FailedConsole Output

Skipping 1,187 KB.. Full Log
nciliatorV5_5Test)  Time elapsed: 0.004 sec
concileInterface1(org.eclipse.php.internal.core.ast.locator.PhpElementConciliatorV5_5Test)  Time elapsed: 0.003 sec
concileMethod1(org.eclipse.php.internal.core.ast.locator.PhpElementConciliatorV5_5Test)  Time elapsed: 0.005 sec
concileMethod2(org.eclipse.php.internal.core.ast.locator.PhpElementConciliatorV5_5Test)  Time elapsed: 0.003 sec
concileMethod3(org.eclipse.php.internal.core.ast.locator.PhpElementConciliatorV5_5Test)  Time elapsed: 0.003 sec
concileMethod4(org.eclipse.php.internal.core.ast.locator.PhpElementConciliatorV5_5Test)  Time elapsed: 0.003 sec
concileField1(org.eclipse.php.internal.core.ast.locator.PhpElementConciliatorV5_5Test)  Time elapsed: 0.003 sec
concileField2(org.eclipse.php.internal.core.ast.locator.PhpElementConciliatorV5_5Test)  Time elapsed: 0.003 sec
concileGlobalVar1(org.eclipse.php.internal.core.ast.locator.PhpElementConciliatorV5_5Test)  Time elapsed: 0.003 sec
concileStaticField1(org.eclipse.php.internal.core.ast.locator.PhpElementConciliatorV5_5Test)  Time elapsed: 0.003 sec
concileClassName1(org.eclipse.php.internal.core.ast.locator.PhpElementConciliatorV5_5Test)  Time elapsed: 0.002 sec
concileClassName2(org.eclipse.php.internal.core.ast.locator.PhpElementConciliatorV5_5Test)  Time elapsed: 0.003 sec
concileConstant1(org.eclipse.php.internal.core.ast.locator.PhpElementConciliatorV5_5Test)  Time elapsed: 0.003 sec
concileConstant2(org.eclipse.php.internal.core.ast.locator.PhpElementConciliatorV5_5Test)  Time elapsed: 0.003 sec
concileConstant3(org.eclipse.php.internal.core.ast.locator.PhpElementConciliatorV5_5Test)  Time elapsed: 0.002 sec
concileClassName(org.eclipse.php.internal.core.ast.locator.PhpElementConciliatorV5_5Test)  Time elapsed: 0.002 sec
concileGlobalVar(org.eclipse.php.internal.core.ast.locator.PhpElementConciliatorV5_5Test)  Time elapsed: 0.003 sec
concileInterface(org.eclipse.php.internal.core.ast.locator.PhpElementConciliatorV5_5Test)  Time elapsed: 0.003 sec
localVar(org.eclipse.php.internal.core.ast.locator.PhpElementConciliatorV5_5Test)  Time elapsed: 0.002 sec
concileFunc1(org.eclipse.php.internal.core.ast.locator.PhpElementConciliatorV5_5Test)  Time elapsed: 0.002 sec
concileConstant(org.eclipse.php.internal.core.ast.locator.PhpElementConciliatorV5_6Test)  Time elapsed: 0.006 sec
concileProgram(org.eclipse.php.internal.core.ast.locator.PhpElementConciliatorV5_6Test)  Time elapsed: 0.006 sec
concileFunc(org.eclipse.php.internal.core.ast.locator.PhpElementConciliatorV5_6Test)  Time elapsed: 0.003 sec
concileInterface1(org.eclipse.php.internal.core.ast.locator.PhpElementConciliatorV5_6Test)  Time elapsed: 0.002 sec
concileMethod1(org.eclipse.php.internal.core.ast.locator.PhpElementConciliatorV5_6Test)  Time elapsed: 0.003 sec
concileMethod2(org.eclipse.php.internal.core.ast.locator.PhpElementConciliatorV5_6Test)  Time elapsed: 0.002 sec
concileMethod3(org.eclipse.php.internal.core.ast.locator.PhpElementConciliatorV5_6Test)  Time elapsed: 0.002 sec
concileMethod4(org.eclipse.php.internal.core.ast.locator.PhpElementConciliatorV5_6Test)  Time elapsed: 0.002 sec
concileField1(org.eclipse.php.internal.core.ast.locator.PhpElementConciliatorV5_6Test)  Time elapsed: 0.002 sec
concileField2(org.eclipse.php.internal.core.ast.locator.PhpElementConciliatorV5_6Test)  Time elapsed: 0.002 sec
concileGlobalVar1(org.eclipse.php.internal.core.ast.locator.PhpElementConciliatorV5_6Test)  Time elapsed: 0.002 sec
concileStaticField1(org.eclipse.php.internal.core.ast.locator.PhpElementConciliatorV5_6Test)  Time elapsed: 0.002 sec
concileClassName1(org.eclipse.php.internal.core.ast.locator.PhpElementConciliatorV5_6Test)  Time elapsed: 0.002 sec
concileClassName2(org.eclipse.php.internal.core.ast.locator.PhpElementConciliatorV5_6Test)  Time elapsed: 0.002 sec
concileConstant1(org.eclipse.php.internal.core.ast.locator.PhpElementConciliatorV5_6Test)  Time elapsed: 0.002 sec
concileConstant2(org.eclipse.php.internal.core.ast.locator.PhpElementConciliatorV5_6Test)  Time elapsed: 0.002 sec
concileConstant3(org.eclipse.php.internal.core.ast.locator.PhpElementConciliatorV5_6Test)  Time elapsed: 0.002 sec
concileClassName(org.eclipse.php.internal.core.ast.locator.PhpElementConciliatorV5_6Test)  Time elapsed: 0.002 sec
concileGlobalVar(org.eclipse.php.internal.core.ast.locator.PhpElementConciliatorV5_6Test)  Time elapsed: 0.001 sec
concileInterface(org.eclipse.php.internal.core.ast.locator.PhpElementConciliatorV5_6Test)  Time elapsed: 0.001 sec
localVar(org.eclipse.php.internal.core.ast.locator.PhpElementConciliatorV5_6Test)  Time elapsed: 0.002 sec
concileFunc1(org.eclipse.php.internal.core.ast.locator.PhpElementConciliatorV5_6Test)  Time elapsed: 0.002 sec
occurrences[workspace/markoccurrence/php5/testClassNameOccurrences3.pdtt](org.eclipse.php.core.tests.markoccurrence.MarkOccurrenceTests)  Time elapsed: 0.083 sec
occurrences[workspace/markoccurrence/php5/testClassNameOccurrences1.pdtt](org.eclipse.php.core.tests.markoccurrence.MarkOccurrenceTests)  Time elapsed: 0.008 sec
occurrences[workspace/markoccurrence/php5/testClassMembersOccurrences3.pdtt](org.eclipse.php.core.tests.markoccurrence.MarkOccurrenceTests)  Time elapsed: 0.012 sec
occurrences[workspace/markoccurrence/php5/testGlobalVariableOccurrences1.pdtt](org.eclipse.php.core.tests.markoccurrence.MarkOccurrenceTests)  Time elapsed: 0.005 sec
occurrences[workspace/markoccurrence/php5/testClassMembersOccurrences2.pdtt](org.eclipse.php.core.tests.markoccurrence.MarkOccurrenceTests)  Time elapsed: 0.007 sec
occurrences[workspace/markoccurrence/php5/testGlobalVariableOccurrences2.pdtt](org.eclipse.php.core.tests.markoccurrence.MarkOccurrenceTests)  Time elapsed: 0.005 sec
occurrences[workspace/markoccurrence/php5/testLocalVariableOccurrences1.pdtt](org.eclipse.php.core.tests.markoccurrence.MarkOccurrenceTests)  Time elapsed: 0.004 sec
occurrences[workspace/markoccurrence/php5/testLocalVariableOccurrences2.pdtt](org.eclipse.php.core.tests.markoccurrence.MarkOccurrenceTests)  Time elapsed: 0.003 sec
occurrences[workspace/markoccurrence/php5/testClassMembersOccurrences1.pdtt](org.eclipse.php.core.tests.markoccurrence.MarkOccurrenceTests)  Time elapsed: 0.009 sec
occurrences[workspace/markoccurrence/php5/testConstantOccurrences1.pdtt](org.eclipse.php.core.tests.markoccurrence.MarkOccurrenceTests)  Time elapsed: 0.004 sec
occurrences[workspace/markoccurrence/php5/testConstantOccurrences2.pdtt](org.eclipse.php.core.tests.markoccurrence.MarkOccurrenceTests)  Time elapsed: 0.003 sec
occurrences[workspace/markoccurrence/php5/testFunctionOccurrences1.pdtt](org.eclipse.php.core.tests.markoccurrence.MarkOccurrenceTests)  Time elapsed: 0.003 sec
occurrences[workspace/markoccurrence/php5/testFunctionOccurrences2.pdtt](org.eclipse.php.core.tests.markoccurrence.MarkOccurrenceTests)  Time elapsed: 0.002 sec
occurrences[workspace/markoccurrence/php5/testClassNameOccurrences3.pdtt](org.eclipse.php.core.tests.markoccurrence.MarkOccurrenceTests)  Time elapsed: 0.009 sec
occurrences[workspace/markoccurrence/php5/testClassNameOccurrences1.pdtt](org.eclipse.php.core.tests.markoccurrence.MarkOccurrenceTests)  Time elapsed: 0.007 sec
occurrences[workspace/markoccurrence/php5/testClassMembersOccurrences3.pdtt](org.eclipse.php.core.tests.markoccurrence.MarkOccurrenceTests)  Time elapsed: 0.012 sec
occurrences[workspace/markoccurrence/php5/testGlobalVariableOccurrences1.pdtt](org.eclipse.php.core.tests.markoccurrence.MarkOccurrenceTests)  Time elapsed: 0.003 sec
occurrences[workspace/markoccurrence/php5/testClassMembersOccurrences2.pdtt](org.eclipse.php.core.tests.markoccurrence.MarkOccurrenceTests)  Time elapsed: 0.007 sec
occurrences[workspace/markoccurrence/php5/testGlobalVariableOccurrences2.pdtt](org.eclipse.php.core.tests.markoccurrence.MarkOccurrenceTests)  Time elapsed: 0.007 sec
occurrences[workspace/markoccurrence/php5/testLocalVariableOccurrences1.pdtt](org.eclipse.php.core.tests.markoccurrence.MarkOccurrenceTests)  Time elapsed: 0.004 sec
occurrences[workspace/markoccurrence/php5/testLocalVariableOccurrences2.pdtt](org.eclipse.php.core.tests.markoccurrence.MarkOccurrenceTests)  Time elapsed: 0.004 sec
occurrences[workspace/markoccurrence/php5/testClassMembersOccurrences1.pdtt](org.eclipse.php.core.tests.markoccurrence.MarkOccurrenceTests)  Time elapsed: 0.009 sec
occurrences[workspace/markoccurrence/php5/testConstantOccurrences1.pdtt](org.eclipse.php.core.tests.markoccurrence.MarkOccurrenceTests)  Time elapsed: 0.004 sec
occurrences[workspace/markoccurrence/php5/testConstantOccurrences2.pdtt](org.eclipse.php.core.tests.markoccurrence.MarkOccurrenceTests)  Time elapsed: 0.003 sec
occurrences[workspace/markoccurrence/php5/testFunctionOccurrences1.pdtt](org.eclipse.php.core.tests.markoccurrence.MarkOccurrenceTests)  Time elapsed: 0.003 sec
occurrences[workspace/markoccurrence/php5/testFunctionOccurrences2.pdtt](org.eclipse.php.core.tests.markoccurrence.MarkOccurrenceTests)  Time elapsed: 0.003 sec
occurrences[workspace/markoccurrence/php53/testClassNameOccurrences1.pdtt](org.eclipse.php.core.tests.markoccurrence.MarkOccurrenceTests)  Time elapsed: 0.007 sec
occurrences[workspace/markoccurrence/php53/testClassMembersOccurrences3.pdtt](org.eclipse.php.core.tests.markoccurrence.MarkOccurrenceTests)  Time elapsed: 0.009 sec
occurrences[workspace/markoccurrence/php53/testGlobalVariableOccurrences1.pdtt](org.eclipse.php.core.tests.markoccurrence.MarkOccurrenceTests)  Time elapsed: 0.007 sec
occurrences[workspace/markoccurrence/php53/testClassMembersOccurrences2.pdtt](org.eclipse.php.core.tests.markoccurrence.MarkOccurrenceTests)  Time elapsed: 0.009 sec
occurrences[workspace/markoccurrence/php53/testGlobalConstantOccurrences2.pdtt](org.eclipse.php.core.tests.markoccurrence.MarkOccurrenceTests)  Time elapsed: 0.008 sec
occurrences[workspace/markoccurrence/php53/testLocalVariableOccurrences1.pdtt](org.eclipse.php.core.tests.markoccurrence.MarkOccurrenceTests)  Time elapsed: 0.003 sec
occurrences[workspace/markoccurrence/php53/testLocalVariableOccurrences2.pdtt](org.eclipse.php.core.tests.markoccurrence.MarkOccurrenceTests)  Time elapsed: 0.004 sec
occurrences[workspace/markoccurrence/php53/testClassMembersOccurrences1.pdtt](org.eclipse.php.core.tests.markoccurrence.MarkOccurrenceTests)  Time elapsed: 0.007 sec
occurrences[workspace/markoccurrence/php53/testGlobalVariableOccurrences3.pdtt](org.eclipse.php.core.tests.markoccurrence.MarkOccurrenceTests)  Time elapsed: 0.003 sec
occurrences[workspace/markoccurrence/php53/testFunctionOccurrences1.pdtt](org.eclipse.php.core.tests.markoccurrence.MarkOccurrenceTests)  Time elapsed: 0.005 sec
occurrences[workspace/markoccurrence/php53/testGlobalConstantOccurrences1.pdtt](org.eclipse.php.core.tests.markoccurrence.MarkOccurrenceTests)  Time elapsed: 0.004 sec
occurrences[workspace/markoccurrence/php5/testClassNameOccurrences3.pdtt](org.eclipse.php.core.tests.markoccurrence.MarkOccurrenceTests)  Time elapsed: 0.037 sec
occurrences[workspace/markoccurrence/php5/testClassNameOccurrences1.pdtt](org.eclipse.php.core.tests.markoccurrence.MarkOccurrenceTests)  Time elapsed: 0.007 sec
occurrences[workspace/markoccurrence/php5/testClassMembersOccurrences3.pdtt](org.eclipse.php.core.tests.markoccurrence.MarkOccurrenceTests)  Time elapsed: 0.007 sec
occurrences[workspace/markoccurrence/php5/testGlobalVariableOccurrences1.pdtt](org.eclipse.php.core.tests.markoccurrence.MarkOccurrenceTests)  Time elapsed: 0.003 sec
occurrences[workspace/markoccurrence/php5/testClassMembersOccurrences2.pdtt](org.eclipse.php.core.tests.markoccurrence.MarkOccurrenceTests)  Time elapsed: 0.006 sec
occurrences[workspace/markoccurrence/php5/testGlobalVariableOccurrences2.pdtt](org.eclipse.php.core.tests.markoccurrence.MarkOccurrenceTests)  Time elapsed: 0.003 sec
occurrences[workspace/markoccurrence/php5/testLocalVariableOccurrences1.pdtt](org.eclipse.php.core.tests.markoccurrence.MarkOccurrenceTests)  Time elapsed: 0.003 sec
occurrences[workspace/markoccurrence/php5/testLocalVariableOccurrences2.pdtt](org.eclipse.php.core.tests.markoccurrence.MarkOccurrenceTests)  Time elapsed: 0.002 sec
occurrences[workspace/markoccurrence/php5/testClassMembersOccurrences1.pdtt](org.eclipse.php.core.tests.markoccurrence.MarkOccurrenceTests)  Time elapsed: 0.008 sec
occurrences[workspace/markoccurrence/php5/testConstantOccurrences1.pdtt](org.eclipse.php.core.tests.markoccurrence.MarkOccurrenceTests)  Time elapsed: 0.003 sec
occurrences[workspace/markoccurrence/php5/testConstantOccurrences2.pdtt](org.eclipse.php.core.tests.markoccurrence.MarkOccurrenceTests)  Time elapsed: 0.004 sec
occurrences[workspace/markoccurrence/php5/testFunctionOccurrences1.pdtt](org.eclipse.php.core.tests.markoccurrence.MarkOccurrenceTests)  Time elapsed: 0.003 sec
occurrences[workspace/markoccurrence/php5/testFunctionOccurrences2.pdtt](org.eclipse.php.core.tests.markoccurrence.MarkOccurrenceTests)  Time elapsed: 0.003 sec
occurrences[workspace/markoccurrence/php53/testClassNameOccurrences1.pdtt](org.eclipse.php.core.tests.markoccurrence.MarkOccurrenceTests)  Time elapsed: 0.006 sec
occurrences[workspace/markoccurrence/php53/testClassMembersOccurrences3.pdtt](org.eclipse.php.core.tests.markoccurrence.MarkOccurrenceTests)  Time elapsed: 0.007 sec
occurrences[workspace/markoccurrence/php53/testGlobalVariableOccurrences1.pdtt](org.eclipse.php.core.tests.markoccurrence.MarkOccurrenceTests)  Time elapsed: 0.005 sec
occurrences[workspace/markoccurrence/php53/testClassMembersOccurrences2.pdtt](org.eclipse.php.core.tests.markoccurrence.MarkOccurrenceTests)  Time elapsed: 0.007 sec
occurrences[workspace/markoccurrence/php53/testGlobalConstantOccurrences2.pdtt](org.eclipse.php.core.tests.markoccurrence.MarkOccurrenceTests)  Time elapsed: 0.006 sec
occurrences[workspace/markoccurrence/php53/testLocalVariableOccurrences1.pdtt](org.eclipse.php.core.tests.markoccurrence.MarkOccurrenceTests)  Time elapsed: 0.003 sec
occurrences[workspace/markoccurrence/php53/testLocalVariableOccurrences2.pdtt](org.eclipse.php.core.tests.markoccurrence.MarkOccurrenceTests)  Time elapsed: 0.004 sec
occurrences[workspace/markoccurrence/php53/testClassMembersOccurrences1.pdtt](org.eclipse.php.core.tests.markoccurrence.MarkOccurrenceTests)  Time elapsed: 0.009 sec
occurrences[workspace/markoccurrence/php53/testGlobalVariableOccurrences3.pdtt](org.eclipse.php.core.tests.markoccurrence.MarkOccurrenceTests)  Time elapsed: 0.004 sec
occurrences[workspace/markoccurrence/php53/testFunctionOccurrences1.pdtt](org.eclipse.php.core.tests.markoccurrence.MarkOccurrenceTests)  Time elapsed: 0.04 sec
occurrences[workspace/markoccurrence/php53/testGlobalConstantOccurrences1.pdtt](org.eclipse.php.core.tests.markoccurrence.MarkOccurrenceTests)  Time elapsed: 0.005 sec
occurrences[workspace/markoccurrence/php54/testTraitMembersOccurrences2.pdtt](org.eclipse.php.core.tests.markoccurrence.MarkOccurrenceTests)  Time elapsed: 0.011 sec
occurrences[workspace/markoccurrence/php54/testTraitMembersOccurrences5.pdtt](org.eclipse.php.core.tests.markoccurrence.MarkOccurrenceTests)  Time elapsed: 0.009 sec
occurrences[workspace/markoccurrence/php54/testTraitMembersOccurrences1.pdtt](org.eclipse.php.core.tests.markoccurrence.MarkOccurrenceTests)  Time elapsed: 0.012 sec
occurrences[workspace/markoccurrence/php54/testTraitMembersOccurrences8.pdtt](org.eclipse.php.core.tests.markoccurrence.MarkOccurrenceTests)  Time elapsed: 0.013 sec
occurrences[workspace/markoccurrence/php54/testTraitMembersOccurrences4.pdtt](org.eclipse.php.core.tests.markoccurrence.MarkOccurrenceTests)  Time elapsed: 0.011 sec
occurrences[workspace/markoccurrence/php54/testTraitMembersOccurrences7.pdtt](org.eclipse.php.core.tests.markoccurrence.MarkOccurrenceTests)  Time elapsed: 0.043 sec
occurrences[workspace/markoccurrence/php54/testTraitMembersOccurrences3.pdtt](org.eclipse.php.core.tests.markoccurrence.MarkOccurrenceTests)  Time elapsed: 0.009 sec
occurrences[workspace/markoccurrence/php54/testTraitMembersOccurrences6.pdtt](org.eclipse.php.core.tests.markoccurrence.MarkOccurrenceTests)  Time elapsed: 0.03 sec
occurrences[workspace/markoccurrence/php5/testClassNameOccurrences3.pdtt](org.eclipse.php.core.tests.markoccurrence.MarkOccurrenceTests)  Time elapsed: 0.008 sec
occurrences[workspace/markoccurrence/php5/testClassNameOccurrences1.pdtt](org.eclipse.php.core.tests.markoccurrence.MarkOccurrenceTests)  Time elapsed: 0.007 sec
occurrences[workspace/markoccurrence/php5/testClassMembersOccurrences3.pdtt](org.eclipse.php.core.tests.markoccurrence.MarkOccurrenceTests)  Time elapsed: 0.009 sec
occurrences[workspace/markoccurrence/php5/testGlobalVariableOccurrences1.pdtt](org.eclipse.php.core.tests.markoccurrence.MarkOccurrenceTests)  Time elapsed: 0.2 sec
occurrences[workspace/markoccurrence/php5/testClassMembersOccurrences2.pdtt](org.eclipse.php.core.tests.markoccurrence.MarkOccurrenceTests)  Time elapsed: 0.009 sec
occurrences[workspace/markoccurrence/php5/testGlobalVariableOccurrences2.pdtt](org.eclipse.php.core.tests.markoccurrence.MarkOccurrenceTests)  Time elapsed: 0.004 sec
occurrences[workspace/markoccurrence/php5/testLocalVariableOccurrences1.pdtt](org.eclipse.php.core.tests.markoccurrence.MarkOccurrenceTests)  Time elapsed: 0.003 sec
occurrences[workspace/markoccurrence/php5/testLocalVariableOccurrences2.pdtt](org.eclipse.php.core.tests.markoccurrence.MarkOccurrenceTests)  Time elapsed: 0.003 sec
occurrences[workspace/markoccurrence/php5/testClassMembersOccurrences1.pdtt](org.eclipse.php.core.tests.markoccurrence.MarkOccurrenceTests)  Time elapsed: 0.007 sec
occurrences[workspace/markoccurrence/php5/testConstantOccurrences1.pdtt](org.eclipse.php.core.tests.markoccurrence.MarkOccurrenceTests)  Time elapsed: 0.003 sec
occurrences[workspace/markoccurrence/php5/testConstantOccurrences2.pdtt](org.eclipse.php.core.tests.markoccurrence.MarkOccurrenceTests)  Time elapsed: 0.003 sec
occurrences[workspace/markoccurrence/php5/testFunctionOccurrences1.pdtt](org.eclipse.php.core.tests.markoccurrence.MarkOccurrenceTests)  Time elapsed: 0.003 sec
occurrences[workspace/markoccurrence/php5/testFunctionOccurrences2.pdtt](org.eclipse.php.core.tests.markoccurrence.MarkOccurrenceTests)  Time elapsed: 0.003 sec
occurrences[workspace/markoccurrence/php53/testClassNameOccurrences1.pdtt](org.eclipse.php.core.tests.markoccurrence.MarkOccurrenceTests)  Time elapsed: 0.005 sec
occurrences[workspace/markoccurrence/php53/testClassMembersOccurrences3.pdtt](org.eclipse.php.core.tests.markoccurrence.MarkOccurrenceTests)  Time elapsed: 0.007 sec
occurrences[workspace/markoccurrence/php53/testGlobalVariableOccurrences1.pdtt](org.eclipse.php.core.tests.markoccurrence.MarkOccurrenceTests)  Time elapsed: 0.006 sec
occurrences[workspace/markoccurrence/php53/testClassMembersOccurrences2.pdtt](org.eclipse.php.core.tests.markoccurrence.MarkOccurrenceTests)  Time elapsed: 0.069 sec
occurrences[workspace/markoccurrence/php53/testGlobalConstantOccurrences2.pdtt](org.eclipse.php.core.tests.markoccurrence.MarkOccurrenceTests)  Time elapsed: 0.018 sec
occurrences[workspace/markoccurrence/php53/testLocalVariableOccurrences1.pdtt](org.eclipse.php.core.tests.markoccurrence.MarkOccurrenceTests)  Time elapsed: 0.005 sec
occurrences[workspace/markoccurrence/php53/testLocalVariableOccurrences2.pdtt](org.eclipse.php.core.tests.markoccurrence.MarkOccurrenceTests)  Time elapsed: 0.004 sec
occurrences[workspace/markoccurrence/php53/testClassMembersOccurrences1.pdtt](org.eclipse.php.core.tests.markoccurrence.MarkOccurrenceTests)  Time elapsed: 0.008 sec
occurrences[workspace/markoccurrence/php53/testGlobalVariableOccurrences3.pdtt](org.eclipse.php.core.tests.markoccurrence.MarkOccurrenceTests)  Time elapsed: 0.003 sec
occurrences[workspace/markoccurrence/php53/testFunctionOccurrences1.pdtt](org.eclipse.php.core.tests.markoccurrence.MarkOccurrenceTests)  Time elapsed: 0.005 sec
occurrences[workspace/markoccurrence/php53/testGlobalConstantOccurrences1.pdtt](org.eclipse.php.core.tests.markoccurrence.MarkOccurrenceTests)  Time elapsed: 0.004 sec
occurrences[workspace/markoccurrence/php54/testTraitMembersOccurrences2.pdtt](org.eclipse.php.core.tests.markoccurrence.MarkOccurrenceTests)  Time elapsed: 0.012 sec
occurrences[workspace/markoccurrence/php54/testTraitMembersOccurrences5.pdtt](org.eclipse.php.core.tests.markoccurrence.MarkOccurrenceTests)  Time elapsed: 0.01 sec
occurrences[workspace/markoccurrence/php54/testTraitMembersOccurrences1.pdtt](org.eclipse.php.core.tests.markoccurrence.MarkOccurrenceTests)  Time elapsed: 0.012 sec
occurrences[workspace/markoccurrence/php54/testTraitMembersOccurrences8.pdtt](org.eclipse.php.core.tests.markoccurrence.MarkOccurrenceTests)  Time elapsed: 0.009 sec
occurrences[workspace/markoccurrence/php54/testTraitMembersOccurrences4.pdtt](org.eclipse.php.core.tests.markoccurrence.MarkOccurrenceTests)  Time elapsed: 0.011 sec
occurrences[workspace/markoccurrence/php54/testTraitMembersOccurrences7.pdtt](org.eclipse.php.core.tests.markoccurrence.MarkOccurrenceTests)  Time elapsed: 0.009 sec
occurrences[workspace/markoccurrence/php54/testTraitMembersOccurrences3.pdtt](org.eclipse.php.core.tests.markoccurrence.MarkOccurrenceTests)  Time elapsed: 0.011 sec
occurrences[workspace/markoccurrence/php54/testTraitMembersOccurrences6.pdtt](org.eclipse.php.core.tests.markoccurrence.MarkOccurrenceTests)  Time elapsed: 0.009 sec
occurrences[workspace/markoccurrence/php5/testClassNameOccurrences3.pdtt](org.eclipse.php.core.tests.markoccurrence.MarkOccurrenceTests)  Time elapsed: 0.01 sec
occurrences[workspace/markoccurrence/php5/testClassNameOccurrences1.pdtt](org.eclipse.php.core.tests.markoccurrence.MarkOccurrenceTests)  Time elapsed: 0.007 sec
occurrences[workspace/markoccurrence/php5/testClassMembersOccurrences3.pdtt](org.eclipse.php.core.tests.markoccurrence.MarkOccurrenceTests)  Time elapsed: 0.008 sec
occurrences[workspace/markoccurrence/php5/testGlobalVariableOccurrences1.pdtt](org.eclipse.php.core.tests.markoccurrence.MarkOccurrenceTests)  Time elapsed: 0.003 sec
occurrences[workspace/markoccurrence/php5/testClassMembersOccurrences2.pdtt](org.eclipse.php.core.tests.markoccurrence.MarkOccurrenceTests)  Time elapsed: 0.006 sec
occurrences[workspace/markoccurrence/php5/testGlobalVariableOccurrences2.pdtt](org.eclipse.php.core.tests.markoccurrence.MarkOccurrenceTests)  Time elapsed: 0.004 sec
occurrences[workspace/markoccurrence/php5/testLocalVariableOccurrences1.pdtt](org.eclipse.php.core.tests.markoccurrence.MarkOccurrenceTests)  Time elapsed: 0.003 sec
occurrences[workspace/markoccurrence/php5/testLocalVariableOccurrences2.pdtt](org.eclipse.php.core.tests.markoccurrence.MarkOccurrenceTests)  Time elapsed: 0.003 sec
occurrences[workspace/markoccurrence/php5/testClassMembersOccurrences1.pdtt](org.eclipse.php.core.tests.markoccurrence.MarkOccurrenceTests)  Time elapsed: 0.007 sec
occurrences[workspace/markoccurrence/php5/testConstantOccurrences1.pdtt](org.eclipse.php.core.tests.markoccurrence.MarkOccurrenceTests)  Time elapsed: 0.003 sec
occurrences[workspace/markoccurrence/php5/testConstantOccurrences2.pdtt](org.eclipse.php.core.tests.markoccurrence.MarkOccurrenceTests)  Time elapsed: 0.003 sec
occurrences[workspace/markoccurrence/php5/testFunctionOccurrences1.pdtt](org.eclipse.php.core.tests.markoccurrence.MarkOccurrenceTests)  Time elapsed: 0.002 sec
occurrences[workspace/markoccurrence/php5/testFunctionOccurrences2.pdtt](org.eclipse.php.core.tests.markoccurrence.MarkOccurrenceTests)  Time elapsed: 0.003 sec
occurrences[workspace/markoccurrence/php53/testClassNameOccurrences1.pdtt](org.eclipse.php.core.tests.markoccurrence.MarkOccurrenceTests)  Time elapsed: 0.005 sec
occurrences[workspace/markoccurrence/php53/testClassMembersOccurrences3.pdtt](org.eclipse.php.core.tests.markoccurrence.MarkOccurrenceTests)  Time elapsed: 0.007 sec
occurrences[workspace/markoccurrence/php53/testGlobalVariableOccurrences1.pdtt](org.eclipse.php.core.tests.markoccurrence.MarkOccurrenceTests)  Time elapsed: 0.02 sec
occurrences[workspace/markoccurrence/php53/testClassMembersOccurrences2.pdtt](org.eclipse.php.core.tests.markoccurrence.MarkOccurrenceTests)  Time elapsed: 0.008 sec
occurrences[workspace/markoccurrence/php53/testGlobalConstantOccurrences2.pdtt](org.eclipse.php.core.tests.markoccurrence.MarkOccurrenceTests)  Time elapsed: 0.006 sec
occurrences[workspace/markoccurrence/php53/testLocalVariableOccurrences1.pdtt](org.eclipse.php.core.tests.markoccurrence.MarkOccurrenceTests)  Time elapsed: 0.003 sec
occurrences[workspace/markoccurrence/php53/testLocalVariableOccurrences2.pdtt](org.eclipse.php.core.tests.markoccurrence.MarkOccurrenceTests)  Time elapsed: 0.004 sec
occurrences[workspace/markoccurrence/php53/testClassMembersOccurrences1.pdtt](org.eclipse.php.core.tests.markoccurrence.MarkOccurrenceTests)  Time elapsed: 0.008 sec
occurrences[workspace/markoccurrence/php53/testGlobalVariableOccurrences3.pdtt](org.eclipse.php.core.tests.markoccurrence.MarkOccurrenceTests)  Time elapsed: 0.003 sec
occurrences[workspace/markoccurrence/php53/testFunctionOccurrences1.pdtt](org.eclipse.php.core.tests.markoccurrence.MarkOccurrenceTests)  Time elapsed: 0.005 sec
occurrences[workspace/markoccurrence/php53/testGlobalConstantOccurrences1.pdtt](org.eclipse.php.core.tests.markoccurrence.MarkOccurrenceTests)  Time elapsed: 0.005 sec
occurrences[workspace/markoccurrence/php54/testTraitMembersOccurrences2.pdtt](org.eclipse.php.core.tests.markoccurrence.MarkOccurrenceTests)  Time elapsed: 0.01 sec
occurrences[workspace/markoccurrence/php54/testTraitMembersOccurrences5.pdtt](org.eclipse.php.core.tests.markoccurrence.MarkOccurrenceTests)  Time elapsed: 0.01 sec
occurrences[workspace/markoccurrence/php54/testTraitMembersOccurrences1.pdtt](org.eclipse.php.core.tests.markoccurrence.MarkOccurrenceTests)  Time elapsed: 0.012 sec
occurrences[workspace/markoccurrence/php54/testTraitMembersOccurrences8.pdtt](org.eclipse.php.core.tests.markoccurrence.MarkOccurrenceTests)  Time elapsed: 0.011 sec
occurrences[workspace/markoccurrence/php54/testTraitMembersOccurrences4.pdtt](org.eclipse.php.core.tests.markoccurrence.MarkOccurrenceTests)  Time elapsed: 0.011 sec
occurrences[workspace/markoccurrence/php54/testTraitMembersOccurrences7.pdtt](org.eclipse.php.core.tests.markoccurrence.MarkOccurrenceTests)  Time elapsed: 0.01 sec
occurrences[workspace/markoccurrence/php54/testTraitMembersOccurrences3.pdtt](org.eclipse.php.core.tests.markoccurrence.MarkOccurrenceTests)  Time elapsed: 0.067 sec
occurrences[workspace/markoccurrence/php54/testTraitMembersOccurrences6.pdtt](org.eclipse.php.core.tests.markoccurrence.MarkOccurrenceTests)  Time elapsed: 0.011 sec
occurrences[workspace/markoccurrence/php56/testVariadicParameter01.pdtt](org.eclipse.php.core.tests.markoccurrence.MarkOccurrenceTests)  Time elapsed: 0.004 sec
occurrences[workspace/markoccurrence/php5/testClassNameOccurrences3.pdtt](org.eclipse.php.core.tests.markoccurrence.MarkOccurrenceTests)  Time elapsed: 1.176 sec
occurrences[workspace/markoccurrence/php5/testClassNameOccurrences1.pdtt](org.eclipse.php.core.tests.markoccurrence.MarkOccurrenceTests)  Time elapsed: 0.013 sec
occurrences[workspace/markoccurrence/php5/testClassMembersOccurrences3.pdtt](org.eclipse.php.core.tests.markoccurrence.MarkOccurrenceTests)  Time elapsed: 0.016 sec
occurrences[workspace/markoccurrence/php5/testGlobalVariableOccurrences1.pdtt](org.eclipse.php.core.tests.markoccurrence.MarkOccurrenceTests)  Time elapsed: 0.064 sec
occurrences[workspace/markoccurrence/php5/testClassMembersOccurrences2.pdtt](org.eclipse.php.core.tests.markoccurrence.MarkOccurrenceTests)  Time elapsed: 0.01 sec
occurrences[workspace/markoccurrence/php5/testGlobalVariableOccurrences2.pdtt](org.eclipse.php.core.tests.markoccurrence.MarkOccurrenceTests)  Time elapsed: 0.005 sec
occurrences[workspace/markoccurrence/php5/testLocalVariableOccurrences1.pdtt](org.eclipse.php.core.tests.markoccurrence.MarkOccurrenceTests)  Time elapsed: 0.002 sec
occurrences[workspace/markoccurrence/php5/testLocalVariableOccurrences2.pdtt](org.eclipse.php.core.tests.markoccurrence.MarkOccurrenceTests)  Time elapsed: 0.003 sec
occurrences[workspace/markoccurrence/php5/testClassMembersOccurrences1.pdtt](org.eclipse.php.core.tests.markoccurrence.MarkOccurrenceTests)  Time elapsed: 0.009 sec
occurrences[workspace/markoccurrence/php5/testConstantOccurrences1.pdtt](org.eclipse.php.core.tests.markoccurrence.MarkOccurrenceTests)  Time elapsed: 0.003 sec
occurrences[workspace/markoccurrence/php5/testConstantOccurrences2.pdtt](org.eclipse.php.core.tests.markoccurrence.MarkOccurrenceTests)  Time elapsed: 0.003 sec
occurrences[workspace/markoccurrence/php5/testFunctionOccurrences1.pdtt](org.eclipse.php.core.tests.markoccurrence.MarkOccurrenceTests)  Time elapsed: 0.004 sec
occurrences[workspace/markoccurrence/php5/testFunctionOccurrences2.pdtt](org.eclipse.php.core.tests.markoccurrence.MarkOccurrenceTests)  Time elapsed: 0.003 sec
occurrences[workspace/markoccurrence/php53/testClassNameOccurrences1.pdtt](org.eclipse.php.core.tests.markoccurrence.MarkOccurrenceTests)  Time elapsed: 0.006 sec
occurrences[workspace/markoccurrence/php53/testClassMembersOccurrences3.pdtt](org.eclipse.php.core.tests.markoccurrence.MarkOccurrenceTests)  Time elapsed: 0.008 sec
occurrences[workspace/markoccurrence/php53/testGlobalVariableOccurrences1.pdtt](org.eclipse.php.core.tests.markoccurrence.MarkOccurrenceTests)  Time elapsed: 0.005 sec
occurrences[workspace/markoccurrence/php53/testClassMembersOccurrences2.pdtt](org.eclipse.php.core.tests.markoccurrence.MarkOccurrenceTests)  Time elapsed: 0.007 sec
occurrences[workspace/markoccurrence/php53/testGlobalConstantOccurrences2.pdtt](org.eclipse.php.core.tests.markoccurrence.MarkOccurrenceTests)  Time elapsed: 0.005 sec
occurrences[workspace/markoccurrence/php53/testLocalVariableOccurrences1.pdtt](org.eclipse.php.core.tests.markoccurrence.MarkOccurrenceTests)  Time elapsed: 0.003 sec
occurrences[workspace/markoccurrence/php53/testLocalVariableOccurrences2.pdtt](org.eclipse.php.core.tests.markoccurrence.MarkOccurrenceTests)  Time elapsed: 0.004 sec
occurrences[workspace/markoccurrence/php53/testClassMembersOccurrences1.pdtt](org.eclipse.php.core.tests.markoccurrence.MarkOccurrenceTests)  Time elapsed: 0.01 sec
occurrences[workspace/markoccurrence/php53/testGlobalVariableOccurrences3.pdtt](org.eclipse.php.core.tests.markoccurrence.MarkOccurrenceTests)  Time elapsed: 0.003 sec
occurrences[workspace/markoccurrence/php53/testFunctionOccurrences1.pdtt](org.eclipse.php.core.tests.markoccurrence.MarkOccurrenceTests)  Time elapsed: 0.005 sec
occurrences[workspace/markoccurrence/php53/testGlobalConstantOccurrences1.pdtt](org.eclipse.php.core.tests.markoccurrence.MarkOccurrenceTests)  Time elapsed: 0.005 sec
occurrences[workspace/markoccurrence/php54/testTraitMembersOccurrences2.pdtt](org.eclipse.php.core.tests.markoccurrence.MarkOccurrenceTests)  Time elapsed: 0.011 sec
occurrences[workspace/markoccurrence/php54/testTraitMembersOccurrences5.pdtt](org.eclipse.php.core.tests.markoccurrence.MarkOccurrenceTests)  Time elapsed: 0.06 sec
occurrences[workspace/markoccurrence/php54/testTraitMembersOccurrences1.pdtt](org.eclipse.php.core.tests.markoccurrence.MarkOccurrenceTests)  Time elapsed: 0.015 sec
occurrences[workspace/markoccurrence/php54/testTraitMembersOccurrences8.pdtt](org.eclipse.php.core.tests.markoccurrence.MarkOccurrenceTests)  Time elapsed: 0.009 sec
occurrences[workspace/markoccurrence/php54/testTraitMembersOccurrences4.pdtt](org.eclipse.php.core.tests.markoccurrence.MarkOccurrenceTests)  Time elapsed: 0.009 sec
occurrences[workspace/markoccurrence/php54/testTraitMembersOccurrences7.pdtt](org.eclipse.php.core.tests.markoccurrence.MarkOccurrenceTests)  Time elapsed: 0.048 sec
occurrences[workspace/markoccurrence/php54/testTraitMembersOccurrences3.pdtt](org.eclipse.php.core.tests.markoccurrence.MarkOccurrenceTests)  Time elapsed: 0.013 sec
occurrences[workspace/markoccurrence/php54/testTraitMembersOccurrences6.pdtt](org.eclipse.php.core.tests.markoccurrence.MarkOccurrenceTests)  Time elapsed: 0.01 sec
occurrences[workspace/markoccurrence/php56/testVariadicParameter01.pdtt](org.eclipse.php.core.tests.markoccurrence.MarkOccurrenceTests)  Time elapsed: 0.004 sec
simpleXml(org.eclipse.php.core.tests.searchEngine.PHP5LanguageModelTest)  Time elapsed: 0.032 sec
sockets(org.eclipse.php.core.tests.searchEngine.PHP5LanguageModelTest)  Time elapsed: 0 sec
mime_magic(org.eclipse.php.core.tests.searchEngine.PHP5LanguageModelTest)  Time elapsed: 0 sec
bcmath(org.eclipse.php.core.tests.searchEngine.PHP5LanguageModelTest)  Time elapsed: 0 sec
reflection(org.eclipse.php.core.tests.searchEngine.PHP5LanguageModelTest)  Time elapsed: 0 sec
filter(org.eclipse.php.core.tests.searchEngine.PHP5LanguageModelTest)  Time elapsed: 0.001 sec
openssl(org.eclipse.php.core.tests.searchEngine.PHP5LanguageModelTest)  Time elapsed: 0 sec
mcrypt(org.eclipse.php.core.tests.searchEngine.PHP5LanguageModelTest)  Time elapsed: 0 sec
mysqli(org.eclipse.php.core.tests.searchEngine.PHP5LanguageModelTest)  Time elapsed: 0 sec
Ibm_db2(org.eclipse.php.core.tests.searchEngine.PHP5LanguageModelTest)  Time elapsed: 0.001 sec
sqlite(org.eclipse.php.core.tests.searchEngine.PHP5LanguageModelTest)  Time elapsed: 0 sec
xmlreader(org.eclipse.php.core.tests.searchEngine.PHP5LanguageModelTest)  Time elapsed: 0 sec
xmlwriter(org.eclipse.php.core.tests.searchEngine.PHP5LanguageModelTest)  Time elapsed: 0 sec
calendar(org.eclipse.php.core.tests.searchEngine.PHP5LanguageModelTest)  Time elapsed: 0.001 sec
gettext(org.eclipse.php.core.tests.searchEngine.PHP5LanguageModelTest)  Time elapsed: 0 sec
gd(org.eclipse.php.core.tests.searchEngine.PHP5LanguageModelTest)  Time elapsed: 0 sec
bz2(org.eclipse.php.core.tests.searchEngine.PHP5LanguageModelTest)  Time elapsed: 0 sec
dom(org.eclipse.php.core.tests.searchEngine.PHP5LanguageModelTest)  Time elapsed: 0.001 sec
ftp(org.eclipse.php.core.tests.searchEngine.PHP5LanguageModelTest)  Time elapsed: 0 sec
pdo(org.eclipse.php.core.tests.searchEngine.PHP5LanguageModelTest)  Time elapsed: 0 sec
spl(org.eclipse.php.core.tests.searchEngine.PHP5LanguageModelTest)  Time elapsed: 0.001 sec
xml(org.eclipse.php.core.tests.searchEngine.PHP5LanguageModelTest)  Time elapsed: 0 sec
xsl(org.eclipse.php.core.tests.searchEngine.PHP5LanguageModelTest)  Time elapsed: 0 sec
zip(org.eclipse.php.core.tests.searchEngine.PHP5LanguageModelTest)  Time elapsed: 0 sec
Imap(org.eclipse.php.core.tests.searchEngine.PHP5LanguageModelTest)  Time elapsed: 0 sec
Intl(org.eclipse.php.core.tests.searchEngine.PHP5LanguageModelTest)  Time elapsed: 0 sec
curl(org.eclipse.php.core.tests.searchEngine.PHP5LanguageModelTest)  Time elapsed: 0 sec
date(org.eclipse.php.core.tests.searchEngine.PHP5LanguageModelTest)  Time elapsed: 0 sec
exif(org.eclipse.php.core.tests.searchEngine.PHP5LanguageModelTest)  Time elapsed: 0 sec
hash(org.eclipse.php.core.tests.searchEngine.PHP5LanguageModelTest)  Time elapsed: 0 sec
json(org.eclipse.php.core.tests.searchEngine.PHP5LanguageModelTest)  Time elapsed: 0 sec
ldap(org.eclipse.php.core.tests.searchEngine.PHP5LanguageModelTest)  Time elapsed: 0.001 sec
oci8(org.eclipse.php.core.tests.searchEngine.PHP5LanguageModelTest)  Time elapsed: 0 sec
pcre(org.eclipse.php.core.tests.searchEngine.PHP5LanguageModelTest)  Time elapsed: 0 sec
soap(org.eclipse.php.core.tests.searchEngine.PHP5LanguageModelTest)  Time elapsed: 0 sec
tidy(org.eclipse.php.core.tests.searchEngine.PHP5LanguageModelTest)  Time elapsed: 0 sec
zlib(org.eclipse.php.core.tests.searchEngine.PHP5LanguageModelTest)  Time elapsed: 0 sec
Iconv(org.eclipse.php.core.tests.searchEngine.PHP5LanguageModelTest)  Time elapsed: 0 sec
ctype(org.eclipse.php.core.tests.searchEngine.PHP5LanguageModelTest)  Time elapsed: 0 sec
mhash(org.eclipse.php.core.tests.searchEngine.PHP5LanguageModelTest)  Time elapsed: 0.001 sec
mysql(org.eclipse.php.core.tests.searchEngine.PHP5LanguageModelTest)  Time elapsed: 0 sec
pgsql(org.eclipse.php.core.tests.searchEngine.PHP5LanguageModelTest)  Time elapsed: 0 sec
posix(org.eclipse.php.core.tests.searchEngine.PHP5LanguageModelTest)  Time elapsed: 0.001 sec
tokenizer(org.eclipse.php.core.tests.searchEngine.PHP5LanguageModelTest)  Time elapsed: 0 sec
standard(org.eclipse.php.core.tests.searchEngine.PHP5LanguageModelTest)  Time elapsed: 0 sec
session(org.eclipse.php.core.tests.searchEngine.PHP5LanguageModelTest)  Time elapsed: 0 sec
simpleXml(org.eclipse.php.core.tests.searchEngine.PHP53LanguageModelTest)  Time elapsed: 0.001 sec
sockets(org.eclipse.php.core.tests.searchEngine.PHP53LanguageModelTest)  Time elapsed: 0.001 sec
mime_magic(org.eclipse.php.core.tests.searchEngine.PHP53LanguageModelTest)  Time elapsed: 0 sec
bcmath(org.eclipse.php.core.tests.searchEngine.PHP53LanguageModelTest)  Time elapsed: 0 sec
reflection(org.eclipse.php.core.tests.searchEngine.PHP53LanguageModelTest)  Time elapsed: 0.001 sec
filter(org.eclipse.php.core.tests.searchEngine.PHP53LanguageModelTest)  Time elapsed: 0 sec
openssl(org.eclipse.php.core.tests.searchEngine.PHP53LanguageModelTest)  Time elapsed: 0 sec
mcrypt(org.eclipse.php.core.tests.searchEngine.PHP53LanguageModelTest)  Time elapsed: 0 sec
mysqli(org.eclipse.php.core.tests.searchEngine.PHP53LanguageModelTest)  Time elapsed: 0.001 sec
sqlite(org.eclipse.php.core.tests.searchEngine.PHP53LanguageModelTest)  Time elapsed: 0 sec
xmlreader(org.eclipse.php.core.tests.searchEngine.PHP53LanguageModelTest)  Time elapsed: 0 sec
xmlwriter(org.eclipse.php.core.tests.searchEngine.PHP53LanguageModelTest)  Time elapsed: 0 sec
calendar(org.eclipse.php.core.tests.searchEngine.PHP53LanguageModelTest)  Time elapsed: 0.001 sec
gettext(org.eclipse.php.core.tests.searchEngine.PHP53LanguageModelTest)  Time elapsed: 0 sec
gd(org.eclipse.php.core.tests.searchEngine.PHP53LanguageModelTest)  Time elapsed: 0 sec
bz2(org.eclipse.php.core.tests.searchEngine.PHP53LanguageModelTest)  Time elapsed: 0 sec
dom(org.eclipse.php.core.tests.searchEngine.PHP53LanguageModelTest)  Time elapsed: 0 sec
ftp(org.eclipse.php.core.tests.searchEngine.PHP53LanguageModelTest)  Time elapsed: 0.001 sec
pdo(org.eclipse.php.core.tests.searchEngine.PHP53LanguageModelTest)  Time elapsed: 0 sec
spl(org.eclipse.php.core.tests.searchEngine.PHP53LanguageModelTest)  Time elapsed: 0 sec
xml(org.eclipse.php.core.tests.searchEngine.PHP53LanguageModelTest)  Time elapsed: 0.001 sec
xsl(org.eclipse.php.core.tests.searchEngine.PHP53LanguageModelTest)  Time elapsed: 0 sec
zip(org.eclipse.php.core.tests.searchEngine.PHP53LanguageModelTest)  Time elapsed: 0 sec
curl(org.eclipse.php.core.tests.searchEngine.PHP53LanguageModelTest)  Time elapsed: 0 sec
date(org.eclipse.php.core.tests.searchEngine.PHP53LanguageModelTest)  Time elapsed: 0.001 sec
exif(org.eclipse.php.core.tests.searchEngine.PHP53LanguageModelTest)  Time elapsed: 0 sec
hash(org.eclipse.php.core.tests.searchEngine.PHP53LanguageModelTest)  Time elapsed: 0 sec
imap(org.eclipse.php.core.tests.searchEngine.PHP53LanguageModelTest)  Time elapsed: 0 sec
intl(org.eclipse.php.core.tests.searchEngine.PHP53LanguageModelTest)  Time elapsed: 0.001 sec
json(org.eclipse.php.core.tests.searchEngine.PHP53LanguageModelTest)  Time elapsed: 0 sec
ldap(org.eclipse.php.core.tests.searchEngine.PHP53LanguageModelTest)  Time elapsed: 0 sec
oci8(org.eclipse.php.core.tests.searchEngine.PHP53LanguageModelTest)  Time elapsed: 0 sec
pcre(org.eclipse.php.core.tests.searchEngine.PHP53LanguageModelTest)  Time elapsed: 0.001 sec
soap(org.eclipse.php.core.tests.searchEngine.PHP53LanguageModelTest)  Time elapsed: 0 sec
tidy(org.eclipse.php.core.tests.searchEngine.PHP53LanguageModelTest)  Time elapsed: 0 sec
zlib(org.eclipse.php.core.tests.searchEngine.PHP53LanguageModelTest)  Time elapsed: 0 sec
ctype(org.eclipse.php.core.tests.searchEngine.PHP53LanguageModelTest)  Time elapsed: 0.001 sec
iconv(org.eclipse.php.core.tests.searchEngine.PHP53LanguageModelTest)  Time elapsed: 0 sec
mhash(org.eclipse.php.core.tests.searchEngine.PHP53LanguageModelTest)  Time elapsed: 0 sec
mysql(org.eclipse.php.core.tests.searchEngine.PHP53LanguageModelTest)  Time elapsed: 0 sec
pgsql(org.eclipse.php.core.tests.searchEngine.PHP53LanguageModelTest)  Time elapsed: 0.001 sec
posix(org.eclipse.php.core.tests.searchEngine.PHP53LanguageModelTest)  Time elapsed: 0 sec
tokenizer(org.eclipse.php.core.tests.searchEngine.PHP53LanguageModelTest)  Time elapsed: 0 sec
standard(org.eclipse.php.core.tests.searchEngine.PHP53LanguageModelTest)  Time elapsed: 0.001 sec
ibm_db2(org.eclipse.php.core.tests.searchEngine.PHP53LanguageModelTest)  Time elapsed: 0 sec
session(org.eclipse.php.core.tests.searchEngine.PHP53LanguageModelTest)  Time elapsed: 0 sec
search[workspace/searchEngine/php5/searchClassField1.pdtt](org.eclipse.php.core.tests.searchEngine.SearchFieldTests)  Time elapsed: 0.017 sec
suggestStaticObjectOperator(org.eclipse.php.core.tests.text.PHPTextSequenceUtilitiesTests)  Time elapsed: 0 sec
ignoreInternalCall(org.eclipse.php.core.tests.text.PHPTextSequenceUtilitiesTests)  Time elapsed: 0 sec
singleArgument(org.eclipse.php.core.tests.text.PHPTextSequenceUtilitiesTests)  Time elapsed: 0 sec
singleArgumentIgnoreParenthesis(org.eclipse.php.core.tests.text.PHPTextSequenceUtilitiesTests)  Time elapsed: 0 sec
suggestObjectOperator(org.eclipse.php.core.tests.text.PHPTextSequenceUtilitiesTests)  Time elapsed: 0 sec
nestedCall(org.eclipse.php.core.tests.text.PHPTextSequenceUtilitiesTests)  Time elapsed: 0 sec
multiArgumentIgnore(org.eclipse.php.core.tests.text.PHPTextSequenceUtilitiesTests)  Time elapsed: 0 sec
multiArgumentIgnore2(org.eclipse.php.core.tests.text.PHPTextSequenceUtilitiesTests)  Time elapsed: 0 sec
ignoreObjecOperator(org.eclipse.php.core.tests.text.PHPTextSequenceUtilitiesTests)  Time elapsed: 0 sec
singleArgumentDoubleQuote(org.eclipse.php.core.tests.text.PHPTextSequenceUtilitiesTests)  Time elapsed: 0 sec
singleArgumentIgnore(org.eclipse.php.core.tests.text.PHPTextSequenceUtilitiesTests)  Time elapsed: 0 sec
emptyArgumentList(org.eclipse.php.core.tests.text.PHPTextSequenceUtilitiesTests)  Time elapsed: 0 sec

Results :

Tests run: 7359, Failures: 0, Errors: 0, Skipped: 0

[INFO] All tests passed!
[INFO]                                                                         
[INFO] ------------------------------------------------------------------------
[INFO] Building org.eclipse.php.core.performance.tests 4.1.0-SNAPSHOT
[INFO] ------------------------------------------------------------------------
[INFO] 
[INFO] --- maven-clean-plugin:2.4.1:clean (default-clean) @ org.eclipse.php.core.performance.tests ---
[INFO] 
[INFO] --- tycho-packaging-plugin:0.23.0:build-qualifier (default-build-qualifier) @ org.eclipse.php.core.performance.tests ---
[INFO] The project's OSGi version is 4.1.0.201606301519
[INFO] 
[INFO] --- tycho-packaging-plugin:0.23.0:validate-id (default-validate-id) @ org.eclipse.php.core.performance.tests ---
[INFO] 
[INFO] --- tycho-packaging-plugin:0.23.0:validate-version (default-validate-version) @ org.eclipse.php.core.performance.tests ---
[INFO] 
[INFO] --- maven-resources-plugin:2.4.3:resources (default-resources) @ org.eclipse.php.core.performance.tests ---
[INFO] Using 'UTF-8' encoding to copy filtered resources.
[INFO] skip non existing resourceDirectory /jobs/genie.pdt/pdt-gerrit/workspace2/tests/org.eclipse.php.core.performance.tests/src/main/resources
[INFO] 
[INFO] --- tycho-compiler-plugin:0.23.0:compile (default-compile) @ org.eclipse.php.core.performance.tests ---
[INFO] Compiling 16 source files to /jobs/genie.pdt/pdt-gerrit/workspace2/tests/org.eclipse.php.core.performance.tests/target/classes
[INFO] 
[INFO] --- maven-resources-plugin:2.4.3:testResources (default-testResources) @ org.eclipse.php.core.performance.tests ---
[INFO] Using 'UTF-8' encoding to copy filtered resources.
[INFO] skip non existing resourceDirectory /jobs/genie.pdt/pdt-gerrit/workspace2/tests/org.eclipse.php.core.performance.tests/src/test/resources
[INFO] 
[INFO] --- tycho-source-plugin:0.23.0:plugin-source (plugin-source) @ org.eclipse.php.core.performance.tests ---
[WARNING] bundle localization file /jobs/genie.pdt/pdt-gerrit/workspace2/tests/org.eclipse.php.core.performance.tests/plugin.properties not found
[INFO] Building jar: /jobs/genie.pdt/pdt-gerrit/workspace2/tests/org.eclipse.php.core.performance.tests/target/org.eclipse.php.core.performance.tests-4.1.0-SNAPSHOT-sources.jar
[INFO] 
[INFO] --- target-platform-configuration:0.23.0:target-platform (default-target-platform) @ org.eclipse.php.core.performance.tests ---
[INFO] 
[INFO] --- tycho-packaging-plugin:0.23.0:package-plugin (default-package-plugin) @ org.eclipse.php.core.performance.tests ---
[INFO] Building jar: /jobs/genie.pdt/pdt-gerrit/workspace2/tests/org.eclipse.php.core.performance.tests/target/org.eclipse.php.core.performance.tests-4.1.0-SNAPSHOT.jar
[INFO] 
[INFO] --- tycho-p2-plugin:0.23.0:p2-metadata-default (default-p2-metadata-default) @ org.eclipse.php.core.performance.tests ---
[INFO] 
[INFO] --- tycho-surefire-plugin:0.23.0:test (default-test) @ org.eclipse.php.core.performance.tests ---
[INFO] Skipping tests
[INFO]                                                                         
[INFO] ------------------------------------------------------------------------
[INFO] Building org.eclipse.php.formatter.core.tests 4.1.0-SNAPSHOT
[INFO] ------------------------------------------------------------------------
[INFO] 
[INFO] --- maven-clean-plugin:2.4.1:clean (default-clean) @ org.eclipse.php.formatter.core.tests ---
[INFO] 
[INFO] --- tycho-packaging-plugin:0.23.0:build-qualifier (default-build-qualifier) @ org.eclipse.php.formatter.core.tests ---
[INFO] The project's OSGi version is 4.1.0.201606301519
[INFO] 
[INFO] --- tycho-packaging-plugin:0.23.0:validate-id (default-validate-id) @ org.eclipse.php.formatter.core.tests ---
[INFO] 
[INFO] --- tycho-packaging-plugin:0.23.0:validate-version (default-validate-version) @ org.eclipse.php.formatter.core.tests ---
[INFO] 
[INFO] --- maven-resources-plugin:2.4.3:resources (default-resources) @ org.eclipse.php.formatter.core.tests ---
[INFO] Using 'UTF-8' encoding to copy filtered resources.
[INFO] skip non existing resourceDirectory /jobs/genie.pdt/pdt-gerrit/workspace2/tests/org.eclipse.php.formatter.core.tests/src/main/resources
[INFO] 
[INFO] --- tycho-compiler-plugin:0.23.0:compile (default-compile) @ org.eclipse.php.formatter.core.tests ---
[INFO] Compiling 5 source files to /jobs/genie.pdt/pdt-gerrit/workspace2/tests/org.eclipse.php.formatter.core.tests/target/classes
[INFO] 
[INFO] --- maven-resources-plugin:2.4.3:testResources (default-testResources) @ org.eclipse.php.formatter.core.tests ---
[INFO] Using 'UTF-8' encoding to copy filtered resources.
[INFO] skip non existing resourceDirectory /jobs/genie.pdt/pdt-gerrit/workspace2/tests/org.eclipse.php.formatter.core.tests/src/test/resources
[INFO] 
[INFO] --- tycho-source-plugin:0.23.0:plugin-source (plugin-source) @ org.eclipse.php.formatter.core.tests ---
[WARNING] bundle localization file /jobs/genie.pdt/pdt-gerrit/workspace2/tests/org.eclipse.php.formatter.core.tests/plugin.properties not found
[INFO] Building jar: /jobs/genie.pdt/pdt-gerrit/workspace2/tests/org.eclipse.php.formatter.core.tests/target/org.eclipse.php.formatter.core.tests-4.1.0-SNAPSHOT-sources.jar
[INFO] 
[INFO] --- target-platform-configuration:0.23.0:target-platform (default-target-platform) @ org.eclipse.php.formatter.core.tests ---
[INFO] 
[INFO] --- tycho-packaging-plugin:0.23.0:package-plugin (default-package-plugin) @ org.eclipse.php.formatter.core.tests ---
[INFO] Building jar: /jobs/genie.pdt/pdt-gerrit/workspace2/tests/org.eclipse.php.formatter.core.tests/target/org.eclipse.php.formatter.core.tests-4.1.0-SNAPSHOT.jar
[INFO] 
[INFO] --- tycho-p2-plugin:0.23.0:p2-metadata-default (default-p2-metadata-default) @ org.eclipse.php.formatter.core.tests ---
[INFO] 
[INFO] --- tycho-surefire-plugin:0.23.0:test (default-test) @ org.eclipse.php.formatter.core.tests ---
[INFO] Expected eclipse log file: /jobs/genie.pdt/pdt-gerrit/workspace2/tests/org.eclipse.php.formatter.core.tests/target/work/data/.metadata/.log
[INFO] Command line:
	[/opt/public/common/jdk1.8.0_51.x64/jre/bin/java, -Dosgi.noShutdown=false, -Dosgi.os=linux, -Dosgi.ws=gtk, -Dosgi.arch=x86_64, -Xmx512m, -XX:MaxPermSize=256m, -Dfile.encoding=UTF-8, -Dosgi.clean=true, -jar, /opt/public/hipp/homes/genie.pdt/.m2/repository/p2/osgi/bundle/org.eclipse.equinox.launcher/1.3.200.v20160318-1642/org.eclipse.equinox.launcher-1.3.200.v20160318-1642.jar, -data, /jobs/genie.pdt/pdt-gerrit/workspace2/tests/org.eclipse.php.formatter.core.tests/target/work/data, -install, /jobs/genie.pdt/pdt-gerrit/workspace2/tests/org.eclipse.php.formatter.core.tests/target/work, -configuration, /jobs/genie.pdt/pdt-gerrit/workspace2/tests/org.eclipse.php.formatter.core.tests/target/work/configuration, -application, org.eclipse.tycho.surefire.osgibooter.uitest, -testproperties, /jobs/genie.pdt/pdt-gerrit/workspace2/tests/org.eclipse.php.formatter.core.tests/target/surefire.properties, -nouithread]
Java HotSpot(TM) 64-Bit Server VM warning: ignoring option MaxPermSize=256m; support was removed in 8.0
Xlib:  extension "RANDR" missing on display ":299.0".

-------------------------------------------------------
 T E S T S
-------------------------------------------------------
Running org.eclipse.php.formatter.core.tests.AllTests
[TEST] -> org.eclipse.php.formatter.core.tests.AllTests
[TEST] -> org.eclipse.php.formatter.core.tests.FormatterAutoEditTests
[TEST] -> org.eclipse.php.formatter.core.tests.FormatterLinuxAutoEditTests
Tests run: 406, Failures: 0, Errors: 0, Skipped: 0, Time elapsed: 14.676 sec - in org.eclipse.php.formatter.core.tests.AllTests
formatter[workspace/formatter/php5/comments_formatter_7/commentFormatter6.pdtt](org.eclipse.php.formatter.core.tests.FormatterTests)  Time elapsed: 0.351 sec
formatter[workspace/formatter/php5/comments_formatter_7/commentFormatter2.pdtt](org.eclipse.php.formatter.core.tests.FormatterTests)  Time elapsed: 0.024 sec
formatter[workspace/formatter/php5/comments_formatter_7/commentFormatter3.pdtt](org.eclipse.php.formatter.core.tests.FormatterTests)  Time elapsed: 0.011 sec
formatter[workspace/formatter/php5/comments_formatter_7/commentFormatter4.pdtt](org.eclipse.php.formatter.core.tests.FormatterTests)  Time elapsed: 0.025 sec
formatter[workspace/formatter/php5/comments_formatter_7/commentFormatter1.pdtt](org.eclipse.php.formatter.core.tests.FormatterTests)  Time elapsed: 0.01 sec
formatter[workspace/formatter/php5/comments_formatter_7/commentFormatter7.pdtt](org.eclipse.php.formatter.core.tests.FormatterTests)  Time elapsed: 0.011 sec
formatter[workspace/formatter/php5/comments_formatter_7/commentFormatter5.pdtt](org.eclipse.php.formatter.core.tests.FormatterTests)  Time elapsed: 0.279 sec
formatter[workspace/formatter/php5/comments_formatter_3/commentFormatter2.pdtt](org.eclipse.php.formatter.core.tests.FormatterTests)  Time elapsed: 0.014 sec
formatter[workspace/formatter/php5/comments_formatter_3/commentFormatter3.pdtt](org.eclipse.php.formatter.core.tests.FormatterTests)  Time elapsed: 0.008 sec
formatter[workspace/formatter/php5/comments_formatter_3/commentFormatter4.pdtt](org.eclipse.php.formatter.core.tests.FormatterTests)  Time elapsed: 0.015 sec
formatter[workspace/formatter/php5/comments_formatter_3/commentFormatter1.pdtt](org.eclipse.php.formatter.core.tests.FormatterTests)  Time elapsed: 0.009 sec
formatter[workspace/formatter/php5/comments_formatter_3/commentFormatter5.pdtt](org.eclipse.php.formatter.core.tests.FormatterTests)  Time elapsed: 0.009 sec
formatter[workspace/formatter/php5/comments_formatter_4/commentFormatter2.pdtt](org.eclipse.php.formatter.core.tests.FormatterTests)  Time elapsed: 0.011 sec
formatter[workspace/formatter/php5/comments_formatter_4/commentFormatter3.pdtt](org.eclipse.php.formatter.core.tests.FormatterTests)  Time elapsed: 0.007 sec
formatter[workspace/formatter/php5/comments_formatter_4/commentFormatter4.pdtt](org.eclipse.php.formatter.core.tests.FormatterTests)  Time elapsed: 0.011 sec
formatter[workspace/formatter/php5/comments_formatter_4/commentFormatter1.pdtt](org.eclipse.php.formatter.core.tests.FormatterTests)  Time elapsed: 0.007 sec
formatter[workspace/formatter/php5/comments_formatter/commentFormatter6.pdtt](org.eclipse.php.formatter.core.tests.FormatterTests)  Time elapsed: 0.012 sec
formatter[workspace/formatter/php5/comments_formatter/commentFormatter2.pdtt](org.eclipse.php.formatter.core.tests.FormatterTests)  Time elapsed: 0.009 sec
formatter[workspace/formatter/php5/comments_formatter/commentFormatter3.pdtt](org.eclipse.php.formatter.core.tests.FormatterTests)  Time elapsed: 0.007 sec
formatter[workspace/formatter/php5/comments_formatter/commentFormatter9.pdtt](org.eclipse.php.formatter.core.tests.FormatterTests)  Time elapsed: 0.01 sec
formatter[workspace/formatter/php5/comments_formatter/commentFormatter4.pdtt](org.eclipse.php.formatter.core.tests.FormatterTests)  Time elapsed: 0.01 sec
formatter[workspace/formatter/php5/comments_formatter/commentFormatter10.pdtt](org.eclipse.php.formatter.core.tests.FormatterTests)  Time elapsed: 0.008 sec
formatter[workspace/formatter/php5/comments_formatter/commentFormatter1.pdtt](org.eclipse.php.formatter.core.tests.FormatterTests)  Time elapsed: 0.006 sec
formatter[workspace/formatter/php5/comments_formatter/commentFormatter7.pdtt](org.eclipse.php.formatter.core.tests.FormatterTests)  Time elapsed: 0.009 sec
formatter[workspace/formatter/php5/comments_formatter/commentFormatter5.pdtt](org.eclipse.php.formatter.core.tests.FormatterTests)  Time elapsed: 0.006 sec
formatter[workspace/formatter/php5/comments_formatter/commentFormatter8.pdtt](org.eclipse.php.formatter.core.tests.FormatterTests)  Time elapsed: 0.013 sec
formatter[workspace/formatter/php5/comments_formatter/commentFormatter11.pdtt](org.eclipse.php.formatter.core.tests.FormatterTests)  Time elapsed: 0.009 sec
formatter[workspace/formatter/php5/max_line_wrap_length_80/ZSTD-1395.pdtt](org.eclipse.php.formatter.core.tests.FormatterTests)  Time elapsed: 0.023 sec
formatter[workspace/formatter/php5/default_formatter_configuration/unaryOperation.pdtt](org.eclipse.php.formatter.core.tests.FormatterTests)  Time elapsed: 0.007 sec
formatter[workspace/formatter/php5/default_formatter_configuration/prefixExpression.pdtt](org.eclipse.php.formatter.core.tests.FormatterTests)  Time elapsed: 0.007 sec
formatter[workspace/formatter/php5/default_formatter_configuration/arrayElement.pdtt](org.eclipse.php.formatter.core.tests.FormatterTests)  Time elapsed: 0.005 sec
formatter[workspace/formatter/php5/default_formatter_configuration/declarationStatements.pdtt](org.eclipse.php.formatter.core.tests.FormatterTests)  Time elapsed: 0.01 sec
formatter[workspace/formatter/php5/default_formatter_configuration/reference.pdtt](org.eclipse.php.formatter.core.tests.FormatterTests)  Time elapsed: 0.009 sec
formatter[workspace/formatter/php5/default_formatter_configuration/backTickExpression.pdtt](org.eclipse.php.formatter.core.tests.FormatterTests)  Time elapsed: 0.005 sec
formatter[workspace/formatter/php5/default_formatter_configuration/classInstanceCreation.pdtt](org.eclipse.php.formatter.core.tests.FormatterTests)  Time elapsed: 0.005 sec
formatter[workspace/formatter/php5/default_formatter_configuration/functionName.pdtt](org.eclipse.php.formatter.core.tests.FormatterTests)  Time elapsed: 0.006 sec
formatter[workspace/formatter/php5/default_formatter_configuration/staticConstantAccess.pdtt](org.eclipse.php.formatter.core.tests.FormatterTests)  Time elapsed: 0.006 sec
formatter[workspace/formatter/php5/default_formatter_configuration/instanceOfExpression.pdtt](org.eclipse.php.formatter.core.tests.FormatterTests)  Time elapsed: 0.006 sec
formatter[workspace/formatter/php5/default_formatter_configuration/staticStatement.pdtt](org.eclipse.php.formatter.core.tests.FormatterTests)  Time elapsed: 0.043 sec
formatter[workspace/formatter/php5/default_formatter_configuration/conditionalExpression.pdtt](org.eclipse.php.formatter.core.tests.FormatterTests)  Time elapsed: 0.008 sec
formatter[workspace/formatter/php5/default_formatter_configuration/switchCase.pdtt](org.eclipse.php.formatter.core.tests.FormatterTests)  Time elapsed: 0.009 sec
formatter[workspace/formatter/php5/default_formatter_configuration/globalStatement.pdtt](org.eclipse.php.formatter.core.tests.FormatterTests)  Time elapsed: 0.007 sec
formatter[workspace/formatter/php5/default_formatter_configuration/foreachStatements.pdtt](org.eclipse.php.formatter.core.tests.FormatterTests)  Time elapsed: 0.006 sec
formatter[workspace/formatter/php5/default_formatter_configuration/breakStatement.pdtt](org.eclipse.php.formatter.core.tests.FormatterTests)  Time elapsed: 0.068 sec
formatter[workspace/formatter/php5/default_formatter_configuration/arrayCreation.pdtt](org.eclipse.php.formatter.core.tests.FormatterTests)  Time elapsed: 0.008 sec
formatter[workspace/formatter/php5/default_formatter_configuration/castExpressiont.pdtt](org.eclipse.php.formatter.core.tests.FormatterTests)  Time elapsed: 0.005 sec
formatter[workspace/formatter/php5/default_formatter_configuration/classComments.pdtt](org.eclipse.php.formatter.core.tests.FormatterTests)  Time elapsed: 0.005 sec
formatter[workspace/formatter/php5/default_formatter_configuration/quote.pdtt](org.eclipse.php.formatter.core.tests.FormatterTests)  Time elapsed: 0.005 sec
formatter[workspace/formatter/php5/default_formatter_configuration/include.pdtt](org.eclipse.php.formatter.core.tests.FormatterTests)  Time elapsed: 0.005 sec
formatter[workspace/formatter/php5/default_formatter_configuration/forStatements.pdtt](org.eclipse.php.formatter.core.tests.FormatterTests)  Time elapsed: 0.006 sec
formatter[workspace/formatter/php5/default_formatter_configuration/methodEmptyLineThenComment.pdtt](org.eclipse.php.formatter.core.tests.FormatterTests)  Time elapsed: 0.004 sec
formatter[workspace/formatter/php5/default_formatter_configuration/doStatement.pdtt](org.eclipse.php.formatter.core.tests.FormatterTests)  Time elapsed: 0.006 sec
formatter[workspace/formatter/php5/default_formatter_configuration/cloneExpression.pdtt](org.eclipse.php.formatter.core.tests.FormatterTests)  Time elapsed: 0.007 sec
formatter[workspace/formatter/php5/default_formatter_configuration/declareStatement.pdtt](org.eclipse.php.formatter.core.tests.FormatterTests)  Time elapsed: 0.006 sec
formatter[workspace/formatter/php5/default_formatter_configuration/quote2.pdtt](org.eclipse.php.formatter.core.tests.FormatterTests)  Time elapsed: 0.016 sec
formatter[workspace/formatter/php5/default_formatter_configuration/postfixExpression.pdtt](org.eclipse.php.formatter.core.tests.FormatterTests)  Time elapsed: 0.005 sec
formatter[workspace/formatter/php5/default_formatter_configuration/block.pdtt](org.eclipse.php.formatter.core.tests.FormatterTests)  Time elapsed: 0.006 sec
formatter[workspace/formatter/php5/default_formatter_configuration/listVariable.pdtt](org.eclipse.php.formatter.core.tests.FormatterTests)  Time elapsed: 0.007 sec
formatter[workspace/formatter/php5/default_formatter_configuration/foreachStatement.pdtt](org.eclipse.php.formatter.core.tests.FormatterTests)  Time elapsed: 0.009 sec
formatter[workspace/formatter/php5/default_formatter_configuration/returnStatement.pdtt](org.eclipse.php.formatter.core.tests.FormatterTests)  Time elapsed: 0.005 sec
formatter[workspace/formatter/php5/default_formatter_configuration/catchClause.pdtt](org.eclipse.php.formatter.core.tests.FormatterTests)  Time elapsed: 0.008 sec
formatter[workspace/formatter/php5/default_formatter_configuration/inLinePhp.pdtt](org.eclipse.php.formatter.core.tests.FormatterTests)  Time elapsed: 0.025 sec
formatter[workspace/formatter/php5/default_formatter_configuration/ifStatementsWithComment.pdtt](org.eclipse.php.formatter.core.tests.FormatterTests)  Time elapsed: 0.007 sec
formatter[workspace/formatter/php5/default_formatter_configuration/fieldAccess.pdtt](org.eclipse.php.formatter.core.tests.FormatterTests)  Time elapsed: 0.006 sec
formatter[workspace/formatter/php5/default_formatter_configuration/multiLinePHPdoc.pdtt](org.eclipse.php.formatter.core.tests.FormatterTests)  Time elapsed: 0.005 sec
formatter[workspace/formatter/php5/default_formatter_configuration/ignoreError.pdtt](org.eclipse.php.formatter.core.tests.FormatterTests)  Time elapsed: 0.009 sec
formatter[workspace/formatter/php5/default_formatter_configuration/phpWithinHtmlTag.pdtt](org.eclipse.php.formatter.core.tests.FormatterTests)  Time elapsed: 0.311 sec
formatter[workspace/formatter/php5/default_formatter_configuration/inLineHtml.pdtt](org.eclipse.php.formatter.core.tests.FormatterTests)  Time elapsed: 0.077 sec
formatter[workspace/formatter/php5/default_formatter_configuration/methodChain.pdtt](org.eclipse.php.formatter.core.tests.FormatterTests)  Time elapsed: 0.006 sec
formatter[workspace/formatter/php5/default_formatter_configuration/arrayStatements.pdtt](org.eclipse.php.formatter.core.tests.FormatterTests)  Time elapsed: 0.006 sec
formatter[workspace/formatter/php5/default_formatter_configuration/arrayAccess.pdtt](org.eclipse.php.formatter.core.tests.FormatterTests)  Time elapsed: 0.007 sec
formatter[workspace/formatter/php5/default_formatter_configuration/continueStatement.pdtt](org.eclipse.php.formatter.core.tests.FormatterTests)  Time elapsed: 0.03 sec
formatter[workspace/formatter/php5/default_formatter_configuration/fieldDeclaration.pdtt](org.eclipse.php.formatter.core.tests.FormatterTests)  Time elapsed: 0.004 sec
formatter[workspace/formatter/php5/default_formatter_configuration/staticFieldAccess.pdtt](org.eclipse.php.formatter.core.tests.FormatterTests)  Time elapsed: 0.005 sec
formatter[workspace/formatter/php5/default_formatter_configuration/reflectionVariable.pdtt](org.eclipse.php.formatter.core.tests.FormatterTests)  Time elapsed: 0.003 sec
formatter[workspace/formatter/php5/default_formatter_configuration/assignment.pdtt](org.eclipse.php.formatter.core.tests.FormatterTests)  Time elapsed: 0.005 sec
formatter[workspace/formatter/php5/default_formatter_configuration/phpWithHtml.pdtt](org.eclipse.php.formatter.core.tests.FormatterTests)  Time elapsed: 0.033 sec
formatter[workspace/formatter/php5/default_formatter_configuration/echoStatement.pdtt](org.eclipse.php.formatter.core.tests.FormatterTests)  Time elapsed: 0.006 sec
formatter[workspace/formatter/php5/default_formatter_configuration/infixExpression.pdtt](org.eclipse.php.formatter.core.tests.FormatterTests)  Time elapsed: 0.004 sec
formatter[workspace/formatter/php5/default_formatter_configuration/ifStatements.pdtt](org.eclipse.php.formatter.core.tests.FormatterTests)  Time elapsed: 0.006 sec
formatter[workspace/formatter/php5/default_formatter_configuration/whileStatements.pdtt](org.eclipse.php.formatter.core.tests.FormatterTests)  Time elapsed: 0.006 sec
formatter[workspace/formatter/php5/default_formatter_configuration/staticMethodInfokation.pdtt](org.eclipse.php.formatter.core.tests.FormatterTests)  Time elapsed: 0.005 sec
formatter[workspace/formatter/php5/default_formatter_configuration/tryStatements.pdtt](org.eclipse.php.formatter.core.tests.FormatterTests)  Time elapsed: 0.004 sec
formatter[workspace/formatter/php5/default_formatter_configuration/phpWithHtml1.pdtt](org.eclipse.php.formatter.core.tests.FormatterTests)  Time elapsed: 0.027 sec
formatter[workspace/formatter/php5/comments_formatter_5/commentFormatter2.pdtt](org.eclipse.php.formatter.core.tests.FormatterTests)  Time elapsed: 0.009 sec
formatter[workspace/formatter/php5/comments_formatter_5/commentFormatter3.pdtt](org.eclipse.php.formatter.core.tests.FormatterTests)  Time elapsed: 0.006 sec
formatter[workspace/formatter/php5/comments_formatter_5/commentFormatter4.pdtt](org.eclipse.php.formatter.core.tests.FormatterTests)  Time elapsed: 0.008 sec
formatter[workspace/formatter/php5/comments_formatter_5/commentFormatter1.pdtt](org.eclipse.php.formatter.core.tests.FormatterTests)  Time elapsed: 0.054 sec
formatter[workspace/formatter/php5/zend_framework_default_configuration/unaryOperation.pdtt](org.eclipse.php.formatter.core.tests.FormatterTests)  Time elapsed: 0.009 sec
formatter[workspace/formatter/php5/zend_framework_default_configuration/prefixExpression.pdtt](org.eclipse.php.formatter.core.tests.FormatterTests)  Time elapsed: 0.006 sec
formatter[workspace/formatter/php5/zend_framework_default_configuration/arrayElement.pdtt](org.eclipse.php.formatter.core.tests.FormatterTests)  Time elapsed: 0.005 sec
formatter[workspace/formatter/php5/zend_framework_default_configuration/declarationStatements.pdtt](org.eclipse.php.formatter.core.tests.FormatterTests)  Time elapsed: 0.006 sec
formatter[workspace/formatter/php5/zend_framework_default_configuration/reference.pdtt](org.eclipse.php.formatter.core.tests.FormatterTests)  Time elapsed: 0.005 sec
formatter[workspace/formatter/php5/zend_framework_default_configuration/backTickExpression.pdtt](org.eclipse.php.formatter.core.tests.FormatterTests)  Time elapsed: 0.034 sec
formatter[workspace/formatter/php5/zend_framework_default_configuration/classInstanceCreation.pdtt](org.eclipse.php.formatter.core.tests.FormatterTests)  Time elapsed: 0.005 sec
formatter[workspace/formatter/php5/zend_framework_default_configuration/functionName.pdtt](org.eclipse.php.formatter.core.tests.FormatterTests)  Time elapsed: 0.005 sec
formatter[workspace/formatter/php5/zend_framework_default_configuration/staticConstantAccess.pdtt](org.eclipse.php.formatter.core.tests.FormatterTests)  Time elapsed: 0.004 sec
formatter[workspace/formatter/php5/zend_framework_default_configuration/instanceOfExpression.pdtt](org.eclipse.php.formatter.core.tests.FormatterTests)  Time elapsed: 0.004 sec
formatter[workspace/formatter/php5/zend_framework_default_configuration/staticStatement.pdtt](org.eclipse.php.formatter.core.tests.FormatterTests)  Time elapsed: 0.003 sec
formatter[workspace/formatter/php5/zend_framework_default_configuration/conditionalExpression.pdtt](org.eclipse.php.formatter.core.tests.FormatterTests)  Time elapsed: 0.004 sec
formatter[workspace/formatter/php5/zend_framework_default_configuration/switchCase.pdtt](org.eclipse.php.formatter.core.tests.FormatterTests)  Time elapsed: 0.006 sec
formatter[workspace/formatter/php5/zend_framework_default_configuration/globalStatement.pdtt](org.eclipse.php.formatter.core.tests.FormatterTests)  Time elapsed: 0.004 sec
formatter[workspace/formatter/php5/zend_framework_default_configuration/foreachStatements.pdtt](org.eclipse.php.formatter.core.tests.FormatterTests)  Time elapsed: 0.037 sec
formatter[workspace/formatter/php5/zend_framework_default_configuration/breakStatement.pdtt](org.eclipse.php.formatter.core.tests.FormatterTests)  Time elapsed: 0.006 sec
formatter[workspace/formatter/php5/zend_framework_default_configuration/arrayCreation.pdtt](org.eclipse.php.formatter.core.tests.FormatterTests)  Time elapsed: 0.005 sec
formatter[workspace/formatter/php5/zend_framework_default_configuration/castExpressiont.pdtt](org.eclipse.php.formatter.core.tests.FormatterTests)  Time elapsed: 0.004 sec
formatter[workspace/formatter/php5/zend_framework_default_configuration/classComments.pdtt](org.eclipse.php.formatter.core.tests.FormatterTests)  Time elapsed: 0.005 sec
formatter[workspace/formatter/php5/zend_framework_default_configuration/quote.pdtt](org.eclipse.php.formatter.core.tests.FormatterTests)  Time elapsed: 0.004 sec
formatter[workspace/formatter/php5/zend_framework_default_configuration/include.pdtt](org.eclipse.php.formatter.core.tests.FormatterTests)  Time elapsed: 0.072 sec
formatter[workspace/formatter/php5/zend_framework_default_configuration/methodChainWrapped.pdtt](org.eclipse.php.formatter.core.tests.FormatterTests)  Time elapsed: 0.005 sec
formatter[workspace/formatter/php5/zend_framework_default_configuration/forStatements.pdtt](org.eclipse.php.formatter.core.tests.FormatterTests)  Time elapsed: 0.005 sec
formatter[workspace/formatter/php5/zend_framework_default_configuration/methodEmptyLineThenComment.pdtt](org.eclipse.php.formatter.core.tests.FormatterTests)  Time elapsed: 0.004 sec
formatter[workspace/formatter/php5/zend_framework_default_configuration/doStatement.pdtt](org.eclipse.php.formatter.core.tests.FormatterTests)  Time elapsed: 0.004 sec
formatter[workspace/formatter/php5/zend_framework_default_configuration/cloneExpression.pdtt](org.eclipse.php.formatter.core.tests.FormatterTests)  Time elapsed: 0.004 sec
formatter[workspace/formatter/php5/zend_framework_default_configuration/declareStatement.pdtt](org.eclipse.php.formatter.core.tests.FormatterTests)  Time elapsed: 0.004 sec
formatter[workspace/formatter/php5/zend_framework_default_configuration/methodChainWrapped1.pdtt](org.eclipse.php.formatter.core.tests.FormatterTests)  Time elapsed: 0.003 sec
formatter[workspace/formatter/php5/zend_framework_default_configuration/postfixExpression.pdtt](org.eclipse.php.formatter.core.tests.FormatterTests)  Time elapsed: 0.003 sec
formatter[workspace/formatter/php5/zend_framework_default_configuration/block.pdtt](org.eclipse.php.formatter.core.tests.FormatterTests)  Time elapsed: 0.004 sec
formatter[workspace/formatter/php5/zend_framework_default_configuration/listVariable.pdtt](org.eclipse.php.formatter.core.tests.FormatterTests)  Time elapsed: 0.004 sec
formatter[workspace/formatter/php5/zend_framework_default_configuration/foreachStatement.pdtt](org.eclipse.php.formatter.core.tests.FormatterTests)  Time elapsed: 0.006 sec
formatter[workspace/formatter/php5/zend_framework_default_configuration/returnStatement.pdtt](org.eclipse.php.formatter.core.tests.FormatterTests)  Time elapsed: 0.003 sec
formatter[workspace/formatter/php5/zend_framework_default_configuration/catchClause.pdtt](org.eclipse.php.formatter.core.tests.FormatterTests)  Time elapsed: 0.005 sec
formatter[workspace/formatter/php5/zend_framework_default_configuration/inLinePhp.pdtt](org.eclipse.php.formatter.core.tests.FormatterTests)  Time elapsed: 0.008 sec
formatter[workspace/formatter/php5/zend_framework_default_configuration/funcChain1.pdtt](org.eclipse.php.formatter.core.tests.FormatterTests)  Time elapsed: 0.005 sec
formatter[workspace/formatter/php5/zend_framework_default_configuration/fieldAccess.pdtt](org.eclipse.php.formatter.core.tests.FormatterTests)  Time elapsed: 0.003 sec
formatter[workspace/formatter/php5/zend_framework_default_configuration/multiLinePHPdoc.pdtt](org.eclipse.php.formatter.core.tests.FormatterTests)  Time elapsed: 0.004 sec
formatter[workspace/formatter/php5/zend_framework_default_configuration/ignoreError.pdtt](org.eclipse.php.formatter.core.tests.FormatterTests)  Time elapsed: 0.004 sec
formatter[workspace/formatter/php5/zend_framework_default_configuration/phpWithinHtmlTag.pdtt](org.eclipse.php.formatter.core.tests.FormatterTests)  Time elapsed: 0.015 sec
formatter[workspace/formatter/php5/zend_framework_default_configuration/inLineHtml.pdtt](org.eclipse.php.formatter.core.tests.FormatterTests)  Time elapsed: 0.084 sec
formatter[workspace/formatter/php5/zend_framework_default_configuration/methodChain1.pdtt](org.eclipse.php.formatter.core.tests.FormatterTests)  Time elapsed: 0.004 sec
formatter[workspace/formatter/php5/zend_framework_default_configuration/methodChainWrapped2.pdtt](org.eclipse.php.formatter.core.tests.FormatterTests)  Time elapsed: 0.004 sec
formatter[workspace/formatter/php5/zend_framework_default_configuration/methodChain.pdtt](org.eclipse.php.formatter.core.tests.FormatterTests)  Time elapsed: 0.003 sec
formatter[workspace/formatter/php5/zend_framework_default_configuration/arrayStatements.pdtt](org.eclipse.php.formatter.core.tests.FormatterTests)  Time elapsed: 0.004 sec
formatter[workspace/formatter/php5/zend_framework_default_configuration/arrayAccess.pdtt](org.eclipse.php.formatter.core.tests.FormatterTests)  Time elapsed: 0.004 sec
formatter[workspace/formatter/php5/zend_framework_default_configuration/continueStatement.pdtt](org.eclipse.php.formatter.core.tests.FormatterTests)  Time elapsed: 0.005 sec
formatter[workspace/formatter/php5/zend_framework_default_configuration/fieldDeclaration.pdtt](org.eclipse.php.formatter.core.tests.FormatterTests)  Time elapsed: 0.003 sec
formatter[workspace/formatter/php5/zend_framework_default_configuration/funcChain.pdtt](org.eclipse.php.formatter.core.tests.FormatterTests)  Time elapsed: 0.003 sec
formatter[workspace/formatter/php5/zend_framework_default_configuration/staticFieldAccess.pdtt](org.eclipse.php.formatter.core.tests.FormatterTests)  Time elapsed: 0.003 sec
formatter[workspace/formatter/php5/zend_framework_default_configuration/reflectionVariable.pdtt](org.eclipse.php.formatter.core.tests.FormatterTests)  Time elapsed: 0.003 sec
formatter[workspace/formatter/php5/zend_framework_default_configuration/assignment.pdtt](org.eclipse.php.formatter.core.tests.FormatterTests)  Time elapsed: 0.003 sec
formatter[workspace/formatter/php5/zend_framework_default_configuration/phpWithHtml.pdtt](org.eclipse.php.formatter.core.tests.FormatterTests)  Time elapsed: 0.022 sec
formatter[workspace/formatter/php5/zend_framework_default_configuration/echoStatement.pdtt](org.eclipse.php.formatter.core.tests.FormatterTests)  Time elapsed: 0.006 sec
formatter[workspace/formatter/php5/zend_framework_default_configuration/infixExpression.pdtt](org.eclipse.php.formatter.core.tests.FormatterTests)  Time elapsed: 0.004 sec
formatter[workspace/formatter/php5/zend_framework_default_configuration/ifStatements.pdtt](org.eclipse.php.formatter.core.tests.FormatterTests)  Time elapsed: 0.004 sec
formatter[workspace/formatter/php5/zend_framework_default_configuration/whileStatements.pdtt](org.eclipse.php.formatter.core.tests.FormatterTests)  Time elapsed: 0.004 sec
formatter[workspace/formatter/php5/zend_framework_default_configuration/staticMethodInfokation.pdtt](org.eclipse.php.formatter.core.tests.FormatterTests)  Time elapsed: 0.003 sec
formatter[workspace/formatter/php5/zend_framework_default_configuration/tryStatements.pdtt](org.eclipse.php.formatter.core.tests.FormatterTests)  Time elapsed: 0.004 sec
formatter[workspace/formatter/php5/comments_formatter_2/commentFormatter2.pdtt](org.eclipse.php.formatter.core.tests.FormatterTests)  Time elapsed: 0.008 sec
formatter[workspace/formatter/php5/comments_formatter_2/commentFormatter3.pdtt](org.eclipse.php.formatter.core.tests.FormatterTests)  Time elapsed: 0.004 sec
formatter[workspace/formatter/php5/comments_formatter_2/commentFormatter4.pdtt](org.eclipse.php.formatter.core.tests.FormatterTests)  Time elapsed: 0.006 sec
formatter[workspace/formatter/php5/comments_formatter_2/commentFormatter1.pdtt](org.eclipse.php.formatter.core.tests.FormatterTests)  Time elapsed: 0.004 sec
formatter[workspace/formatter/php5/comments_formatter_6/commentFormatter2.pdtt](org.eclipse.php.formatter.core.tests.FormatterTests)  Time elapsed: 0.007 sec
formatter[workspace/formatter/php5/comments_formatter_6/commentFormatter3.pdtt](org.eclipse.php.formatter.core.tests.FormatterTests)  Time elapsed: 0.005 sec
formatter[workspace/formatter/php5/comments_formatter_6/commentFormatter4.pdtt](org.eclipse.php.formatter.core.tests.FormatterTests)  Time elapsed: 0.007 sec
formatter[workspace/formatter/php5/comments_formatter_6/commentFormatter1.pdtt](org.eclipse.php.formatter.core.tests.FormatterTests)  Time elapsed: 0.004 sec
formatter[workspace/formatter/php5/new_default_formatter_configuration/unaryOperation.pdtt](org.eclipse.php.formatter.core.tests.FormatterTests)  Time elapsed: 0.004 sec
formatter[workspace/formatter/php5/new_default_formatter_configuration/prefixExpression.pdtt](org.eclipse.php.formatter.core.tests.FormatterTests)  Time elapsed: 0.021 sec
formatter[workspace/formatter/php5/new_default_formatter_configuration/arrayElement.pdtt](org.eclipse.php.formatter.core.tests.FormatterTests)  Time elapsed: 0.004 sec
formatter[workspace/formatter/php5/new_default_formatter_configuration/declarationStatements.pdtt](org.eclipse.php.formatter.core.tests.FormatterTests)  Time elapsed: 0.005 sec
formatter[workspace/formatter/php5/new_default_formatter_configuration/reference.pdtt](org.eclipse.php.formatter.core.tests.FormatterTests)  Time elapsed: 0.003 sec
formatter[workspace/formatter/php5/new_default_formatter_configuration/backTickExpression.pdtt](org.eclipse.php.formatter.core.tests.FormatterTests)  Time elapsed: 0.003 sec
formatter[workspace/formatter/php5/new_default_formatter_configuration/classInstanceCreation.pdtt](org.eclipse.php.formatter.core.tests.FormatterTests)  Time elapsed: 0.004 sec
formatter[workspace/formatter/php5/new_default_formatter_configuration/functionName.pdtt](org.eclipse.php.formatter.core.tests.FormatterTests)  Time elapsed: 0.003 sec
formatter[workspace/formatter/php5/new_default_formatter_configuration/staticConstantAccess.pdtt](org.eclipse.php.formatter.core.tests.FormatterTests)  Time elapsed: 0.005 sec
formatter[workspace/formatter/php5/new_default_formatter_configuration/instanceOfExpression.pdtt](org.eclipse.php.formatter.core.tests.FormatterTests)  Time elapsed: 0.004 sec
formatter[workspace/formatter/php5/new_default_formatter_configuration/staticStatement.pdtt](org.eclipse.php.formatter.core.tests.FormatterTests)  Time elapsed: 0.003 sec
formatter[workspace/formatter/php5/new_default_formatter_configuration/conditionalExpression.pdtt](org.eclipse.php.formatter.core.tests.FormatterTests)  Time elapsed: 0.004 sec
formatter[workspace/formatter/php5/new_default_formatter_configuration/switchCase.pdtt](org.eclipse.php.formatter.core.tests.FormatterTests)  Time elapsed: 0.011 sec
formatter[workspace/formatter/php5/new_default_formatter_configuration/globalStatement.pdtt](org.eclipse.php.formatter.core.tests.FormatterTests)  Time elapsed: 0.006 sec
formatter[workspace/formatter/php5/new_default_formatter_configuration/foreachStatements.pdtt](org.eclipse.php.formatter.core.tests.FormatterTests)  Time elapsed: 0.049 sec
formatter[workspace/formatter/php5/new_default_formatter_configuration/breakStatement.pdtt](org.eclipse.php.formatter.core.tests.FormatterTests)  Time elapsed: 0.006 sec
formatter[workspace/formatter/php5/new_default_formatter_configuration/arrayCreation.pdtt](org.eclipse.php.formatter.core.tests.FormatterTests)  Time elapsed: 0.006 sec
formatter[workspace/formatter/php5/new_default_formatter_configuration/castExpressiont.pdtt](org.eclipse.php.formatter.core.tests.FormatterTests)  Time elapsed: 0.004 sec
formatter[workspace/formatter/php5/new_default_formatter_configuration/classComments.pdtt](org.eclipse.php.formatter.core.tests.FormatterTests)  Time elapsed: 0.005 sec
formatter[workspace/formatter/php5/new_default_formatter_configuration/quote.pdtt](org.eclipse.php.formatter.core.tests.FormatterTests)  Time elapsed: 0.004 sec
formatter[workspace/formatter/php5/new_default_formatter_configuration/include.pdtt](org.eclipse.php.formatter.core.tests.FormatterTests)  Time elapsed: 0.004 sec
formatter[workspace/formatter/php5/new_default_formatter_configuration/forStatements.pdtt](org.eclipse.php.formatter.core.tests.FormatterTests)  Time elapsed: 0.008 sec
formatter[workspace/formatter/php5/new_default_formatter_configuration/methodEmptyLineThenComment.pdtt](org.eclipse.php.formatter.core.tests.FormatterTests)  Time elapsed: 0.005 sec
formatter[workspace/formatter/php5/new_default_formatter_configuration/doStatement.pdtt](org.eclipse.php.formatter.core.tests.FormatterTests)  Time elapsed: 0.004 sec
formatter[workspace/formatter/php5/new_default_formatter_configuration/cloneExpression.pdtt](org.eclipse.php.formatter.core.tests.FormatterTests)  Time elapsed: 0.003 sec
formatter[workspace/formatter/php5/new_default_formatter_configuration/declareStatement.pdtt](org.eclipse.php.formatter.core.tests.FormatterTests)  Time elapsed: 0.004 sec
formatter[workspace/formatter/php5/new_default_formatter_configuration/postfixExpression.pdtt](org.eclipse.php.formatter.core.tests.FormatterTests)  Time elapsed: 0.004 sec
formatter[workspace/formatter/php5/new_default_formatter_configuration/block.pdtt](org.eclipse.php.formatter.core.tests.FormatterTests)  Time elapsed: 0.005 sec
formatter[workspace/formatter/php5/new_default_formatter_configuration/listVariable.pdtt](org.eclipse.php.formatter.core.tests.FormatterTests)  Time elapsed: 0.005 sec
formatter[workspace/formatter/php5/new_default_formatter_configuration/foreachStatement.pdtt](org.eclipse.php.formatter.core.tests.FormatterTests)  Time elapsed: 0.008 sec
formatter[workspace/formatter/php5/new_default_formatter_configuration/arrayWithComment1.pdtt](org.eclipse.php.formatter.core.tests.FormatterTests)  Time elapsed: 0.004 sec
formatter[workspace/formatter/php5/new_default_formatter_configuration/returnStatement.pdtt](org.eclipse.php.formatter.core.tests.FormatterTests)  Time elapsed: 0.004 sec
formatter[workspace/formatter/php5/new_default_formatter_configuration/catchClause.pdtt](org.eclipse.php.formatter.core.tests.FormatterTests)  Time elapsed: 0.006 sec
formatter[workspace/formatter/php5/new_default_formatter_configuration/inLinePhp.pdtt](org.eclipse.php.formatter.core.tests.FormatterTests)  Time elapsed: 0.009 sec
formatter[workspace/formatter/php5/new_default_formatter_configuration/ifStatementsWithComment.pdtt](org.eclipse.php.formatter.core.tests.FormatterTests)  Time elapsed: 0.004 sec
formatter[workspace/formatter/php5/new_default_formatter_configuration/fieldAccess.pdtt](org.eclipse.php.formatter.core.tests.FormatterTests)  Time elapsed: 0.004 sec
formatter[workspace/formatter/php5/new_default_formatter_configuration/commentFormatter.pdtt](org.eclipse.php.formatter.core.tests.FormatterTests)  Time elapsed: 0.008 sec
formatter[workspace/formatter/php5/new_default_formatter_configuration/multiLinePHPdoc.pdtt](org.eclipse.php.formatter.core.tests.FormatterTests)  Time elapsed: 0.005 sec
formatter[workspace/formatter/php5/new_default_formatter_configuration/ignoreError.pdtt](org.eclipse.php.formatter.core.tests.FormatterTests)  Time elapsed: 0.005 sec
formatter[workspace/formatter/php5/new_default_formatter_configuration/phpWithinHtmlTag.pdtt](org.eclipse.php.formatter.core.tests.FormatterTests)  Time elapsed: 0.015 sec
formatter[workspace/formatter/php5/new_default_formatter_configuration/inLineHtml.pdtt](org.eclipse.php.formatter.core.tests.FormatterTests)  Time elapsed: 0.025 sec
formatter[workspace/formatter/php5/new_default_formatter_configuration/multiPHPSections.pdtt](org.eclipse.php.formatter.core.tests.FormatterTests)  Time elapsed: 0.004 sec
formatter[workspace/formatter/php5/new_default_formatter_configuration/methodChain.pdtt](org.eclipse.php.formatter.core.tests.FormatterTests)  Time elapsed: 0.003 sec
formatter[workspace/formatter/php5/new_default_formatter_configuration/arrayStatements.pdtt](org.eclipse.php.formatter.core.tests.FormatterTests)  Time elapsed: 0.004 sec
formatter[workspace/formatter/php5/new_default_formatter_configuration/arrayAccess.pdtt](org.eclipse.php.formatter.core.tests.FormatterTests)  Time elapsed: 0.005 sec
formatter[workspace/formatter/php5/new_default_formatter_configuration/continueStatement.pdtt](org.eclipse.php.formatter.core.tests.FormatterTests)  Time elapsed: 0.036 sec
formatter[workspace/formatter/php5/new_default_formatter_configuration/fieldDeclaration.pdtt](org.eclipse.php.formatter.core.tests.FormatterTests)  Time elapsed: 0.004 sec
formatter[workspace/formatter/php5/new_default_formatter_configuration/staticFieldAccess.pdtt](org.eclipse.php.formatter.core.tests.FormatterTests)  Time elapsed: 0.004 sec
formatter[workspace/formatter/php5/new_default_formatter_configuration/reflectionVariable.pdtt](org.eclipse.php.formatter.core.tests.FormatterTests)  Time elapsed: 0.003 sec
formatter[workspace/formatter/php5/new_default_formatter_configuration/assignment.pdtt](org.eclipse.php.formatter.core.tests.FormatterTests)  Time elapsed: 0.003 sec
formatter[workspace/formatter/php5/new_default_formatter_configuration/arrayWithComment2.pdtt](org.eclipse.php.formatter.core.tests.FormatterTests)  Time elapsed: 0.004 sec
formatter[workspace/formatter/php5/new_default_formatter_configuration/phpWithHtml.pdtt](org.eclipse.php.formatter.core.tests.FormatterTests)  Time elapsed: 0.081 sec
formatter[workspace/formatter/php5/new_default_formatter_configuration/echoStatement.pdtt](org.eclipse.php.formatter.core.tests.FormatterTests)  Time elapsed: 0.005 sec
formatter[workspace/formatter/php5/new_default_formatter_configuration/unicode.pdtt](org.eclipse.php.formatter.core.tests.FormatterTests)  Time elapsed: 0.005 sec
formatter[workspace/formatter/php5/new_default_formatter_configuration/infixExpression.pdtt](org.eclipse.php.formatter.core.tests.FormatterTests)  Time elapsed: 0.003 sec
formatter[workspace/formatter/php5/new_default_formatter_configuration/ifStatements.pdtt](org.eclipse.php.formatter.core.tests.FormatterTests)  Time elapsed: 0.003 sec
formatter[workspace/formatter/php5/new_default_formatter_configuration/whileStatements.pdtt](org.eclipse.php.formatter.core.tests.FormatterTests)  Time elapsed: 0.003 sec
formatter[workspace/formatter/php5/new_default_formatter_configuration/staticMethodInfokation.pdtt](org.eclipse.php.formatter.core.tests.FormatterTests)  Time elapsed: 0.003 sec
formatter[workspace/formatter/php5/new_default_formatter_configuration/tryStatements.pdtt](org.eclipse.php.formatter.core.tests.FormatterTests)  Time elapsed: 0.038 sec
formatter[workspace/formatter/php5/new_default_formatter_configuration/phpWithHtml1.pdtt](org.eclipse.php.formatter.core.tests.FormatterTests)  Time elapsed: 0.014 sec
formatter[workspace/formatter/php5/max_line_wrap_length_20/unaryOperation.pdtt](org.eclipse.php.formatter.core.tests.FormatterTests)  Time elapsed: 0.004 sec
formatter[workspace/formatter/php5/max_line_wrap_length_20/prefixExpression.pdtt](org.eclipse.php.formatter.core.tests.FormatterTests)  Time elapsed: 0.003 sec
formatter[workspace/formatter/php5/max_line_wrap_length_20/arrayElement.pdtt](org.eclipse.php.formatter.core.tests.FormatterTests)  Time elapsed: 0.004 sec
formatter[workspace/formatter/php5/max_line_wrap_length_20/declarationStatements.pdtt](org.eclipse.php.formatter.core.tests.FormatterTests)  Time elapsed: 0.004 sec
formatter[workspace/formatter/php5/max_line_wrap_length_20/reference.pdtt](org.eclipse.php.formatter.core.tests.FormatterTests)  Time elapsed: 0.003 sec
formatter[workspace/formatter/php5/max_line_wrap_length_20/backTickExpression.pdtt](org.eclipse.php.formatter.core.tests.FormatterTests)  Time elapsed: 0.003 sec
formatter[workspace/formatter/php5/max_line_wrap_length_20/classInstanceCreation.pdtt](org.eclipse.php.formatter.core.tests.FormatterTests)  Time elapsed: 0.003 sec
formatter[workspace/formatter/php5/max_line_wrap_length_20/functionName.pdtt](org.eclipse.php.formatter.core.tests.FormatterTests)  Time elapsed: 0.003 sec
formatter[workspace/formatter/php5/max_line_wrap_length_20/staticConstantAccess.pdtt](org.eclipse.php.formatter.core.tests.FormatterTests)  Time elapsed: 0.003 sec
formatter[workspace/formatter/php5/max_line_wrap_length_20/instanceOfExpression.pdtt](org.eclipse.php.formatter.core.tests.FormatterTests)  Time elapsed: 0.004 sec
formatter[workspace/formatter/php5/max_line_wrap_length_20/staticStatement.pdtt](org.eclipse.php.formatter.core.tests.FormatterTests)  Time elapsed: 0.003 sec
formatter[workspace/formatter/php5/max_line_wrap_length_20/conditionalExpression.pdtt](org.eclipse.php.formatter.core.tests.FormatterTests)  Time elapsed: 0.003 sec
formatter[workspace/formatter/php5/max_line_wrap_length_20/switchCase.pdtt](org.eclipse.php.formatter.core.tests.FormatterTests)  Time elapsed: 0.003 sec
formatter[workspace/formatter/php5/max_line_wrap_length_20/globalStatement.pdtt](org.eclipse.php.formatter.core.tests.FormatterTests)  Time elapsed: 0.003 sec
formatter[workspace/formatter/php5/max_line_wrap_length_20/foreachStatements.pdtt](org.eclipse.php.formatter.core.tests.FormatterTests)  Time elapsed: 0.002 sec
formatter[workspace/formatter/php5/max_line_wrap_length_20/breakStatement.pdtt](org.eclipse.php.formatter.core.tests.FormatterTests)  Time elapsed: 0.004 sec
formatter[workspace/formatter/php5/max_line_wrap_length_20/arrayCreation.pdtt](org.eclipse.php.formatter.core.tests.FormatterTests)  Time elapsed: 0.04 sec
formatter[workspace/formatter/php5/max_line_wrap_length_20/castExpressiont.pdtt](org.eclipse.php.formatter.core.tests.FormatterTests)  Time elapsed: 0.004 sec
formatter[workspace/formatter/php5/max_line_wrap_length_20/classComments.pdtt](org.eclipse.php.formatter.core.tests.FormatterTests)  Time elapsed: 0.009 sec
formatter[workspace/formatter/php5/max_line_wrap_length_20/quote.pdtt](org.eclipse.php.formatter.core.tests.FormatterTests)  Time elapsed: 0.003 sec
formatter[workspace/formatter/php5/max_line_wrap_length_20/include.pdtt](org.eclipse.php.formatter.core.tests.FormatterTests)  Time elapsed: 0.003 sec
formatter[workspace/formatter/php5/max_line_wrap_length_20/doStatement.pdtt](org.eclipse.php.formatter.core.tests.FormatterTests)  Time elapsed: 0.004 sec
formatter[workspace/formatter/php5/max_line_wrap_length_20/cloneExpression.pdtt](org.eclipse.php.formatter.core.tests.FormatterTests)  Time elapsed: 0.004 sec
formatter[workspace/formatter/php5/max_line_wrap_length_20/declareStatement.pdtt](org.eclipse.php.formatter.core.tests.FormatterTests)  Time elapsed: 0.004 sec
formatter[workspace/formatter/php5/max_line_wrap_length_20/postfixExpression.pdtt](org.eclipse.php.formatter.core.tests.FormatterTests)  Time elapsed: 0.003 sec
formatter[workspace/formatter/php5/max_line_wrap_length_20/listVariable.pdtt](org.eclipse.php.formatter.core.tests.FormatterTests)  Time elapsed: 0.004 sec
formatter[workspace/formatter/php5/max_line_wrap_length_20/foreachStatement.pdtt](org.eclipse.php.formatter.core.tests.FormatterTests)  Time elapsed: 0.007 sec
formatter[workspace/formatter/php5/max_line_wrap_length_20/returnStatement.pdtt](org.eclipse.php.formatter.core.tests.FormatterTests)  Time elapsed: 0.006 sec
formatter[workspace/formatter/php5/max_line_wrap_length_20/catchClause.pdtt](org.eclipse.php.formatter.core.tests.FormatterTests)  Time elapsed: 0.052 sec
formatter[workspace/formatter/php5/max_line_wrap_length_20/longTest.pdtt](org.eclipse.php.formatter.core.tests.FormatterTests)  Time elapsed: 0.012 sec
formatter[workspace/formatter/php5/max_line_wrap_length_20/inLinePhp.pdtt](org.eclipse.php.formatter.core.tests.FormatterTests)  Time elapsed: 0.008 sec
formatter[workspace/formatter/php5/max_line_wrap_length_20/fieldAccess.pdtt](org.eclipse.php.formatter.core.tests.FormatterTests)  Time elapsed: 0.003 sec
formatter[workspace/formatter/php5/max_line_wrap_length_20/ignoreError.pdtt](org.eclipse.php.formatter.core.tests.FormatterTests)  Time elapsed: 0.003 sec
formatter[workspace/formatter/php5/max_line_wrap_length_20/phpWithinHtmlTag.pdtt](org.eclipse.php.formatter.core.tests.FormatterTests)  Time elapsed: 0.011 sec
formatter[workspace/formatter/php5/max_line_wrap_length_20/inLineHtml.pdtt](org.eclipse.php.formatter.core.tests.FormatterTests)  Time elapsed: 0.017 sec
formatter[workspace/formatter/php5/max_line_wrap_length_20/arrayStatements.pdtt](org.eclipse.php.formatter.core.tests.FormatterTests)  Time elapsed: 0.004 sec
formatter[workspace/formatter/php5/max_line_wrap_length_20/arrayAccess.pdtt](org.eclipse.php.formatter.core.tests.FormatterTests)  Time elapsed: 0.004 sec
formatter[workspace/formatter/php5/max_line_wrap_length_20/continueStatement.pdtt](org.eclipse.php.formatter.core.tests.FormatterTests)  Time elapsed: 0.005 sec
formatter[workspace/formatter/php5/max_line_wrap_length_20/fieldDeclaration.pdtt](org.eclipse.php.formatter.core.tests.FormatterTests)  Time elapsed: 0.003 sec
formatter[workspace/formatter/php5/max_line_wrap_length_20/staticFieldAccess.pdtt](org.eclipse.php.formatter.core.tests.FormatterTests)  Time elapsed: 0.003 sec
formatter[workspace/formatter/php5/max_line_wrap_length_20/reflectionVariable.pdtt](org.eclipse.php.formatter.core.tests.FormatterTests)  Time elapsed: 0.003 sec
formatter[workspace/formatter/php5/max_line_wrap_length_20/assignment.pdtt](org.eclipse.php.formatter.core.tests.FormatterTests)  Time elapsed: 0.003 sec
formatter[workspace/formatter/php5/max_line_wrap_length_20/phpWithHtml.pdtt](org.eclipse.php.formatter.core.tests.FormatterTests)  Time elapsed: 0.026 sec
formatter[workspace/formatter/php5/max_line_wrap_length_20/echoStatement.pdtt](org.eclipse.php.formatter.core.tests.FormatterTests)  Time elapsed: 0.005 sec
formatter[workspace/formatter/php5/max_line_wrap_length_20/infixExpression.pdtt](org.eclipse.php.formatter.core.tests.FormatterTests)  Time elapsed: 0.002 sec
formatter[workspace/formatter/php5/max_line_wrap_length_20/ifStatements.pdtt](org.eclipse.php.formatter.core.tests.FormatterTests)  Time elapsed: 0.004 sec
formatter[workspace/formatter/php5/max_line_wrap_length_20/whileStatements.pdtt](org.eclipse.php.formatter.core.tests.FormatterTests)  Time elapsed: 0.005 sec
formatter[workspace/formatter/php5/max_line_wrap_length_20/staticMethodInfokation.pdtt](org.eclipse.php.formatter.core.tests.FormatterTests)  Time elapsed: 0.004 sec
formatter[workspace/formatter/php5/max_line_wrap_length_20/tryStatements.pdtt](org.eclipse.php.formatter.core.tests.FormatterTests)  Time elapsed: 0.003 sec
formatter[workspace/formatter/php5/comments_formatter_8/singleLineComment.pdtt](org.eclipse.php.formatter.core.tests.FormatterTests)  Time elapsed: 0.004 sec
formatter[workspace/formatter/php5/comments_formatter_8/test491991.pdtt](org.eclipse.php.formatter.core.tests.FormatterTests)  Time elapsed: 0.004 sec
formatter[workspace/formatter/php53/lambda_function_configuration/lambdaFunctionDeclaration.pdtt](org.eclipse.php.formatter.core.tests.FormatterTests)  Time elapsed: 0.024 sec
formatter[workspace/formatter/php53/default_formatter_configuration/useStatement.pdtt](org.eclipse.php.formatter.core.tests.FormatterTests)  Time elapsed: 0.027 sec
formatter[workspace/formatter/php53/default_formatter_configuration/useStatement7.pdtt](org.eclipse.php.formatter.core.tests.FormatterTests)  Time elapsed: 0.03 sec
formatter[workspace/formatter/php53/default_formatter_configuration/namespaceDeclaration9.pdtt](org.eclipse.php.formatter.core.tests.FormatterTests)  Time elapsed: 0.006 sec
formatter[workspace/formatter/php53/default_formatter_configuration/staticConstantAccess.pdtt](org.eclipse.php.formatter.core.tests.FormatterTests)  Time elapsed: 0.004 sec
formatter[workspace/formatter/php53/default_formatter_configuration/conditionalExpression.pdtt](org.eclipse.php.formatter.core.tests.FormatterTests)  Time elapsed: 0.003 sec
formatter[workspace/formatter/php53/default_formatter_configuration/useStatement1.pdtt](org.eclipse.php.formatter.core.tests.FormatterTests)  Time elapsed: 0.003 sec
formatter[workspace/formatter/php53/default_formatter_configuration/namespace3.pdtt](org.eclipse.php.formatter.core.tests.FormatterTests)  Time elapsed: 0.003 sec
formatter[workspace/formatter/php53/default_formatter_configuration/namespaceDeclarationImplements_mantis0031261.pdtt](org.eclipse.php.formatter.core.tests.FormatterTests)  Time elapsed: 0.002 sec
formatter[workspace/formatter/php53/default_formatter_configuration/namespaceDeclaration3.pdtt](org.eclipse.php.formatter.core.tests.FormatterTests)  Time elapsed: 0.002 sec
formatter[workspace/formatter/php53/default_formatter_configuration/useStatement8.pdtt](org.eclipse.php.formatter.core.tests.FormatterTests)  Time elapsed: 0.003 sec
formatter[workspace/formatter/php53/default_formatter_configuration/astError.pdtt](org.eclipse.php.formatter.core.tests.FormatterTests)  Time elapsed: 0.003 sec
formatter[workspace/formatter/php53/default_formatter_configuration/namespaceDeclaration2.pdtt](org.eclipse.php.formatter.core.tests.FormatterTests)  Time elapsed: 0.003 sec
formatter[workspace/formatter/php53/default_formatter_configuration/namespace1.pdtt](org.eclipse.php.formatter.core.tests.FormatterTests)  Time elapsed: 0.003 sec
formatter[workspace/formatter/php53/default_formatter_configuration/useStatement2.pdtt](org.eclipse.php.formatter.core.tests.FormatterTests)  Time elapsed: 0.002 sec
formatter[workspace/formatter/php53/default_formatter_configuration/namespaceDeclaration6.pdtt](org.eclipse.php.formatter.core.tests.FormatterTests)  Time elapsed: 0.003 sec
formatter[workspace/formatter/php53/default_formatter_configuration/namespaceDeclaration7.pdtt](org.eclipse.php.formatter.core.tests.FormatterTests)  Time elapsed: 0.002 sec
formatter[workspace/formatter/php53/default_formatter_configuration/namespaceInstantiation_mantis0027905.pdtt](org.eclipse.php.formatter.core.tests.FormatterTests)  Time elapsed: 0.003 sec
formatter[workspace/formatter/php53/default_formatter_configuration/namespaceDeclarationExtends_mantis0031261.pdtt](org.eclipse.php.formatter.core.tests.FormatterTests)  Time elapsed: 0.003 sec
formatter[workspace/formatter/php53/default_formatter_configuration/inheritdoc01.pdtt](org.eclipse.php.formatter.core.tests.FormatterTests)  Time elapsed: 0.003 sec
formatter[workspace/formatter/php53/default_formatter_configuration/namespaceDeclaration4.pdtt](org.eclipse.php.formatter.core.tests.FormatterTests)  Time elapsed: 0.002 sec
formatter[workspace/formatter/php53/default_formatter_configuration/useStatement6.pdtt](org.eclipse.php.formatter.core.tests.FormatterTests)  Time elapsed: 0.003 sec
formatter[workspace/formatter/php53/default_formatter_configuration/namespaceDeclaration8.pdtt](org.eclipse.php.formatter.core.tests.FormatterTests)  Time elapsed: 0.004 sec
formatter[workspace/formatter/php53/default_formatter_configuration/useStatement3.pdtt](org.eclipse.php.formatter.core.tests.FormatterTests)  Time elapsed: 0.002 sec
formatter[workspace/formatter/php53/default_formatter_configuration/lambdaFunctionDeclaration.pdtt](org.eclipse.php.formatter.core.tests.FormatterTests)  Time elapsed: 0.003 sec
formatter[workspace/formatter/php53/default_formatter_configuration/namespaceDeclaration5.pdtt](org.eclipse.php.formatter.core.tests.FormatterTests)  Time elapsed: 0.003 sec
formatter[workspace/formatter/php53/default_formatter_configuration/useStatement4.pdtt](org.eclipse.php.formatter.core.tests.FormatterTests)  Time elapsed: 0.002 sec
formatter[workspace/formatter/php53/default_formatter_configuration/methodChain.pdtt](org.eclipse.php.formatter.core.tests.FormatterTests)  Time elapsed: 0.002 sec
formatter[workspace/formatter/php53/default_formatter_configuration/namespace2.pdtt](org.eclipse.php.formatter.core.tests.FormatterTests)  Time elapsed: 0.004 sec
formatter[workspace/formatter/php53/default_formatter_configuration/useStatement5.pdtt](org.eclipse.php.formatter.core.tests.FormatterTests)  Time elapsed: 0.002 sec
formatter[workspace/formatter/php53/default_formatter_configuration/namespace_ZSTD-318.pdtt](org.eclipse.php.formatter.core.tests.FormatterTests)  Time elapsed: 0.003 sec
formatter[workspace/formatter/php53/default_formatter_configuration/namespaceDeclaration1.pdtt](org.eclipse.php.formatter.core.tests.FormatterTests)  Time elapsed: 0.028 sec
formatter[workspace/formatter/php53/default_formatter_configuration/staticMethodInfokation.pdtt](org.eclipse.php.formatter.core.tests.FormatterTests)  Time elapsed: 0.004 sec
formatter[workspace/formatter/php54/default_formatter_configuration/testTrait8.pdtt](org.eclipse.php.formatter.core.tests.FormatterTests)  Time elapsed: 0.023 sec
formatter[workspace/formatter/php54/default_formatter_configuration/testTrait6.pdtt](org.eclipse.php.formatter.core.tests.FormatterTests)  Time elapsed: 0.005 sec
formatter[workspace/formatter/php54/default_formatter_configuration/testStaticLambdaFunction.pdtt](org.eclipse.php.formatter.core.tests.FormatterTests)  Time elapsed: 0.002 sec
formatter[workspace/formatter/php54/default_formatter_configuration/arrayInitializer1.pdtt](org.eclipse.php.formatter.core.tests.FormatterTests)  Time elapsed: 0.003 sec
formatter[workspace/formatter/php54/default_formatter_configuration/methodInvocation1.pdtt](org.eclipse.php.formatter.core.tests.FormatterTests)  Time elapsed: 0.003 sec
formatter[workspace/formatter/php54/default_formatter_configuration/singleLine.pdtt](org.eclipse.php.formatter.core.tests.FormatterTests)  Time elapsed: 0.005 sec
formatter[workspace/formatter/php54/default_formatter_configuration/testTrait5.pdtt](org.eclipse.php.formatter.core.tests.FormatterTests)  Time elapsed: 0.064 sec
formatter[workspace/formatter/php54/default_formatter_configuration/testShortEcho.pdtt](org.eclipse.php.formatter.core.tests.FormatterTests)  Time elapsed: 0.004 sec
formatter[workspace/formatter/php54/default_formatter_configuration/testTrait4.pdtt](org.eclipse.php.formatter.core.tests.FormatterTests)  Time elapsed: 0.006 sec
formatter[workspace/formatter/php54/default_formatter_configuration/callable1.pdtt](org.eclipse.php.formatter.core.tests.FormatterTests)  Time elapsed: 0.003 sec
formatter[workspace/formatter/php54/default_formatter_configuration/arrayDereferenceCall.pdtt](org.eclipse.php.formatter.core.tests.FormatterTests)  Time elapsed: 0.003 sec
formatter[workspace/formatter/php54/default_formatter_configuration/expression1.pdtt](org.eclipse.php.formatter.core.tests.FormatterTests)  Time elapsed: 0.003 sec
formatter[workspace/formatter/php54/default_formatter_configuration/arrayInitializer3.pdtt](org.eclipse.php.formatter.core.tests.FormatterTests)  Time elapsed: 0.003 sec
formatter[workspace/formatter/php54/default_formatter_configuration/classInitializer1.pdtt](org.eclipse.php.formatter.core.tests.FormatterTests)  Time elapsed: 0.002 sec
formatter[workspace/formatter/php54/default_formatter_configuration/arrayInitializer4.pdtt](org.eclipse.php.formatter.core.tests.FormatterTests)  Time elapsed: 0.003 sec
formatter[workspace/formatter/php54/default_formatter_configuration/testTrait3.pdtt](org.eclipse.php.formatter.core.tests.FormatterTests)  Time elapsed: 0.003 sec
formatter[workspace/formatter/php54/default_formatter_configuration/testTrait7.pdtt](org.eclipse.php.formatter.core.tests.FormatterTests)  Time elapsed: 0.003 sec
formatter[workspace/formatter/php54/default_formatter_configuration/testTrait9.pdtt](org.eclipse.php.formatter.core.tests.FormatterTests)  Time elapsed: 0.003 sec
formatter[workspace/formatter/php54/default_formatter_configuration/testTrait2.pdtt](org.eclipse.php.formatter.core.tests.FormatterTests)  Time elapsed: 0.003 sec
formatter[workspace/formatter/php54/default_formatter_configuration/testTrait1.pdtt](org.eclipse.php.formatter.core.tests.FormatterTests)  Time elapsed: 0.003 sec
formatter[workspace/formatter/php55/default_formatter_configuration/yieldStatement1.pdtt](org.eclipse.php.formatter.core.tests.FormatterTests)  Time elapsed: 0.083 sec
formatter[workspace/formatter/php55/default_formatter_configuration/arrayInitializer1.pdtt](org.eclipse.php.formatter.core.tests.FormatterTests)  Time elapsed: 0.007 sec
formatter[workspace/formatter/php55/default_formatter_configuration/arrayInitializer3.pdtt](org.eclipse.php.formatter.core.tests.FormatterTests)  Time elapsed: 0.004 sec
formatter[workspace/formatter/php55/default_formatter_configuration/yieldStatement.pdtt](org.eclipse.php.formatter.core.tests.FormatterTests)  Time elapsed: 0.004 sec
formatter[workspace/formatter/php55/default_formatter_configuration/tryStatements.pdtt](org.eclipse.php.formatter.core.tests.FormatterTests)  Time elapsed: 0.003 sec
formatter[workspace/formatter/php56/default_formatter_configuration/constScalarExprs03.pdtt](org.eclipse.php.formatter.core.tests.FormatterTests)  Time elapsed: 0.021 sec
formatter[workspace/formatter/php56/default_formatter_configuration/constScalarExprs05.pdtt](org.eclipse.php.formatter.core.tests.FormatterTests)  Time elapsed: 0.005 sec
formatter[workspace/formatter/php56/default_formatter_configuration/useFunctionConst01.pdtt](org.eclipse.php.formatter.core.tests.FormatterTests)  Time elapsed: 0.009 sec
formatter[workspace/formatter/php56/default_formatter_configuration/constScalarExprs04.pdtt](org.eclipse.php.formatter.core.tests.FormatterTests)  Time elapsed: 0.081 sec
formatter[workspace/formatter/php56/default_formatter_configuration/argumentUnpacking01.pdtt](org.eclipse.php.formatter.core.tests.FormatterTests)  Time elapsed: 0.008 sec
formatter[workspace/formatter/php56/default_formatter_configuration/constScalarExprs01.pdtt](org.eclipse.php.formatter.core.tests.FormatterTests)  Time elapsed: 0.004 sec
formatter[workspace/formatter/php56/default_formatter_configuration/variadicParameter01.pdtt](org.eclipse.php.formatter.core.tests.FormatterTests)  Time elapsed: 0.003 sec
formatter[workspace/formatter/php56/default_formatter_configuration/powOperator.pdtt](org.eclipse.php.formatter.core.tests.FormatterTests)  Time elapsed: 0.004 sec
formatter[workspace/formatter/php56/default_formatter_configuration/constScalarExprs02.pdtt](org.eclipse.php.formatter.core.tests.FormatterTests)  Time elapsed: 0.003 sec
formatter[workspace/formatter/php56/default_formatter_configuration/useFunctionConst02.pdtt](org.eclipse.php.formatter.core.tests.FormatterTests)  Time elapsed: 0.003 sec
formatter[workspace/formatter/php7/default_formatter_configuration/returnType01.pdtt](org.eclipse.php.formatter.core.tests.FormatterTests)  Time elapsed: 0.024 sec
formatter[workspace/formatter/php7/default_formatter_configuration/spaceshipOperator02.pdtt](org.eclipse.php.formatter.core.tests.FormatterTests)  Time elapsed: 0.004 sec
formatter[workspace/formatter/php7/default_formatter_configuration/nullCoalesceOperator01.pdtt](org.eclipse.php.formatter.core.tests.FormatterTests)  Time elapsed: 0.006 sec
formatter[workspace/formatter/php7/default_formatter_configuration/spaceshipOperator01.pdtt](org.eclipse.php.formatter.core.tests.FormatterTests)  Time elapsed: 0.005 sec
formatter[workspace/formatter/php7/default_formatter_configuration/groupUseStatement01.pdtt](org.eclipse.php.formatter.core.tests.FormatterTests)  Time elapsed: 0.003 sec
formatter[workspace/formatter/php7/default_formatter_configuration/anonymousClass01.pdtt](org.eclipse.php.formatter.core.tests.FormatterTests)  Time elapsed: 0.004 sec
formatter[workspace/formatter/php7/default_formatter_configuration/anonymousFunction01.pdtt](org.eclipse.php.formatter.core.tests.FormatterTests)  Time elapsed: 0.003 sec
formatter[workspace/formatter/php7/default_formatter_configuration/generatorDelegation01.pdtt](org.eclipse.php.formatter.core.tests.FormatterTests)  Time elapsed: 0.003 sec
formatter[workspace/formatter-autoedit/php5/pasteMethod1.pdtt](org.eclipse.php.formatter.core.tests.FormatterAutoEditTests)  Time elapsed: 0.126 sec
formatter[workspace/formatter-autoedit/php5/arrayStatements2.pdtt](org.eclipse.php.formatter.core.tests.FormatterAutoEditTests)  Time elapsed: 0.006 sec
formatter[workspace/formatter-autoedit/php5/pasteMethod5.pdtt](org.eclipse.php.formatter.core.tests.FormatterAutoEditTests)  Time elapsed: 0.009 sec
formatter[workspace/formatter-autoedit/php5/arrayStatements6.pdtt](org.eclipse.php.formatter.core.tests.FormatterAutoEditTests)  Time elapsed: 0.016 sec
formatter[workspace/formatter-autoedit/php5/arrayStatements1.pdtt](org.eclipse.php.formatter.core.tests.FormatterAutoEditTests)  Time elapsed: 0.005 sec
formatter[workspace/formatter-autoedit/php5/pasteClass1.pdtt](org.eclipse.php.formatter.core.tests.FormatterAutoEditTests)  Time elapsed: 0.008 sec
formatter[workspace/formatter-autoedit/php5/arrayStatements11.pdtt](org.eclipse.php.formatter.core.tests.FormatterAutoEditTests)  Time elapsed: 0.01 sec
formatter[workspace/formatter-autoedit/php5/comments02.pdtt](org.eclipse.php.formatter.core.tests.FormatterAutoEditTests)  Time elapsed: 0.004 sec
formatter[workspace/formatter-autoedit/php5/pasteMethod4.pdtt](org.eclipse.php.formatter.core.tests.FormatterAutoEditTests)  Time elapsed: 0.01 sec
formatter[workspace/formatter-autoedit/php5/pasteMethod2.pdtt](org.eclipse.php.formatter.core.tests.FormatterAutoEditTests)  Time elapsed: 0.009 sec
formatter[workspace/formatter-autoedit/php5/arrayStatements12.pdtt](org.eclipse.php.formatter.core.tests.FormatterAutoEditTests)  Time elapsed: 0.005 sec
formatter[workspace/formatter-autoedit/php5/autoInsertClosingBraces.pdtt](org.eclipse.php.formatter.core.tests.FormatterAutoEditTests)  Time elapsed: 0.006 sec
formatter[workspace/formatter-autoedit/php5/arrayStatements9.pdtt](org.eclipse.php.formatter.core.tests.FormatterAutoEditTests)  Time elapsed: 0.005 sec
formatter[workspace/formatter-autoedit/php5/arrayStatements10.pdtt](org.eclipse.php.formatter.core.tests.FormatterAutoEditTests)  Time elapsed: 0.005 sec
formatter[workspace/formatter-autoedit/php5/multilineVariableDeclaration.pdtt](org.eclipse.php.formatter.core.tests.FormatterAutoEditTests)  Time elapsed: 0.005 sec
formatter[workspace/formatter-autoedit/php5/commentWithArrayStatement03.pdtt](org.eclipse.php.formatter.core.tests.FormatterAutoEditTests)  Time elapsed: 0.01 sec
formatter[workspace/formatter-autoedit/php5/arrayStatements4.pdtt](org.eclipse.php.formatter.core.tests.FormatterAutoEditTests)  Time elapsed: 0.005 sec
formatter[workspace/formatter-autoedit/php5/pasteArray1.pdtt](org.eclipse.php.formatter.core.tests.FormatterAutoEditTests)  Time elapsed: 0.035 sec
formatter[workspace/formatter-autoedit/php5/arrayStatements5.pdtt](org.eclipse.php.formatter.core.tests.FormatterAutoEditTests)  Time elapsed: 0.005 sec
formatter[workspace/formatter-autoedit/php5/pasteMethod6.pdtt](org.eclipse.php.formatter.core.tests.FormatterAutoEditTests)  Time elapsed: 0.006 sec
formatter[workspace/formatter-autoedit/php5/arrayStatements3.pdtt](org.eclipse.php.formatter.core.tests.FormatterAutoEditTests)  Time elapsed: 0.004 sec
formatter[workspace/formatter-autoedit/php5/comments03.pdtt](org.eclipse.php.formatter.core.tests.FormatterAutoEditTests)  Time elapsed: 0.005 sec
formatter[workspace/formatter-autoedit/php5/commentWithArrayStatement01.pdtt](org.eclipse.php.formatter.core.tests.FormatterAutoEditTests)  Time elapsed: 0.005 sec
formatter[workspace/formatter-autoedit/php5/pasteMethod3.pdtt](org.eclipse.php.formatter.core.tests.FormatterAutoEditTests)  Time elapsed: 0.006 sec
formatter[workspace/formatter-autoedit/php5/comments01.pdtt](org.eclipse.php.formatter.core.tests.FormatterAutoEditTests)  Time elapsed: 0.004 sec
formatter[workspace/formatter-autoedit/php5/multilineFunctionDeclaration.pdtt](org.eclipse.php.formatter.core.tests.FormatterAutoEditTests)  Time elapsed: 0.006 sec
formatter[workspace/formatter-autoedit/php5/arrayStatements8.pdtt](org.eclipse.php.formatter.core.tests.FormatterAutoEditTests)  Time elapsed: 0.005 sec
formatter[workspace/formatter-autoedit/php5/defaultStatement.pdtt](org.eclipse.php.formatter.core.tests.FormatterAutoEditTests)  Time elapsed: 0.003 sec
formatter[workspace/formatter-autoedit/php5/commentWithArrayStatement02.pdtt](org.eclipse.php.formatter.core.tests.FormatterAutoEditTests)  Time elapsed: 0.003 sec
formatter[workspace/formatter-autoedit/php5/multilinePhpDoc.pdtt](org.eclipse.php.formatter.core.tests.FormatterAutoEditTests)  Time elapsed: 0.008 sec
formatter[workspace/formatter-autoedit/php5/multilineExceptionDeclaration.pdtt](org.eclipse.php.formatter.core.tests.FormatterAutoEditTests)  Time elapsed: 0.004 sec
formatter[workspace/formatter-autoedit/php5/multilineComment.pdtt](org.eclipse.php.formatter.core.tests.FormatterAutoEditTests)  Time elapsed: 0.007 sec
formatter[workspace/formatter-autoedit/php5/pasteMethod1.pdtt](org.eclipse.php.formatter.core.tests.FormatterLinuxAutoEditTests)  Time elapsed: 0.023 sec
formatter[workspace/formatter-autoedit/php5/arrayStatements2.pdtt](org.eclipse.php.formatter.core.tests.FormatterLinuxAutoEditTests)  Time elapsed: 0.004 sec
formatter[workspace/formatter-autoedit/php5/pasteMethod5.pdtt](org.eclipse.php.formatter.core.tests.FormatterLinuxAutoEditTests)  Time elapsed: 0.005 sec
formatter[workspace/formatter-autoedit/php5/arrayStatements6.pdtt](org.eclipse.php.formatter.core.tests.FormatterLinuxAutoEditTests)  Time elapsed: 0.003 sec
formatter[workspace/formatter-autoedit/php5/arrayStatements1.pdtt](org.eclipse.php.formatter.core.tests.FormatterLinuxAutoEditTests)  Time elapsed: 0.003 sec
formatter[workspace/formatter-autoedit/php5/pasteClass1.pdtt](org.eclipse.php.formatter.core.tests.FormatterLinuxAutoEditTests)  Time elapsed: 0.004 sec
formatter[workspace/formatter-autoedit/php5/arrayStatements11.pdtt](org.eclipse.php.formatter.core.tests.FormatterLinuxAutoEditTests)  Time elapsed: 0.005 sec
formatter[workspace/formatter-autoedit/php5/comments02.pdtt](org.eclipse.php.formatter.core.tests.FormatterLinuxAutoEditTests)  Time elapsed: 0.002 sec
formatter[workspace/formatter-autoedit/php5/pasteMethod4.pdtt](org.eclipse.php.formatter.core.tests.FormatterLinuxAutoEditTests)  Time elapsed: 0.006 sec
formatter[workspace/formatter-autoedit/php5/pasteMethod2.pdtt](org.eclipse.php.formatter.core.tests.FormatterLinuxAutoEditTests)  Time elapsed: 0.015 sec
formatter[workspace/formatter-autoedit/php5/arrayStatements12.pdtt](org.eclipse.php.formatter.core.tests.FormatterLinuxAutoEditTests)  Time elapsed: 0.004 sec
formatter[workspace/formatter-autoedit/php5/autoInsertClosingBraces.pdtt](org.eclipse.php.formatter.core.tests.FormatterLinuxAutoEditTests)  Time elapsed: 0.004 sec
formatter[workspace/formatter-autoedit/php5/arrayStatements9.pdtt](org.eclipse.php.formatter.core.tests.FormatterLinuxAutoEditTests)  Time elapsed: 0.003 sec
formatter[workspace/formatter-autoedit/php5/arrayStatements10.pdtt](org.eclipse.php.formatter.core.tests.FormatterLinuxAutoEditTests)  Time elapsed: 0.003 sec
formatter[workspace/formatter-autoedit/php5/multilineVariableDeclaration.pdtt](org.eclipse.php.formatter.core.tests.FormatterLinuxAutoEditTests)  Time elapsed: 0.003 sec
formatter[workspace/formatter-autoedit/php5/commentWithArrayStatement03.pdtt](org.eclipse.php.formatter.core.tests.FormatterLinuxAutoEditTests)  Time elapsed: 0.063 sec
formatter[workspace/formatter-autoedit/php5/arrayStatements4.pdtt](org.eclipse.php.formatter.core.tests.FormatterLinuxAutoEditTests)  Time elapsed: 0.004 sec
formatter[workspace/formatter-autoedit/php5/pasteArray1.pdtt](org.eclipse.php.formatter.core.tests.FormatterLinuxAutoEditTests)  Time elapsed: 0.018 sec
formatter[workspace/formatter-autoedit/php5/arrayStatements5.pdtt](org.eclipse.php.formatter.core.tests.FormatterLinuxAutoEditTests)  Time elapsed: 0.004 sec
formatter[workspace/formatter-autoedit/php5/pasteMethod6.pdtt](org.eclipse.php.formatter.core.tests.FormatterLinuxAutoEditTests)  Time elapsed: 0.005 sec
formatter[workspace/formatter-autoedit/php5/arrayStatements3.pdtt](org.eclipse.php.formatter.core.tests.FormatterLinuxAutoEditTests)  Time elapsed: 0.003 sec
formatter[workspace/formatter-autoedit/php5/comments03.pdtt](org.eclipse.php.formatter.core.tests.FormatterLinuxAutoEditTests)  Time elapsed: 0.002 sec
formatter[workspace/formatter-autoedit/php5/commentWithArrayStatement01.pdtt](org.eclipse.php.formatter.core.tests.FormatterLinuxAutoEditTests)  Time elapsed: 0.004 sec
formatter[workspace/formatter-autoedit/php5/pasteMethod3.pdtt](org.eclipse.php.formatter.core.tests.FormatterLinuxAutoEditTests)  Time elapsed: 0.03 sec
formatter[workspace/formatter-autoedit/php5/comments01.pdtt](org.eclipse.php.formatter.core.tests.FormatterLinuxAutoEditTests)  Time elapsed: 0.005 sec
formatter[workspace/formatter-autoedit/php5/multilineFunctionDeclaration.pdtt](org.eclipse.php.formatter.core.tests.FormatterLinuxAutoEditTests)  Time elapsed: 0.005 sec
formatter[workspace/formatter-autoedit/php5/arrayStatements8.pdtt](org.eclipse.php.formatter.core.tests.FormatterLinuxAutoEditTests)  Time elapsed: 0.005 sec
formatter[workspace/formatter-autoedit/php5/defaultStatement.pdtt](org.eclipse.php.formatter.core.tests.FormatterLinuxAutoEditTests)  Time elapsed: 0.004 sec
formatter[workspace/formatter-autoedit/php5/commentWithArrayStatement02.pdtt](org.eclipse.php.formatter.core.tests.FormatterLinuxAutoEditTests)  Time elapsed: 0.004 sec
formatter[workspace/formatter-autoedit/php5/multilinePhpDoc.pdtt](org.eclipse.php.formatter.core.tests.FormatterLinuxAutoEditTests)  Time elapsed: 0.009 sec
formatter[workspace/formatter-autoedit/php5/multilineExceptionDeclaration.pdtt](org.eclipse.php.formatter.core.tests.FormatterLinuxAutoEditTests)  Time elapsed: 0.005 sec
formatter[workspace/formatter-autoedit/php5/multilineComment.pdtt](org.eclipse.php.formatter.core.tests.FormatterLinuxAutoEditTests)  Time elapsed: 0.009 sec

Results :

Tests run: 406, Failures: 0, Errors: 0, Skipped: 0

[INFO] All tests passed!
30/06/2016 11:22:44 Xvnc version X.org/xf4vnc custom version
30/06/2016 11:22:44 Copyright (C) 2001-2004 Alan Hourihane.
30/06/2016 11:22:44 Copyright (C) 2000-2004 Constantin Kaplinsky
30/06/2016 11:22:44 Copyright (C) 1999 AT&T Laboratories Cambridge
30/06/2016 11:22:44 All Rights Reserved.
30/06/2016 11:22:44 See http://www.tightvnc.com/ for information on TightVNC
30/06/2016 11:22:44 See http://xf4vnc.sf.net for xf4vnc-specific information
30/06/2016 11:22:44 Desktop name 'x11' (hipp5:299)
30/06/2016 11:22:44 Protocol versions supported: 3.7, 3.3
30/06/2016 11:22:44 RGB format 8 8 8
30/06/2016 11:22:44 Listening for VNC connections on TCP port 6199
[dix] Could not init font path element /usr/share/fonts/TTF/, removing from list!
[dix] Could not init font path element /usr/share/fonts/OTF, removing from list!
(EE) config/hal: NewInputDeviceRequest failed (2)
(EE) config/hal: NewInputDeviceRequest failed (2)
[INFO]                                                                         
[INFO] ------------------------------------------------------------------------
[INFO] Building org.eclipse.php.refactoring.core.tests 4.1.0-SNAPSHOT
[INFO] ------------------------------------------------------------------------
[INFO] 
[INFO] --- maven-clean-plugin:2.4.1:clean (default-clean) @ org.eclipse.php.refactoring.core.tests ---
[INFO] 
[INFO] --- tycho-packaging-plugin:0.23.0:build-qualifier (default-build-qualifier) @ org.eclipse.php.refactoring.core.tests ---
[INFO] The project's OSGi version is 4.1.0.201606301519
[INFO] 
[INFO] --- tycho-packaging-plugin:0.23.0:validate-id (default-validate-id) @ org.eclipse.php.refactoring.core.tests ---
[INFO] 
[INFO] --- tycho-packaging-plugin:0.23.0:validate-version (default-validate-version) @ org.eclipse.php.refactoring.core.tests ---
[INFO] 
[INFO] --- maven-resources-plugin:2.4.3:resources (default-resources) @ org.eclipse.php.refactoring.core.tests ---
[INFO] Using 'UTF-8' encoding to copy filtered resources.
[INFO] skip non existing resourceDirectory /jobs/genie.pdt/pdt-gerrit/workspace2/tests/org.eclipse.php.refactoring.core.tests/src/main/resources
[INFO] 
[INFO] --- tycho-compiler-plugin:0.23.0:compile (default-compile) @ org.eclipse.php.refactoring.core.tests ---
[INFO] Compiling 70 source files to /jobs/genie.pdt/pdt-gerrit/workspace2/tests/org.eclipse.php.refactoring.core.tests/target/classes
[INFO] 
[INFO] --- maven-resources-plugin:2.4.3:testResources (default-testResources) @ org.eclipse.php.refactoring.core.tests ---
[INFO] Using 'UTF-8' encoding to copy filtered resources.
[INFO] skip non existing resourceDirectory /jobs/genie.pdt/pdt-gerrit/workspace2/tests/org.eclipse.php.refactoring.core.tests/src/test/resources
[INFO] 
[INFO] --- tycho-source-plugin:0.23.0:plugin-source (plugin-source) @ org.eclipse.php.refactoring.core.tests ---
[INFO] Building jar: /jobs/genie.pdt/pdt-gerrit/workspace2/tests/org.eclipse.php.refactoring.core.tests/target/org.eclipse.php.refactoring.core.tests-4.1.0-SNAPSHOT-sources.jar
[INFO] 
[INFO] --- target-platform-configuration:0.23.0:target-platform (default-target-platform) @ org.eclipse.php.refactoring.core.tests ---
[INFO] 
[INFO] --- tycho-packaging-plugin:0.23.0:package-plugin (default-package-plugin) @ org.eclipse.php.refactoring.core.tests ---
[INFO] Building jar: /jobs/genie.pdt/pdt-gerrit/workspace2/tests/org.eclipse.php.refactoring.core.tests/target/org.eclipse.php.refactoring.core.tests-4.1.0-SNAPSHOT.jar
[INFO] 
[INFO] --- tycho-p2-plugin:0.23.0:p2-metadata-default (default-p2-metadata-default) @ org.eclipse.php.refactoring.core.tests ---
[INFO] 
[INFO] --- tycho-surefire-plugin:0.23.0:test (default-test) @ org.eclipse.php.refactoring.core.tests ---
[INFO] Expected eclipse log file: /jobs/genie.pdt/pdt-gerrit/workspace2/tests/org.eclipse.php.refactoring.core.tests/target/work/data/.metadata/.log
[INFO] Command line:
	[/opt/public/common/jdk1.8.0_51.x64/jre/bin/java, -Dosgi.noShutdown=false, -Dosgi.os=linux, -Dosgi.ws=gtk, -Dosgi.arch=x86_64, -Dh2.syncMethod=force, -Xmx512m, -XX:MaxPermSize=256m, -Dosgi.clean=true, -jar, /opt/public/hipp/homes/genie.pdt/.m2/repository/p2/osgi/bundle/org.eclipse.equinox.launcher/1.3.200.v20160318-1642/org.eclipse.equinox.launcher-1.3.200.v20160318-1642.jar, -data, /jobs/genie.pdt/pdt-gerrit/workspace2/tests/org.eclipse.php.refactoring.core.tests/target/work/data, -install, /jobs/genie.pdt/pdt-gerrit/workspace2/tests/org.eclipse.php.refactoring.core.tests/target/work, -configuration, /jobs/genie.pdt/pdt-gerrit/workspace2/tests/org.eclipse.php.refactoring.core.tests/target/work/configuration, -application, org.eclipse.tycho.surefire.osgibooter.uitest, -testproperties, /jobs/genie.pdt/pdt-gerrit/workspace2/tests/org.eclipse.php.refactoring.core.tests/target/surefire.properties, -nouithread]
Java HotSpot(TM) 64-Bit Server VM warning: ignoring option MaxPermSize=256m; support was removed in 8.0
Xlib:  extension "RANDR" missing on display ":299.0".

-------------------------------------------------------
 T E S T S
-------------------------------------------------------
Running org.eclipse.php.refactoring.core.test.AllTests
[TEST] -> org.eclipse.php.refactoring.core.rename.AllTests
[TEST] -> org.eclipse.php.refactoring.core.move.AllTests
[TEST] -> org.eclipse.php.refactoring.core.extract.function.AllTests
[TEST] -> org.eclipse.php.refactoring.core.extract.variable.AllTests
[TEST] -> org.eclipse.php.refactoring.core.changes.AllTests
Tests run: 118, Failures: 2, Errors: 0, Skipped: 0, Time elapsed: 18.816 sec <<< FAILURE! - in org.eclipse.php.refactoring.core.test.AllTests
test[resources/rename/renameTrait/testRenameTrait.pdtt](org.eclipse.php.refactoring.core.rename.RenameTraitProcessorTest)  Time elapsed: 0.526 sec
rename[resources/rename/renameClassMember/testRenameClassMember26942.pdtt](org.eclipse.php.refactoring.core.rename.RenameClassMemberProcessorTest)  Time elapsed: 0.234 sec
rename[resources/rename/renameClassMember/testRenameClassMember7.pdtt](org.eclipse.php.refactoring.core.rename.RenameClassMemberProcessorTest)  Time elapsed: 0.168 sec
rename[resources/rename/renameClassMember/testRenameClassMember_ZSTD-3934-2.pdtt](org.eclipse.php.refactoring.core.rename.RenameClassMemberProcessorTest)  Time elapsed: 0.045 sec
rename[resources/rename/renameClassMember/testRenameClassMember3.pdtt](org.eclipse.php.refactoring.core.rename.RenameClassMemberProcessorTest)  Time elapsed: 0.049 sec
rename[resources/rename/renameClassMember/testRenameClassMember_ZSTD-3934-1.pdtt](org.eclipse.php.refactoring.core.rename.RenameClassMemberProcessorTest)  Time elapsed: 0.048 sec
rename[resources/rename/renameClassMember/testRenameClassMember11.pdtt](org.eclipse.php.refactoring.core.rename.RenameClassMemberProcessorTest)  Time elapsed: 0.049 sec
rename[resources/rename/renameClassMember/testRenameClassMember10.pdtt](org.eclipse.php.refactoring.core.rename.RenameClassMemberProcessorTest)  Time elapsed: 0.051 sec
rename[resources/rename/renameClassMember/testRenameClassMember2.pdtt](org.eclipse.php.refactoring.core.rename.RenameClassMemberProcessorTest)  Time elapsed: 0.07 sec
rename[resources/rename/renameClassMember/testRenameClassMember5.pdtt](org.eclipse.php.refactoring.core.rename.RenameClassMemberProcessorTest)  Time elapsed: 0.272 sec
rename[resources/rename/renameClassMember/testRenameClassMember4.pdtt](org.eclipse.php.refactoring.core.rename.RenameClassMemberProcessorTest)  Time elapsed: 0.035 sec
rename[resources/rename/renameClassMember/testRenameClassMember1.pdtt](org.eclipse.php.refactoring.core.rename.RenameClassMemberProcessorTest)  Time elapsed: 0.045 sec
rename[resources/rename/renameClassMember/testRenameClassMember9.pdtt](org.eclipse.php.refactoring.core.rename.RenameClassMemberProcessorTest)  Time elapsed: 0.043 sec
rename[resources/rename/renameClassMember/testRenameClassMember.pdtt](org.eclipse.php.refactoring.core.rename.RenameClassMemberProcessorTest)  Time elapsed: 0.028 sec
rename[resources/rename/renameClassMember/testRenameClassMember30679.pdtt](org.eclipse.php.refactoring.core.rename.RenameClassMemberProcessorTest)  Time elapsed: 0.042 sec
rename[resources/rename/renameClassMember/testRenameClassMember6.pdtt](org.eclipse.php.refactoring.core.rename.RenameClassMemberProcessorTest)  Time elapsed: 0.038 sec
rename[resources/rename/renameClassMember/testClassFieldWithIncludeFiles.pdtt](org.eclipse.php.refactoring.core.rename.RenameClassMemberProcessorTest)  Time elapsed: 0.041 sec
rename[resources/rename/renameClassMember/testRenameClassMember12.pdtt](org.eclipse.php.refactoring.core.rename.RenameClassMemberProcessorTest)  Time elapsed: 0.044 sec
rename[resources/rename/renameClassMember/testRenameClassMember27036.pdtt](org.eclipse.php.refactoring.core.rename.RenameClassMemberProcessorTest)  Time elapsed: 0.05 sec
rename[resources/rename/renameClassMember/testRenameClassMember8.pdtt](org.eclipse.php.refactoring.core.rename.RenameClassMemberProcessorTest)  Time elapsed: 0.046 sec
test[resources/rename/renameTraitMember/testRenameTraitMember6.pdtt](org.eclipse.php.refactoring.core.rename.RenameTraitMemberProcessorTest)  Time elapsed: 0.154 sec
rename[resources/rename/renameTraitMember/testRenameTraitMember6.pdtt](org.eclipse.php.refactoring.core.rename.RenameTraitMemberProcessorTest)  Time elapsed: 0.061 sec
test[resources/rename/renameTraitMember/testRenameTraitMember1.pdtt](org.eclipse.php.refactoring.core.rename.RenameTraitMemberProcessorTest)  Time elapsed: 0.029 sec
rename[resources/rename/renameTraitMember/testRenameTraitMember1.pdtt](org.eclipse.php.refactoring.core.rename.RenameTraitMemberProcessorTest)  Time elapsed: 0.032 sec
test[resources/rename/renameTraitMember/testRenameTraitMember4.pdtt](org.eclipse.php.refactoring.core.rename.RenameTraitMemberProcessorTest)  Time elapsed: 0.092 sec
rename[resources/rename/renameTraitMember/testRenameTraitMember4.pdtt](org.eclipse.php.refactoring.core.rename.RenameTraitMemberProcessorTest)  Time elapsed: 0.032 sec
test[resources/rename/renameTraitMember/testRenameTraitMember5.pdtt](org.eclipse.php.refactoring.core.rename.RenameTraitMemberProcessorTest)  Time elapsed: 0.077 sec
rename[resources/rename/renameTraitMember/testRenameTraitMember5.pdtt](org.eclipse.php.refactoring.core.rename.RenameTraitMemberProcessorTest)  Time elapsed: 0.031 sec
test[resources/rename/renameTraitMember/testRenameTraitMember.pdtt](org.eclipse.php.refactoring.core.rename.RenameTraitMemberProcessorTest)  Time elapsed: 0.1 sec  <<< FAILURE!
java.lang.AssertionError: 
EXPECTED:
--------------
<?php
trait RenameTraitMember{
	public function fun11(){
	}
	public function fun2() {
	}
	public function fun3() {
	}
	public $a;
	private $b;
	public $c*****;
}
class RenameTraitMember_class {
	use RenameTraitMember{
		fun11 as public;
		a as a1;
	}
	use RenameTraitMember{
		RenameTraitMember::fun2 as public fun4;
		b as public b1;
	}
}
$a = new RenameTraitMember_class();
$a->fun11();
$a->fun4();
$a->fun3();
$a->b1;
$a->a1;
$a->c;
?>

ACTUAL:
--------------
<?php
trait RenameTraitMember{
	public function fun11(){
	}
	public function fun2() {
	}
	public function fun3() {
	}
	public $a;
	private $b;
	public $c*****1;
}
class RenameTraitMember_class {
	use RenameTraitMember{
		fun11 as public;
		a as a1;
	}
	use RenameTraitMember{
		RenameTraitMember::fun2 as public fun4;
		b as public b1;
	}
}
$a = new RenameTraitMember_class();
$a->fun11();
$a->fun4();
$a->fun3();
$a->b1;
$a->a1;
$a->c;
?>
	at org.junit.Assert.fail(Assert.java:88)
	at org.eclipse.php.core.tests.PDTTUtils.assertContents(PDTTUtils.java:64)
	at org.eclipse.php.refactoring.core.test.AbstractRefactoringTest.checkTestResult(AbstractRefactoringTest.java:196)
	at org.eclipse.php.refactoring.core.rename.RenameTraitMemberProcessorTest.test(RenameTraitMemberProcessorTest.java:62)

rename[resources/rename/renameTraitMember/testRenameTraitMember.pdtt](org.eclipse.php.refactoring.core.rename.RenameTraitMemberProcessorTest)  Time elapsed: 0.038 sec  <<< FAILURE!
java.lang.AssertionError: 
EXPECTED:
--------------
<?php
trait RenameTraitMember{
	public function fun11(){
	}
	public function fun2() {
	}
	public function fun3() {
	}
	public $a;
	private $b;
	public $c*****;
}
class RenameTraitMember_class {
	use RenameTraitMember{
		fun11 as public;
		a as a1;
	}
	use RenameTraitMember{
		RenameTraitMember::fun2 as public fun4;
		b as public b1;
	}
}
$a = new RenameTraitMember_class();
$a->fun11();
$a->fun4();
$a->fun3();
$a->b1;
$a->a1;
$a->c;
?>

ACTUAL:
--------------
<?php
trait RenameTraitMember{
	public function fun11(){
	}
	public function fun2() {
	}
	public function fun3() {
	}
	public $a;
	private $b;
	public $c*****1;
}
class RenameTraitMember_class {
	use RenameTraitMember{
		fun11 as public;
		a as a1;
	}
	use RenameTraitMember{
		RenameTraitMember::fun2 as public fun4;
		b as public b1;
	}
}
$a = new RenameTraitMember_class();
$a->fun11();
$a->fun4();
$a->fun3();
$a->b1;
$a->a1;
$a->c;
?>
	at org.junit.Assert.fail(Assert.java:88)
	at org.eclipse.php.core.tests.PDTTUtils.assertContents(PDTTUtils.java:64)
	at org.eclipse.php.refactoring.core.test.AbstractRefactoringTest.checkTestResult(AbstractRefactoringTest.java:196)
	at org.eclipse.php.refactoring.core.rename.RenameClassMemberProcessorTest.rename(RenameClassMemberProcessorTest.java:53)
	at sun.reflect.GeneratedMethodAccessor13.invoke(Unknown Source)
	at sun.reflect.DelegatingMethodAccessorImpl.invoke(DelegatingMethodAccessorImpl.java:43)
	at java.lang.reflect.Method.invoke(Method.java:497)
	at org.junit.runners.model.FrameworkMethod$1.runReflectiveCall(FrameworkMethod.java:50)
	at org.junit.internal.runners.model.ReflectiveCallable.run(ReflectiveCallable.java:12)
	at org.junit.runners.model.FrameworkMethod.invokeExplosively(FrameworkMethod.java:47)
	at org.eclipse.php.core.tests.runner.PDTTList$FileTestClassRunner$1.evaluate(PDTTList.java:371)
	at org.junit.runners.ParentRunner.runLeaf(ParentRunner.java:325)
	at org.junit.runners.BlockJUnit4ClassRunner.runChild(BlockJUnit4ClassRunner.java:78)
	at org.junit.runners.BlockJUnit4ClassRunner.runChild(BlockJUnit4ClassRunner.java:57)
	at org.junit.runners.ParentRunner$3.run(ParentRunner.java:290)
	at org.junit.runners.ParentRunner$1.schedule(ParentRunner.java:71)
	at org.junit.runners.ParentRunner.runChildren(ParentRunner.java:288)
	at org.junit.runners.ParentRunner.access$000(ParentRunner.java:58)
	at org.junit.runners.ParentRunner$2.evaluate(ParentRunner.java:268)
	at org.junit.runners.ParentRunner.run(ParentRunner.java:363)
	at org.junit.runners.Suite.runChild(Suite.java:128)
	at org.junit.runners.Suite.runChild(Suite.java:27)
	at org.junit.runners.ParentRunner$3.run(ParentRunner.java:290)
	at org.junit.runners.ParentRunner$1.schedule(ParentRunner.java:71)
	at org.junit.runners.ParentRunner.runChildren(ParentRunner.java:288)
	at org.junit.runners.ParentRunner.access$000(ParentRunner.java:58)
	at org.junit.runners.ParentRunner$2.evaluate(ParentRunner.java:268)
	at org.eclipse.php.core.tests.runner.PDTTList$BeforeStatement.evaluate(PDTTList.java:258)
	at org.junit.internal.runners.statements.RunBefores.evaluate(RunBefores.java:26)
	at org.eclipse.php.core.tests.runner.PDTTList$AfterStatement.evaluate(PDTTList.java:277)
	at org.junit.runners.ParentRunner.run(ParentRunner.java:363)
	at org.junit.runners.Suite.runChild(Suite.java:128)
	at org.junit.runners.Suite.runChild(Suite.java:27)
	at org.junit.runners.ParentRunner$3.run(ParentRunner.java:290)
	at org.junit.runners.ParentRunner$1.schedule(ParentRunner.java:71)
	at org.junit.runners.ParentRunner.runChildren(ParentRunner.java:288)
	at org.junit.runners.ParentRunner.access$000(ParentRunner.java:58)
	at org.junit.runners.ParentRunner$2.evaluate(ParentRunner.java:268)
	at org.junit.internal.runners.statements.RunBefores.evaluate(RunBefores.java:26)
	at org.junit.internal.runners.statements.RunAfters.evaluate(RunAfters.java:27)
	at org.junit.rules.TestWatcher$1.evaluate(TestWatcher.java:55)
	at org.junit.rules.RunRules.evaluate(RunRules.java:20)
	at org.junit.runners.ParentRunner.run(ParentRunner.java:363)
	at org.junit.runners.Suite.runChild(Suite.java:128)
	at org.junit.runners.Suite.runChild(Suite.java:27)
	at org.junit.runners.ParentRunner$3.run(ParentRunner.java:290)
	at org.junit.runners.ParentRunner$1.schedule(ParentRunner.java:71)
	at org.junit.runners.ParentRunner.runChildren(ParentRunner.java:288)
	at org.junit.runners.ParentRunner.access$000(ParentRunner.java:58)
	at org.junit.runners.ParentRunner$2.evaluate(ParentRunner.java:268)
	at org.junit.internal.runners.statements.RunAfters.evaluate(RunAfters.java:27)
	at org.junit.runners.ParentRunner.run(ParentRunner.java:363)
	at org.apache.maven.surefire.junit4.JUnit4Provider.execute(JUnit4Provider.java:264)
	at org.apache.maven.surefire.junit4.JUnit4Provider.executeTestSet(JUnit4Provider.java:153)
	at org.apache.maven.surefire.junit4.JUnit4Provider.invoke(JUnit4Provider.java:124)
	at sun.reflect.NativeMethodAccessorImpl.invoke0(Native Method)
	at sun.reflect.NativeMethodAccessorImpl.invoke(NativeMethodAccessorImpl.java:62)
	at sun.reflect.DelegatingMethodAccessorImpl.invoke(DelegatingMethodAccessorImpl.java:43)
	at java.lang.reflect.Method.invoke(Method.java:497)
	at org.apache.maven.surefire.util.ReflectionUtils.invokeMethodWithArray2(ReflectionUtils.java:208)
	at org.apache.maven.surefire.booter.ProviderFactory$ProviderProxy.invoke(ProviderFactory.java:156)
	at org.apache.maven.surefire.booter.ProviderFactory.invokeProvider(ProviderFactory.java:82)
	at org.eclipse.tycho.surefire.osgibooter.OsgiSurefireBooter.run(OsgiSurefireBooter.java:91)
	at org.eclipse.tycho.surefire.osgibooter.AbstractUITestApplication.runTests(AbstractUITestApplication.java:44)
	at org.eclipse.e4.ui.internal.workbench.swt.E4Testable$1.run(E4Testable.java:73)
	at java.lang.Thread.run(Thread.java:745)

test[resources/rename/renameTraitMember/testRenameTraitMember2.pdtt](org.eclipse.php.refactoring.core.rename.RenameTraitMemberProcessorTest)  Time elapsed: 0.082 sec
rename[resources/rename/renameTraitMember/testRenameTraitMember2.pdtt](org.eclipse.php.refactoring.core.rename.RenameTraitMemberProcessorTest)  Time elapsed: 0.027 sec
test[resources/rename/renameTraitMember/testRenameTraitMember3.pdtt](org.eclipse.php.refactoring.core.rename.RenameTraitMemberProcessorTest)  Time elapsed: 0.063 sec
rename[resources/rename/renameTraitMember/testRenameTraitMember3.pdtt](org.eclipse.php.refactoring.core.rename.RenameTraitMemberProcessorTest)  Time elapsed: 0.026 sec
rename[resources/rename/renameFunction/testRenameFunc2.pdtt](org.eclipse.php.refactoring.core.rename.RenameFunctionProcessorTest)  Time elapsed: 0.026 sec
rename[resources/rename/renameFunction/testRenameFunc1.pdtt](org.eclipse.php.refactoring.core.rename.RenameFunctionProcessorTest)  Time elapsed: 0.018 sec
rename[resources/rename/renameFunction/testRenameFunc.pdtt](org.eclipse.php.refactoring.core.rename.RenameFunctionProcessorTest)  Time elapsed: 0.013 sec
rename[resources/rename/renameGblConst/testRenameGblConst.pdtt](org.eclipse.php.refactoring.core.rename.RenameGlobalConstantProcessorTest)  Time elapsed: 0.013 sec
test[resources/rename/renameGblVar/testRenameGblVar1.pdtt](org.eclipse.php.refactoring.core.rename.RenameGlobalVariableProcessorTest)  Time elapsed: 0.03 sec
test[resources/rename/renameGblVar/testRenameGblVar2.pdtt](org.eclipse.php.refactoring.core.rename.RenameGlobalVariableProcessorTest)  Time elapsed: 0.019 sec
test[resources/rename/renameGblVar/testRenameGblVar.pdtt](org.eclipse.php.refactoring.core.rename.RenameGlobalVariableProcessorTest)  Time elapsed: 0.012 sec
test[resources/rename/renameGblVar/testRenameGblVar3.pdtt](org.eclipse.php.refactoring.core.rename.RenameGlobalVariableProcessorTest)  Time elapsed: 0.051 sec
test[resources/rename/renameLocalVar/testRenameLocalVar30723.pdtt](org.eclipse.php.refactoring.core.rename.RenameLocalVariableProcessorTest)  Time elapsed: 0.011 sec
test[resources/rename/renameLocalVar/testRenameLocalVar.pdtt](org.eclipse.php.refactoring.core.rename.RenameLocalVariableProcessorTest)  Time elapsed: 0.006 sec
test[resources/rename/renameLocalVar/testRenameLocalVar3.pdtt](org.eclipse.php.refactoring.core.rename.RenameLocalVariableProcessorTest)  Time elapsed: 0.011 sec
test[resources/rename/renameLocalVar/testRenameLocalVar2.pdtt](org.eclipse.php.refactoring.core.rename.RenameLocalVariableProcessorTest)  Time elapsed: 0.008 sec
test[resources/rename/renameResource/testRenameResource3.pdtt](org.eclipse.php.refactoring.core.rename.RenameResourceProcessorTest)  Time elapsed: 0.055 sec
test[resources/rename/renameResource/testRenameResource1.pdtt](org.eclipse.php.refactoring.core.rename.RenameResourceProcessorTest)  Time elapsed: 0.075 sec
test[resources/rename/renameResource/testRenameResource.pdtt](org.eclipse.php.refactoring.core.rename.RenameResourceProcessorTest)  Time elapsed: 0.043 sec
test[resources/rename/renameResource/testRenameResource4.pdtt](org.eclipse.php.refactoring.core.rename.RenameResourceProcessorTest)  Time elapsed: 0.016 sec
testRename(org.eclipse.php.refactoring.core.rename.RenameProcessorTestCase0026915)  Time elapsed: 0.911 sec
testRename(org.eclipse.php.refactoring.core.rename.RenameProcessorTestCase0026972)  Time elapsed: 0.112 sec
testRename(org.eclipse.php.refactoring.core.rename.RenameProcessorTestCase0026988)  Time elapsed: 0.303 sec
testRename1(org.eclipse.php.refactoring.core.rename.RenameProcessorTestCase0027134)  Time elapsed: 0.069 sec
testRename2(org.eclipse.php.refactoring.core.rename.RenameProcessorTestCase0027134)  Time elapsed: 0.06 sec
testRename(org.eclipse.php.refactoring.core.rename.RenameFuncProcessorTestCase0027497)  Time elapsed: 0.264 sec
testRename(org.eclipse.php.refactoring.core.rename.PHPRenameProcessorRunConfigTestCase0027489)  Time elapsed: 0.167 sec
testRename(org.eclipse.php.refactoring.core.rename.PHPRenameProcessorRunConfigTestCase0027489file)  Time elapsed: 0.949 sec
testRename(org.eclipse.php.refactoring.core.rename.RenameFolderTestCase1)  Time elapsed: 0.787 sec
testRename(org.eclipse.php.refactoring.core.rename.RenameFolderTestCase2)  Time elapsed: 0.786 sec
testRename(org.eclipse.php.refactoring.core.rename.RenameFolderTestCase30346)  Time elapsed: 0.784 sec
testRename(org.eclipse.php.refactoring.core.rename.RenameLocalVarTest2)  Time elapsed: 0.043 sec
testRename1(org.eclipse.php.refactoring.core.rename.RenameClassMemberProcessorTest1)  Time elapsed: 0.129 sec
testRename1(org.eclipse.php.refactoring.core.rename.RenameClassMemberProcessorTest2)  Time elapsed: 0.114 sec
testRename1(org.eclipse.php.refactoring.core.rename.RenameClassMemberProcessorTest3)  Time elapsed: 0.086 sec
testRename1(org.eclipse.php.refactoring.core.rename.RenameClassMemberProcessorTest0027555)  Time elapsed: 0.157 sec
testRename(org.eclipse.php.refactoring.core.rename.RenameFileTestCase0029095)  Time elapsed: 0.098 sec
testRename(org.eclipse.php.refactoring.core.rename.RenameFileWithClass)  Time elapsed: 0.065 sec
testRename(org.eclipse.php.refactoring.core.rename.RenameProcessorTestCase0029408)  Time elapsed: 0.164 sec
testRename1(org.eclipse.php.refactoring.core.rename.RenameProcessorTestCaseZSTD_1006)  Time elapsed: 0.116 sec
testMoveing(org.eclipse.php.refactoring.core.move.PHPMoveProcessorTestCase)  Time elapsed: 0.322 sec
testMoveing(org.eclipse.php.refactoring.core.move.PHPMoveProcessorTestCase1)  Time elapsed: 0.254 sec
testMoveing(org.eclipse.php.refactoring.core.move.PHPMoveProcessorTestCase0027202)  Time elapsed: 0.25 sec
testMoveingFolder0029253(org.eclipse.php.refactoring.core.move.PHPMoveProcessorTestCase0029253)  Time elapsed: 0.19 sec
testMoveing(org.eclipse.php.refactoring.core.move.PHPMoveProcessorRunConfigTestCase)  Time elapsed: 0.115 sec
testMoveing(org.eclipse.php.refactoring.core.move.PHPMoveProcessorRunConfigTestCase1)  Time elapsed: 0.183 sec
testMoveing(org.eclipse.php.refactoring.core.move.PHPMoveProcessorRunConfigTestCase2)  Time elapsed: 0.066 sec
testMoveing(org.eclipse.php.refactoring.core.move.PHPMoveProcessorRunConfigTestCase0027489)  Time elapsed: 0.243 sec
testMoveing(org.eclipse.php.refactoring.core.move.PHPMoveProcessorBreakPointTestCase)  Time elapsed: 0.076 sec
test[resources/move/testMove3.pdtt](org.eclipse.php.refactoring.core.move.PHPMoveProcessorTest)  Time elapsed: 0.018 sec
test[resources/move/testMove1.pdtt](org.eclipse.php.refactoring.core.move.PHPMoveProcessorTest)  Time elapsed: 0.015 sec
test[resources/move/testMove.pdtt](org.eclipse.php.refactoring.core.move.PHPMoveProcessorTest)  Time elapsed: 0.015 sec
test[resources/move/testMove4.pdtt](org.eclipse.php.refactoring.core.move.PHPMoveProcessorTest)  Time elapsed: 0.011 sec
test[resources/move/testMove2.pdtt](org.eclipse.php.refactoring.core.move.PHPMoveProcessorTest)  Time elapsed: 0.003 sec
test[resources/extractfunc/testVaraibleInstance.pdtt](org.eclipse.php.refactoring.core.extract.function.ExtractFunctionRefactoringTest)  Time elapsed: 0.232 sec
test[resources/extractfunc/testStaticMethod.pdtt](org.eclipse.php.refactoring.core.extract.function.ExtractFunctionRefactoringTest)  Time elapsed: 0.014 sec
test[resources/extractfunc/testForStatemet0029664.pdtt](org.eclipse.php.refactoring.core.extract.function.ExtractFunctionRefactoringTest)  Time elapsed: 0.019 sec
test[resources/extractfunc/testDynamicMethod.pdtt](org.eclipse.php.refactoring.core.extract.function.ExtractFunctionRefactoringTest)  Time elapsed: 0.009 sec
test[resources/extractfunc/testExtractVarRead.pdtt](org.eclipse.php.refactoring.core.extract.function.ExtractFunctionRefactoringTest)  Time elapsed: 0.008 sec
test[resources/extractfunc/testVarWrite.pdtt](org.eclipse.php.refactoring.core.extract.function.ExtractFunctionRefactoringTest)  Time elapsed: 0.005 sec
test[resources/extractvar/testExtractVar3.pdtt](org.eclipse.php.refactoring.core.extract.variable.ExtractVariableRefactoringTest)  Time elapsed: 0.013 sec
test[resources/extractvar/testExtractVar.pdtt](org.eclipse.php.refactoring.core.extract.variable.ExtractVariableRefactoringTest)  Time elapsed: 0.006 sec
test[resources/extractvar/testExtractVar1.pdtt](org.eclipse.php.refactoring.core.extract.variable.ExtractVariableRefactoringTest)  Time elapsed: 0.003 sec
test[resources/extractvar/testExtractVar2.pdtt](org.eclipse.php.refactoring.core.extract.variable.ExtractVariableRefactoringTest)  Time elapsed: 0.003 sec
test[resources/extractvar/testExtractVar4.pdtt](org.eclipse.php.refactoring.core.extract.variable.ExtractVariableRefactoringTest)  Time elapsed: 0.01 sec
testExtract(org.eclipse.php.refactoring.core.extract.variable.ExtractVariableRefactoringTest1)  Time elapsed: 0.036 sec
testExtract1(org.eclipse.php.refactoring.core.extract.variable.ExtractVariableRefactoringTest1)  Time elapsed: 0.17 sec
testExtract(org.eclipse.php.refactoring.core.extract.variable.ExtractVariableRefactoringTest2)  Time elapsed: 0.084 sec
testExtract1(org.eclipse.php.refactoring.core.extract.variable.ExtractVariableRefactoringTest2)  Time elapsed: 0.122 sec
testExtract2(org.eclipse.php.refactoring.core.extract.variable.ExtractVariableRefactoringTest2)  Time elapsed: 0.076 sec
testExtract(org.eclipse.php.refactoring.core.extract.variable.ExtractVariableRefactoringTest3)  Time elapsed: 0.1 sec
testExtract(org.eclipse.php.refactoring.core.extract.variable.ExtractVariableRefactoringTest27457)  Time elapsed: 0.092 sec
testExtract(org.eclipse.php.refactoring.core.extract.variable.ExtractVariableRefactoringTest26642)  Time elapsed: 0.039 sec
testExtractVar(org.eclipse.php.refactoring.core.extract.variable.ExtractVariableRefactoringTestGetVariableName)  Time elapsed: 0.078 sec
testExtractMethod(org.eclipse.php.refactoring.core.extract.variable.ExtractVariableRefactoringTestGetVariableName)  Time elapsed: 0.03 sec
testExtractVar1(org.eclipse.php.refactoring.core.extract.variable.ExtractVariableRefactoringTestGetVariableName)  Time elapsed: 0.132 sec
testExtractVar2(org.eclipse.php.refactoring.core.extract.variable.ExtractVariableRefactoringTestGetVariableName)  Time elapsed: 0.043 sec
testExtractVar3(org.eclipse.php.refactoring.core.extract.variable.ExtractVariableRefactoringTestGetVariableName)  Time elapsed: 0.093 sec
testExtractVar4(org.eclipse.php.refactoring.core.extract.variable.ExtractVariableRefactoringTestGetVariableName)  Time elapsed: 0.106 sec
testIsSourceReference(org.eclipse.php.refactoring.ui.actions.RenamePHPElementActionDelegateTest)  Time elapsed: 0.098 sec
testGetSourceOffsetAndGetNode1(org.eclipse.php.refactoring.ui.actions.RenamePHPElementActionDelegateTest)  Time elapsed: 0.114 sec
testGetSourceOffsetAndGetNode2(org.eclipse.php.refactoring.ui.actions.RenamePHPElementActionDelegateTest)  Time elapsed: 0.137 sec
testGetSourceOffsetAndGetNode3(org.eclipse.php.refactoring.ui.actions.RenamePHPElementActionDelegateTest)  Time elapsed: 0.103 sec
testIsScriptContainer(org.eclipse.php.refactoring.ui.actions.RenamePHPElementActionDelegateTest)  Time elapsed: 0.105 sec
testGetSourceOffsetAndGetNode(org.eclipse.php.refactoring.ui.actions.RenamePHPElementActionDelegateTest)  Time elapsed: 0.035 sec
testGetProgram(org.eclipse.php.refactoring.core.changes.ProgramDocumentChangeTest)  Time elapsed: 0.128 sec
testGetProgram(org.eclipse.php.refactoring.core.changes.ProgramFileChangeTest)  Time elapsed: 0.085 sec
testGetCurrentContent(org.eclipse.php.refactoring.core.changes.ProgramFileChangeTest)  Time elapsed: 0.035 sec

Results :

Failed tests: 
  RenameTraitMemberProcessorTest.test:62->AbstractRefactoringTest.checkTestResult:196 
EXPECTED:
--------------
<?php
trait RenameTraitMember{
	public function fun11(){
	}
	public function fun2() {
	}
	public function fun3() {
	}
	public $a;
	private $b;
	public $c*****;
}
class RenameTraitMember_class {
	use RenameTraitMember{
		fun11 as public;
		a as a1;
	}
	use RenameTraitMember{
		RenameTraitMember::fun2 as public fun4;
		b as public b1;
	}
}
$a = new RenameTraitMember_class();
$a->fun11();
$a->fun4();
$a->fun3();
$a->b1;
$a->a1;
$a->c;
?>

ACTUAL:
--------------
<?php
trait RenameTraitMember{
	public function fun11(){
	}
	public function fun2() {
	}
	public function fun3() {
	}
	public $a;
	private $b;
	public $c*****1;
}
class RenameTraitMember_class {
	use RenameTraitMember{
		fun11 as public;
		a as a1;
	}
	use RenameTraitMember{
		RenameTraitMember::fun2 as public fun4;
		b as public b1;
	}
}
$a = new RenameTraitMember_class();
$a->fun11();
$a->fun4();
$a->fun3();
$a->b1;
$a->a1;
$a->c;
?>
  RenameTraitMemberProcessorTest>RenameClassMemberProcessorTest.rename:53->AbstractRefactoringTest.checkTestResult:196 
EXPECTED:
--------------
<?php
trait RenameTraitMember{
	public function fun11(){
	}
	public function fun2() {
	}
	public function fun3() {
	}
	public $a;
	private $b;
	public $c*****;
}
class RenameTraitMember_class {
	use RenameTraitMember{
		fun11 as public;
		a as a1;
	}
	use RenameTraitMember{
		RenameTraitMember::fun2 as public fun4;
		b as public b1;
	}
}
$a = new RenameTraitMember_class();
$a->fun11();
$a->fun4();
$a->fun3();
$a->b1;
$a->a1;
$a->c;
?>

ACTUAL:
--------------
<?php
trait RenameTraitMember{
	public function fun11(){
	}
	public function fun2() {
	}
	public function fun3() {
	}
	public $a;
	private $b;
	public $c*****1;
}
class RenameTraitMember_class {
	use RenameTraitMember{
		fun11 as public;
		a as a1;
	}
	use RenameTraitMember{
		RenameTraitMember::fun2 as public fun4;
		b as public b1;
	}
}
$a = new RenameTraitMember_class();
$a->fun11();
$a->fun4();
$a->fun3();
$a->b1;
$a->a1;
$a->c;
?>

Tests run: 118, Failures: 2, Errors: 0, Skipped: 0

30/06/2016 11:23:14 Xvnc version X.org/xf4vnc custom version
30/06/2016 11:23:14 Copyright (C) 2001-2004 Alan Hourihane.
30/06/2016 11:23:14 Copyright (C) 2000-2004 Constantin Kaplinsky
30/06/2016 11:23:14 Copyright (C) 1999 AT&T Laboratories Cambridge
30/06/2016 11:23:14 All Rights Reserved.
30/06/2016 11:23:14 See http://www.tightvnc.com/ for information on TightVNC
30/06/2016 11:23:14 See http://xf4vnc.sf.net for xf4vnc-specific information
30/06/2016 11:23:14 Desktop name 'x11' (hipp5:299)
30/06/2016 11:23:14 Protocol versions supported: 3.7, 3.3
30/06/2016 11:23:14 RGB format 8 8 8
30/06/2016 11:23:14 Listening for VNC connections on TCP port 6199
[dix] Could not init font path element /usr/share/fonts/TTF/, removing from list!
[dix] Could not init font path element /usr/share/fonts/OTF, removing from list!
(EE) config/hal: NewInputDeviceRequest failed (2)
(EE) config/hal: NewInputDeviceRequest failed (2)
[INFO] ------------------------------------------------------------------------
[INFO] Reactor Summary:
[INFO] 
[INFO] PHP Development Tools (PDT) ....................... SUCCESS [0.132s]
[INFO] plugins ........................................... SUCCESS [0.046s]
[INFO] org.eclipse.php.help .............................. SUCCESS [10.867s]
[INFO] org.eclipse.php.core.parser ....................... SUCCESS [1.859s]
[INFO] org.eclipse.php.core .............................. SUCCESS [33.345s]
[INFO] org.eclipse.php.server.core ....................... SUCCESS [0.459s]
[INFO] org.eclipse.php.ui ................................ SUCCESS [3.255s]
[INFO] org.eclipse.php.debug.daemon ...................... SUCCESS [0.217s]
[INFO] org.eclipse.php.debug.core ........................ SUCCESS [1.462s]
[INFO] org.eclipse.php.debug.ui .......................... SUCCESS [1.089s]
[INFO] org.eclipse.php.formatter.core .................... SUCCESS [0.381s]
[INFO] org.eclipse.php.formatter.ui ...................... SUCCESS [0.528s]
[INFO] org.eclipse.php.mylyn.ui .......................... SUCCESS [0.493s]
[INFO] org.eclipse.php.refactoring.core .................. SUCCESS [0.899s]
[INFO] org.eclipse.php.refactoring.ui .................... SUCCESS [0.734s]
[INFO] org.eclipse.php.server.ui ......................... SUCCESS [0.546s]
[INFO] org.eclipse.php.astview ........................... SUCCESS [0.479s]
[INFO] org.eclipse.php.ui.importer ....................... SUCCESS [0.274s]
[INFO] tests ............................................. SUCCESS [0.042s]
[INFO] org.eclipse.php.core.tests ........................ SUCCESS [1:33.769s]
[INFO] org.eclipse.php.core.performance.tests ............ SUCCESS [0.623s]
[INFO] org.eclipse.php.formatter.core.tests .............. SUCCESS [33.793s]
[INFO] org.eclipse.php.refactoring.core.tests ............ FAILURE [29.608s]
[INFO] org.eclipse.php.ui.tests .......................... SKIPPED
[INFO] features .......................................... SKIPPED
[INFO] org.eclipse.php ................................... SKIPPED
[INFO] org.eclipse.php.mylyn ............................. SKIPPED
[INFO] org.eclipse.php.source ............................ SKIPPED
[INFO] org.eclipse.php.test .............................. SKIPPED
[INFO] org.eclipse.php.sdk ............................... SKIPPED
[INFO] org.eclipse.php.importer .......................... SKIPPED
[INFO] org.eclipse.php.repository ........................ SKIPPED
[INFO] ------------------------------------------------------------------------
[INFO] BUILD FAILURE
[INFO] ------------------------------------------------------------------------
[INFO] Total time: 5:18.948s
[INFO] Finished at: Thu Jun 30 11:23:14 EDT 2016
[INFO] Final Memory: 210M/8246M
[INFO] ------------------------------------------------------------------------
[INFO] o.h.m.e.h.MavenExecutionResultHandler - Build failed with exception(s)
[INFO] o.h.m.e.h.MavenExecutionResultHandler - [1] org.apache.maven.lifecycle.LifecycleExecutionException: Failed to execute goal org.eclipse.tycho:tycho-surefire-plugin:0.23.0:test (default-test) on project org.eclipse.php.refactoring.core.tests: There are test failures.

Please refer to /jobs/genie.pdt/pdt-gerrit/workspace2/tests/org.eclipse.php.refactoring.core.tests/target/surefire-reports for the individual test results.
[DEBUG] Closing connection to remote
[ERROR] Failed to execute goal org.eclipse.tycho:tycho-surefire-plugin:0.23.0:test (default-test) on project org.eclipse.php.refactoring.core.tests: There are test failures.
[ERROR] 
[ERROR] Please refer to /jobs/genie.pdt/pdt-gerrit/workspace2/tests/org.eclipse.php.refactoring.core.tests/target/surefire-reports for the individual test results.
[ERROR] -> [Help 1]
[ERROR] 
[ERROR] To see the full stack trace of the errors, re-run Maven with the -e switch.
[ERROR] Re-run Maven using the -X switch to enable full debug logging.
[ERROR] 
[ERROR] For more information about the errors and possible solutions, please read the following articles:
[ERROR] [Help 1] http://cwiki.apache.org/confluence/display/MAVEN/MojoFailureException
[ERROR] 
[ERROR] After correcting the problems, you can resume the build with the command
[ERROR]   mvn <goals> -rf :org.eclipse.php.refactoring.core.tests
[DEBUG] Waiting for process to finish
[DEBUG] Result: 1
Terminating xvnc.
Recording test results
Archiving artifacts
Finished: FAILURE