FailedConsole Output

Skipping 1,017 KB.. Full Log
ce/eclipse.pde.ui-Gerrit/ui/org.eclipse.pde.runtime/src/org/eclipse/pde/internal/runtime/spy/sections/ActiveMenuSection.java:[127] 
	if (action instanceof PluginAction) {
	                      ^^^^^^^^^^^^
Discouraged access: The type 'PluginAction' is not API (restriction on classpath entry '/home/jenkins/agent/workspace/eclipse.pde.ui-Gerrit/.repository/p2/osgi/bundle/org.eclipse.ui.workbench/3.117.100.v20191212-1333/org.eclipse.ui.workbench-3.117.100.v20191212-1333.jar')
[WARNING] /home/jenkins/agent/workspace/eclipse.pde.ui-Gerrit/ui/org.eclipse.pde.runtime/src/org/eclipse/pde/internal/runtime/spy/sections/ActiveMenuSection.java:[128] 
	PluginAction pluginAction = (PluginAction) action;
	^^^^^^^^^^^^
Discouraged access: The type 'PluginAction' is not API (restriction on classpath entry '/home/jenkins/agent/workspace/eclipse.pde.ui-Gerrit/.repository/p2/osgi/bundle/org.eclipse.ui.workbench/3.117.100.v20191212-1333/org.eclipse.ui.workbench-3.117.100.v20191212-1333.jar')
[WARNING] /home/jenkins/agent/workspace/eclipse.pde.ui-Gerrit/ui/org.eclipse.pde.runtime/src/org/eclipse/pde/internal/runtime/spy/sections/ActiveMenuSection.java:[128] 
	PluginAction pluginAction = (PluginAction) action;
	                             ^^^^^^^^^^^^
Discouraged access: The type 'PluginAction' is not API (restriction on classpath entry '/home/jenkins/agent/workspace/eclipse.pde.ui-Gerrit/.repository/p2/osgi/bundle/org.eclipse.ui.workbench/3.117.100.v20191212-1333/org.eclipse.ui.workbench-3.117.100.v20191212-1333.jar')
[WARNING] /home/jenkins/agent/workspace/eclipse.pde.ui-Gerrit/ui/org.eclipse.pde.runtime/src/org/eclipse/pde/internal/runtime/spy/sections/ActiveMenuSection.java:[143] 
	FormText text, Class<?> clazz, PluginAction pluginAction) {
	                               ^^^^^^^^^^^^
Discouraged access: The type 'PluginAction' is not API (restriction on classpath entry '/home/jenkins/agent/workspace/eclipse.pde.ui-Gerrit/.repository/p2/osgi/bundle/org.eclipse.ui.workbench/3.117.100.v20191212-1333/org.eclipse.ui.workbench-3.117.100.v20191212-1333.jar')
[WARNING] /home/jenkins/agent/workspace/eclipse.pde.ui-Gerrit/ui/org.eclipse.pde.runtime/src/org/eclipse/pde/internal/runtime/spy/sections/ActiveMenuSection.java:[147] 
	if (pluginAction instanceof WWinPluginAction) {
	                            ^^^^^^^^^^^^^^^^
Discouraged access: The type 'WWinPluginAction' is not API (restriction on classpath entry '/home/jenkins/agent/workspace/eclipse.pde.ui-Gerrit/.repository/p2/osgi/bundle/org.eclipse.ui.workbench/3.117.100.v20191212-1333/org.eclipse.ui.workbench-3.117.100.v20191212-1333.jar')
35 problems (0 errors, 32 warnings, 32 info)
[INFO] 
[INFO] --- tycho-eclipserun-plugin:1.5.1:eclipse-run (default) @ org.eclipse.pde.runtime ---
[INFO] Toolchain in tycho-eclipserun-plugin: JDK[/opt/tools/java/oracle/jdk-8/latest/jre]
[INFO] Expected eclipse log file: /home/jenkins/agent/workspace/eclipse.pde.ui-Gerrit/ui/org.eclipse.pde.runtime/target/eclipserun-work/data/.metadata/.log
[INFO] Command line:
	[/opt/tools/java/oracle/jdk-8/latest/jre/bin/java, -jar, /home/jenkins/agent/workspace/eclipse.pde.ui-Gerrit/.repository/p2/osgi/bundle/org.eclipse.equinox.launcher/1.5.600.v20191014-2022/org.eclipse.equinox.launcher-1.5.600.v20191014-2022.jar, -install, /home/jenkins/agent/workspace/eclipse.pde.ui-Gerrit/ui/org.eclipse.pde.runtime/target/eclipserun-work, -configuration, /home/jenkins/agent/workspace/eclipse.pde.ui-Gerrit/ui/org.eclipse.pde.runtime/target/eclipserun-work/configuration, -data, target/apibuild-workspace, -application, org.eclipse.ant.core.antRunner, -buildfile, target/.apibuild.xml]
Picked up JAVA_TOOL_OPTIONS: -XX:+IgnoreUnrecognizedVMOptions -XX:+UseContainerSupport -XX:+UnlockExperimentalVMOptions -XX:+UseCGroupMemoryLimitForHeap
Picked up _JAVA_OPTIONS: -XX:MaxRAMPercentage=64.0
Buildfile: target/.apibuild.xml

apigen:
BUILD SUCCESSFUL

BUILD SUCCESSFUL
Total time: 0 seconds
[INFO] 
[INFO] --- maven-resources-plugin:3.1.0:testResources (default-testResources) @ org.eclipse.pde.runtime ---
[INFO] Using 'UTF-8' encoding to copy filtered resources.
[INFO] skip non existing resourceDirectory /home/jenkins/agent/workspace/eclipse.pde.ui-Gerrit/ui/org.eclipse.pde.runtime/src/test/resources
[INFO] 
[INFO] --- tycho-source-plugin:1.5.1:plugin-source (plugin-source) @ org.eclipse.pde.runtime ---
[INFO] Building jar: /home/jenkins/agent/workspace/eclipse.pde.ui-Gerrit/ui/org.eclipse.pde.runtime/target/org.eclipse.pde.runtime-3.6.800-SNAPSHOT-sources.jar
[INFO] 
[INFO] --- target-platform-configuration:1.5.1:target-platform (default-target-platform) @ org.eclipse.pde.runtime ---
[INFO] 
[INFO] --- tycho-packaging-plugin:1.5.1:package-plugin (default-package-plugin) @ org.eclipse.pde.runtime ---
[INFO] Building jar: /home/jenkins/agent/workspace/eclipse.pde.ui-Gerrit/ui/org.eclipse.pde.runtime/target/org.eclipse.pde.runtime-3.6.800-SNAPSHOT.jar
[INFO] 
[INFO] --- tycho-p2-plugin:1.5.1:p2-metadata-default (default-p2-metadata-default) @ org.eclipse.pde.runtime ---
[INFO] MavenProject: org.eclipse.pde:org.eclipse.pde.runtime:3.6.800-SNAPSHOT @ /home/jenkins/agent/workspace/eclipse.pde.ui-Gerrit/ui/org.eclipse.pde.runtime/pom.xml
    The main artifact has been replaced with the baseline version.
    The following attached artifacts have been replaced with the baseline version: [sources]

[INFO] 
[INFO] --- tycho-p2-extras-plugin:1.5.1:compare-version-with-baselines (compare-attached-artifacts-with-release) @ org.eclipse.pde.runtime ---
[INFO] Fetching org.eclipse.pde.runtime_3.6.700.v20191107-0634.jar.pack.gz from https://download.eclipse.org/eclipse/updates/4.14milestones/S-4.14RC1-201911271800/plugins/ (114.33kB)
[INFO] Fetching org.eclipse.pde.runtime_3.6.700.v20191107-0634.jar.pack.gz from https://download.eclipse.org/eclipse/updates/4.14milestones/S-4.14RC1-201911271800/plugins/ (114.33kB)
[INFO] Fetching org.eclipse.pde.runtime.source_3.6.700.v20191107-0634.jar from https://download.eclipse.org/eclipse/updates/4.14milestones/S-4.14RC1-201911271800/plugins/ (83.21kB)
[INFO] Fetching org.eclipse.pde.runtime.source_3.6.700.v20191107-0634.jar from https://download.eclipse.org/eclipse/updates/4.14milestones/S-4.14RC1-201911271800/plugins/ (83.21kB)
[INFO] 
[INFO] --- maven-antrun-plugin:1.8:run (check-skip-api-analysis) @ org.eclipse.pde.runtime ---
[INFO] Executing tasks

main:
[INFO] Executed tasks
[INFO] 
[INFO] --- tycho-dependency-tools-plugin:1.5.1:list-dependencies (list-dependencies) @ org.eclipse.pde.runtime ---
[INFO] 
[INFO] --- tycho-eclipserun-plugin:1.5.1:eclipse-run (api-analysis) @ org.eclipse.pde.runtime ---
[INFO] Toolchain in tycho-eclipserun-plugin: JDK[/opt/tools/java/oracle/jdk-8/latest/jre]
[INFO] Expected eclipse log file: /home/jenkins/agent/workspace/eclipse.pde.ui-Gerrit/ui/org.eclipse.pde.runtime/target/eclipserun-work/data/.metadata/.log
[INFO] Command line:
	[/opt/tools/java/oracle/jdk-8/latest/jre/bin/java, -Xmx2048M, -jar, /home/jenkins/agent/workspace/eclipse.pde.ui-Gerrit/.repository/p2/osgi/bundle/org.eclipse.equinox.launcher/1.5.600.v20191014-2022/org.eclipse.equinox.launcher-1.5.600.v20191014-2022.jar, -install, /home/jenkins/agent/workspace/eclipse.pde.ui-Gerrit/ui/org.eclipse.pde.runtime/target/eclipserun-work, -configuration, /home/jenkins/agent/workspace/eclipse.pde.ui-Gerrit/ui/org.eclipse.pde.runtime/target/eclipserun-work/configuration, -data, /home/jenkins/agent/workspace/eclipse.pde.ui-Gerrit/ui/org.eclipse.pde.runtime/../target/org.eclipse.pde.runtime-apiAnalyzer-workspace, -application, org.eclipse.pde.api.tools.apiAnalyzer, -project, /home/jenkins/agent/workspace/eclipse.pde.ui-Gerrit/ui/org.eclipse.pde.runtime, -baseline, /home/jenkins/agent/workspace/eclipse.pde.ui-Gerrit/ui/org.eclipse.pde.runtime/target/org.eclipse.pde.runtime-apiBaseline.target, -dependencyList, /home/jenkins/agent/workspace/eclipse.pde.ui-Gerrit/ui/org.eclipse.pde.runtime/target/dependencies-list.txt, -failOnError]
Picked up JAVA_TOOL_OPTIONS: -XX:+IgnoreUnrecognizedVMOptions -XX:+UseContainerSupport -XX:+UnlockExperimentalVMOptions -XX:+UseCGroupMemoryLimitForHeap
Picked up _JAVA_OPTIONS: -XX:MaxRAMPercentage=64.0
0 API ERRORS
1 API warnings
* Marker [on: /org.eclipse.pde.runtime, id: 61, type: org.eclipse.pde.api.tools.api_usage, attributes: [apiMarkerID: 3, charEnd: -1, charStart: -1, lineNumber: 0, message: Execution environment references were not checked for 'org.eclipse.pde.runtime' because no environment descriptions are installed. , messagearguments: org.eclipse.pde.runtime, problemid: 665845798, severity: 1, sourceId: API Tools], created: 12/13/19 5:46 PM]
[INFO] 
[INFO] ------------< org.eclipse.pde:org.eclipse.pde.ui.templates >------------
[INFO] Building org.eclipse.pde.ui.templates 3.6.800-SNAPSHOT           [36/46]
[INFO] ---------------------------[ eclipse-plugin ]---------------------------
[INFO] 
[INFO] --- maven-clean-plugin:3.1.0:clean (default-clean) @ org.eclipse.pde.ui.templates ---
[INFO] 
[INFO] --- tycho-packaging-plugin:1.5.1:build-qualifier (default-build-qualifier) @ org.eclipse.pde.ui.templates ---
[INFO] The project's OSGi version is 3.6.800.v20191003-1016
[INFO] 
[INFO] --- tycho-packaging-plugin:1.5.1:validate-id (default-validate-id) @ org.eclipse.pde.ui.templates ---
[INFO] 
[INFO] --- tycho-packaging-plugin:1.5.1:validate-version (default-validate-version) @ org.eclipse.pde.ui.templates ---
[INFO] 
[INFO] --- maven-resources-plugin:3.1.0:copy-resources (saveproperties) @ org.eclipse.pde.ui.templates ---
[INFO] Using 'UTF-8' encoding to copy filtered resources.
[INFO] skip non existing resourceDirectory /home/jenkins/agent/workspace/eclipse.pde.ui-Gerrit/ui/org.eclipse.pde.ui.templates/saveproperties
[INFO] 
[INFO] --- maven-enforcer-plugin:3.0.0-M3:enforce (enforce-maven) @ org.eclipse.pde.ui.templates ---
[INFO] 
[INFO] --- eclipse-cbi-plugin:1.1.8-SNAPSHOT:generate-api-build-xml (default) @ org.eclipse.pde.ui.templates ---
Generating target/.apibuild.xml
[INFO] 
[INFO] --- maven-resources-plugin:3.1.0:resources (default-resources) @ org.eclipse.pde.ui.templates ---
[INFO] Using 'UTF-8' encoding to copy filtered resources.
[INFO] skip non existing resourceDirectory /home/jenkins/agent/workspace/eclipse.pde.ui-Gerrit/ui/org.eclipse.pde.ui.templates/src/main/resources
[INFO] 
[INFO] --- maven-resources-plugin:3.1.0:resources (filter-resources) @ org.eclipse.pde.ui.templates ---
[INFO] Using 'UTF-8' encoding to copy filtered resources.
[INFO] skip non existing resourceDirectory /home/jenkins/agent/workspace/eclipse.pde.ui-Gerrit/ui/org.eclipse.pde.ui.templates/src/main/resources
[INFO] 
[INFO] --- tycho-compiler-plugin:1.5.1:compile (default-compile) @ org.eclipse.pde.ui.templates ---
[INFO] Compiling 59 source files to /home/jenkins/agent/workspace/eclipse.pde.ui-Gerrit/ui/org.eclipse.pde.ui.templates/target/classes
[INFO] 
[INFO] --- tycho-eclipserun-plugin:1.5.1:eclipse-run (default) @ org.eclipse.pde.ui.templates ---
[INFO] Toolchain in tycho-eclipserun-plugin: JDK[/opt/tools/java/oracle/jdk-8/latest/jre]
[INFO] Expected eclipse log file: /home/jenkins/agent/workspace/eclipse.pde.ui-Gerrit/ui/org.eclipse.pde.ui.templates/target/eclipserun-work/data/.metadata/.log
[INFO] Command line:
	[/opt/tools/java/oracle/jdk-8/latest/jre/bin/java, -jar, /home/jenkins/agent/workspace/eclipse.pde.ui-Gerrit/.repository/p2/osgi/bundle/org.eclipse.equinox.launcher/1.5.600.v20191014-2022/org.eclipse.equinox.launcher-1.5.600.v20191014-2022.jar, -install, /home/jenkins/agent/workspace/eclipse.pde.ui-Gerrit/ui/org.eclipse.pde.ui.templates/target/eclipserun-work, -configuration, /home/jenkins/agent/workspace/eclipse.pde.ui-Gerrit/ui/org.eclipse.pde.ui.templates/target/eclipserun-work/configuration, -data, target/apibuild-workspace, -application, org.eclipse.ant.core.antRunner, -buildfile, target/.apibuild.xml]
Picked up JAVA_TOOL_OPTIONS: -XX:+IgnoreUnrecognizedVMOptions -XX:+UseContainerSupport -XX:+UnlockExperimentalVMOptions -XX:+UseCGroupMemoryLimitForHeap
Picked up _JAVA_OPTIONS: -XX:MaxRAMPercentage=64.0
Buildfile: target/.apibuild.xml

apigen:
BUILD SUCCESSFUL

BUILD SUCCESSFUL
Total time: 1 second
[INFO] 
[INFO] --- maven-resources-plugin:3.1.0:testResources (default-testResources) @ org.eclipse.pde.ui.templates ---
[INFO] Using 'UTF-8' encoding to copy filtered resources.
[INFO] skip non existing resourceDirectory /home/jenkins/agent/workspace/eclipse.pde.ui-Gerrit/ui/org.eclipse.pde.ui.templates/src/test/resources
[INFO] 
[INFO] --- tycho-source-plugin:1.5.1:plugin-source (plugin-source) @ org.eclipse.pde.ui.templates ---
[INFO] Building jar: /home/jenkins/agent/workspace/eclipse.pde.ui-Gerrit/ui/org.eclipse.pde.ui.templates/target/org.eclipse.pde.ui.templates-3.6.800-SNAPSHOT-sources.jar
[INFO] 
[INFO] --- target-platform-configuration:1.5.1:target-platform (default-target-platform) @ org.eclipse.pde.ui.templates ---
[INFO] 
[INFO] --- tycho-packaging-plugin:1.5.1:package-plugin (default-package-plugin) @ org.eclipse.pde.ui.templates ---
[INFO] Building jar: /home/jenkins/agent/workspace/eclipse.pde.ui-Gerrit/ui/org.eclipse.pde.ui.templates/target/org.eclipse.pde.ui.templates-3.6.800-SNAPSHOT.jar
[INFO] 
[INFO] --- tycho-p2-plugin:1.5.1:p2-metadata-default (default-p2-metadata-default) @ org.eclipse.pde.ui.templates ---
[INFO] MavenProject: org.eclipse.pde:org.eclipse.pde.ui.templates:3.6.800-SNAPSHOT @ /home/jenkins/agent/workspace/eclipse.pde.ui-Gerrit/ui/org.eclipse.pde.ui.templates/pom.xml
    The main artifact has been replaced with the baseline version.
    The following attached artifacts have been replaced with the baseline version: [sources]

[INFO] 
[INFO] --- tycho-p2-extras-plugin:1.5.1:compare-version-with-baselines (compare-attached-artifacts-with-release) @ org.eclipse.pde.ui.templates ---
[INFO] Fetching org.eclipse.pde.ui.templates_3.6.800.v20191003-1016.jar.pack.gz from https://download.eclipse.org/eclipse/updates/4.14milestones/S-4.14RC1-201911271800/plugins/ (377.12kB)
[INFO] Fetching org.eclipse.pde.ui.templates_3.6.800.v20191003-1016.jar.pack.gz from https://download.eclipse.org/eclipse/updates/4.14milestones/S-4.14RC1-201911271800/plugins/ (377.12kB)
[INFO] Fetching org.eclipse.pde.ui.templates.source_3.6.800.v20191003-1016.jar from https://download.eclipse.org/eclipse/updates/4.14milestones/S-4.14RC1-201911271800/plugins/ (107.49kB)
[INFO] Fetching org.eclipse.pde.ui.templates.source_3.6.800.v20191003-1016.jar from https://download.eclipse.org/eclipse/updates/4.14milestones/S-4.14RC1-201911271800/plugins/ (107.49kB)
[INFO] 
[INFO] --- maven-antrun-plugin:1.8:run (check-skip-api-analysis) @ org.eclipse.pde.ui.templates ---
[INFO] Executing tasks

main:
[INFO] Executed tasks
[INFO] 
[INFO] --- tycho-dependency-tools-plugin:1.5.1:list-dependencies (list-dependencies) @ org.eclipse.pde.ui.templates ---
[INFO] 
[INFO] --- tycho-eclipserun-plugin:1.5.1:eclipse-run (api-analysis) @ org.eclipse.pde.ui.templates ---
[INFO] Toolchain in tycho-eclipserun-plugin: JDK[/opt/tools/java/oracle/jdk-8/latest/jre]
[INFO] Expected eclipse log file: /home/jenkins/agent/workspace/eclipse.pde.ui-Gerrit/ui/org.eclipse.pde.ui.templates/target/eclipserun-work/data/.metadata/.log
[INFO] Command line:
	[/opt/tools/java/oracle/jdk-8/latest/jre/bin/java, -Xmx2048M, -jar, /home/jenkins/agent/workspace/eclipse.pde.ui-Gerrit/.repository/p2/osgi/bundle/org.eclipse.equinox.launcher/1.5.600.v20191014-2022/org.eclipse.equinox.launcher-1.5.600.v20191014-2022.jar, -install, /home/jenkins/agent/workspace/eclipse.pde.ui-Gerrit/ui/org.eclipse.pde.ui.templates/target/eclipserun-work, -configuration, /home/jenkins/agent/workspace/eclipse.pde.ui-Gerrit/ui/org.eclipse.pde.ui.templates/target/eclipserun-work/configuration, -data, /home/jenkins/agent/workspace/eclipse.pde.ui-Gerrit/ui/org.eclipse.pde.ui.templates/../target/org.eclipse.pde.ui.templates-apiAnalyzer-workspace, -application, org.eclipse.pde.api.tools.apiAnalyzer, -project, /home/jenkins/agent/workspace/eclipse.pde.ui-Gerrit/ui/org.eclipse.pde.ui.templates, -baseline, /home/jenkins/agent/workspace/eclipse.pde.ui-Gerrit/ui/org.eclipse.pde.ui.templates/target/org.eclipse.pde.ui.templates-apiBaseline.target, -dependencyList, /home/jenkins/agent/workspace/eclipse.pde.ui-Gerrit/ui/org.eclipse.pde.ui.templates/target/dependencies-list.txt, -failOnError]
Picked up JAVA_TOOL_OPTIONS: -XX:+IgnoreUnrecognizedVMOptions -XX:+UseContainerSupport -XX:+UnlockExperimentalVMOptions -XX:+UseCGroupMemoryLimitForHeap
Picked up _JAVA_OPTIONS: -XX:MaxRAMPercentage=64.0
0 API ERRORS
1 API warnings
* Marker [on: /org.eclipse.pde.ui.templates, id: 4, type: org.eclipse.pde.api.tools.api_usage, attributes: [apiMarkerID: 3, charEnd: -1, charStart: -1, lineNumber: 0, message: Execution environment references were not checked for 'org.eclipse.pde.ui.templates' because no environment descriptions are installed. , messagearguments: org.eclipse.pde.ui.templates, problemid: 665845798, severity: 1, sourceId: API Tools], created: 12/13/19 5:47 PM]
[INFO] 
[INFO] ---------------< org.eclipse.pde:org.eclipse.pde.ua.ui >----------------
[INFO] Building org.eclipse.pde.ua.ui 1.1.700-SNAPSHOT                  [37/46]
[INFO] ---------------------------[ eclipse-plugin ]---------------------------
[INFO] 
[INFO] --- maven-clean-plugin:3.1.0:clean (default-clean) @ org.eclipse.pde.ua.ui ---
[INFO] 
[INFO] --- tycho-packaging-plugin:1.5.1:build-qualifier (default-build-qualifier) @ org.eclipse.pde.ua.ui ---
[INFO] The project's OSGi version is 1.1.700.v20191011-0551
[INFO] 
[INFO] --- tycho-packaging-plugin:1.5.1:validate-id (default-validate-id) @ org.eclipse.pde.ua.ui ---
[INFO] 
[INFO] --- tycho-packaging-plugin:1.5.1:validate-version (default-validate-version) @ org.eclipse.pde.ua.ui ---
[INFO] 
[INFO] --- maven-resources-plugin:3.1.0:copy-resources (saveproperties) @ org.eclipse.pde.ua.ui ---
[INFO] Using 'UTF-8' encoding to copy filtered resources.
[INFO] skip non existing resourceDirectory /home/jenkins/agent/workspace/eclipse.pde.ui-Gerrit/ua/org.eclipse.pde.ua.ui/saveproperties
[INFO] 
[INFO] --- maven-enforcer-plugin:3.0.0-M3:enforce (enforce-maven) @ org.eclipse.pde.ua.ui ---
[INFO] 
[INFO] --- eclipse-cbi-plugin:1.1.8-SNAPSHOT:generate-api-build-xml (default) @ org.eclipse.pde.ua.ui ---
Generating target/.apibuild.xml
[INFO] 
[INFO] --- maven-resources-plugin:3.1.0:resources (default-resources) @ org.eclipse.pde.ua.ui ---
[INFO] Using 'UTF-8' encoding to copy filtered resources.
[INFO] skip non existing resourceDirectory /home/jenkins/agent/workspace/eclipse.pde.ui-Gerrit/ua/org.eclipse.pde.ua.ui/src/main/resources
[INFO] 
[INFO] --- maven-resources-plugin:3.1.0:resources (filter-resources) @ org.eclipse.pde.ua.ui ---
[INFO] Using 'UTF-8' encoding to copy filtered resources.
[INFO] skip non existing resourceDirectory /home/jenkins/agent/workspace/eclipse.pde.ui-Gerrit/ua/org.eclipse.pde.ua.ui/src/main/resources
[INFO] 
[INFO] --- tycho-compiler-plugin:1.5.1:compile (default-compile) @ org.eclipse.pde.ua.ui ---
[INFO] Compiling 146 source files to /home/jenkins/agent/workspace/eclipse.pde.ui-Gerrit/ua/org.eclipse.pde.ua.ui/target/classes
[INFO] 
[INFO] --- tycho-eclipserun-plugin:1.5.1:eclipse-run (default) @ org.eclipse.pde.ua.ui ---
[INFO] Toolchain in tycho-eclipserun-plugin: JDK[/opt/tools/java/oracle/jdk-8/latest/jre]
[INFO] Expected eclipse log file: /home/jenkins/agent/workspace/eclipse.pde.ui-Gerrit/ua/org.eclipse.pde.ua.ui/target/eclipserun-work/data/.metadata/.log
[INFO] Command line:
	[/opt/tools/java/oracle/jdk-8/latest/jre/bin/java, -jar, /home/jenkins/agent/workspace/eclipse.pde.ui-Gerrit/.repository/p2/osgi/bundle/org.eclipse.equinox.launcher/1.5.600.v20191014-2022/org.eclipse.equinox.launcher-1.5.600.v20191014-2022.jar, -install, /home/jenkins/agent/workspace/eclipse.pde.ui-Gerrit/ua/org.eclipse.pde.ua.ui/target/eclipserun-work, -configuration, /home/jenkins/agent/workspace/eclipse.pde.ui-Gerrit/ua/org.eclipse.pde.ua.ui/target/eclipserun-work/configuration, -data, target/apibuild-workspace, -application, org.eclipse.ant.core.antRunner, -buildfile, target/.apibuild.xml]
Picked up JAVA_TOOL_OPTIONS: -XX:+IgnoreUnrecognizedVMOptions -XX:+UseContainerSupport -XX:+UnlockExperimentalVMOptions -XX:+UseCGroupMemoryLimitForHeap
Picked up _JAVA_OPTIONS: -XX:MaxRAMPercentage=64.0
Buildfile: target/.apibuild.xml

apigen:
BUILD SUCCESSFUL

BUILD SUCCESSFUL
Total time: 0 seconds
[INFO] 
[INFO] --- maven-resources-plugin:3.1.0:testResources (default-testResources) @ org.eclipse.pde.ua.ui ---
[INFO] Using 'UTF-8' encoding to copy filtered resources.
[INFO] skip non existing resourceDirectory /home/jenkins/agent/workspace/eclipse.pde.ui-Gerrit/ua/org.eclipse.pde.ua.ui/src/test/resources
[INFO] 
[INFO] --- tycho-source-plugin:1.5.1:plugin-source (plugin-source) @ org.eclipse.pde.ua.ui ---
[INFO] Building jar: /home/jenkins/agent/workspace/eclipse.pde.ui-Gerrit/ua/org.eclipse.pde.ua.ui/target/org.eclipse.pde.ua.ui-1.1.700-SNAPSHOT-sources.jar
[INFO] 
[INFO] --- target-platform-configuration:1.5.1:target-platform (default-target-platform) @ org.eclipse.pde.ua.ui ---
[INFO] 
[INFO] --- tycho-packaging-plugin:1.5.1:package-plugin (default-package-plugin) @ org.eclipse.pde.ua.ui ---
[INFO] Building jar: /home/jenkins/agent/workspace/eclipse.pde.ui-Gerrit/ua/org.eclipse.pde.ua.ui/target/org.eclipse.pde.ua.ui-1.1.700-SNAPSHOT.jar
[INFO] 
[INFO] --- tycho-p2-plugin:1.5.1:p2-metadata-default (default-p2-metadata-default) @ org.eclipse.pde.ua.ui ---
[INFO] MavenProject: org.eclipse.pde:org.eclipse.pde.ua.ui:1.1.700-SNAPSHOT @ /home/jenkins/agent/workspace/eclipse.pde.ui-Gerrit/ua/org.eclipse.pde.ua.ui/pom.xml
    The main artifact has been replaced with the baseline version.
    The following attached artifacts have been replaced with the baseline version: [sources]

[INFO] 
[INFO] --- tycho-p2-extras-plugin:1.5.1:compare-version-with-baselines (compare-attached-artifacts-with-release) @ org.eclipse.pde.ua.ui ---
[INFO] Fetching org.eclipse.pde.ua.ui_1.1.700.v20191011-0551.jar.pack.gz from https://download.eclipse.org/eclipse/updates/4.14milestones/S-4.14RC1-201911271800/plugins/ (144.81kB)
[INFO] Fetching org.eclipse.pde.ua.ui_1.1.700.v20191011-0551.jar.pack.gz from https://download.eclipse.org/eclipse/updates/4.14milestones/S-4.14RC1-201911271800/plugins/ (144.81kB)
[INFO] Fetching org.eclipse.pde.ua.ui.source_1.1.700.v20191011-0551.jar from https://download.eclipse.org/eclipse/updates/4.14milestones/S-4.14RC1-201911271800/plugins/ (272.58kB)
[INFO] Fetching org.eclipse.pde.ua.ui.source_1.1.700.v20191011-0551.jar from https://download.eclipse.org/eclipse/updates/4.14milestones/S-4.14RC1-201911271800/plugins/ (272.58kB)
[INFO] 
[INFO] --- maven-antrun-plugin:1.8:run (check-skip-api-analysis) @ org.eclipse.pde.ua.ui ---
[INFO] Executing tasks

main:
[INFO] Executed tasks
[INFO] 
[INFO] --- tycho-dependency-tools-plugin:1.5.1:list-dependencies (list-dependencies) @ org.eclipse.pde.ua.ui ---
[INFO] 
[INFO] --- tycho-eclipserun-plugin:1.5.1:eclipse-run (api-analysis) @ org.eclipse.pde.ua.ui ---
[INFO] Toolchain in tycho-eclipserun-plugin: JDK[/opt/tools/java/oracle/jdk-8/latest/jre]
[INFO] Expected eclipse log file: /home/jenkins/agent/workspace/eclipse.pde.ui-Gerrit/ua/org.eclipse.pde.ua.ui/target/eclipserun-work/data/.metadata/.log
[INFO] Command line:
	[/opt/tools/java/oracle/jdk-8/latest/jre/bin/java, -Xmx2048M, -jar, /home/jenkins/agent/workspace/eclipse.pde.ui-Gerrit/.repository/p2/osgi/bundle/org.eclipse.equinox.launcher/1.5.600.v20191014-2022/org.eclipse.equinox.launcher-1.5.600.v20191014-2022.jar, -install, /home/jenkins/agent/workspace/eclipse.pde.ui-Gerrit/ua/org.eclipse.pde.ua.ui/target/eclipserun-work, -configuration, /home/jenkins/agent/workspace/eclipse.pde.ui-Gerrit/ua/org.eclipse.pde.ua.ui/target/eclipserun-work/configuration, -data, /home/jenkins/agent/workspace/eclipse.pde.ui-Gerrit/ua/org.eclipse.pde.ua.ui/../target/org.eclipse.pde.ua.ui-apiAnalyzer-workspace, -application, org.eclipse.pde.api.tools.apiAnalyzer, -project, /home/jenkins/agent/workspace/eclipse.pde.ui-Gerrit/ua/org.eclipse.pde.ua.ui, -baseline, /home/jenkins/agent/workspace/eclipse.pde.ui-Gerrit/ua/org.eclipse.pde.ua.ui/target/org.eclipse.pde.ua.ui-apiBaseline.target, -dependencyList, /home/jenkins/agent/workspace/eclipse.pde.ui-Gerrit/ua/org.eclipse.pde.ua.ui/target/dependencies-list.txt, -failOnError]
Picked up JAVA_TOOL_OPTIONS: -XX:+IgnoreUnrecognizedVMOptions -XX:+UseContainerSupport -XX:+UnlockExperimentalVMOptions -XX:+UseCGroupMemoryLimitForHeap
Picked up _JAVA_OPTIONS: -XX:MaxRAMPercentage=64.0
0 API ERRORS
4 API warnings
* Marker [on: /org.eclipse.pde.ua.ui, id: 29, type: org.eclipse.pde.api.tools.api_usage, attributes: [apiMarkerID: 3, charEnd: -1, charStart: -1, lineNumber: 0, message: Execution environment references were not checked for 'org.eclipse.pde.ua.ui' because no environment descriptions are installed. , messagearguments: org.eclipse.pde.ua.ui, problemid: 665845798, severity: 1, sourceId: API Tools], created: 12/13/19 5:48 PM]
* Marker [on: /org.eclipse.pde.ua.ui/src/org/eclipse/pde/internal/ua/ui/wizards/cheatsheet/NewCSFileWizard.java, id: 30, type: org.eclipse.pde.api.tools.api_usage, attributes: [apiMarkerID: 3, charEnd: 1095, charStart: 1080, lineNumber: 27, message: NewCSFileWizard illegally extends BasicNewFileResourceWizard, messagearguments: BasicNewFileResourceWizard#NewCSFileWizard, org.eclipse.jdt.internal.core.JavaModelManager.handleId: =org.eclipse.pde.ua.ui/src<org.eclipse.pde.internal.ua.ui.wizards.cheatsheet{NewCSFileWizard.java[NewCSFileWizard, problemTypeName: org.eclipse.pde.internal.ua.ui.wizards.cheatsheet.NewCSFileWizard, problemid: 571473929, severity: 1, sourceId: API Tools], created: 12/13/19 5:48 PM]
* Marker [on: /org.eclipse.pde.ua.ui/src/org/eclipse/pde/internal/ua/ui/wizards/ctxhelp/NewCtxHelpWizard.java, id: 31, type: org.eclipse.pde.api.tools.api_usage, attributes: [apiMarkerID: 3, charEnd: 1082, charStart: 1066, lineNumber: 29, message: NewCtxHelpWizard illegally extends BasicNewFileResourceWizard, messagearguments: BasicNewFileResourceWizard#NewCtxHelpWizard, org.eclipse.jdt.internal.core.JavaModelManager.handleId: =org.eclipse.pde.ua.ui/src<org.eclipse.pde.internal.ua.ui.wizards.ctxhelp{NewCtxHelpWizard.java[NewCtxHelpWizard, problemTypeName: org.eclipse.pde.internal.ua.ui.wizards.ctxhelp.NewCtxHelpWizard, problemid: 571473929, severity: 1, sourceId: API Tools], created: 12/13/19 5:48 PM]
* Marker [on: /org.eclipse.pde.ua.ui/src/org/eclipse/pde/internal/ua/ui/wizards/toc/TocHTMLWizard.java, id: 32, type: org.eclipse.pde.api.tools.api_usage, attributes: [apiMarkerID: 3, charEnd: 962, charStart: 949, lineNumber: 24, message: TocHTMLWizard illegally extends BasicNewFileResourceWizard, messagearguments: BasicNewFileResourceWizard#TocHTMLWizard, org.eclipse.jdt.internal.core.JavaModelManager.handleId: =org.eclipse.pde.ua.ui/src<org.eclipse.pde.internal.ua.ui.wizards.toc{TocHTMLWizard.java[TocHTMLWizard, problemTypeName: org.eclipse.pde.internal.ua.ui.wizards.toc.TocHTMLWizard, problemid: 571473929, severity: 1, sourceId: API Tools], created: 12/13/19 5:48 PM]
[INFO] 
[INFO] -----< org.eclipse.pde.ui:org.eclipse.pde.genericeditor.extension >-----
[INFO] Building org.eclipse.pde.genericeditor.extension 1.0.700-SNAPSHOT [38/46]
[INFO] ---------------------------[ eclipse-plugin ]---------------------------
[INFO] 
[INFO] --- maven-clean-plugin:3.1.0:clean (default-clean) @ org.eclipse.pde.genericeditor.extension ---
[INFO] 
[INFO] --- tycho-packaging-plugin:1.5.1:build-qualifier (default-build-qualifier) @ org.eclipse.pde.genericeditor.extension ---
[INFO] The project's OSGi version is 1.0.700.v20191212-1043
[INFO] 
[INFO] --- tycho-packaging-plugin:1.5.1:validate-id (default-validate-id) @ org.eclipse.pde.genericeditor.extension ---
[INFO] 
[INFO] --- tycho-packaging-plugin:1.5.1:validate-version (default-validate-version) @ org.eclipse.pde.genericeditor.extension ---
[INFO] 
[INFO] --- maven-resources-plugin:3.1.0:copy-resources (saveproperties) @ org.eclipse.pde.genericeditor.extension ---
[INFO] Using 'UTF-8' encoding to copy filtered resources.
[INFO] skip non existing resourceDirectory /home/jenkins/agent/workspace/eclipse.pde.ui-Gerrit/ui/org.eclipse.pde.genericeditor.extension/saveproperties
[INFO] 
[INFO] --- maven-enforcer-plugin:3.0.0-M3:enforce (enforce-maven) @ org.eclipse.pde.genericeditor.extension ---
[INFO] 
[INFO] --- eclipse-cbi-plugin:1.1.8-SNAPSHOT:generate-api-build-xml (default) @ org.eclipse.pde.genericeditor.extension ---
Generating target/.apibuild.xml
[INFO] 
[INFO] --- maven-resources-plugin:3.1.0:resources (default-resources) @ org.eclipse.pde.genericeditor.extension ---
[INFO] Using 'UTF-8' encoding to copy filtered resources.
[INFO] skip non existing resourceDirectory /home/jenkins/agent/workspace/eclipse.pde.ui-Gerrit/ui/org.eclipse.pde.genericeditor.extension/src/main/resources
[INFO] 
[INFO] --- maven-resources-plugin:3.1.0:resources (filter-resources) @ org.eclipse.pde.genericeditor.extension ---
[INFO] Using 'UTF-8' encoding to copy filtered resources.
[INFO] skip non existing resourceDirectory /home/jenkins/agent/workspace/eclipse.pde.ui-Gerrit/ui/org.eclipse.pde.genericeditor.extension/src/main/resources
[INFO] 
[INFO] --- tycho-compiler-plugin:1.5.1:compile (default-compile) @ org.eclipse.pde.genericeditor.extension ---
[INFO] Compiling 37 source files to /home/jenkins/agent/workspace/eclipse.pde.ui-Gerrit/ui/org.eclipse.pde.genericeditor.extension/target/classes
[INFO] 
[INFO] --- tycho-eclipserun-plugin:1.5.1:eclipse-run (default) @ org.eclipse.pde.genericeditor.extension ---
[INFO] Toolchain in tycho-eclipserun-plugin: JDK[/opt/tools/java/oracle/jdk-8/latest/jre]
[INFO] Expected eclipse log file: /home/jenkins/agent/workspace/eclipse.pde.ui-Gerrit/ui/org.eclipse.pde.genericeditor.extension/target/eclipserun-work/data/.metadata/.log
[INFO] Command line:
	[/opt/tools/java/oracle/jdk-8/latest/jre/bin/java, -jar, /home/jenkins/agent/workspace/eclipse.pde.ui-Gerrit/.repository/p2/osgi/bundle/org.eclipse.equinox.launcher/1.5.600.v20191014-2022/org.eclipse.equinox.launcher-1.5.600.v20191014-2022.jar, -install, /home/jenkins/agent/workspace/eclipse.pde.ui-Gerrit/ui/org.eclipse.pde.genericeditor.extension/target/eclipserun-work, -configuration, /home/jenkins/agent/workspace/eclipse.pde.ui-Gerrit/ui/org.eclipse.pde.genericeditor.extension/target/eclipserun-work/configuration, -data, target/apibuild-workspace, -application, org.eclipse.ant.core.antRunner, -buildfile, target/.apibuild.xml]
Picked up JAVA_TOOL_OPTIONS: -XX:+IgnoreUnrecognizedVMOptions -XX:+UseContainerSupport -XX:+UnlockExperimentalVMOptions -XX:+UseCGroupMemoryLimitForHeap
Picked up _JAVA_OPTIONS: -XX:MaxRAMPercentage=64.0
Buildfile: target/.apibuild.xml

apigen:
BUILD SUCCESSFUL

BUILD SUCCESSFUL
Total time: 0 seconds
[INFO] 
[INFO] --- maven-resources-plugin:3.1.0:testResources (default-testResources) @ org.eclipse.pde.genericeditor.extension ---
[INFO] Using 'UTF-8' encoding to copy filtered resources.
[INFO] skip non existing resourceDirectory /home/jenkins/agent/workspace/eclipse.pde.ui-Gerrit/ui/org.eclipse.pde.genericeditor.extension/src/test/resources
[INFO] 
[INFO] --- tycho-source-plugin:1.5.1:plugin-source (plugin-source) @ org.eclipse.pde.genericeditor.extension ---
[INFO] Building jar: /home/jenkins/agent/workspace/eclipse.pde.ui-Gerrit/ui/org.eclipse.pde.genericeditor.extension/target/org.eclipse.pde.genericeditor.extension-1.0.700-SNAPSHOT-sources.jar
[INFO] 
[INFO] --- target-platform-configuration:1.5.1:target-platform (default-target-platform) @ org.eclipse.pde.genericeditor.extension ---
[INFO] 
[INFO] --- tycho-packaging-plugin:1.5.1:package-plugin (default-package-plugin) @ org.eclipse.pde.genericeditor.extension ---
[INFO] Building jar: /home/jenkins/agent/workspace/eclipse.pde.ui-Gerrit/ui/org.eclipse.pde.genericeditor.extension/target/org.eclipse.pde.genericeditor.extension-1.0.700-SNAPSHOT.jar
[INFO] 
[INFO] --- tycho-p2-plugin:1.5.1:p2-metadata-default (default-p2-metadata-default) @ org.eclipse.pde.genericeditor.extension ---
[INFO] MavenProject: org.eclipse.pde.ui:org.eclipse.pde.genericeditor.extension:1.0.700-SNAPSHOT @ /home/jenkins/agent/workspace/eclipse.pde.ui-Gerrit/ui/org.eclipse.pde.genericeditor.extension/pom.xml
    The main artifact has been replaced with the baseline version.
    The following attached artifacts have been replaced with the baseline version: [sources]

[INFO] 
[INFO] --- tycho-p2-extras-plugin:1.5.1:compare-version-with-baselines (compare-attached-artifacts-with-release) @ org.eclipse.pde.genericeditor.extension ---
[INFO] Fetching org.eclipse.pde.genericeditor.extension_1.0.600.v20191107-0648.jar.pack.gz from https://download.eclipse.org/eclipse/updates/4.14milestones/S-4.14RC1-201911271800/plugins/ (32.79kB)
[INFO] Fetching org.eclipse.pde.genericeditor.extension_1.0.600.v20191107-0648.jar.pack.gz from https://download.eclipse.org/eclipse/updates/4.14milestones/S-4.14RC1-201911271800/plugins/ (32.79kB)
[INFO] Fetching org.eclipse.pde.genericeditor.extension.source_1.0.600.v20191107-0648.jar from https://download.eclipse.org/eclipse/updates/4.14milestones/S-4.14RC1-201911271800/plugins/ (63.28kB)
[INFO] Fetching org.eclipse.pde.genericeditor.extension.source_1.0.600.v20191107-0648.jar from https://download.eclipse.org/eclipse/updates/4.14milestones/S-4.14RC1-201911271800/plugins/ (63.28kB)
[INFO] 
[INFO] --- maven-antrun-plugin:1.8:run (check-skip-api-analysis) @ org.eclipse.pde.genericeditor.extension ---
[INFO] Executing tasks

main:
[INFO] Executed tasks
[INFO] 
[INFO] --- tycho-dependency-tools-plugin:1.5.1:list-dependencies (list-dependencies) @ org.eclipse.pde.genericeditor.extension ---
[INFO] 
[INFO] --- tycho-eclipserun-plugin:1.5.1:eclipse-run (api-analysis) @ org.eclipse.pde.genericeditor.extension ---
[INFO] Toolchain in tycho-eclipserun-plugin: JDK[/opt/tools/java/oracle/jdk-8/latest/jre]
[INFO] Expected eclipse log file: /home/jenkins/agent/workspace/eclipse.pde.ui-Gerrit/ui/org.eclipse.pde.genericeditor.extension/target/eclipserun-work/data/.metadata/.log
[INFO] Command line:
	[/opt/tools/java/oracle/jdk-8/latest/jre/bin/java, -Xmx2048M, -jar, /home/jenkins/agent/workspace/eclipse.pde.ui-Gerrit/.repository/p2/osgi/bundle/org.eclipse.equinox.launcher/1.5.600.v20191014-2022/org.eclipse.equinox.launcher-1.5.600.v20191014-2022.jar, -install, /home/jenkins/agent/workspace/eclipse.pde.ui-Gerrit/ui/org.eclipse.pde.genericeditor.extension/target/eclipserun-work, -configuration, /home/jenkins/agent/workspace/eclipse.pde.ui-Gerrit/ui/org.eclipse.pde.genericeditor.extension/target/eclipserun-work/configuration, -data, /home/jenkins/agent/workspace/eclipse.pde.ui-Gerrit/ui/org.eclipse.pde.genericeditor.extension/../target/org.eclipse.pde.genericeditor.extension-apiAnalyzer-workspace, -application, org.eclipse.pde.api.tools.apiAnalyzer, -project, /home/jenkins/agent/workspace/eclipse.pde.ui-Gerrit/ui/org.eclipse.pde.genericeditor.extension, -baseline, /home/jenkins/agent/workspace/eclipse.pde.ui-Gerrit/ui/org.eclipse.pde.genericeditor.extension/target/org.eclipse.pde.genericeditor.extension-apiBaseline.target, -dependencyList, /home/jenkins/agent/workspace/eclipse.pde.ui-Gerrit/ui/org.eclipse.pde.genericeditor.extension/target/dependencies-list.txt, -failOnError]
Picked up JAVA_TOOL_OPTIONS: -XX:+IgnoreUnrecognizedVMOptions -XX:+UseContainerSupport -XX:+UnlockExperimentalVMOptions -XX:+UseCGroupMemoryLimitForHeap
Picked up _JAVA_OPTIONS: -XX:MaxRAMPercentage=64.0
0 API ERRORS
0 API warnings
[INFO] 
[INFO] ------------< org.eclipse.pde:org.eclipse.tools.layout.spy >------------
[INFO] Building org.eclipse.tools.layout.spy 1.0.400-SNAPSHOT           [39/46]
[INFO] ---------------------------[ eclipse-plugin ]---------------------------
[INFO] 
[INFO] --- maven-clean-plugin:3.1.0:clean (default-clean) @ org.eclipse.tools.layout.spy ---
[INFO] 
[INFO] --- tycho-packaging-plugin:1.5.1:build-qualifier (default-build-qualifier) @ org.eclipse.tools.layout.spy ---
[INFO] The project's OSGi version is 1.0.400.v20190709-0901
[INFO] 
[INFO] --- tycho-packaging-plugin:1.5.1:validate-id (default-validate-id) @ org.eclipse.tools.layout.spy ---
[INFO] 
[INFO] --- tycho-packaging-plugin:1.5.1:validate-version (default-validate-version) @ org.eclipse.tools.layout.spy ---
[INFO] 
[INFO] --- maven-resources-plugin:3.1.0:copy-resources (saveproperties) @ org.eclipse.tools.layout.spy ---
[INFO] Using 'UTF-8' encoding to copy filtered resources.
[INFO] skip non existing resourceDirectory /home/jenkins/agent/workspace/eclipse.pde.ui-Gerrit/ui/org.eclipse.tools.layout.spy/saveproperties
[INFO] 
[INFO] --- maven-enforcer-plugin:3.0.0-M3:enforce (enforce-maven) @ org.eclipse.tools.layout.spy ---
[INFO] 
[INFO] --- eclipse-cbi-plugin:1.1.8-SNAPSHOT:generate-api-build-xml (default) @ org.eclipse.tools.layout.spy ---
Generating target/.apibuild.xml
[INFO] 
[INFO] --- maven-resources-plugin:3.1.0:resources (default-resources) @ org.eclipse.tools.layout.spy ---
[INFO] Using 'UTF-8' encoding to copy filtered resources.
[INFO] skip non existing resourceDirectory /home/jenkins/agent/workspace/eclipse.pde.ui-Gerrit/ui/org.eclipse.tools.layout.spy/src/main/resources
[INFO] 
[INFO] --- maven-resources-plugin:3.1.0:resources (filter-resources) @ org.eclipse.tools.layout.spy ---
[INFO] Using 'UTF-8' encoding to copy filtered resources.
[INFO] skip non existing resourceDirectory /home/jenkins/agent/workspace/eclipse.pde.ui-Gerrit/ui/org.eclipse.tools.layout.spy/src/main/resources
[INFO] 
[INFO] --- tycho-compiler-plugin:1.5.1:compile (default-compile) @ org.eclipse.tools.layout.spy ---
[INFO] Compiling 7 source files to /home/jenkins/agent/workspace/eclipse.pde.ui-Gerrit/ui/org.eclipse.tools.layout.spy/target/classes
[INFO] 
[INFO] --- tycho-eclipserun-plugin:1.5.1:eclipse-run (default) @ org.eclipse.tools.layout.spy ---
[INFO] Toolchain in tycho-eclipserun-plugin: JDK[/opt/tools/java/oracle/jdk-8/latest/jre]
[INFO] Expected eclipse log file: /home/jenkins/agent/workspace/eclipse.pde.ui-Gerrit/ui/org.eclipse.tools.layout.spy/target/eclipserun-work/data/.metadata/.log
[INFO] Command line:
	[/opt/tools/java/oracle/jdk-8/latest/jre/bin/java, -jar, /home/jenkins/agent/workspace/eclipse.pde.ui-Gerrit/.repository/p2/osgi/bundle/org.eclipse.equinox.launcher/1.5.600.v20191014-2022/org.eclipse.equinox.launcher-1.5.600.v20191014-2022.jar, -install, /home/jenkins/agent/workspace/eclipse.pde.ui-Gerrit/ui/org.eclipse.tools.layout.spy/target/eclipserun-work, -configuration, /home/jenkins/agent/workspace/eclipse.pde.ui-Gerrit/ui/org.eclipse.tools.layout.spy/target/eclipserun-work/configuration, -data, target/apibuild-workspace, -application, org.eclipse.ant.core.antRunner, -buildfile, target/.apibuild.xml]
Picked up JAVA_TOOL_OPTIONS: -XX:+IgnoreUnrecognizedVMOptions -XX:+UseContainerSupport -XX:+UnlockExperimentalVMOptions -XX:+UseCGroupMemoryLimitForHeap
Picked up _JAVA_OPTIONS: -XX:MaxRAMPercentage=64.0
Buildfile: target/.apibuild.xml

apigen:
BUILD SUCCESSFUL

BUILD SUCCESSFUL
Total time: 0 seconds
[INFO] 
[INFO] --- maven-resources-plugin:3.1.0:testResources (default-testResources) @ org.eclipse.tools.layout.spy ---
[INFO] Using 'UTF-8' encoding to copy filtered resources.
[INFO] skip non existing resourceDirectory /home/jenkins/agent/workspace/eclipse.pde.ui-Gerrit/ui/org.eclipse.tools.layout.spy/src/test/resources
[INFO] 
[INFO] --- tycho-source-plugin:1.5.1:plugin-source (plugin-source) @ org.eclipse.tools.layout.spy ---
[INFO] Building jar: /home/jenkins/agent/workspace/eclipse.pde.ui-Gerrit/ui/org.eclipse.tools.layout.spy/target/org.eclipse.tools.layout.spy-1.0.400-SNAPSHOT-sources.jar
[INFO] 
[INFO] --- target-platform-configuration:1.5.1:target-platform (default-target-platform) @ org.eclipse.tools.layout.spy ---
[INFO] 
[INFO] --- tycho-packaging-plugin:1.5.1:package-plugin (default-package-plugin) @ org.eclipse.tools.layout.spy ---
[INFO] Building jar: /home/jenkins/agent/workspace/eclipse.pde.ui-Gerrit/ui/org.eclipse.tools.layout.spy/target/org.eclipse.tools.layout.spy-1.0.400-SNAPSHOT.jar
[INFO] 
[INFO] --- tycho-p2-plugin:1.5.1:p2-metadata-default (default-p2-metadata-default) @ org.eclipse.tools.layout.spy ---
[INFO] MavenProject: org.eclipse.pde:org.eclipse.tools.layout.spy:1.0.400-SNAPSHOT @ /home/jenkins/agent/workspace/eclipse.pde.ui-Gerrit/ui/org.eclipse.tools.layout.spy/pom.xml
    The main artifact has been replaced with the baseline version.
    The following attached artifacts have been replaced with the baseline version: [sources]

[INFO] 
[INFO] --- tycho-p2-extras-plugin:1.5.1:compare-version-with-baselines (compare-attached-artifacts-with-release) @ org.eclipse.tools.layout.spy ---
[INFO] Fetching org.eclipse.tools.layout.spy_1.0.400.v20190709-0901.jar.pack.gz from https://download.eclipse.org/eclipse/updates/4.14milestones/S-4.14RC1-201911271800/plugins/ (24.9kB)
[INFO] Fetching org.eclipse.tools.layout.spy_1.0.400.v20190709-0901.jar.pack.gz from https://download.eclipse.org/eclipse/updates/4.14milestones/S-4.14RC1-201911271800/plugins/ (24.9kB)
[INFO] Fetching org.eclipse.tools.layout.spy.source_1.0.400.v20190709-0901.jar from https://download.eclipse.org/eclipse/updates/4.14milestones/S-4.14RC1-201911271800/plugins/ (26.09kB)
[INFO] Fetching org.eclipse.tools.layout.spy.source_1.0.400.v20190709-0901.jar from https://download.eclipse.org/eclipse/updates/4.14milestones/S-4.14RC1-201911271800/plugins/ (26.09kB)
[INFO] 
[INFO] --- maven-antrun-plugin:1.8:run (check-skip-api-analysis) @ org.eclipse.tools.layout.spy ---
[INFO] Executing tasks

main:
[INFO] Executed tasks
[INFO] 
[INFO] --- tycho-dependency-tools-plugin:1.5.1:list-dependencies (list-dependencies) @ org.eclipse.tools.layout.spy ---
[INFO] 
[INFO] --- tycho-eclipserun-plugin:1.5.1:eclipse-run (api-analysis) @ org.eclipse.tools.layout.spy ---
[INFO] Toolchain in tycho-eclipserun-plugin: JDK[/opt/tools/java/oracle/jdk-8/latest/jre]
[INFO] Expected eclipse log file: /home/jenkins/agent/workspace/eclipse.pde.ui-Gerrit/ui/org.eclipse.tools.layout.spy/target/eclipserun-work/data/.metadata/.log
[INFO] Command line:
	[/opt/tools/java/oracle/jdk-8/latest/jre/bin/java, -Xmx2048M, -jar, /home/jenkins/agent/workspace/eclipse.pde.ui-Gerrit/.repository/p2/osgi/bundle/org.eclipse.equinox.launcher/1.5.600.v20191014-2022/org.eclipse.equinox.launcher-1.5.600.v20191014-2022.jar, -install, /home/jenkins/agent/workspace/eclipse.pde.ui-Gerrit/ui/org.eclipse.tools.layout.spy/target/eclipserun-work, -configuration, /home/jenkins/agent/workspace/eclipse.pde.ui-Gerrit/ui/org.eclipse.tools.layout.spy/target/eclipserun-work/configuration, -data, /home/jenkins/agent/workspace/eclipse.pde.ui-Gerrit/ui/org.eclipse.tools.layout.spy/../target/org.eclipse.tools.layout.spy-apiAnalyzer-workspace, -application, org.eclipse.pde.api.tools.apiAnalyzer, -project, /home/jenkins/agent/workspace/eclipse.pde.ui-Gerrit/ui/org.eclipse.tools.layout.spy, -baseline, /home/jenkins/agent/workspace/eclipse.pde.ui-Gerrit/ui/org.eclipse.tools.layout.spy/target/org.eclipse.tools.layout.spy-apiBaseline.target, -dependencyList, /home/jenkins/agent/workspace/eclipse.pde.ui-Gerrit/ui/org.eclipse.tools.layout.spy/target/dependencies-list.txt, -failOnError]
Picked up JAVA_TOOL_OPTIONS: -XX:+IgnoreUnrecognizedVMOptions -XX:+UseContainerSupport -XX:+UnlockExperimentalVMOptions -XX:+UseCGroupMemoryLimitForHeap
Picked up _JAVA_OPTIONS: -XX:MaxRAMPercentage=64.0
0 API ERRORS
0 API warnings
[INFO] 
[INFO] --------------< org.eclipse.pde.feature:org.eclipse.pde >---------------
[INFO] Building org.eclipse.pde 3.14.300-SNAPSHOT                       [40/46]
[INFO] --------------------------[ eclipse-feature ]---------------------------
[INFO] 
[INFO] --- maven-clean-plugin:3.1.0:clean (default-clean) @ org.eclipse.pde ---
[INFO] Deleting /home/jenkins/agent/workspace/eclipse.pde.ui-Gerrit/features/org.eclipse.pde-feature/target
[INFO] 
[INFO] --- tycho-packaging-plugin:1.5.1:build-qualifier-aggregator (default-build-qualifier-aggregator) @ org.eclipse.pde ---
[INFO] The project's OSGi version is 3.14.300.v20191213-1702
[INFO] 
[INFO] --- tycho-packaging-plugin:1.5.1:validate-id (default-validate-id) @ org.eclipse.pde ---
[INFO] 
[INFO] --- tycho-packaging-plugin:1.5.1:validate-version (default-validate-version) @ org.eclipse.pde ---
[INFO] 
[INFO] --- maven-resources-plugin:3.1.0:copy-resources (saveproperties) @ org.eclipse.pde ---
[INFO] Using 'UTF-8' encoding to copy filtered resources.
[INFO] skip non existing resourceDirectory /home/jenkins/agent/workspace/eclipse.pde.ui-Gerrit/features/org.eclipse.pde-feature/saveproperties
[INFO] 
[INFO] --- maven-enforcer-plugin:3.0.0-M3:enforce (enforce-maven) @ org.eclipse.pde ---
[INFO] 
[INFO] --- eclipse-cbi-plugin:1.1.8-SNAPSHOT:generate-api-build-xml (default) @ org.eclipse.pde ---
[INFO] 
[INFO] --- maven-resources-plugin:3.1.0:resources (filter-resources) @ org.eclipse.pde ---
[INFO] Using 'UTF-8' encoding to copy filtered resources.
[INFO] skip non existing resourceDirectory /home/jenkins/agent/workspace/eclipse.pde.ui-Gerrit/features/org.eclipse.pde-feature/src/main/resources
[INFO] 
[INFO] --- tycho-eclipserun-plugin:1.5.1:eclipse-run (default) @ org.eclipse.pde ---
[INFO] 
[INFO] --- tycho-source-plugin:1.5.1:plugin-source (plugin-source) @ org.eclipse.pde ---
[INFO] 
[INFO] --- target-platform-configuration:1.5.1:target-platform (default-target-platform) @ org.eclipse.pde ---
[INFO] 
[INFO] --- tycho-packaging-plugin:1.5.1:package-feature (default-package-feature) @ org.eclipse.pde ---
[INFO] Building jar: /home/jenkins/agent/workspace/eclipse.pde.ui-Gerrit/features/org.eclipse.pde-feature/target/org.eclipse.pde-3.14.300-SNAPSHOT.jar
[INFO] 
[INFO] --- tycho-p2-plugin:1.5.1:p2-metadata-default (default-p2-metadata-default) @ org.eclipse.pde ---
[INFO] No baseline version MavenProject: org.eclipse.pde.feature:org.eclipse.pde:3.14.300-SNAPSHOT @ /home/jenkins/agent/workspace/eclipse.pde.ui-Gerrit/features/org.eclipse.pde-feature/pom.xml
[INFO] 
[INFO] --- tycho-p2-plugin:1.5.1:feature-p2-metadata (default-feature-p2-metadata) @ org.eclipse.pde ---
[INFO] 
[INFO] --- tycho-source-feature-plugin:1.5.1:source-feature (source-feature) @ org.eclipse.pde ---
[INFO] Fetching org.eclipse.pde.build.source_3.10.700.v20191211-2130.jar from https://download.eclipse.org/eclipse/updates/4.15-I-builds/I20191212-1800/plugins/ (319.75kB)
[INFO] Fetching org.eclipse.pde.build.source_3.10.700.v20191211-2130.jar from https://download.eclipse.org/eclipse/updates/4.15-I-builds/I20191212-1800/plugins/ (319.75kB)
[INFO] Fetching org.objectweb.asm.source_7.2.0.v20191010-1910.jar from https://download.eclipse.org/eclipse/updates/4.15-I-builds/I20191209-2205/plugins/ (180.82kB)
[INFO] Fetching org.objectweb.asm.source_7.2.0.v20191010-1910.jar from https://download.eclipse.org/eclipse/updates/4.15-I-builds/I20191209-2205/plugins/ (180.82kB)
[INFO] Fetching org.objectweb.asm.tree.source_7.2.0.v20191010-1910.jar from https://download.eclipse.org/eclipse/updates/4.15-I-builds/I20191209-2205/plugins/ (83.64kB)
[INFO] Fetching org.objectweb.asm.tree.source_7.2.0.v20191010-1910.jar from https://download.eclipse.org/eclipse/updates/4.15-I-builds/I20191209-2205/plugins/ (83.64kB)
[INFO] Building jar: /home/jenkins/agent/workspace/eclipse.pde.ui-Gerrit/features/org.eclipse.pde-feature/target/org.eclipse.pde-3.14.300-SNAPSHOT-sources-feature.jar
[INFO] 
[INFO] --- tycho-p2-plugin:1.5.1:p2-metadata (attached-p2-metadata) @ org.eclipse.pde ---
[INFO] No baseline version MavenProject: org.eclipse.pde.feature:org.eclipse.pde:3.14.300-SNAPSHOT @ /home/jenkins/agent/workspace/eclipse.pde.ui-Gerrit/features/org.eclipse.pde-feature/pom.xml
[INFO] 
[INFO] --- tycho-p2-extras-plugin:1.5.1:compare-version-with-baselines (compare-attached-artifacts-with-release) @ org.eclipse.pde ---
[INFO] Fetching org.eclipse.pde_3.14.200.v20191210-0610.jar from https://download.eclipse.org/eclipse/updates/4.14milestones/S-4.14RC2a-201912100610/features/ (19.45kB)
[INFO] Fetching org.eclipse.pde_3.14.200.v20191210-0610.jar from https://download.eclipse.org/eclipse/updates/4.14milestones/S-4.14RC2a-201912100610/features/ (19.45kB)
[INFO] Fetching org.eclipse.pde.source_3.14.200.v20191210-0610.jar from https://download.eclipse.org/eclipse/updates/4.14milestones/S-4.14RC2a-201912100610/features/ (18.88kB)
[INFO] Fetching org.eclipse.pde.source_3.14.200.v20191210-0610.jar from https://download.eclipse.org/eclipse/updates/4.14milestones/S-4.14RC2a-201912100610/features/ (18.88kB)
[INFO] 
[INFO] --- maven-antrun-plugin:1.8:run (check-skip-api-analysis) @ org.eclipse.pde ---
[INFO] Executing tasks

main:
[INFO] Executed tasks
[INFO] 
[INFO] --- tycho-dependency-tools-plugin:1.5.1:list-dependencies (list-dependencies) @ org.eclipse.pde ---
[INFO] Skipped
[INFO] 
[INFO] --- tycho-eclipserun-plugin:1.5.1:eclipse-run (api-analysis) @ org.eclipse.pde ---
[INFO] 
[INFO] --------------< org.eclipse.pde:org.eclipse.pde.ua.tests >--------------
[INFO] Building org.eclipse.pde.ua.tests 1.1.300-SNAPSHOT               [41/46]
[INFO] ------------------------[ eclipse-test-plugin ]-------------------------
[INFO] 
[INFO] --- maven-clean-plugin:3.1.0:clean (default-clean) @ org.eclipse.pde.ua.tests ---
[INFO] 
[INFO] --- tycho-packaging-plugin:1.5.1:build-qualifier (default-build-qualifier) @ org.eclipse.pde.ua.tests ---
[INFO] The project's OSGi version is 1.1.300.v20190701-0716
[INFO] 
[INFO] --- tycho-packaging-plugin:1.5.1:validate-id (default-validate-id) @ org.eclipse.pde.ua.tests ---
[INFO] 
[INFO] --- tycho-packaging-plugin:1.5.1:validate-version (default-validate-version) @ org.eclipse.pde.ua.tests ---
[INFO] 
[INFO] --- maven-resources-plugin:3.1.0:copy-resources (saveproperties) @ org.eclipse.pde.ua.tests ---
[INFO] Using 'UTF-8' encoding to copy filtered resources.
[INFO] skip non existing resourceDirectory /home/jenkins/agent/workspace/eclipse.pde.ui-Gerrit/ua/org.eclipse.pde.ua.tests/saveproperties
[INFO] 
[INFO] --- maven-enforcer-plugin:3.0.0-M3:enforce (enforce-maven) @ org.eclipse.pde.ua.tests ---
[INFO] 
[INFO] --- eclipse-cbi-plugin:1.1.8-SNAPSHOT:generate-api-build-xml (default) @ org.eclipse.pde.ua.tests ---
[INFO] 
[INFO] --- maven-resources-plugin:3.1.0:resources (default-resources) @ org.eclipse.pde.ua.tests ---
[INFO] Using 'UTF-8' encoding to copy filtered resources.
[INFO] skip non existing resourceDirectory /home/jenkins/agent/workspace/eclipse.pde.ui-Gerrit/ua/org.eclipse.pde.ua.tests/src/main/resources
[INFO] 
[INFO] --- maven-resources-plugin:3.1.0:resources (filter-resources) @ org.eclipse.pde.ua.tests ---
[INFO] Using 'UTF-8' encoding to copy filtered resources.
[INFO] skip non existing resourceDirectory /home/jenkins/agent/workspace/eclipse.pde.ui-Gerrit/ua/org.eclipse.pde.ua.tests/src/main/resources
[INFO] 
[INFO] --- tycho-compiler-plugin:1.5.1:compile (default-compile) @ org.eclipse.pde.ua.tests ---
[INFO] Compiling 10 source files to /home/jenkins/agent/workspace/eclipse.pde.ui-Gerrit/ua/org.eclipse.pde.ua.tests/target/classes
[INFO] 
[INFO] --- tycho-eclipserun-plugin:1.5.1:eclipse-run (default) @ org.eclipse.pde.ua.tests ---
[INFO] 
[INFO] --- maven-resources-plugin:3.1.0:testResources (default-testResources) @ org.eclipse.pde.ua.tests ---
[INFO] Using 'UTF-8' encoding to copy filtered resources.
[INFO] skip non existing resourceDirectory /home/jenkins/agent/workspace/eclipse.pde.ui-Gerrit/ua/org.eclipse.pde.ua.tests/src/test/resources
[INFO] 
[INFO] --- tycho-source-plugin:1.5.1:plugin-source (plugin-source) @ org.eclipse.pde.ua.tests ---
[INFO] Building jar: /home/jenkins/agent/workspace/eclipse.pde.ui-Gerrit/ua/org.eclipse.pde.ua.tests/target/org.eclipse.pde.ua.tests-1.1.300-SNAPSHOT-sources.jar
[INFO] 
[INFO] --- target-platform-configuration:1.5.1:target-platform (default-target-platform) @ org.eclipse.pde.ua.tests ---
[INFO] 
[INFO] --- tycho-packaging-plugin:1.5.1:package-plugin (default-package-plugin) @ org.eclipse.pde.ua.tests ---
[INFO] Building jar: /home/jenkins/agent/workspace/eclipse.pde.ui-Gerrit/ua/org.eclipse.pde.ua.tests/tests.jar
[INFO] Building jar: /home/jenkins/agent/workspace/eclipse.pde.ui-Gerrit/ua/org.eclipse.pde.ua.tests/target/org.eclipse.pde.ua.tests-1.1.300-SNAPSHOT.jar
[INFO] 
[INFO] --- tycho-p2-plugin:1.5.1:p2-metadata-default (default-p2-metadata-default) @ org.eclipse.pde.ua.tests ---
Dec 13, 2019 5:50:53 PM org.apache.http.impl.execchain.RetryExec execute
INFO: I/O exception (org.apache.http.NoHttpResponseException) caught when processing request to {s}->https://download.eclipse.org:443: The target server failed to respond
Dec 13, 2019 5:50:53 PM org.apache.http.impl.execchain.RetryExec execute
INFO: Retrying request to {s}->https://download.eclipse.org:443
[WARNING] MavenProject: org.eclipse.pde:org.eclipse.pde.ua.tests:1.1.300-SNAPSHOT @ /home/jenkins/agent/workspace/eclipse.pde.ui-Gerrit/ua/org.eclipse.pde.ua.tests/pom.xml: baseline and build artifacts have same version but different contents
   classifier-sources: not present in baseline

[INFO] MavenProject: org.eclipse.pde:org.eclipse.pde.ua.tests:1.1.300-SNAPSHOT @ /home/jenkins/agent/workspace/eclipse.pde.ui-Gerrit/ua/org.eclipse.pde.ua.tests/pom.xml
    The main artifact has been replaced with the baseline version.
    The following attached artifacts are not present in the baseline and have been removed: [sources]

[INFO] 
[INFO] --- tycho-surefire-plugin:1.5.1:test (default-test) @ org.eclipse.pde.ua.tests ---
[INFO] Expected eclipse log file: /home/jenkins/agent/workspace/eclipse.pde.ui-Gerrit/ua/org.eclipse.pde.ua.tests/target/work/data/.metadata/.log
[INFO] Command line:
	[/opt/tools/java/openjdk/jdk-11/11.0.4/bin/java, -Dosgi.noShutdown=false, -Dosgi.os=linux, -Dosgi.ws=gtk, -Dosgi.arch=x86_64, --add-modules=ALL-SYSTEM, -Dosgi.clean=true, -ea, -jar, /home/jenkins/agent/workspace/eclipse.pde.ui-Gerrit/.repository/p2/osgi/bundle/org.eclipse.equinox.launcher/1.5.600.v20191014-2022/org.eclipse.equinox.launcher-1.5.600.v20191014-2022.jar, -data, /home/jenkins/agent/workspace/eclipse.pde.ui-Gerrit/ua/org.eclipse.pde.ua.tests/target/work/data, -install, /home/jenkins/agent/workspace/eclipse.pde.ui-Gerrit/ua/org.eclipse.pde.ua.tests/target/work, -configuration, /home/jenkins/agent/workspace/eclipse.pde.ui-Gerrit/ua/org.eclipse.pde.ua.tests/target/work/configuration, -application, org.eclipse.tycho.surefire.osgibooter.uitest, -testproperties, /home/jenkins/agent/workspace/eclipse.pde.ui-Gerrit/ua/org.eclipse.pde.ua.tests/target/surefire.properties]
Picked up JAVA_TOOL_OPTIONS: -XX:+IgnoreUnrecognizedVMOptions -XX:+UseContainerSupport -XX:+UnlockExperimentalVMOptions -XX:+UseCGroupMemoryLimitForHeap
Picked up _JAVA_OPTIONS: -XX:MaxRAMPercentage=64.0
Running org.eclipse.pde.internal.ua.tests.AllUATests
Tests run: 45, Failures: 0, Errors: 0, Skipped: 0, Time elapsed: 0.27 s - in org.eclipse.pde.internal.ua.tests.AllUATests
testMoveSimpleCSItem(org.eclipse.pde.internal.ua.tests.cheatsheet.SimpleCSIntroTestCase)  Time elapsed: 0.026 s
testRemoveSimpleCSItem(org.eclipse.pde.internal.ua.tests.cheatsheet.SimpleCSIntroTestCase)  Time elapsed: 0.001 s
testSetIntroDescription(org.eclipse.pde.internal.ua.tests.cheatsheet.SimpleCSIntroTestCase)  Time elapsed: 0.002 s
testAddSimpleCSItem(org.eclipse.pde.internal.ua.tests.cheatsheet.SimpleCSIntroTestCase)  Time elapsed: 0.001 s
testSingleQuoteAttributes(org.eclipse.pde.internal.ua.tests.cheatsheet.SimpleCSIntroTestCase)  Time elapsed: 0.001 s
testRemoveSimpleCSItem2(org.eclipse.pde.internal.ua.tests.cheatsheet.SimpleCSIntroTestCase)  Time elapsed: 0.001 s
testAddSimpleCSItem2(org.eclipse.pde.internal.ua.tests.cheatsheet.SimpleCSIntroTestCase)  Time elapsed: 0.001 s
testReadSimpleCSIntro(org.eclipse.pde.internal.ua.tests.cheatsheet.SimpleCSIntroTestCase)  Time elapsed: 0.001 s
testSetModelAttributes(org.eclipse.pde.internal.ua.tests.cheatsheet.SimpleCSIntroTestCase)  Time elapsed: 0.001 s
testItemActionTestCase(org.eclipse.pde.internal.ua.tests.cheatsheet.SimpleCSItemTestCase)  Time elapsed: 0.003 s
testSimpleCSItemTestCaseSpace(org.eclipse.pde.internal.ua.tests.cheatsheet.SimpleCSItemTestCase)  Time elapsed: 0.002 s
testItemPerformWhenTestCase(org.eclipse.pde.internal.ua.tests.cheatsheet.SimpleCSItemTestCase)  Time elapsed: 0.001 s
testSimpleCSItemTestCaseCRLF(org.eclipse.pde.internal.ua.tests.cheatsheet.SimpleCSItemTestCase)  Time elapsed: 0.002 s
testSimpleCSItemTestCaseCR(org.eclipse.pde.internal.ua.tests.cheatsheet.SimpleCSItemTestCase)  Time elapsed: 0.001 s
testSimpleCSItemTestCaseLF(org.eclipse.pde.internal.ua.tests.cheatsheet.SimpleCSItemTestCase)  Time elapsed: 0.001 s
testSimpleCSItemTestCase(org.eclipse.pde.internal.ua.tests.cheatsheet.SimpleCSItemTestCase)  Time elapsed: 0.001 s
testItemCommandTestCase(org.eclipse.pde.internal.ua.tests.cheatsheet.SimpleCSItemTestCase)  Time elapsed: 0.002 s
testSimpleSubItemActionTestCase3(org.eclipse.pde.internal.ua.tests.cheatsheet.SimpleCSSubItemTestCase)  Time elapsed: 0.004 s
testSimpleRepeatedSubItemTestCase3(org.eclipse.pde.internal.ua.tests.cheatsheet.SimpleCSSubItemTestCase)  Time elapsed: 0.002 s
testSimpleSubItemActionTestCase(org.eclipse.pde.internal.ua.tests.cheatsheet.SimpleCSSubItemTestCase)  Time elapsed: 0.002 s
testSimpleSubItemCommandTestCase(org.eclipse.pde.internal.ua.tests.cheatsheet.SimpleCSSubItemTestCase)  Time elapsed: 0.002 s
testSimpleSubItemCommandTestCase3(org.eclipse.pde.internal.ua.tests.cheatsheet.SimpleCSSubItemTestCase)  Time elapsed: 0.002 s
testSimpleSubItemTestCase(org.eclipse.pde.internal.ua.tests.cheatsheet.SimpleCSSubItemTestCase)  Time elapsed: 0.002 s
testSimpleConditionalSubItemTestCase(org.eclipse.pde.internal.ua.tests.cheatsheet.SimpleCSSubItemTestCase)  Time elapsed: 0.002 s
testSimpleConditionalSubItemTestCase3(org.eclipse.pde.internal.ua.tests.cheatsheet.SimpleCSSubItemTestCase)  Time elapsed: 0.001 s
testSimpleSubItemTestCase3(org.eclipse.pde.internal.ua.tests.cheatsheet.SimpleCSSubItemTestCase)  Time elapsed: 0.003 s
testSimpleRepeatedSubItemTestCase(org.eclipse.pde.internal.ua.tests.cheatsheet.SimpleCSSubItemTestCase)  Time elapsed: 0.001 s
testItemActionTestCase(org.eclipse.pde.internal.ua.tests.cheatsheet.SimpleCSItemAPITestCase)  Time elapsed: 0.005 s
testSimpleCSItemTestCaseSpace(org.eclipse.pde.internal.ua.tests.cheatsheet.SimpleCSItemAPITestCase)  Time elapsed: 0.002 s
testItemPerformWhenTestCase(org.eclipse.pde.internal.ua.tests.cheatsheet.SimpleCSItemAPITestCase)  Time elapsed: 0.002 s
testSimpleCSItemTestCaseCRLF(org.eclipse.pde.internal.ua.tests.cheatsheet.SimpleCSItemAPITestCase)  Time elapsed: 0.002 s
testSimpleCSItemTestCaseCR(org.eclipse.pde.internal.ua.tests.cheatsheet.SimpleCSItemAPITestCase)  Time elapsed: 0.002 s
testSimpleCSItemTestCaseLF(org.eclipse.pde.internal.ua.tests.cheatsheet.SimpleCSItemAPITestCase)  Time elapsed: 0.002 s
testSimpleCSItemTestCase(org.eclipse.pde.internal.ua.tests.cheatsheet.SimpleCSItemAPITestCase)  Time elapsed: 0.002 s
testItemCommandTestCase(org.eclipse.pde.internal.ua.tests.cheatsheet.SimpleCSItemAPITestCase)  Time elapsed: 0.002 s
testSimpleSubItemActionTestCase3(org.eclipse.pde.internal.ua.tests.cheatsheet.SimpleCSSubItemAPITestCase)  Time elapsed: 0.004 s
testSimpleRepeatedSubItemTestCase3(org.eclipse.pde.internal.ua.tests.cheatsheet.SimpleCSSubItemAPITestCase)  Time elapsed: 0.002 s
testSimpleSubItemActionTestCase(org.eclipse.pde.internal.ua.tests.cheatsheet.SimpleCSSubItemAPITestCase)  Time elapsed: 0.002 s
testSimpleSubItemCommandTestCase(org.eclipse.pde.internal.ua.tests.cheatsheet.SimpleCSSubItemAPITestCase)  Time elapsed: 0.002 s
testSimpleSubItemCommandTestCase3(org.eclipse.pde.internal.ua.tests.cheatsheet.SimpleCSSubItemAPITestCase)  Time elapsed: 0.003 s
testSimpleSubItemTestCase(org.eclipse.pde.internal.ua.tests.cheatsheet.SimpleCSSubItemAPITestCase)  Time elapsed: 0.002 s
testSimpleConditionalSubItemTestCase(org.eclipse.pde.internal.ua.tests.cheatsheet.SimpleCSSubItemAPITestCase)  Time elapsed: 0.002 s
testSimpleConditionalSubItemTestCase3(org.eclipse.pde.internal.ua.tests.cheatsheet.SimpleCSSubItemAPITestCase)  Time elapsed: 0.002 s
testSimpleSubItemTestCase3(org.eclipse.pde.internal.ua.tests.cheatsheet.SimpleCSSubItemAPITestCase)  Time elapsed: 0.003 s
testSimpleRepeatedSubItemTestCase(org.eclipse.pde.internal.ua.tests.cheatsheet.SimpleCSSubItemAPITestCase)  Time elapsed: 0.002 s

Results:

Tests run: 45, Failures: 0, Errors: 0, Skipped: 0

[INFO] All tests passed!
[INFO] 
[INFO] --- tycho-p2-extras-plugin:1.5.1:compare-version-with-baselines (compare-attached-artifacts-with-release) @ org.eclipse.pde.ua.tests ---
[INFO] Fetching org.eclipse.pde.ua.tests_1.1.300.v20190701-0716.jar.pack.gz from https://download.eclipse.org/eclipse/updates/4.14milestones/S-4.14RC1-201911271800/plugins/ (29.44kB)
[INFO] Fetching org.eclipse.pde.ua.tests_1.1.300.v20190701-0716.jar.pack.gz from https://download.eclipse.org/eclipse/updates/4.14milestones/S-4.14RC1-201911271800/plugins/ (29.44kB)
[INFO] 
[INFO] --- maven-antrun-plugin:1.8:run (check-skip-api-analysis) @ org.eclipse.pde.ua.tests ---
[INFO] Executing tasks

main:
[INFO] Executed tasks
[INFO] 
[INFO] --- tycho-dependency-tools-plugin:1.5.1:list-dependencies (list-dependencies) @ org.eclipse.pde.ua.tests ---
[INFO] 
[INFO] --- tycho-eclipserun-plugin:1.5.1:eclipse-run (api-analysis) @ org.eclipse.pde.ua.tests ---
[INFO] Toolchain in tycho-eclipserun-plugin: JDK[/opt/tools/java/oracle/jdk-8/latest/jre]
[INFO] Expected eclipse log file: /home/jenkins/agent/workspace/eclipse.pde.ui-Gerrit/ua/org.eclipse.pde.ua.tests/target/eclipserun-work/data/.metadata/.log
[INFO] Command line:
	[/opt/tools/java/oracle/jdk-8/latest/jre/bin/java, -Xmx2048M, -jar, /home/jenkins/agent/workspace/eclipse.pde.ui-Gerrit/.repository/p2/osgi/bundle/org.eclipse.equinox.launcher/1.5.600.v20191014-2022/org.eclipse.equinox.launcher-1.5.600.v20191014-2022.jar, -install, /home/jenkins/agent/workspace/eclipse.pde.ui-Gerrit/ua/org.eclipse.pde.ua.tests/target/eclipserun-work, -configuration, /home/jenkins/agent/workspace/eclipse.pde.ui-Gerrit/ua/org.eclipse.pde.ua.tests/target/eclipserun-work/configuration, -data, /home/jenkins/agent/workspace/eclipse.pde.ui-Gerrit/ua/org.eclipse.pde.ua.tests/../target/org.eclipse.pde.ua.tests-apiAnalyzer-workspace, -application, org.eclipse.pde.api.tools.apiAnalyzer, -project, /home/jenkins/agent/workspace/eclipse.pde.ui-Gerrit/ua/org.eclipse.pde.ua.tests, -baseline, /home/jenkins/agent/workspace/eclipse.pde.ui-Gerrit/ua/org.eclipse.pde.ua.tests/target/org.eclipse.pde.ua.tests-apiBaseline.target, -dependencyList, /home/jenkins/agent/workspace/eclipse.pde.ui-Gerrit/ua/org.eclipse.pde.ua.tests/target/dependencies-list.txt, -failOnError]
Picked up JAVA_TOOL_OPTIONS: -XX:+IgnoreUnrecognizedVMOptions -XX:+UseContainerSupport -XX:+UnlockExperimentalVMOptions -XX:+UseCGroupMemoryLimitForHeap
Picked up _JAVA_OPTIONS: -XX:MaxRAMPercentage=64.0
0 API ERRORS
0 API warnings
[INFO] 
[INFO] --------< org.eclipse.pde:org.eclipse.pde.junit.runtime.tests >---------
[INFO] Building org.eclipse.pde.junit.runtime.tests 3.5.500-SNAPSHOT    [42/46]
[INFO] ------------------------[ eclipse-test-plugin ]-------------------------
[INFO] 
[INFO] --- maven-clean-plugin:3.1.0:clean (default-clean) @ org.eclipse.pde.junit.runtime.tests ---
[INFO] 
[INFO] --- tycho-packaging-plugin:1.5.1:build-qualifier (default-build-qualifier) @ org.eclipse.pde.junit.runtime.tests ---
[INFO] The project's OSGi version is 3.5.500.v20191213-1656
[INFO] 
[INFO] --- tycho-packaging-plugin:1.5.1:validate-id (default-validate-id) @ org.eclipse.pde.junit.runtime.tests ---
[INFO] 
[INFO] --- tycho-packaging-plugin:1.5.1:validate-version (default-validate-version) @ org.eclipse.pde.junit.runtime.tests ---
[INFO] 
[INFO] --- maven-resources-plugin:3.1.0:copy-resources (saveproperties) @ org.eclipse.pde.junit.runtime.tests ---
[INFO] Using 'UTF-8' encoding to copy filtered resources.
[INFO] skip non existing resourceDirectory /home/jenkins/agent/workspace/eclipse.pde.ui-Gerrit/ui/org.eclipse.pde.junit.runtime.tests/saveproperties
[INFO] 
[INFO] --- maven-enforcer-plugin:3.0.0-M3:enforce (enforce-maven) @ org.eclipse.pde.junit.runtime.tests ---
[INFO] 
[INFO] --- eclipse-cbi-plugin:1.1.8-SNAPSHOT:generate-api-build-xml (default) @ org.eclipse.pde.junit.runtime.tests ---
[INFO] 
[INFO] --- maven-resources-plugin:3.1.0:resources (default-resources) @ org.eclipse.pde.junit.runtime.tests ---
[INFO] Using 'UTF-8' encoding to copy filtered resources.
[INFO] skip non existing resourceDirectory /home/jenkins/agent/workspace/eclipse.pde.ui-Gerrit/ui/org.eclipse.pde.junit.runtime.tests/src/main/resources
[INFO] 
[INFO] --- maven-resources-plugin:3.1.0:resources (filter-resources) @ org.eclipse.pde.junit.runtime.tests ---
[INFO] Using 'UTF-8' encoding to copy filtered resources.
[INFO] skip non existing resourceDirectory /home/jenkins/agent/workspace/eclipse.pde.ui-Gerrit/ui/org.eclipse.pde.junit.runtime.tests/src/main/resources
[INFO] 
[INFO] --- tycho-compiler-plugin:1.5.1:compile (default-compile) @ org.eclipse.pde.junit.runtime.tests ---
[INFO] Compiling 4 source files to /home/jenkins/agent/workspace/eclipse.pde.ui-Gerrit/ui/org.eclipse.pde.junit.runtime.tests/target/classes
[INFO] 
[INFO] --- tycho-eclipserun-plugin:1.5.1:eclipse-run (default) @ org.eclipse.pde.junit.runtime.tests ---
[INFO] 
[INFO] --- maven-resources-plugin:3.1.0:testResources (default-testResources) @ org.eclipse.pde.junit.runtime.tests ---
[INFO] Using 'UTF-8' encoding to copy filtered resources.
[INFO] skip non existing resourceDirectory /home/jenkins/agent/workspace/eclipse.pde.ui-Gerrit/ui/org.eclipse.pde.junit.runtime.tests/src/test/resources
[INFO] 
[INFO] --- tycho-source-plugin:1.5.1:plugin-source (plugin-source) @ org.eclipse.pde.junit.runtime.tests ---
[INFO] Building jar: /home/jenkins/agent/workspace/eclipse.pde.ui-Gerrit/ui/org.eclipse.pde.junit.runtime.tests/target/org.eclipse.pde.junit.runtime.tests-3.5.500-SNAPSHOT-sources.jar
[INFO] 
[INFO] --- target-platform-configuration:1.5.1:target-platform (default-target-platform) @ org.eclipse.pde.junit.runtime.tests ---
[INFO] 
[INFO] --- tycho-packaging-plugin:1.5.1:package-plugin (default-package-plugin) @ org.eclipse.pde.junit.runtime.tests ---
[INFO] Building jar: /home/jenkins/agent/workspace/eclipse.pde.ui-Gerrit/ui/org.eclipse.pde.junit.runtime.tests/target/org.eclipse.pde.junit.runtime.tests-3.5.500-SNAPSHOT.jar
[INFO] 
[INFO] --- tycho-p2-plugin:1.5.1:p2-metadata-default (default-p2-metadata-default) @ org.eclipse.pde.junit.runtime.tests ---
[INFO] No baseline version MavenProject: org.eclipse.pde:org.eclipse.pde.junit.runtime.tests:3.5.500-SNAPSHOT @ /home/jenkins/agent/workspace/eclipse.pde.ui-Gerrit/ui/org.eclipse.pde.junit.runtime.tests/pom.xml
[INFO] 
[INFO] --- tycho-surefire-plugin:1.5.1:test (default-test) @ org.eclipse.pde.junit.runtime.tests ---
[INFO] Expected eclipse log file: /home/jenkins/agent/workspace/eclipse.pde.ui-Gerrit/ui/org.eclipse.pde.junit.runtime.tests/target/work/data/.metadata/.log
[INFO] Command line:
	[/opt/tools/java/openjdk/jdk-11/11.0.4/bin/java, -Dosgi.noShutdown=false, -Dosgi.os=linux, -Dosgi.ws=gtk, -Dosgi.arch=x86_64, --add-modules=ALL-SYSTEM, -Dosgi.clean=true, -ea, -jar, /home/jenkins/agent/workspace/eclipse.pde.ui-Gerrit/.repository/p2/osgi/bundle/org.eclipse.equinox.launcher/1.5.600.v20191014-2022/org.eclipse.equinox.launcher-1.5.600.v20191014-2022.jar, -data, /home/jenkins/agent/workspace/eclipse.pde.ui-Gerrit/ui/org.eclipse.pde.junit.runtime.tests/target/work/data, -install, /home/jenkins/agent/workspace/eclipse.pde.ui-Gerrit/ui/org.eclipse.pde.junit.runtime.tests/target/work, -configuration, /home/jenkins/agent/workspace/eclipse.pde.ui-Gerrit/ui/org.eclipse.pde.junit.runtime.tests/target/work/configuration, -application, org.eclipse.tycho.surefire.osgibooter.uitest, -testproperties, /home/jenkins/agent/workspace/eclipse.pde.ui-Gerrit/ui/org.eclipse.pde.junit.runtime.tests/target/surefire.properties]
Picked up JAVA_TOOL_OPTIONS: -XX:+IgnoreUnrecognizedVMOptions -XX:+UseContainerSupport -XX:+UnlockExperimentalVMOptions -XX:+UseCGroupMemoryLimitForHeap
Picked up _JAVA_OPTIONS: -XX:MaxRAMPercentage=64.0
Running org.eclipse.pde.junit.runtime.tests.JUnitExecutionTest
test process terminated with exit value 0
command line: /opt/tools/java/openjdk/jdk-11/11.0.4/bin/java -ea -Declipse.pde.launch=true -Declipse.p2.data.area=@config.dir/p2 --add-modules=ALL-SYSTEM -Dfile.encoding=UTF-8 -classpath /home/jenkins/agent/workspace/eclipse.pde.ui-Gerrit/.repository/p2/osgi/bundle/org.eclipse.equinox.launcher/1.5.600.v20191014-2022/org.eclipse.equinox.launcher-1.5.600.v20191014-2022.jar:/home/jenkins/agent/workspace/eclipse.pde.ui-Gerrit/ui/org.eclipse.pde.junit.runtime.tests/target/work/configuration/org.eclipse.osgi/138/0/.cp org.eclipse.equinox.launcher.Main -os linux -ws gtk -arch x86_64 -nl en_US -consoleLog -version 3 -port 35212 -testLoaderClass org.eclipse.jdt.internal.junit5.runner.JUnit5TestLoader -loaderpluginname org.eclipse.jdt.junit5.runtime -packageNameFile /tmp/packageNames11923649121994609164.txt -application org.eclipse.pde.junit.runtime.coretestapplication -data /home/jenkins/agent/workspace/eclipse.pde.ui-Gerrit/ui/org.eclipse.pde.junit.runtime.tests/target/work/data/verification.tests.junit5_verification.tests.junit5/workspace -configuration file:/home/jenkins/agent/workspace/eclipse.pde.ui-Gerrit/ui/org.eclipse.pde.junit.runtime.tests/target/work/data/verification.tests.junit5_verification.tests.junit5/configuration/ -dev file:/home/jenkins/agent/workspace/eclipse.pde.ui-Gerrit/ui/org.eclipse.pde.junit.runtime.tests/target/work/data/verification.tests.junit5_verification.tests.junit5/configuration/dev.properties -os linux -ws gtk -arch x86_64 -nl en_US -consoleLog -testpluginname verification.tests.junit5
log file: 

no log file for: verification.tests.junit5
[test] Picked up JAVA_TOOL_OPTIONS: -XX:+IgnoreUnrecognizedVMOptions -XX:+UseContainerSupport -XX:+UnlockExperimentalVMOptions -XX:+UseCGroupMemoryLimitForHeap
Picked up _JAVA_OPTIONS: -XX:MaxRAMPercentage=64.0

test process terminated with exit value 0
command line: /opt/tools/java/openjdk/jdk-11/11.0.4/bin/java -ea -Declipse.pde.launch=true -Declipse.p2.data.area=@config.dir/p2 --add-modules=ALL-SYSTEM -Dfile.encoding=UTF-8 -classpath /home/jenkins/agent/workspace/eclipse.pde.ui-Gerrit/.repository/p2/osgi/bundle/org.eclipse.equinox.launcher/1.5.600.v20191014-2022/org.eclipse.equinox.launcher-1.5.600.v20191014-2022.jar:/home/jenkins/agent/workspace/eclipse.pde.ui-Gerrit/ui/org.eclipse.pde.junit.runtime.tests/target/work/configuration/org.eclipse.osgi/138/0/.cp org.eclipse.equinox.launcher.Main -os linux -ws gtk -arch x86_64 -nl en_US -consoleLog -version 3 -port 43197 -testLoaderClass org.eclipse.jdt.internal.junit5.runner.JUnit5TestLoader -loaderpluginname org.eclipse.jdt.junit5.runtime -packageNameFile /tmp/packageNames18248028382235922113.txt -application org.eclipse.pde.junit.runtime.coretestapplication -data "/home/jenkins/agent/workspace/eclipse.pde.ui-Gerrit/ui/org.eclipse.pde.junit.runtime.tests/target/work/data/verification.tests.junit5_verification.tests.junit5 (1)/workspace" -configuration "file:/home/jenkins/agent/workspace/eclipse.pde.ui-Gerrit/ui/org.eclipse.pde.junit.runtime.tests/target/work/data/verification.tests.junit5_verification.tests.junit5 (1)/configuration/" -dev "file:/home/jenkins/agent/workspace/eclipse.pde.ui-Gerrit/ui/org.eclipse.pde.junit.runtime.tests/target/work/data/verification.tests.junit5_verification.tests.junit5 (1)/configuration/dev.properties" -os linux -ws gtk -arch x86_64 -nl en_US -consoleLog -testpluginname verification.tests.junit5
log file: 

no log file for: verification.tests.junit5 (1)
[test] Picked up JAVA_TOOL_OPTIONS: -XX:+IgnoreUnrecognizedVMOptions -XX:+UseContainerSupport -XX:+UnlockExperimentalVMOptions -XX:+UseCGroupMemoryLimitForHeap
Picked up _JAVA_OPTIONS: -XX:MaxRAMPercentage=64.0

test process terminated with exit value 0
command line: /opt/tools/java/openjdk/jdk-11/11.0.4/bin/java -ea -Declipse.pde.launch=true -Declipse.p2.data.area=@config.dir/p2 --add-modules=ALL-SYSTEM -Dfile.encoding=UTF-8 -classpath /home/jenkins/agent/workspace/eclipse.pde.ui-Gerrit/.repository/p2/osgi/bundle/org.eclipse.equinox.launcher/1.5.600.v20191014-2022/org.eclipse.equinox.launcher-1.5.600.v20191014-2022.jar:/home/jenkins/agent/workspace/eclipse.pde.ui-Gerrit/ui/org.eclipse.pde.junit.runtime.tests/target/work/configuration/org.eclipse.osgi/138/0/.cp org.eclipse.equinox.launcher.Main -os linux -ws gtk -arch x86_64 -nl en_US -consoleLog -version 3 -port 35600 -testLoaderClass org.eclipse.jdt.internal.junit5.runner.JUnit5TestLoader -loaderpluginname org.eclipse.jdt.junit5.runtime -classNames verification.tests.junit5.Test1 -application org.eclipse.pde.junit.runtime.coretestapplication -data /home/jenkins/agent/workspace/eclipse.pde.ui-Gerrit/ui/org.eclipse.pde.junit.runtime.tests/target/work/data/verification.tests.junit5_Test1/workspace -configuration file:/home/jenkins/agent/workspace/eclipse.pde.ui-Gerrit/ui/org.eclipse.pde.junit.runtime.tests/target/work/data/verification.tests.junit5_Test1/configuration/ -dev file:/home/jenkins/agent/workspace/eclipse.pde.ui-Gerrit/ui/org.eclipse.pde.junit.runtime.tests/target/work/data/verification.tests.junit5_Test1/configuration/dev.properties -os linux -ws gtk -arch x86_64 -nl en_US -consoleLog -testpluginname verification.tests.junit5
log file: 

no log file for: Test1
[test] Picked up JAVA_TOOL_OPTIONS: -XX:+IgnoreUnrecognizedVMOptions -XX:+UseContainerSupport -XX:+UnlockExperimentalVMOptions -XX:+UseCGroupMemoryLimitForHeap
Picked up _JAVA_OPTIONS: -XX:MaxRAMPercentage=64.0

test process terminated with exit value 0
command line: /opt/tools/java/openjdk/jdk-11/11.0.4/bin/java -ea -Declipse.pde.launch=true -Declipse.p2.data.area=@config.dir/p2 --add-modules=ALL-SYSTEM -Dfile.encoding=UTF-8 -classpath /home/jenkins/agent/workspace/eclipse.pde.ui-Gerrit/.repository/p2/osgi/bundle/org.eclipse.equinox.launcher/1.5.600.v20191014-2022/org.eclipse.equinox.launcher-1.5.600.v20191014-2022.jar:/home/jenkins/agent/workspace/eclipse.pde.ui-Gerrit/ui/org.eclipse.pde.junit.runtime.tests/target/work/configuration/org.eclipse.osgi/138/0/.cp org.eclipse.equinox.launcher.Main -os linux -ws gtk -arch x86_64 -nl en_US -consoleLog -version 3 -port 43234 -testLoaderClass org.eclipse.jdt.internal.junit5.runner.JUnit5TestLoader -loaderpluginname org.eclipse.jdt.junit5.runtime -test verification.tests.junit5.Test1:test1 -application org.eclipse.pde.junit.runtime.coretestapplication -data /home/jenkins/agent/workspace/eclipse.pde.ui-Gerrit/ui/org.eclipse.pde.junit.runtime.tests/target/work/data/verification.tests.junit5_Test1.test1/workspace -configuration file:/home/jenkins/agent/workspace/eclipse.pde.ui-Gerrit/ui/org.eclipse.pde.junit.runtime.tests/target/work/data/verification.tests.junit5_Test1.test1/configuration/ -dev file:/home/jenkins/agent/workspace/eclipse.pde.ui-Gerrit/ui/org.eclipse.pde.junit.runtime.tests/target/work/data/verification.tests.junit5_Test1.test1/configuration/dev.properties -os linux -ws gtk -arch x86_64 -nl en_US -consoleLog -testpluginname verification.tests.junit5
log file: 

no log file for: Test1.test1
[test] Picked up JAVA_TOOL_OPTIONS: -XX:+IgnoreUnrecognizedVMOptions -XX:+UseContainerSupport -XX:+UnlockExperimentalVMOptions -XX:+UseCGroupMemoryLimitForHeap
Picked up _JAVA_OPTIONS: -XX:MaxRAMPercentage=64.0

test process terminated with exit value 0
command line: /opt/tools/java/openjdk/jdk-11/11.0.4/bin/java -ea -Declipse.pde.launch=true -Declipse.p2.data.area=@config.dir/p2 --add-modules=ALL-SYSTEM -Dfile.encoding=UTF-8 -classpath /home/jenkins/agent/workspace/eclipse.pde.ui-Gerrit/.repository/p2/osgi/bundle/org.eclipse.equinox.launcher/1.5.600.v20191014-2022/org.eclipse.equinox.launcher-1.5.600.v20191014-2022.jar:/home/jenkins/agent/workspace/eclipse.pde.ui-Gerrit/ui/org.eclipse.pde.junit.runtime.tests/target/work/configuration/org.eclipse.osgi/138/0/.cp org.eclipse.equinox.launcher.Main -os linux -ws gtk -arch x86_64 -nl en_US -consoleLog -version 3 -port 44792 -testLoaderClass org.eclipse.jdt.internal.junit5.runner.JUnit5TestLoader -loaderpluginname org.eclipse.jdt.junit5.runtime -packageNameFile /tmp/packageNames4815940999989978796.txt -application org.eclipse.pde.junit.runtime.coretestapplication -data /home/jenkins/agent/workspace/eclipse.pde.ui-Gerrit/ui/org.eclipse.pde.junit.runtime.tests/target/work/data/verification.tests.junit5.fragment_verification.tests.junit5.fragment/workspace -configuration file:/home/jenkins/agent/workspace/eclipse.pde.ui-Gerrit/ui/org.eclipse.pde.junit.runtime.tests/target/work/data/verification.tests.junit5.fragment_verification.tests.junit5.fragment/configuration/ -dev file:/home/jenkins/agent/workspace/eclipse.pde.ui-Gerrit/ui/org.eclipse.pde.junit.runtime.tests/target/work/data/verification.tests.junit5.fragment_verification.tests.junit5.fragment/configuration/dev.properties -os linux -ws gtk -arch x86_64 -nl en_US -consoleLog -testpluginname verification.tests.junit5
log file: 

no log file for: verification.tests.junit5.fragment
[test] Picked up JAVA_TOOL_OPTIONS: -XX:+IgnoreUnrecognizedVMOptions -XX:+UseContainerSupport -XX:+UnlockExperimentalVMOptions -XX:+UseCGroupMemoryLimitForHeap
Picked up _JAVA_OPTIONS: -XX:MaxRAMPercentage=64.0

test process terminated with exit value 0
command line: /opt/tools/java/openjdk/jdk-11/11.0.4/bin/java -ea -Declipse.pde.launch=true -Declipse.p2.data.area=@config.dir/p2 --add-modules=ALL-SYSTEM -Dfile.encoding=UTF-8 -classpath /home/jenkins/agent/workspace/eclipse.pde.ui-Gerrit/.repository/p2/osgi/bundle/org.eclipse.equinox.launcher/1.5.600.v20191014-2022/org.eclipse.equinox.launcher-1.5.600.v20191014-2022.jar:/home/jenkins/agent/workspace/eclipse.pde.ui-Gerrit/ui/org.eclipse.pde.junit.runtime.tests/target/work/configuration/org.eclipse.osgi/138/0/.cp org.eclipse.equinox.launcher.Main -os linux -ws gtk -arch x86_64 -nl en_US -consoleLog -version 3 -port 37057 -testLoaderClass org.eclipse.jdt.internal.junit5.runner.JUnit5TestLoader -loaderpluginname org.eclipse.jdt.junit5.runtime -packageNameFile /tmp/packageNames1254894266853861012.txt -application org.eclipse.pde.junit.runtime.coretestapplication -data "/home/jenkins/agent/workspace/eclipse.pde.ui-Gerrit/ui/org.eclipse.pde.junit.runtime.tests/target/work/data/verification.tests.junit5.fragment_verification.tests.junit5.fragment (1)/workspace" -configuration "file:/home/jenkins/agent/workspace/eclipse.pde.ui-Gerrit/ui/org.eclipse.pde.junit.runtime.tests/target/work/data/verification.tests.junit5.fragment_verification.tests.junit5.fragment (1)/configuration/" -dev "file:/home/jenkins/agent/workspace/eclipse.pde.ui-Gerrit/ui/org.eclipse.pde.junit.runtime.tests/target/work/data/verification.tests.junit5.fragment_verification.tests.junit5.fragment (1)/configuration/dev.properties" -os linux -ws gtk -arch x86_64 -nl en_US -consoleLog -testpluginname verification.tests.junit5
log file: 

no log file for: verification.tests.junit5.fragment (1)
[test] Picked up JAVA_TOOL_OPTIONS: -XX:+IgnoreUnrecognizedVMOptions -XX:+UseContainerSupport -XX:+UnlockExperimentalVMOptions -XX:+UseCGroupMemoryLimitForHeap
Picked up _JAVA_OPTIONS: -XX:MaxRAMPercentage=64.0

test process terminated with exit value 0
command line: /opt/tools/java/openjdk/jdk-11/11.0.4/bin/java -ea -Declipse.pde.launch=true -Declipse.p2.data.area=@config.dir/p2 --add-modules=ALL-SYSTEM -Dfile.encoding=UTF-8 -classpath /home/jenkins/agent/workspace/eclipse.pde.ui-Gerrit/.repository/p2/osgi/bundle/org.eclipse.equinox.launcher/1.5.600.v20191014-2022/org.eclipse.equinox.launcher-1.5.600.v20191014-2022.jar:/home/jenkins/agent/workspace/eclipse.pde.ui-Gerrit/ui/org.eclipse.pde.junit.runtime.tests/target/work/configuration/org.eclipse.osgi/138/0/.cp org.eclipse.equinox.launcher.Main -os linux -ws gtk -arch x86_64 -nl en_US -consoleLog -version 3 -port 40487 -testLoaderClass org.eclipse.jdt.internal.junit5.runner.JUnit5TestLoader -loaderpluginname org.eclipse.jdt.junit5.runtime -classNames verification.tests.junit5.fragment.Test1 -application org.eclipse.pde.junit.runtime.coretestapplication -data "/home/jenkins/agent/workspace/eclipse.pde.ui-Gerrit/ui/org.eclipse.pde.junit.runtime.tests/target/work/data/verification.tests.junit5.fragment_Test1 (1)/workspace" -configuration "file:/home/jenkins/agent/workspace/eclipse.pde.ui-Gerrit/ui/org.eclipse.pde.junit.runtime.tests/target/work/data/verification.tests.junit5.fragment_Test1 (1)/configuration/" -dev "file:/home/jenkins/agent/workspace/eclipse.pde.ui-Gerrit/ui/org.eclipse.pde.junit.runtime.tests/target/work/data/verification.tests.junit5.fragment_Test1 (1)/configuration/dev.properties" -os linux -ws gtk -arch x86_64 -nl en_US -consoleLog -testpluginname verification.tests.junit5
log file: 

no log file for: Test1 (1)
[test] Picked up JAVA_TOOL_OPTIONS: -XX:+IgnoreUnrecognizedVMOptions -XX:+UseContainerSupport -XX:+UnlockExperimentalVMOptions -XX:+UseCGroupMemoryLimitForHeap
Picked up _JAVA_OPTIONS: -XX:MaxRAMPercentage=64.0

test process terminated with exit value 0
command line: /opt/tools/java/openjdk/jdk-11/11.0.4/bin/java -ea -Declipse.pde.launch=true -Declipse.p2.data.area=@config.dir/p2 --add-modules=ALL-SYSTEM -Dfile.encoding=UTF-8 -classpath /home/jenkins/agent/workspace/eclipse.pde.ui-Gerrit/.repository/p2/osgi/bundle/org.eclipse.equinox.launcher/1.5.600.v20191014-2022/org.eclipse.equinox.launcher-1.5.600.v20191014-2022.jar:/home/jenkins/agent/workspace/eclipse.pde.ui-Gerrit/ui/org.eclipse.pde.junit.runtime.tests/target/work/configuration/org.eclipse.osgi/138/0/.cp org.eclipse.equinox.launcher.Main -os linux -ws gtk -arch x86_64 -nl en_US -consoleLog -version 3 -port 34346 -testLoaderClass org.eclipse.jdt.internal.junit5.runner.JUnit5TestLoader -loaderpluginname org.eclipse.jdt.junit5.runtime -test verification.tests.junit5.fragment.Test1:test1 -application org.eclipse.pde.junit.runtime.coretestapplication -data "/home/jenkins/agent/workspace/eclipse.pde.ui-Gerrit/ui/org.eclipse.pde.junit.runtime.tests/target/work/data/verification.tests.junit5.fragment_Test1.test1 (1)/workspace" -configuration "file:/home/jenkins/agent/workspace/eclipse.pde.ui-Gerrit/ui/org.eclipse.pde.junit.runtime.tests/target/work/data/verification.tests.junit5.fragment_Test1.test1 (1)/configuration/" -dev "file:/home/jenkins/agent/workspace/eclipse.pde.ui-Gerrit/ui/org.eclipse.pde.junit.runtime.tests/target/work/data/verification.tests.junit5.fragment_Test1.test1 (1)/configuration/dev.properties" -os linux -ws gtk -arch x86_64 -nl en_US -consoleLog -testpluginname verification.tests.junit5
log file: 

no log file for: Test1.test1 (1)
[test] Picked up JAVA_TOOL_OPTIONS: -XX:+IgnoreUnrecognizedVMOptions -XX:+UseContainerSupport -XX:+UnlockExperimentalVMOptions -XX:+UseCGroupMemoryLimitForHeap
Picked up _JAVA_OPTIONS: -XX:MaxRAMPercentage=64.0

test process terminated with exit value 0
command line: /opt/tools/java/openjdk/jdk-11/11.0.4/bin/java -ea -Declipse.pde.launch=true -Declipse.p2.data.area=@config.dir/p2 --add-modules=ALL-SYSTEM -Dfile.encoding=UTF-8 -classpath /home/jenkins/agent/workspace/eclipse.pde.ui-Gerrit/.repository/p2/osgi/bundle/org.eclipse.equinox.launcher/1.5.600.v20191014-2022/org.eclipse.equinox.launcher-1.5.600.v20191014-2022.jar org.eclipse.equinox.launcher.Main -os linux -ws gtk -arch x86_64 -nl en_US -consoleLog -version 3 -port 38044 -testLoaderClass org.eclipse.jdt.internal.junit4.runner.JUnit4TestLoader -loaderpluginname org.eclipse.jdt.junit4.runtime -testNameFile /tmp/testNames13382478526069039896.txt -application org.eclipse.pde.junit.runtime.coretestapplication -data /home/jenkins/agent/workspace/eclipse.pde.ui-Gerrit/ui/org.eclipse.pde.junit.runtime.tests/target/work/data/verification.tests.junit4_verification.tests.junit4/workspace -configuration file:/home/jenkins/agent/workspace/eclipse.pde.ui-Gerrit/ui/org.eclipse.pde.junit.runtime.tests/target/work/data/verification.tests.junit4_verification.tests.junit4/configuration/ -dev file:/home/jenkins/agent/workspace/eclipse.pde.ui-Gerrit/ui/org.eclipse.pde.junit.runtime.tests/target/work/data/verification.tests.junit4_verification.tests.junit4/configuration/dev.properties -os linux -ws gtk -arch x86_64 -nl en_US -consoleLog -testpluginname verification.tests.junit4
log file: 

no log file for: verification.tests.junit4
[test] Picked up JAVA_TOOL_OPTIONS: -XX:+IgnoreUnrecognizedVMOptions -XX:+UseContainerSupport -XX:+UnlockExperimentalVMOptions -XX:+UseCGroupMemoryLimitForHeap
Picked up _JAVA_OPTIONS: -XX:MaxRAMPercentage=64.0

test process terminated with exit value 0
command line: /opt/tools/java/openjdk/jdk-11/11.0.4/bin/java -ea -Declipse.pde.launch=true -Declipse.p2.data.area=@config.dir/p2 --add-modules=ALL-SYSTEM -Dfile.encoding=UTF-8 -classpath /home/jenkins/agent/workspace/eclipse.pde.ui-Gerrit/.repository/p2/osgi/bundle/org.eclipse.equinox.launcher/1.5.600.v20191014-2022/org.eclipse.equinox.launcher-1.5.600.v20191014-2022.jar org.eclipse.equinox.launcher.Main -os linux -ws gtk -arch x86_64 -nl en_US -consoleLog -version 3 -port 46708 -testLoaderClass org.eclipse.jdt.internal.junit4.runner.JUnit4TestLoader -loaderpluginname org.eclipse.jdt.junit4.runtime -testNameFile /tmp/testNames12925373120701714780.txt -application org.eclipse.pde.junit.runtime.coretestapplication -data "/home/jenkins/agent/workspace/eclipse.pde.ui-Gerrit/ui/org.eclipse.pde.junit.runtime.tests/target/work/data/verification.tests.junit4_verification.tests.junit4 (1)/workspace" -configuration "file:/home/jenkins/agent/workspace/eclipse.pde.ui-Gerrit/ui/org.eclipse.pde.junit.runtime.tests/target/work/data/verification.tests.junit4_verification.tests.junit4 (1)/configuration/" -dev "file:/home/jenkins/agent/workspace/eclipse.pde.ui-Gerrit/ui/org.eclipse.pde.junit.runtime.tests/target/work/data/verification.tests.junit4_verification.tests.junit4 (1)/configuration/dev.properties" -os linux -ws gtk -arch x86_64 -nl en_US -consoleLog -testpluginname verification.tests.junit4
log file: 

no log file for: verification.tests.junit4 (1)
[test] Picked up JAVA_TOOL_OPTIONS: -XX:+IgnoreUnrecognizedVMOptions -XX:+UseContainerSupport -XX:+UnlockExperimentalVMOptions -XX:+UseCGroupMemoryLimitForHeap
Picked up _JAVA_OPTIONS: -XX:MaxRAMPercentage=64.0

test process terminated with exit value 0
command line: /opt/tools/java/openjdk/jdk-11/11.0.4/bin/java -ea -Declipse.pde.launch=true -Declipse.p2.data.area=@config.dir/p2 --add-modules=ALL-SYSTEM -Dfile.encoding=UTF-8 -classpath /home/jenkins/agent/workspace/eclipse.pde.ui-Gerrit/.repository/p2/osgi/bundle/org.eclipse.equinox.launcher/1.5.600.v20191014-2022/org.eclipse.equinox.launcher-1.5.600.v20191014-2022.jar org.eclipse.equinox.launcher.Main -os linux -ws gtk -arch x86_64 -nl en_US -consoleLog -version 3 -port 45646 -testLoaderClass org.eclipse.jdt.internal.junit4.runner.JUnit4TestLoader -loaderpluginname org.eclipse.jdt.junit4.runtime -classNames verification.tests.junit4.Test1 -application org.eclipse.pde.junit.runtime.coretestapplication -data "/home/jenkins/agent/workspace/eclipse.pde.ui-Gerrit/ui/org.eclipse.pde.junit.runtime.tests/target/work/data/verification.tests.junit4_Test1 (2)/workspace" -configuration "file:/home/jenkins/agent/workspace/eclipse.pde.ui-Gerrit/ui/org.eclipse.pde.junit.runtime.tests/target/work/data/verification.tests.junit4_Test1 (2)/configuration/" -dev "file:/home/jenkins/agent/workspace/eclipse.pde.ui-Gerrit/ui/org.eclipse.pde.junit.runtime.tests/target/work/data/verification.tests.junit4_Test1 (2)/configuration/dev.properties" -os linux -ws gtk -arch x86_64 -nl en_US -consoleLog -testpluginname verification.tests.junit4
log file: 

no log file for: Test1 (2)
[test] Picked up JAVA_TOOL_OPTIONS: -XX:+IgnoreUnrecognizedVMOptions -XX:+UseContainerSupport -XX:+UnlockExperimentalVMOptions -XX:+UseCGroupMemoryLimitForHeap
Picked up _JAVA_OPTIONS: -XX:MaxRAMPercentage=64.0

test process terminated with exit value 0
command line: /opt/tools/java/openjdk/jdk-11/11.0.4/bin/java -ea -Declipse.pde.launch=true -Declipse.p2.data.area=@config.dir/p2 --add-modules=ALL-SYSTEM -Dfile.encoding=UTF-8 -classpath /home/jenkins/agent/workspace/eclipse.pde.ui-Gerrit/.repository/p2/osgi/bundle/org.eclipse.equinox.launcher/1.5.600.v20191014-2022/org.eclipse.equinox.launcher-1.5.600.v20191014-2022.jar org.eclipse.equinox.launcher.Main -os linux -ws gtk -arch x86_64 -nl en_US -consoleLog -version 3 -port 46314 -testLoaderClass org.eclipse.jdt.internal.junit4.runner.JUnit4TestLoader -loaderpluginname org.eclipse.jdt.junit4.runtime -test verification.tests.junit4.Test1:test1 -application org.eclipse.pde.junit.runtime.coretestapplication -data "/home/jenkins/agent/workspace/eclipse.pde.ui-Gerrit/ui/org.eclipse.pde.junit.runtime.tests/target/work/data/verification.tests.junit4_Test1.test1 (2)/workspace" -configuration "file:/home/jenkins/agent/workspace/eclipse.pde.ui-Gerrit/ui/org.eclipse.pde.junit.runtime.tests/target/work/data/verification.tests.junit4_Test1.test1 (2)/configuration/" -dev "file:/home/jenkins/agent/workspace/eclipse.pde.ui-Gerrit/ui/org.eclipse.pde.junit.runtime.tests/target/work/data/verification.tests.junit4_Test1.test1 (2)/configuration/dev.properties" -os linux -ws gtk -arch x86_64 -nl en_US -consoleLog -testpluginname verification.tests.junit4
log file: 

no log file for: Test1.test1 (2)
[test] Picked up JAVA_TOOL_OPTIONS: -XX:+IgnoreUnrecognizedVMOptions -XX:+UseContainerSupport -XX:+UnlockExperimentalVMOptions -XX:+UseCGroupMemoryLimitForHeap
Picked up _JAVA_OPTIONS: -XX:MaxRAMPercentage=64.0

test process terminated with exit value 0
command line: /opt/tools/java/openjdk/jdk-11/11.0.4/bin/java -ea -Declipse.pde.launch=true -Declipse.p2.data.area=@config.dir/p2 --add-modules=ALL-SYSTEM -Dfile.encoding=UTF-8 -classpath /home/jenkins/agent/workspace/eclipse.pde.ui-Gerrit/.repository/p2/osgi/bundle/org.eclipse.equinox.launcher/1.5.600.v20191014-2022/org.eclipse.equinox.launcher-1.5.600.v20191014-2022.jar org.eclipse.equinox.launcher.Main -os linux -ws gtk -arch x86_64 -nl en_US -consoleLog -version 3 -port 46191 -testLoaderClass org.eclipse.jdt.internal.junit4.runner.JUnit4TestLoader -loaderpluginname org.eclipse.jdt.junit4.runtime -testNameFile /tmp/testNames1294681093659938292.txt -application org.eclipse.pde.junit.runtime.coretestapplication -data /home/jenkins/agent/workspace/eclipse.pde.ui-Gerrit/ui/org.eclipse.pde.junit.runtime.tests/target/work/data/verification.tests.junit4.fragment_verification.tests.junit4.fragment/workspace -configuration file:/home/jenkins/agent/workspace/eclipse.pde.ui-Gerrit/ui/org.eclipse.pde.junit.runtime.tests/target/work/data/verification.tests.junit4.fragment_verification.tests.junit4.fragment/configuration/ -dev file:/home/jenkins/agent/workspace/eclipse.pde.ui-Gerrit/ui/org.eclipse.pde.junit.runtime.tests/target/work/data/verification.tests.junit4.fragment_verification.tests.junit4.fragment/configuration/dev.properties -os linux -ws gtk -arch x86_64 -nl en_US -consoleLog -testpluginname verification.tests.junit4
log file: 

no log file for: verification.tests.junit4.fragment
[test] Picked up JAVA_TOOL_OPTIONS: -XX:+IgnoreUnrecognizedVMOptions -XX:+UseContainerSupport -XX:+UnlockExperimentalVMOptions -XX:+UseCGroupMemoryLimitForHeap
Picked up _JAVA_OPTIONS: -XX:MaxRAMPercentage=64.0

test process terminated with exit value 0
command line: /opt/tools/java/openjdk/jdk-11/11.0.4/bin/java -ea -Declipse.pde.launch=true -Declipse.p2.data.area=@config.dir/p2 --add-modules=ALL-SYSTEM -Dfile.encoding=UTF-8 -classpath /home/jenkins/agent/workspace/eclipse.pde.ui-Gerrit/.repository/p2/osgi/bundle/org.eclipse.equinox.launcher/1.5.600.v20191014-2022/org.eclipse.equinox.launcher-1.5.600.v20191014-2022.jar org.eclipse.equinox.launcher.Main -os linux -ws gtk -arch x86_64 -nl en_US -consoleLog -version 3 -port 46599 -testLoaderClass org.eclipse.jdt.internal.junit4.runner.JUnit4TestLoader -loaderpluginname org.eclipse.jdt.junit4.runtime -testNameFile /tmp/testNames16638047436536043097.txt -application org.eclipse.pde.junit.runtime.coretestapplication -data "/home/jenkins/agent/workspace/eclipse.pde.ui-Gerrit/ui/org.eclipse.pde.junit.runtime.tests/target/work/data/verification.tests.junit4.fragment_verification.tests.junit4.fragment (1)/workspace" -configuration "file:/home/jenkins/agent/workspace/eclipse.pde.ui-Gerrit/ui/org.eclipse.pde.junit.runtime.tests/target/work/data/verification.tests.junit4.fragment_verification.tests.junit4.fragment (1)/configuration/" -dev "file:/home/jenkins/agent/workspace/eclipse.pde.ui-Gerrit/ui/org.eclipse.pde.junit.runtime.tests/target/work/data/verification.tests.junit4.fragment_verification.tests.junit4.fragment (1)/configuration/dev.properties" -os linux -ws gtk -arch x86_64 -nl en_US -consoleLog -testpluginname verification.tests.junit4
log file: 

no log file for: verification.tests.junit4.fragment (1)
[test] Picked up JAVA_TOOL_OPTIONS: -XX:+IgnoreUnrecognizedVMOptions -XX:+UseContainerSupport -XX:+UnlockExperimentalVMOptions -XX:+UseCGroupMemoryLimitForHeap
Picked up _JAVA_OPTIONS: -XX:MaxRAMPercentage=64.0

test process terminated with exit value 0
command line: /opt/tools/java/openjdk/jdk-11/11.0.4/bin/java -ea -Declipse.pde.launch=true -Declipse.p2.data.area=@config.dir/p2 --add-modules=ALL-SYSTEM -Dfile.encoding=UTF-8 -classpath /home/jenkins/agent/workspace/eclipse.pde.ui-Gerrit/.repository/p2/osgi/bundle/org.eclipse.equinox.launcher/1.5.600.v20191014-2022/org.eclipse.equinox.launcher-1.5.600.v20191014-2022.jar org.eclipse.equinox.launcher.Main -os linux -ws gtk -arch x86_64 -nl en_US -consoleLog -version 3 -port 40223 -testLoaderClass org.eclipse.jdt.internal.junit4.runner.JUnit4TestLoader -loaderpluginname org.eclipse.jdt.junit4.runtime -classNames verification.tests.junit4.fragment.Test1 -application org.eclipse.pde.junit.runtime.coretestapplication -data "/home/jenkins/agent/workspace/eclipse.pde.ui-Gerrit/ui/org.eclipse.pde.junit.runtime.tests/target/work/data/verification.tests.junit4.fragment_Test1 (3)/workspace" -configuration "file:/home/jenkins/agent/workspace/eclipse.pde.ui-Gerrit/ui/org.eclipse.pde.junit.runtime.tests/target/work/data/verification.tests.junit4.fragment_Test1 (3)/configuration/" -dev "file:/home/jenkins/agent/workspace/eclipse.pde.ui-Gerrit/ui/org.eclipse.pde.junit.runtime.tests/target/work/data/verification.tests.junit4.fragment_Test1 (3)/configuration/dev.properties" -os linux -ws gtk -arch x86_64 -nl en_US -consoleLog -testpluginname verification.tests.junit4
log file: 

no log file for: Test1 (3)
[test] Picked up JAVA_TOOL_OPTIONS: -XX:+IgnoreUnrecognizedVMOptions -XX:+UseContainerSupport -XX:+UnlockExperimentalVMOptions -XX:+UseCGroupMemoryLimitForHeap
Picked up _JAVA_OPTIONS: -XX:MaxRAMPercentage=64.0

test process terminated with exit value 0
command line: /opt/tools/java/openjdk/jdk-11/11.0.4/bin/java -ea -Declipse.pde.launch=true -Declipse.p2.data.area=@config.dir/p2 --add-modules=ALL-SYSTEM -Dfile.encoding=UTF-8 -classpath /home/jenkins/agent/workspace/eclipse.pde.ui-Gerrit/.repository/p2/osgi/bundle/org.eclipse.equinox.launcher/1.5.600.v20191014-2022/org.eclipse.equinox.launcher-1.5.600.v20191014-2022.jar org.eclipse.equinox.launcher.Main -os linux -ws gtk -arch x86_64 -nl en_US -consoleLog -version 3 -port 33067 -testLoaderClass org.eclipse.jdt.internal.junit4.runner.JUnit4TestLoader -loaderpluginname org.eclipse.jdt.junit4.runtime -test verification.tests.junit4.fragment.Test1:test1 -application org.eclipse.pde.junit.runtime.coretestapplication -data "/home/jenkins/agent/workspace/eclipse.pde.ui-Gerrit/ui/org.eclipse.pde.junit.runtime.tests/target/work/data/verification.tests.junit4.fragment_Test1.test1 (3)/workspace" -configuration "file:/home/jenkins/agent/workspace/eclipse.pde.ui-Gerrit/ui/org.eclipse.pde.junit.runtime.tests/target/work/data/verification.tests.junit4.fragment_Test1.test1 (3)/configuration/" -dev "file:/home/jenkins/agent/workspace/eclipse.pde.ui-Gerrit/ui/org.eclipse.pde.junit.runtime.tests/target/work/data/verification.tests.junit4.fragment_Test1.test1 (3)/configuration/dev.properties" -os linux -ws gtk -arch x86_64 -nl en_US -consoleLog -testpluginname verification.tests.junit4
log file: 

no log file for: Test1.test1 (3)
[test] Picked up JAVA_TOOL_OPTIONS: -XX:+IgnoreUnrecognizedVMOptions -XX:+UseContainerSupport -XX:+UnlockExperimentalVMOptions -XX:+UseCGroupMemoryLimitForHeap
Picked up _JAVA_OPTIONS: -XX:MaxRAMPercentage=64.0

[test] Dec 13, 2019 5:54:34 PM org.junit.vintage.engine.discovery.DefensiveAllDefaultPossibilitiesBuilder$DefensiveAnnotatedBuilder buildRunner
WARNING: Ignoring test class using JUnitPlatform runner: verification.tests.junit4.platform.Test1

[test] Dec 13, 2019 5:54:34 PM org.junit.vintage.engine.discovery.DefensiveAllDefaultPossibilitiesBuilder$DefensiveAnnotatedBuilder buildRunner
WARNING: Ignoring test class using JUnitPlatform runner: verification.tests.junit4.platform.Test2

test process terminated with exit value 0
command line: /opt/tools/java/openjdk/jdk-11/11.0.4/bin/java -ea -Declipse.pde.launch=true -Declipse.p2.data.area=@config.dir/p2 --add-modules=ALL-SYSTEM -Dfile.encoding=UTF-8 -classpath /home/jenkins/agent/workspace/eclipse.pde.ui-Gerrit/.repository/p2/osgi/bundle/org.eclipse.equinox.launcher/1.5.600.v20191014-2022/org.eclipse.equinox.launcher-1.5.600.v20191014-2022.jar:/home/jenkins/agent/workspace/eclipse.pde.ui-Gerrit/ui/org.eclipse.pde.junit.runtime.tests/target/work/configuration/org.eclipse.osgi/138/0/.cp org.eclipse.equinox.launcher.Main -os linux -ws gtk -arch x86_64 -nl en_US -consoleLog -version 3 -port 38026 -testLoaderClass org.eclipse.jdt.internal.junit5.runner.JUnit5TestLoader -loaderpluginname org.eclipse.jdt.junit5.runtime -packageNameFile /tmp/packageNames1537909679024828546.txt -application org.eclipse.pde.junit.runtime.coretestapplication -data /home/jenkins/agent/workspace/eclipse.pde.ui-Gerrit/ui/org.eclipse.pde.junit.runtime.tests/target/work/data/verification.tests.junit4.platform_verification.tests.junit4.platform/workspace -configuration file:/home/jenkins/agent/workspace/eclipse.pde.ui-Gerrit/ui/org.eclipse.pde.junit.runtime.tests/target/work/data/verification.tests.junit4.platform_verification.tests.junit4.platform/configuration/ -dev file:/home/jenkins/agent/workspace/eclipse.pde.ui-Gerrit/ui/org.eclipse.pde.junit.runtime.tests/target/work/data/verification.tests.junit4.platform_verification.tests.junit4.platform/configuration/dev.properties -os linux -ws gtk -arch x86_64 -nl en_US -consoleLog -testpluginname verification.tests.junit4.platform
log file: 

no log file for: verification.tests.junit4.platform
[test] Picked up JAVA_TOOL_OPTIONS: -XX:+IgnoreUnrecognizedVMOptions -XX:+UseContainerSupport -XX:+UnlockExperimentalVMOptions -XX:+UseCGroupMemoryLimitForHeap
Picked up _JAVA_OPTIONS: -XX:MaxRAMPercentage=64.0

[test] Dec 13, 2019 5:54:54 PM org.junit.vintage.engine.discovery.DefensiveAllDefaultPossibilitiesBuilder$DefensiveAnnotatedBuilder buildRunner
WARNING: Ignoring test class using JUnitPlatform runner: verification.tests.junit4.platform.Test1

[test] Dec 13, 2019 5:54:54 PM org.junit.vintage.engine.discovery.DefensiveAllDefaultPossibilitiesBuilder$DefensiveAnnotatedBuilder buildRunner
WARNING: Ignoring test class using JUnitPlatform runner: verification.tests.junit4.platform.Test2

test process terminated with exit value 0
command line: /opt/tools/java/openjdk/jdk-11/11.0.4/bin/java -ea -Declipse.pde.launch=true -Declipse.p2.data.area=@config.dir/p2 --add-modules=ALL-SYSTEM -Dfile.encoding=UTF-8 -classpath /home/jenkins/agent/workspace/eclipse.pde.ui-Gerrit/.repository/p2/osgi/bundle/org.eclipse.equinox.launcher/1.5.600.v20191014-2022/org.eclipse.equinox.launcher-1.5.600.v20191014-2022.jar:/home/jenkins/agent/workspace/eclipse.pde.ui-Gerrit/ui/org.eclipse.pde.junit.runtime.tests/target/work/configuration/org.eclipse.osgi/138/0/.cp org.eclipse.equinox.launcher.Main -os linux -ws gtk -arch x86_64 -nl en_US -consoleLog -version 3 -port 36689 -testLoaderClass org.eclipse.jdt.internal.junit5.runner.JUnit5TestLoader -loaderpluginname org.eclipse.jdt.junit5.runtime -packageNameFile /tmp/packageNames18381690486932036586.txt -application org.eclipse.pde.junit.runtime.coretestapplication -data "/home/jenkins/agent/workspace/eclipse.pde.ui-Gerrit/ui/org.eclipse.pde.junit.runtime.tests/target/work/data/verification.tests.junit4.platform_verification.tests.junit4.platform (1)/workspace" -configuration "file:/home/jenkins/agent/workspace/eclipse.pde.ui-Gerrit/ui/org.eclipse.pde.junit.runtime.tests/target/work/data/verification.tests.junit4.platform_verification.tests.junit4.platform (1)/configuration/" -dev "file:/home/jenkins/agent/workspace/eclipse.pde.ui-Gerrit/ui/org.eclipse.pde.junit.runtime.tests/target/work/data/verification.tests.junit4.platform_verification.tests.junit4.platform (1)/configuration/dev.properties" -os linux -ws gtk -arch x86_64 -nl en_US -consoleLog -testpluginname verification.tests.junit4.platform
log file: 

no log file for: verification.tests.junit4.platform (1)
[test] Picked up JAVA_TOOL_OPTIONS: -XX:+IgnoreUnrecognizedVMOptions -XX:+UseContainerSupport -XX:+UnlockExperimentalVMOptions -XX:+UseCGroupMemoryLimitForHeap
Picked up _JAVA_OPTIONS: -XX:MaxRAMPercentage=64.0

[test] Dec 13, 2019 5:55:00 PM org.junit.vintage.engine.discovery.DefensiveAllDefaultPossibilitiesBuilder$DefensiveAnnotatedBuilder buildRunner
WARNING: Ignoring test class using JUnitPlatform runner: verification.tests.junit4.platform.Test1

test process terminated with exit value 0
command line: /opt/tools/java/openjdk/jdk-11/11.0.4/bin/java -ea -Declipse.pde.launch=true -Declipse.p2.data.area=@config.dir/p2 --add-modules=ALL-SYSTEM -Dfile.encoding=UTF-8 -classpath /home/jenkins/agent/workspace/eclipse.pde.ui-Gerrit/.repository/p2/osgi/bundle/org.eclipse.equinox.launcher/1.5.600.v20191014-2022/org.eclipse.equinox.launcher-1.5.600.v20191014-2022.jar org.eclipse.equinox.launcher.Main -os linux -ws gtk -arch x86_64 -nl en_US -consoleLog -version 3 -port 43678 -testLoaderClass org.eclipse.jdt.internal.junit4.runner.JUnit4TestLoader -loaderpluginname org.eclipse.jdt.junit4.runtime -classNames verification.tests.junit4.platform.Test1 -application org.eclipse.pde.junit.runtime.coretestapplication -data "/home/jenkins/agent/workspace/eclipse.pde.ui-Gerrit/ui/org.eclipse.pde.junit.runtime.tests/target/work/data/verification.tests.junit4.platform_Test1 (4)/workspace" -configuration "file:/home/jenkins/agent/workspace/eclipse.pde.ui-Gerrit/ui/org.eclipse.pde.junit.runtime.tests/target/work/data/verification.tests.junit4.platform_Test1 (4)/configuration/" -dev "file:/home/jenkins/agent/workspace/eclipse.pde.ui-Gerrit/ui/org.eclipse.pde.junit.runtime.tests/target/work/data/verification.tests.junit4.platform_Test1 (4)/configuration/dev.properties" -os linux -ws gtk -arch x86_64 -nl en_US -consoleLog -testpluginname verification.tests.junit4.platform -runasjunit5
log file: 

no log file for: Test1 (4)
[test] Picked up JAVA_TOOL_OPTIONS: -XX:+IgnoreUnrecognizedVMOptions -XX:+UseContainerSupport -XX:+UnlockExperimentalVMOptions -XX:+UseCGroupMemoryLimitForHeap
Picked up _JAVA_OPTIONS: -XX:MaxRAMPercentage=64.0

[test] Dec 13, 2019 5:55:07 PM org.junit.vintage.engine.discovery.DefensiveAllDefaultPossibilitiesBuilder$DefensiveAnnotatedBuilder buildRunner
WARNING: Ignoring test class using JUnitPlatform runner: verification.tests.junit4.platform.Test1

test process terminated with exit value 0
command line: /opt/tools/java/openjdk/jdk-11/11.0.4/bin/java -ea -Declipse.pde.launch=true -Declipse.p2.data.area=@config.dir/p2 --add-modules=ALL-SYSTEM -Dfile.encoding=UTF-8 -classpath /home/jenkins/agent/workspace/eclipse.pde.ui-Gerrit/.repository/p2/osgi/bundle/org.eclipse.equinox.launcher/1.5.600.v20191014-2022/org.eclipse.equinox.launcher-1.5.600.v20191014-2022.jar:/home/jenkins/agent/workspace/eclipse.pde.ui-Gerrit/ui/org.eclipse.pde.junit.runtime.tests/target/work/configuration/org.eclipse.osgi/138/0/.cp org.eclipse.equinox.launcher.Main -os linux -ws gtk -arch x86_64 -nl en_US -consoleLog -version 3 -port 33542 -testLoaderClass org.eclipse.jdt.internal.junit5.runner.JUnit5TestLoader -loaderpluginname org.eclipse.jdt.junit5.runtime -test verification.tests.junit4.platform.Test1:test1 -application org.eclipse.pde.junit.runtime.coretestapplication -data "/home/jenkins/agent/workspace/eclipse.pde.ui-Gerrit/ui/org.eclipse.pde.junit.runtime.tests/target/work/data/verification.tests.junit4.platform_Test1.test1 (4)/workspace" -configuration "file:/home/jenkins/agent/workspace/eclipse.pde.ui-Gerrit/ui/org.eclipse.pde.junit.runtime.tests/target/work/data/verification.tests.junit4.platform_Test1.test1 (4)/configuration/" -dev "file:/home/jenkins/agent/workspace/eclipse.pde.ui-Gerrit/ui/org.eclipse.pde.junit.runtime.tests/target/work/data/verification.tests.junit4.platform_Test1.test1 (4)/configuration/dev.properties" -os linux -ws gtk -arch x86_64 -nl en_US -consoleLog -testpluginname verification.tests.junit4.platform
log file: 

no log file for: Test1.test1 (4)
[test] Picked up JAVA_TOOL_OPTIONS: -XX:+IgnoreUnrecognizedVMOptions -XX:+UseContainerSupport -XX:+UnlockExperimentalVMOptions -XX:+UseCGroupMemoryLimitForHeap
Picked up _JAVA_OPTIONS: -XX:MaxRAMPercentage=64.0

[test] Dec 13, 2019 5:55:14 PM org.junit.vintage.engine.discovery.DefensiveAllDefaultPossibilitiesBuilder$DefensiveAnnotatedBuilder buildRunner
WARNING: Ignoring test class using JUnitPlatform runner: verification.tests.junit4.platform.fragment.Test1

[test] Dec 13, 2019 5:55:14 PM org.junit.vintage.engine.discovery.DefensiveAllDefaultPossibilitiesBuilder$DefensiveAnnotatedBuilder buildRunner
WARNING: Ignoring test class using JUnitPlatform runner: verification.tests.junit4.platform.fragment.Test2

test process terminated with exit value 0
command line: /opt/tools/java/openjdk/jdk-11/11.0.4/bin/java -ea -Declipse.pde.launch=true -Declipse.p2.data.area=@config.dir/p2 --add-modules=ALL-SYSTEM -Dfile.encoding=UTF-8 -classpath /home/jenkins/agent/workspace/eclipse.pde.ui-Gerrit/.repository/p2/osgi/bundle/org.eclipse.equinox.launcher/1.5.600.v20191014-2022/org.eclipse.equinox.launcher-1.5.600.v20191014-2022.jar:/home/jenkins/agent/workspace/eclipse.pde.ui-Gerrit/ui/org.eclipse.pde.junit.runtime.tests/target/work/configuration/org.eclipse.osgi/138/0/.cp org.eclipse.equinox.launcher.Main -os linux -ws gtk -arch x86_64 -nl en_US -consoleLog -version 3 -port 46667 -testLoaderClass org.eclipse.jdt.internal.junit5.runner.JUnit5TestLoader -loaderpluginname org.eclipse.jdt.junit5.runtime -packageNameFile /tmp/packageNames7280725912411349879.txt -application org.eclipse.pde.junit.runtime.coretestapplication -data /home/jenkins/agent/workspace/eclipse.pde.ui-Gerrit/ui/org.eclipse.pde.junit.runtime.tests/target/work/data/verification.tests.junit4.platform.fragment_verification.tests.junit4.platform.fragment/workspace -configuration file:/home/jenkins/agent/workspace/eclipse.pde.ui-Gerrit/ui/org.eclipse.pde.junit.runtime.tests/target/work/data/verification.tests.junit4.platform.fragment_verification.tests.junit4.platform.fragment/configuration/ -dev file:/home/jenkins/agent/workspace/eclipse.pde.ui-Gerrit/ui/org.eclipse.pde.junit.runtime.tests/target/work/data/verification.tests.junit4.platform.fragment_verification.tests.junit4.platform.fragment/configuration/dev.properties -os linux -ws gtk -arch x86_64 -nl en_US -consoleLog -testpluginname verification.tests.junit4.platform
log file: 

no log file for: verification.tests.junit4.platform.fragment
[test] Picked up JAVA_TOOL_OPTIONS: -XX:+IgnoreUnrecognizedVMOptions -XX:+UseContainerSupport -XX:+UnlockExperimentalVMOptions -XX:+UseCGroupMemoryLimitForHeap
Picked up _JAVA_OPTIONS: -XX:MaxRAMPercentage=64.0

[test] Dec 13, 2019 5:55:23 PM org.junit.vintage.engine.discovery.DefensiveAllDefaultPossibilitiesBuilder$DefensiveAnnotatedBuilder buildRunner
WARNING: Ignoring test class using JUnitPlatform runner: verification.tests.junit4.platform.fragment.Test1

[test] Dec 13, 2019 5:55:23 PM org.junit.vintage.engine.discovery.DefensiveAllDefaultPossibilitiesBuilder$DefensiveAnnotatedBuilder buildRunner
WARNING: Ignoring test class using JUnitPlatform runner: verification.tests.junit4.platform.fragment.Test2

test process terminated with exit value 0
command line: /opt/tools/java/openjdk/jdk-11/11.0.4/bin/java -ea -Declipse.pde.launch=true -Declipse.p2.data.area=@config.dir/p2 --add-modules=ALL-SYSTEM -Dfile.encoding=UTF-8 -classpath /home/jenkins/agent/workspace/eclipse.pde.ui-Gerrit/.repository/p2/osgi/bundle/org.eclipse.equinox.launcher/1.5.600.v20191014-2022/org.eclipse.equinox.launcher-1.5.600.v20191014-2022.jar:/home/jenkins/agent/workspace/eclipse.pde.ui-Gerrit/ui/org.eclipse.pde.junit.runtime.tests/target/work/configuration/org.eclipse.osgi/138/0/.cp org.eclipse.equinox.launcher.Main -os linux -ws gtk -arch x86_64 -nl en_US -consoleLog -version 3 -port 41490 -testLoaderClass org.eclipse.jdt.internal.junit5.runner.JUnit5TestLoader -loaderpluginname org.eclipse.jdt.junit5.runtime -packageNameFile /tmp/packageNames9511636195563634192.txt -application org.eclipse.pde.junit.runtime.coretestapplication -data "/home/jenkins/agent/workspace/eclipse.pde.ui-Gerrit/ui/org.eclipse.pde.junit.runtime.tests/target/work/data/verification.tests.junit4.platform.fragment_verification.tests.junit4.platform.fragment (1)/workspace" -configuration "file:/home/jenkins/agent/workspace/eclipse.pde.ui-Gerrit/ui/org.eclipse.pde.junit.runtime.tests/target/work/data/verification.tests.junit4.platform.fragment_verification.tests.junit4.platform.fragment (1)/configuration/" -dev "file:/home/jenkins/agent/workspace/eclipse.pde.ui-Gerrit/ui/org.eclipse.pde.junit.runtime.tests/target/work/data/verification.tests.junit4.platform.fragment_verification.tests.junit4.platform.fragment (1)/configuration/dev.properties" -os linux -ws gtk -arch x86_64 -nl en_US -consoleLog -testpluginname verification.tests.junit4.platform
log file: 

no log file for: verification.tests.junit4.platform.fragment (1)
[test] Picked up JAVA_TOOL_OPTIONS: -XX:+IgnoreUnrecognizedVMOptions -XX:+UseContainerSupport -XX:+UnlockExperimentalVMOptions -XX:+UseCGroupMemoryLimitForHeap
Picked up _JAVA_OPTIONS: -XX:MaxRAMPercentage=64.0

[test] Dec 13, 2019 5:55:30 PM org.junit.vintage.engine.discovery.DefensiveAllDefaultPossibilitiesBuilder$DefensiveAnnotatedBuilder buildRunner
WARNING: Ignoring test class using JUnitPlatform runner: verification.tests.junit4.platform.fragment.Test1

test process terminated with exit value 0
command line: /opt/tools/java/openjdk/jdk-11/11.0.4/bin/java -ea -Declipse.pde.launch=true -Declipse.p2.data.area=@config.dir/p2 --add-modules=ALL-SYSTEM -Dfile.encoding=UTF-8 -classpath /home/jenkins/agent/workspace/eclipse.pde.ui-Gerrit/.repository/p2/osgi/bundle/org.eclipse.equinox.launcher/1.5.600.v20191014-2022/org.eclipse.equinox.launcher-1.5.600.v20191014-2022.jar org.eclipse.equinox.launcher.Main -os linux -ws gtk -arch x86_64 -nl en_US -consoleLog -version 3 -port 44772 -testLoaderClass org.eclipse.jdt.internal.junit4.runner.JUnit4TestLoader -loaderpluginname org.eclipse.jdt.junit4.runtime -classNames verification.tests.junit4.platform.fragment.Test1 -application org.eclipse.pde.junit.runtime.coretestapplication -data "/home/jenkins/agent/workspace/eclipse.pde.ui-Gerrit/ui/org.eclipse.pde.junit.runtime.tests/target/work/data/verification.tests.junit4.platform.fragment_Test1 (5)/workspace" -configuration "file:/home/jenkins/agent/workspace/eclipse.pde.ui-Gerrit/ui/org.eclipse.pde.junit.runtime.tests/target/work/data/verification.tests.junit4.platform.fragment_Test1 (5)/configuration/" -dev "file:/home/jenkins/agent/workspace/eclipse.pde.ui-Gerrit/ui/org.eclipse.pde.junit.runtime.tests/target/work/data/verification.tests.junit4.platform.fragment_Test1 (5)/configuration/dev.properties" -os linux -ws gtk -arch x86_64 -nl en_US -consoleLog -testpluginname verification.tests.junit4.platform -runasjunit5
log file: 

no log file for: Test1 (5)
[test] Picked up JAVA_TOOL_OPTIONS: -XX:+IgnoreUnrecognizedVMOptions -XX:+UseContainerSupport -XX:+UnlockExperimentalVMOptions -XX:+UseCGroupMemoryLimitForHeap
Picked up _JAVA_OPTIONS: -XX:MaxRAMPercentage=64.0

[test] Dec 13, 2019 5:55:37 PM org.junit.vintage.engine.discovery.DefensiveAllDefaultPossibilitiesBuilder$DefensiveAnnotatedBuilder buildRunner
WARNING: Ignoring test class using JUnitPlatform runner: verification.tests.junit4.platform.fragment.Test1

test process terminated with exit value 0
command line: /opt/tools/java/openjdk/jdk-11/11.0.4/bin/java -ea -Declipse.pde.launch=true -Declipse.p2.data.area=@config.dir/p2 --add-modules=ALL-SYSTEM -Dfile.encoding=UTF-8 -classpath /home/jenkins/agent/workspace/eclipse.pde.ui-Gerrit/.repository/p2/osgi/bundle/org.eclipse.equinox.launcher/1.5.600.v20191014-2022/org.eclipse.equinox.launcher-1.5.600.v20191014-2022.jar:/home/jenkins/agent/workspace/eclipse.pde.ui-Gerrit/ui/org.eclipse.pde.junit.runtime.tests/target/work/configuration/org.eclipse.osgi/138/0/.cp org.eclipse.equinox.launcher.Main -os linux -ws gtk -arch x86_64 -nl en_US -consoleLog -version 3 -port 46213 -testLoaderClass org.eclipse.jdt.internal.junit5.runner.JUnit5TestLoader -loaderpluginname org.eclipse.jdt.junit5.runtime -test verification.tests.junit4.platform.fragment.Test1:test1 -application org.eclipse.pde.junit.runtime.coretestapplication -data "/home/jenkins/agent/workspace/eclipse.pde.ui-Gerrit/ui/org.eclipse.pde.junit.runtime.tests/target/work/data/verification.tests.junit4.platform.fragment_Test1.test1 (5)/workspace" -configuration "file:/home/jenkins/agent/workspace/eclipse.pde.ui-Gerrit/ui/org.eclipse.pde.junit.runtime.tests/target/work/data/verification.tests.junit4.platform.fragment_Test1.test1 (5)/configuration/" -dev "file:/home/jenkins/agent/workspace/eclipse.pde.ui-Gerrit/ui/org.eclipse.pde.junit.runtime.tests/target/work/data/verification.tests.junit4.platform.fragment_Test1.test1 (5)/configuration/dev.properties" -os linux -ws gtk -arch x86_64 -nl en_US -consoleLog -testpluginname verification.tests.junit4.platform
log file: 

no log file for: Test1.test1 (5)
Tests run: 24, Failures: 0, Errors: 0, Skipped: 0, Time elapsed: 189.095 s - in org.eclipse.pde.junit.runtime.tests.JUnitExecutionTest
executePackage[JUnit5](org.eclipse.pde.junit.runtime.tests.JUnitExecutionTest)  Time elapsed: 12.518 s
executeProject[JUnit5](org.eclipse.pde.junit.runtime.tests.JUnitExecutionTest)  Time elapsed: 8.989 s
executeType[JUnit5](org.eclipse.pde.junit.runtime.tests.JUnitExecutionTest)  Time elapsed: 6.25 s
executeMethod[JUnit5](org.eclipse.pde.junit.runtime.tests.JUnitExecutionTest)  Time elapsed: 5.597 s
executePackage[JUnit5 Fragment](org.eclipse.pde.junit.runtime.tests.JUnitExecutionTest)  Time elapsed: 6.799 s
executeProject[JUnit5 Fragment](org.eclipse.pde.junit.runtime.tests.JUnitExecutionTest)  Time elapsed: 5.821 s
executeType[JUnit5 Fragment](org.eclipse.pde.junit.runtime.tests.JUnitExecutionTest)  Time elapsed: 5.929 s
executeMethod[JUnit5 Fragment](org.eclipse.pde.junit.runtime.tests.JUnitExecutionTest)  Time elapsed: 5.823 s
executePackage[JUnit4](org.eclipse.pde.junit.runtime.tests.JUnitExecutionTest)  Time elapsed: 5.494 s
executeProject[JUnit4](org.eclipse.pde.junit.runtime.tests.JUnitExecutionTest)  Time elapsed: 8.068 s
executeType[JUnit4](org.eclipse.pde.junit.runtime.tests.JUnitExecutionTest)  Time elapsed: 7.423 s
executeMethod[JUnit4](org.eclipse.pde.junit.runtime.tests.JUnitExecutionTest)  Time elapsed: 5.319 s
executePackage[JUnit4 Fragment](org.eclipse.pde.junit.runtime.tests.JUnitExecutionTest)  Time elapsed: 4.763 s
executeProject[JUnit4 Fragment](org.eclipse.pde.junit.runtime.tests.JUnitExecutionTest)  Time elapsed: 4.929 s
executeType[JUnit4 Fragment](org.eclipse.pde.junit.runtime.tests.JUnitExecutionTest)  Time elapsed: 6.443 s
executeMethod[JUnit4 Fragment](org.eclipse.pde.junit.runtime.tests.JUnitExecutionTest)  Time elapsed: 5.062 s
executePackage[JUnit4 (JUnitPlatform)](org.eclipse.pde.junit.runtime.tests.JUnitExecutionTest)  Time elapsed: 29.109 s
executeProject[JUnit4 (JUnitPlatform)](org.eclipse.pde.junit.runtime.tests.JUnitExecutionTest)  Time elapsed: 5.902 s
executeType[JUnit4 (JUnitPlatform)](org.eclipse.pde.junit.runtime.tests.JUnitExecutionTest)  Time elapsed: 6.879 s
executeMethod[JUnit4 (JUnitPlatform)](org.eclipse.pde.junit.runtime.tests.JUnitExecutionTest)  Time elapsed: 6.583 s
executePackage[JUnit4 (JUnitPlatform) Fragment](org.eclipse.pde.junit.runtime.tests.JUnitExecutionTest)  Time elapsed: 8.973 s
executeProject[JUnit4 (JUnitPlatform) Fragment](org.eclipse.pde.junit.runtime.tests.JUnitExecutionTest)  Time elapsed: 7.457 s
executeType[JUnit4 (JUnitPlatform) Fragment](org.eclipse.pde.junit.runtime.tests.JUnitExecutionTest)  Time elapsed: 6.479 s
executeMethod[JUnit4 (JUnitPlatform) Fragment](org.eclipse.pde.junit.runtime.tests.JUnitExecutionTest)  Time elapsed: 6.485 s

Results:

Tests run: 24, Failures: 0, Errors: 0, Skipped: 0

[INFO] All tests passed!
[INFO] 
[INFO] --- tycho-p2-extras-plugin:1.5.1:compare-version-with-baselines (compare-attached-artifacts-with-release) @ org.eclipse.pde.junit.runtime.tests ---
[INFO] Fetching org.eclipse.pde.junit.runtime.tests_3.5.500.v20190801-0829.jar.pack.gz from https://download.eclipse.org/eclipse/updates/4.14milestones/S-4.14RC1-201911271800/plugins/ (19kB)
[INFO] Fetching org.eclipse.pde.junit.runtime.tests_3.5.500.v20190801-0829.jar.pack.gz from https://download.eclipse.org/eclipse/updates/4.14milestones/S-4.14RC1-201911271800/plugins/ (19kB)
[INFO] ------------------------------------------------------------------------
[INFO] Reactor Summary:
[INFO] 
[INFO] eclipse.pde.ui 4.15.0-SNAPSHOT ..................... SUCCESS [ 32.468 s]
[INFO] eclipse.pde.ui.apitools 4.15.0-SNAPSHOT ............ SUCCESS [  0.114 s]
[INFO] org.eclipse.pde.core 3.13.300-SNAPSHOT ............. SUCCESS [02:26 min]
[INFO] org.eclipse.pde.api.tools 1.1.1200-SNAPSHOT ........ SUCCESS [01:47 min]
[INFO] org.eclipse.pde.api.tools.annotations 1.1.400-SNAPSHOT SUCCESS [ 25.612 s]
[INFO] CDC-1.0/Foundation-1.0 Execution Environment Description  1.1.400-SNAPSHOT SUCCESS [ 35.053 s]
[INFO] CDC-1.1/Foundation-1.1 Execution Environment Description  1.1.400-SNAPSHOT SUCCESS [ 30.996 s]
[INFO] J2SE-1.2 Execution Environment Description  1.1.400-SNAPSHOT SUCCESS [ 30.108 s]
[INFO] J2SE-1.3 Execution Environment Description  1.1.400-SNAPSHOT SUCCESS [ 29.806 s]
[INFO] J2SE-1.4 Execution Environment Description  1.1.400-SNAPSHOT SUCCESS [ 32.703 s]
[INFO] J2SE-1.5 Execution Environment Description  1.1.400-SNAPSHOT SUCCESS [ 36.239 s]
[INFO] JavaSE-1.6 Execution Environment Description 1.1.400-SNAPSHOT SUCCESS [ 32.075 s]
[INFO] JavaSE-1.7 Execution Environment Description  1.1.400-SNAPSHOT SUCCESS [ 34.102 s]
[INFO] JRE-1.1 Execution Environment Description  1.1.400-SNAPSHOT SUCCESS [ 29.798 s]
[INFO] OSGi/Minimum-1.0 Environment Description 1.1.400-SNAPSHOT SUCCESS [ 30.294 s]
[INFO] OSGi/Minimum-1.1 Execution Environment Description  1.1.400-SNAPSHOT SUCCESS [ 31.174 s]
[INFO] OSGi/Minimum-1.2 Execution Environment Description  1.1.400-SNAPSHOT SUCCESS [ 44.900 s]
[INFO] JavaSE-1.8 Execution Environment Description  1.1.500-SNAPSHOT SUCCESS [ 32.491 s]
[INFO] JavaSE-9 Execution Environment Description 1.0.300-SNAPSHOT SUCCESS [ 32.875 s]
[INFO] API Tools Execution Environment Descriptions 1.0.700-SNAPSHOT SUCCESS [  0.658 s]
[INFO] org.eclipse.pde.launching 3.8.100-SNAPSHOT ......... SUCCESS [01:03 min]
[INFO] org.eclipse.ui.trace 1.1.800-SNAPSHOT .............. SUCCESS [ 52.196 s]
[INFO] org.eclipse.pde.ui 3.11.300-SNAPSHOT ............... SUCCESS [02:10 min]
[INFO] API Tools UI 1.1.1000-SNAPSHOT ..................... SUCCESS [01:23 min]
[INFO] org.eclipse.pde.api.tools.tests 1.1.800-SNAPSHOT ... SUCCESS [13:33 min]
[INFO] org.eclipse.pde.ds.core 1.1.800-SNAPSHOT ........... SUCCESS [ 47.282 s]
[INFO] org.eclipse.pde.ds.tests 1.1.500-SNAPSHOT .......... SUCCESS [ 48.023 s]
[INFO] org.eclipse.pde.ds.ui 1.1.700-SNAPSHOT ............. SUCCESS [01:12 min]
[INFO] org.eclipse.pde.ds.lib 1.1.400-SNAPSHOT ............ SUCCESS [ 26.864 s]
[INFO] org.eclipse.pde.ds1_2.lib 1.0.400-SNAPSHOT ......... SUCCESS [ 22.188 s]
[INFO] org.eclipse.pde.ds.annotations 1.1.700-SNAPSHOT .... SUCCESS [01:12 min]
[INFO] org.eclipse.pde.ua.core 1.1.400-SNAPSHOT ........... SUCCESS [ 44.183 s]
[INFO] org.eclipse.pde 3.13.900-SNAPSHOT .................. SUCCESS [ 12.174 s]
[INFO] org.eclipse.pde.junit.runtime 3.5.600-SNAPSHOT ..... SUCCESS [ 32.294 s]
[INFO] org.eclipse.pde.runtime 3.6.800-SNAPSHOT ........... SUCCESS [ 46.711 s]
[INFO] org.eclipse.pde.ui.templates 3.6.800-SNAPSHOT ...... SUCCESS [01:11 min]
[INFO] org.eclipse.pde.ua.ui 1.1.700-SNAPSHOT ............. SUCCESS [01:12 min]
[INFO] org.eclipse.pde.genericeditor.extension 1.0.700-SNAPSHOT SUCCESS [01:11 min]
[INFO] org.eclipse.tools.layout.spy 1.0.400-SNAPSHOT ...... SUCCESS [ 49.212 s]
[INFO] org.eclipse.pde 3.14.300-SNAPSHOT .................. SUCCESS [  1.440 s]
[INFO] org.eclipse.pde.ua.tests 1.1.300-SNAPSHOT .......... SUCCESS [01:20 min]
[INFO] org.eclipse.pde.junit.runtime.tests 3.5.500-SNAPSHOT FAILURE [03:29 min]
[INFO] org.eclipse.pde.ui.tests 3.10.700-SNAPSHOT ......... SKIPPED
[INFO] org.eclipse.pde.ui.tests.smartimport 1.0.0-SNAPSHOT  SKIPPED
[INFO] org.eclipse.pde.ui.templates.tests 1.0.600-SNAPSHOT  SKIPPED
[INFO] org.eclipse.pde.genericeditor.extension.tests 1.0.500-SNAPSHOT SKIPPED
[INFO] ------------------------------------------------------------------------
[INFO] BUILD FAILURE
[INFO] ------------------------------------------------------------------------
[INFO] Total time:  53:12 min
[INFO] Finished at: 2019-12-13T17:55:42Z
[INFO] ------------------------------------------------------------------------
[ERROR] Failed to execute goal org.eclipse.tycho.extras:tycho-p2-extras-plugin:1.5.1:compare-version-with-baselines (compare-attached-artifacts-with-release) on project org.eclipse.pde.junit.runtime.tests: Only qualifier changed for (org.eclipse.pde.junit.runtime.tests/3.5.500.v20191213-1656). Expected to have bigger x.y.z than what is available in baseline (3.5.500.v20190801-0829) -> [Help 1]
[ERROR] 
[ERROR] To see the full stack trace of the errors, re-run Maven with the -e switch.
[ERROR] Re-run Maven using the -X switch to enable full debug logging.
[ERROR] 
[ERROR] For more information about the errors and possible solutions, please read the following articles:
[ERROR] [Help 1] http://cwiki.apache.org/confluence/display/MAVEN/MojoFailureException
[ERROR] 
[ERROR] After correcting the problems, you can resume the build with the command
[ERROR]   mvn <goals> -rf :org.eclipse.pde.junit.runtime.tests
Build step 'Invoke top-level Maven targets' marked build as failure
Terminating xvnc.
[WARNINGS] Skipping publisher since build result is FAILURE
Recording test results
Archiving artifacts
Finished: FAILURE