FailedConsole Output

Skipping 1,154 KB.. Full Log
c.internal.base.tests.conditions.evaluation.SimpleMapExpressionEvaluationServiceTest)  Time elapsed: 0 s
failureOnUnexpectedExpression(org.eclipse.passage.lic.internal.base.tests.conditions.evaluation.SimpleMapExpressionEvaluationServiceTest)  Time elapsed: 0.001 s
canOnlyEvaluateExpressionOfSameProtocl(org.eclipse.passage.lic.internal.base.tests.conditions.evaluation.SimpleMapExpressionEvaluationServiceTest)  Time elapsed: 0 s
prohibitsNullExpression(org.eclipse.passage.lic.internal.base.tests.conditions.evaluation.SimpleMapExpressionEvaluationServiceTest)  Time elapsed: 0 s
prohibitsNullAssessor(org.eclipse.passage.lic.internal.base.tests.conditions.evaluation.SimpleMapExpressionEvaluationServiceTest)  Time elapsed: 0 s
Running org.eclipse.passage.lic.internal.base.tests.conditions.evaluation.SumOfEmissionsTest
Tests run: 8, Failures: 0, Errors: 0, Skipped: 0, Time elapsed: 0.001 s - in org.eclipse.passage.lic.internal.base.tests.conditions.evaluation.SumOfEmissionsTest
prohibitsNullSecondOperand(org.eclipse.passage.lic.internal.base.tests.conditions.evaluation.SumOfEmissionsTest)  Time elapsed: 0 s
prohibitsNullFirstOperand(org.eclipse.passage.lic.internal.base.tests.conditions.evaluation.SumOfEmissionsTest)  Time elapsed: 0 s
sumsDiagnostics(org.eclipse.passage.lic.internal.base.tests.conditions.evaluation.SumOfEmissionsTest)  Time elapsed: 0 s
sumOfFailureAndSuccessIsFailure(org.eclipse.passage.lic.internal.base.tests.conditions.evaluation.SumOfEmissionsTest)  Time elapsed: 0 s
sumOfSuccessesAndFailureIsFailure(org.eclipse.passage.lic.internal.base.tests.conditions.evaluation.SumOfEmissionsTest)  Time elapsed: 0 s
sumsPermissions(org.eclipse.passage.lic.internal.base.tests.conditions.evaluation.SumOfEmissionsTest)  Time elapsed: 0 s
sumOfFailuresIsFailure(org.eclipse.passage.lic.internal.base.tests.conditions.evaluation.SumOfEmissionsTest)  Time elapsed: 0 s
sumOfSuccessesIsSuccess(org.eclipse.passage.lic.internal.base.tests.conditions.evaluation.SumOfEmissionsTest)  Time elapsed: 0 s
Running org.eclipse.passage.lic.internal.base.tests.conditions.contract.MatchingRuleEquivalentContractTest
Tests run: 12, Failures: 0, Errors: 0, Skipped: 0, Time elapsed: 0.002 s - in org.eclipse.passage.lic.internal.base.tests.conditions.contract.MatchingRuleEquivalentContractTest
blankStringMatchesDefault(org.eclipse.passage.lic.internal.base.tests.conditions.contract.MatchingRuleEquivalentContractTest)  Time elapsed: 0 s
notVersionMatchesDefault(org.eclipse.passage.lic.internal.base.tests.conditions.contract.MatchingRuleEquivalentContractTest)  Time elapsed: 0 s
requiredDefaultAlwaysMatches(org.eclipse.passage.lic.internal.base.tests.conditions.contract.MatchingRuleEquivalentContractTest)  Time elapsed: 0 s
nullRequiredIsProhibited(org.eclipse.passage.lic.internal.base.tests.conditions.contract.MatchingRuleEquivalentContractTest)  Time elapsed: 0 s
nullAllowedIsProhibited(org.eclipse.passage.lic.internal.base.tests.conditions.contract.MatchingRuleEquivalentContractTest)  Time elapsed: 0.001 s
stateless(org.eclipse.passage.lic.internal.base.tests.conditions.contract.MatchingRuleEquivalentContractTest)  Time elapsed: 0 s
allInstancesAreEqual(org.eclipse.passage.lic.internal.base.tests.conditions.contract.MatchingRuleEquivalentContractTest)  Time elapsed: 0 s
absolutelyEqualVersionsMatch(org.eclipse.passage.lic.internal.base.tests.conditions.contract.MatchingRuleEquivalentContractTest)  Time elapsed: 0 s
absolutelyEqualNotVersionsMatch(org.eclipse.passage.lic.internal.base.tests.conditions.contract.MatchingRuleEquivalentContractTest)  Time elapsed: 0 s
matchingIsIdempotant(org.eclipse.passage.lic.internal.base.tests.conditions.contract.MatchingRuleEquivalentContractTest)  Time elapsed: 0 s
defaultVersionsMatch(org.eclipse.passage.lic.internal.base.tests.conditions.contract.MatchingRuleEquivalentContractTest)  Time elapsed: 0 s
matchingIsDeterministic(org.eclipse.passage.lic.internal.base.tests.conditions.contract.MatchingRuleEquivalentContractTest)  Time elapsed: 0 s
Running org.eclipse.passage.lic.internal.base.tests.conditions.contract.MatchingRuleDefaultContractTest
Tests run: 9, Failures: 0, Errors: 0, Skipped: 0, Time elapsed: 0.001 s - in org.eclipse.passage.lic.internal.base.tests.conditions.contract.MatchingRuleDefaultContractTest
nullRequiredIsProhibited(org.eclipse.passage.lic.internal.base.tests.conditions.contract.MatchingRuleDefaultContractTest)  Time elapsed: 0 s
nullAllowedIsProhibited(org.eclipse.passage.lic.internal.base.tests.conditions.contract.MatchingRuleDefaultContractTest)  Time elapsed: 0 s
stateless(org.eclipse.passage.lic.internal.base.tests.conditions.contract.MatchingRuleDefaultContractTest)  Time elapsed: 0 s
allInstancesAreEqual(org.eclipse.passage.lic.internal.base.tests.conditions.contract.MatchingRuleDefaultContractTest)  Time elapsed: 0 s
absolutelyEqualVersionsMatch(org.eclipse.passage.lic.internal.base.tests.conditions.contract.MatchingRuleDefaultContractTest)  Time elapsed: 0.001 s
absolutelyEqualNotVersionsMatch(org.eclipse.passage.lic.internal.base.tests.conditions.contract.MatchingRuleDefaultContractTest)  Time elapsed: 0 s
matchingIsIdempotant(org.eclipse.passage.lic.internal.base.tests.conditions.contract.MatchingRuleDefaultContractTest)  Time elapsed: 0 s
defaultVersionsMatch(org.eclipse.passage.lic.internal.base.tests.conditions.contract.MatchingRuleDefaultContractTest)  Time elapsed: 0 s
matchingIsDeterministic(org.eclipse.passage.lic.internal.base.tests.conditions.contract.MatchingRuleDefaultContractTest)  Time elapsed: 0 s
Running org.eclipse.passage.lic.internal.base.tests.conditions.contract.MatchingRulePerfectContractTest
Tests run: 9, Failures: 0, Errors: 0, Skipped: 0, Time elapsed: 0.001 s - in org.eclipse.passage.lic.internal.base.tests.conditions.contract.MatchingRulePerfectContractTest
nullRequiredIsProhibited(org.eclipse.passage.lic.internal.base.tests.conditions.contract.MatchingRulePerfectContractTest)  Time elapsed: 0 s
nullAllowedIsProhibited(org.eclipse.passage.lic.internal.base.tests.conditions.contract.MatchingRulePerfectContractTest)  Time elapsed: 0 s
stateless(org.eclipse.passage.lic.internal.base.tests.conditions.contract.MatchingRulePerfectContractTest)  Time elapsed: 0 s
allInstancesAreEqual(org.eclipse.passage.lic.internal.base.tests.conditions.contract.MatchingRulePerfectContractTest)  Time elapsed: 0 s
absolutelyEqualVersionsMatch(org.eclipse.passage.lic.internal.base.tests.conditions.contract.MatchingRulePerfectContractTest)  Time elapsed: 0 s
absolutelyEqualNotVersionsMatch(org.eclipse.passage.lic.internal.base.tests.conditions.contract.MatchingRulePerfectContractTest)  Time elapsed: 0 s
matchingIsIdempotant(org.eclipse.passage.lic.internal.base.tests.conditions.contract.MatchingRulePerfectContractTest)  Time elapsed: 0 s
defaultVersionsMatch(org.eclipse.passage.lic.internal.base.tests.conditions.contract.MatchingRulePerfectContractTest)  Time elapsed: 0 s
matchingIsDeterministic(org.eclipse.passage.lic.internal.base.tests.conditions.contract.MatchingRulePerfectContractTest)  Time elapsed: 0 s
Running org.eclipse.passage.lic.internal.base.tests.conditions.contract.BaseValidityPeriodContractTest
Tests run: 8, Failures: 0, Errors: 0, Skipped: 0, Time elapsed: 0.002 s - in org.eclipse.passage.lic.internal.base.tests.conditions.contract.BaseValidityPeriodContractTest
doNotReverseIncorectBounds(org.eclipse.passage.lic.internal.base.tests.conditions.contract.BaseValidityPeriodContractTest)  Time elapsed: 0 s
fromBeforeTo(org.eclipse.passage.lic.internal.base.tests.conditions.contract.BaseValidityPeriodContractTest)  Time elapsed: 0 s
doNotInventTo(org.eclipse.passage.lic.internal.base.tests.conditions.contract.BaseValidityPeriodContractTest)  Time elapsed: 0 s
mustEndWithDefinedTo(org.eclipse.passage.lic.internal.base.tests.conditions.contract.BaseValidityPeriodContractTest)  Time elapsed: 0.001 s
mustStartWithDefinedFrom(org.eclipse.passage.lic.internal.base.tests.conditions.contract.BaseValidityPeriodContractTest)  Time elapsed: 0 s
doNotInventFrom(org.eclipse.passage.lic.internal.base.tests.conditions.contract.BaseValidityPeriodContractTest)  Time elapsed: 0 s
dateCanBeValid(org.eclipse.passage.lic.internal.base.tests.conditions.contract.BaseValidityPeriodContractTest)  Time elapsed: 0 s
dateCanBeInvalid(org.eclipse.passage.lic.internal.base.tests.conditions.contract.BaseValidityPeriodContractTest)  Time elapsed: 0 s
Running org.eclipse.passage.lic.internal.base.tests.conditions.contract.MatchingRuleGreaterOrEqualContractTest
Tests run: 12, Failures: 0, Errors: 0, Skipped: 0, Time elapsed: 0.002 s - in org.eclipse.passage.lic.internal.base.tests.conditions.contract.MatchingRuleGreaterOrEqualContractTest
blankStringMatchesDefault(org.eclipse.passage.lic.internal.base.tests.conditions.contract.MatchingRuleGreaterOrEqualContractTest)  Time elapsed: 0 s
notVersionMatchesDefault(org.eclipse.passage.lic.internal.base.tests.conditions.contract.MatchingRuleGreaterOrEqualContractTest)  Time elapsed: 0 s
requiredDefaultAlwaysMatches(org.eclipse.passage.lic.internal.base.tests.conditions.contract.MatchingRuleGreaterOrEqualContractTest)  Time elapsed: 0 s
nullRequiredIsProhibited(org.eclipse.passage.lic.internal.base.tests.conditions.contract.MatchingRuleGreaterOrEqualContractTest)  Time elapsed: 0 s
nullAllowedIsProhibited(org.eclipse.passage.lic.internal.base.tests.conditions.contract.MatchingRuleGreaterOrEqualContractTest)  Time elapsed: 0 s
stateless(org.eclipse.passage.lic.internal.base.tests.conditions.contract.MatchingRuleGreaterOrEqualContractTest)  Time elapsed: 0 s
allInstancesAreEqual(org.eclipse.passage.lic.internal.base.tests.conditions.contract.MatchingRuleGreaterOrEqualContractTest)  Time elapsed: 0 s
absolutelyEqualVersionsMatch(org.eclipse.passage.lic.internal.base.tests.conditions.contract.MatchingRuleGreaterOrEqualContractTest)  Time elapsed: 0 s
absolutelyEqualNotVersionsMatch(org.eclipse.passage.lic.internal.base.tests.conditions.contract.MatchingRuleGreaterOrEqualContractTest)  Time elapsed: 0 s
matchingIsIdempotant(org.eclipse.passage.lic.internal.base.tests.conditions.contract.MatchingRuleGreaterOrEqualContractTest)  Time elapsed: 0.001 s
defaultVersionsMatch(org.eclipse.passage.lic.internal.base.tests.conditions.contract.MatchingRuleGreaterOrEqualContractTest)  Time elapsed: 0 s
matchingIsDeterministic(org.eclipse.passage.lic.internal.base.tests.conditions.contract.MatchingRuleGreaterOrEqualContractTest)  Time elapsed: 0 s
Running org.eclipse.passage.lic.internal.base.tests.conditions.contract.MatchingRuleCompatibleContractTest
Tests run: 12, Failures: 0, Errors: 0, Skipped: 0, Time elapsed: 0.002 s - in org.eclipse.passage.lic.internal.base.tests.conditions.contract.MatchingRuleCompatibleContractTest
blankStringMatchesDefault(org.eclipse.passage.lic.internal.base.tests.conditions.contract.MatchingRuleCompatibleContractTest)  Time elapsed: 0 s
notVersionMatchesDefault(org.eclipse.passage.lic.internal.base.tests.conditions.contract.MatchingRuleCompatibleContractTest)  Time elapsed: 0 s
requiredDefaultAlwaysMatches(org.eclipse.passage.lic.internal.base.tests.conditions.contract.MatchingRuleCompatibleContractTest)  Time elapsed: 0 s
nullRequiredIsProhibited(org.eclipse.passage.lic.internal.base.tests.conditions.contract.MatchingRuleCompatibleContractTest)  Time elapsed: 0 s
nullAllowedIsProhibited(org.eclipse.passage.lic.internal.base.tests.conditions.contract.MatchingRuleCompatibleContractTest)  Time elapsed: 0 s
stateless(org.eclipse.passage.lic.internal.base.tests.conditions.contract.MatchingRuleCompatibleContractTest)  Time elapsed: 0.001 s
allInstancesAreEqual(org.eclipse.passage.lic.internal.base.tests.conditions.contract.MatchingRuleCompatibleContractTest)  Time elapsed: 0 s
absolutelyEqualVersionsMatch(org.eclipse.passage.lic.internal.base.tests.conditions.contract.MatchingRuleCompatibleContractTest)  Time elapsed: 0 s
absolutelyEqualNotVersionsMatch(org.eclipse.passage.lic.internal.base.tests.conditions.contract.MatchingRuleCompatibleContractTest)  Time elapsed: 0 s
matchingIsIdempotant(org.eclipse.passage.lic.internal.base.tests.conditions.contract.MatchingRuleCompatibleContractTest)  Time elapsed: 0 s
defaultVersionsMatch(org.eclipse.passage.lic.internal.base.tests.conditions.contract.MatchingRuleCompatibleContractTest)  Time elapsed: 0 s
matchingIsDeterministic(org.eclipse.passage.lic.internal.base.tests.conditions.contract.MatchingRuleCompatibleContractTest)  Time elapsed: 0 s
Running org.eclipse.passage.lic.internal.base.tests.conditions.MatchingRulePerfectTest
Tests run: 3, Failures: 0, Errors: 0, Skipped: 0, Time elapsed: 0 s - in org.eclipse.passage.lic.internal.base.tests.conditions.MatchingRulePerfectTest
idIsPerfect(org.eclipse.passage.lic.internal.base.tests.conditions.MatchingRulePerfectTest)  Time elapsed: 0 s
qualifierSegmentIsCaseSensitive(org.eclipse.passage.lic.internal.base.tests.conditions.MatchingRulePerfectTest)  Time elapsed: 0 s
bulk(org.eclipse.passage.lic.internal.base.tests.conditions.MatchingRulePerfectTest)  Time elapsed: 0 s
Running org.eclipse.passage.lic.internal.base.tests.conditions.BaseValidityPeriodClosedTest
Tests run: 2, Failures: 0, Errors: 0, Skipped: 0, Time elapsed: 0.001 s - in org.eclipse.passage.lic.internal.base.tests.conditions.BaseValidityPeriodClosedTest
fromIsMandatory(org.eclipse.passage.lic.internal.base.tests.conditions.BaseValidityPeriodClosedTest)  Time elapsed: 0 s
toIsMandatory(org.eclipse.passage.lic.internal.base.tests.conditions.BaseValidityPeriodClosedTest)  Time elapsed: 0 s
Running org.eclipse.passage.lic.internal.base.tests.conditions.MatchingRuleEquivalentTest
Tests run: 8, Failures: 0, Errors: 0, Skipped: 0, Time elapsed: 0.002 s - in org.eclipse.passage.lic.internal.base.tests.conditions.MatchingRuleEquivalentTest
lesserServiceRequiredSegmentFailsMatching(org.eclipse.passage.lic.internal.base.tests.conditions.MatchingRuleEquivalentTest)  Time elapsed: 0 s
notEqualMajorSegmentsFailMatching(org.eclipse.passage.lic.internal.base.tests.conditions.MatchingRuleEquivalentTest)  Time elapsed: 0 s
notEqualMinorSegmentsFailMatching(org.eclipse.passage.lic.internal.base.tests.conditions.MatchingRuleEquivalentTest)  Time elapsed: 0 s
greaterServiceRequiredSegmentSucceedsMatching(org.eclipse.passage.lic.internal.base.tests.conditions.MatchingRuleEquivalentTest)  Time elapsed: 0 s
qualifierSegmentDoesNotAffectMatching(org.eclipse.passage.lic.internal.base.tests.conditions.MatchingRuleEquivalentTest)  Time elapsed: 0 s
equalServiceSegmentsSucceedMatching(org.eclipse.passage.lic.internal.base.tests.conditions.MatchingRuleEquivalentTest)  Time elapsed: 0 s
bulk(org.eclipse.passage.lic.internal.base.tests.conditions.MatchingRuleEquivalentTest)  Time elapsed: 0.001 s
idIsEquivalent(org.eclipse.passage.lic.internal.base.tests.conditions.MatchingRuleEquivalentTest)  Time elapsed: 0 s
Running org.eclipse.passage.lic.internal.base.tests.conditions.BaseConditionTest
Tests run: 5, Failures: 0, Errors: 0, Skipped: 0, Time elapsed: 0.001 s - in org.eclipse.passage.lic.internal.base.tests.conditions.BaseConditionTest
versionMatchDefinitionIsMandatory(org.eclipse.passage.lic.internal.base.tests.conditions.BaseConditionTest)  Time elapsed: 0 s
validityPeriodIsMandatory(org.eclipse.passage.lic.internal.base.tests.conditions.BaseConditionTest)  Time elapsed: 0 s
evaluationInstructionsAreMandatory(org.eclipse.passage.lic.internal.base.tests.conditions.BaseConditionTest)  Time elapsed: 0 s
isDataTransitionObject(org.eclipse.passage.lic.internal.base.tests.conditions.BaseConditionTest)  Time elapsed: 0 s
featureIsMandatory(org.eclipse.passage.lic.internal.base.tests.conditions.BaseConditionTest)  Time elapsed: 0 s
Running org.eclipse.passage.lic.internal.base.tests.conditions.MatchingRuleGreaterOrEqualTest
Tests run: 8, Failures: 0, Errors: 0, Skipped: 0, Time elapsed: 0.001 s - in org.eclipse.passage.lic.internal.base.tests.conditions.MatchingRuleGreaterOrEqualTest
idIsGreaterOrEqual(org.eclipse.passage.lic.internal.base.tests.conditions.MatchingRuleGreaterOrEqualTest)  Time elapsed: 0 s
lesserMajorRequiredSegmentFailsMatching(org.eclipse.passage.lic.internal.base.tests.conditions.MatchingRuleGreaterOrEqualTest)  Time elapsed: 0 s
greaterMajourRequiredSegmentSucceedsMatching(org.eclipse.passage.lic.internal.base.tests.conditions.MatchingRuleGreaterOrEqualTest)  Time elapsed: 0 s
qualifierSegmentDoesNotAffectMatching(org.eclipse.passage.lic.internal.base.tests.conditions.MatchingRuleGreaterOrEqualTest)  Time elapsed: 0 s
bulk(org.eclipse.passage.lic.internal.base.tests.conditions.MatchingRuleGreaterOrEqualTest)  Time elapsed: 0.001 s
minorSegmentDoesNotAffectMatching(org.eclipse.passage.lic.internal.base.tests.conditions.MatchingRuleGreaterOrEqualTest)  Time elapsed: 0 s
equalMajorSegmentsSucceedMatching(org.eclipse.passage.lic.internal.base.tests.conditions.MatchingRuleGreaterOrEqualTest)  Time elapsed: 0 s
serviceSegmentDoesNotAffectMatching(org.eclipse.passage.lic.internal.base.tests.conditions.MatchingRuleGreaterOrEqualTest)  Time elapsed: 0 s
Running org.eclipse.passage.lic.internal.base.tests.conditions.BaseEvaluationInstructionsTest
Tests run: 2, Failures: 0, Errors: 0, Skipped: 0, Time elapsed: 0 s - in org.eclipse.passage.lic.internal.base.tests.conditions.BaseEvaluationInstructionsTest
nullTypeIsProhibited(org.eclipse.passage.lic.internal.base.tests.conditions.BaseEvaluationInstructionsTest)  Time elapsed: 0 s
nullExpressionIsProhibited(org.eclipse.passage.lic.internal.base.tests.conditions.BaseEvaluationInstructionsTest)  Time elapsed: 0 s
Running org.eclipse.passage.lic.internal.base.tests.version.contract.BaseSemanticVersionContractTest
Tests run: 2, Failures: 0, Errors: 0, Skipped: 0, Time elapsed: 0.002 s - in org.eclipse.passage.lic.internal.base.tests.version.contract.BaseSemanticVersionContractTest
notExistingQualifierRetrievalMustFail(org.eclipse.passage.lic.internal.base.tests.version.contract.BaseSemanticVersionContractTest)  Time elapsed: 0.001 s
existingQualifierMustPresent(org.eclipse.passage.lic.internal.base.tests.version.contract.BaseSemanticVersionContractTest)  Time elapsed: 0 s
Running org.eclipse.passage.lic.internal.base.tests.version.contract.SafeVersionContractTest
Tests run: 2, Failures: 0, Errors: 0, Skipped: 0, Time elapsed: 0.002 s - in org.eclipse.passage.lic.internal.base.tests.version.contract.SafeVersionContractTest
sameValuedVersionsAreEqual(org.eclipse.passage.lic.internal.base.tests.version.contract.SafeVersionContractTest)  Time elapsed: 0.002 s
differentValuedVersionsAreNotEqual(org.eclipse.passage.lic.internal.base.tests.version.contract.SafeVersionContractTest)  Time elapsed: 0 s
Running org.eclipse.passage.lic.internal.base.tests.version.SafeVersionTest
Tests run: 11, Failures: 0, Errors: 0, Skipped: 0, Time elapsed: 0.002 s - in org.eclipse.passage.lic.internal.base.tests.version.SafeVersionTest
lastMissingSegmentBecomesZero(org.eclipse.passage.lic.internal.base.tests.version.SafeVersionTest)  Time elapsed: 0 s
emptySourceBecomesDefaultVersion(org.eclipse.passage.lic.internal.base.tests.version.SafeVersionTest)  Time elapsed: 0 s
defaultVersionCannotHaveQualifier(org.eclipse.passage.lic.internal.base.tests.version.SafeVersionTest)  Time elapsed: 0 s
qualifierCanTakeAnyForm(org.eclipse.passage.lic.internal.base.tests.version.SafeVersionTest)  Time elapsed: 0 s
eachSegmentIsTrimmed(org.eclipse.passage.lic.internal.base.tests.version.SafeVersionTest)  Time elapsed: 0 s
unproperSourceBecomesDefaultVersion(org.eclipse.passage.lic.internal.base.tests.version.SafeVersionTest)  Time elapsed: 0 s
lastUnparsableSegmentBecomesZero(org.eclipse.passage.lic.internal.base.tests.version.SafeVersionTest)  Time elapsed: 0 s
unparsableSourceBecomesDefaultVersion(org.eclipse.passage.lic.internal.base.tests.version.SafeVersionTest)  Time elapsed: 0 s
validVerionBecomesItself(org.eclipse.passage.lic.internal.base.tests.version.SafeVersionTest)  Time elapsed: 0.001 s
lesserUnparsableSegmentsBecomeZeros(org.eclipse.passage.lic.internal.base.tests.version.SafeVersionTest)  Time elapsed: 0 s
lesserMissingSegmentsBecomeZeros(org.eclipse.passage.lic.internal.base.tests.version.SafeVersionTest)  Time elapsed: 0 s
Running org.eclipse.passage.lic.internal.base.tests.requirements.RequirementsTest
Tests run: 1, Failures: 0, Errors: 0, Skipped: 0, Time elapsed: 0.002 s - in org.eclipse.passage.lic.internal.base.tests.requirements.RequirementsTest
noResolversMeansNoAccess(org.eclipse.passage.lic.internal.base.tests.requirements.RequirementsTest)  Time elapsed: 0.002 s
Running org.eclipse.passage.lic.internal.base.tests.BaseLicensedProductServiceIdContractTest
Tests run: 1, Failures: 0, Errors: 0, Skipped: 0, Time elapsed: 0.001 s - in org.eclipse.passage.lic.internal.base.tests.BaseLicensedProductServiceIdContractTest
isDataDriven(org.eclipse.passage.lic.internal.base.tests.BaseLicensedProductServiceIdContractTest)  Time elapsed: 0 s

Results:

Tests run: 228, Failures: 0, Errors: 0, Skipped: 0

[INFO] All tests passed!
[INFO] 
[INFO] --- tycho-pack200a-plugin:1.7.0:normalize (pack200-normalize) @ org.eclipse.passage.lic.base.tests ---
[INFO] Pack200 normalizing jar /home/jenkins/agent/workspace/passage-base/tests/org.eclipse.passage.lic.base.tests/target/org.eclipse.passage.lic.base.tests-0.5.100-SNAPSHOT.jar
[INFO] 
[INFO] --- eclipse-jarsigner-plugin:1.1.7:sign (sign) @ org.eclipse.passage.lic.base.tests ---
[INFO] Signing jar: /home/jenkins/agent/workspace/passage-base/tests/org.eclipse.passage.lic.base.tests/target/org.eclipse.passage.lic.base.tests-0.5.100-SNAPSHOT.jar
[INFO] Signing jar: /home/jenkins/agent/workspace/passage-base/tests/org.eclipse.passage.lic.base.tests/target/org.eclipse.passage.lic.base.tests-0.5.100-SNAPSHOT-sources.jar
[INFO] 
[INFO] --- tycho-pack200b-plugin:1.7.0:pack (pack200-pack) @ org.eclipse.passage.lic.base.tests ---
[INFO] Pack200 packing jar /home/jenkins/agent/workspace/passage-base/tests/org.eclipse.passage.lic.base.tests/target/org.eclipse.passage.lic.base.tests-0.5.100-SNAPSHOT.jar
[INFO] 
[INFO] --- tycho-p2-plugin:1.5.1:p2-metadata (p2-metadata) @ org.eclipse.passage.lic.base.tests ---
[INFO] No baseline version MavenProject: org.eclipse.passage:org.eclipse.passage.lic.base.tests:0.5.100-SNAPSHOT @ /home/jenkins/agent/workspace/passage-base/tests/org.eclipse.passage.lic.base.tests/.polyglot..META-INF_MANIFEST.MF
[INFO] 
[INFO] --- tycho-p2-extras-plugin:1.5.1:compare-version-with-baselines (compare-attached-artifacts-with-release) @ org.eclipse.passage.lic.base.tests ---
[INFO] 
[INFO] --< org.eclipse.passage:org.eclipse.passage.lic.equinox.tests.data.requirements >--
[INFO] Building Data for Passage LIC Equinox requirements tests 0.1.0-SNAPSHOT [8/140]
[INFO] ---------------------------[ eclipse-plugin ]---------------------------
[INFO] 
[INFO] --- maven-clean-plugin:3.1.0:clean (default-clean) @ org.eclipse.passage.lic.equinox.tests.data.requirements ---
[INFO] 
[INFO] --- tycho-packaging-plugin:1.5.1:build-qualifier (default-build-qualifier) @ org.eclipse.passage.lic.equinox.tests.data.requirements ---
[INFO] The project's OSGi version is 0.1.0.v20200405-1741
[INFO] 
[INFO] --- tycho-packaging-plugin:1.5.1:validate-id (default-validate-id) @ org.eclipse.passage.lic.equinox.tests.data.requirements ---
[INFO] 
[INFO] --- tycho-packaging-plugin:1.5.1:validate-version (default-validate-version) @ org.eclipse.passage.lic.equinox.tests.data.requirements ---
[INFO] 
[INFO] --- eclipse-cbi-plugin:1.1.8-SNAPSHOT:generate-api-build-xml (default) @ org.eclipse.passage.lic.equinox.tests.data.requirements ---
Generating target/.apibuild.xml
[INFO] 
[INFO] --- maven-resources-plugin:3.1.0:resources (default-resources) @ org.eclipse.passage.lic.equinox.tests.data.requirements ---
[INFO] Using 'UTF-8' encoding to copy filtered resources.
[INFO] Copying 0 resource
[INFO] 
[INFO] --- tycho-compiler-plugin:1.5.1:compile (default-compile) @ org.eclipse.passage.lic.equinox.tests.data.requirements ---
[INFO] Compiling 4 source files to /home/jenkins/agent/workspace/passage-base/tests/org.eclipse.passage.lic.equinox.tests.data.requirements/target/classes
[INFO] 
[INFO] --- tycho-eclipserun-plugin:1.5.1:eclipse-run (default) @ org.eclipse.passage.lic.equinox.tests.data.requirements ---
[INFO] Toolchain in tycho-eclipserun-plugin: JDK[/opt/tools/java/oracle/jdk-8/latest]
[INFO] Expected eclipse log file: /home/jenkins/agent/workspace/passage-base/tests/org.eclipse.passage.lic.equinox.tests.data.requirements/target/eclipserun-work/data/.metadata/.log
[INFO] Command line:
	[/opt/tools/java/oracle/jdk-8/latest/bin/java, -jar, /home/jenkins/.m2/repository/p2/osgi/bundle/org.eclipse.equinox.launcher/1.5.700.v20200207-2156/org.eclipse.equinox.launcher-1.5.700.v20200207-2156.jar, -install, /home/jenkins/agent/workspace/passage-base/tests/org.eclipse.passage.lic.equinox.tests.data.requirements/target/eclipserun-work, -configuration, /home/jenkins/agent/workspace/passage-base/tests/org.eclipse.passage.lic.equinox.tests.data.requirements/target/eclipserun-work/configuration, -data, target/apibuild-workspace, -application, org.eclipse.ant.core.antRunner, -buildfile, target/.apibuild.xml]
Buildfile: target/.apibuild.xml

apigen:
BUILD SUCCESSFUL

BUILD SUCCESSFUL
Total time: 0 seconds
[INFO] 
[INFO] --- maven-resources-plugin:3.1.0:testResources (default-testResources) @ org.eclipse.passage.lic.equinox.tests.data.requirements ---
[INFO] Using 'UTF-8' encoding to copy filtered resources.
[INFO] skip non existing resourceDirectory /home/jenkins/agent/workspace/passage-base/tests/org.eclipse.passage.lic.equinox.tests.data.requirements/src/test/resources
[INFO] 
[INFO] --- tycho-source-plugin:1.5.1:plugin-source (attach-source) @ org.eclipse.passage.lic.equinox.tests.data.requirements ---
[INFO] Building jar: /home/jenkins/agent/workspace/passage-base/tests/org.eclipse.passage.lic.equinox.tests.data.requirements/target/org.eclipse.passage.lic.equinox.tests.data.requirements-0.1.0-SNAPSHOT-sources.jar
[INFO] 
[INFO] --- target-platform-configuration:1.5.1:target-platform (default-target-platform) @ org.eclipse.passage.lic.equinox.tests.data.requirements ---
[INFO] 
[INFO] --- tycho-packaging-plugin:1.5.1:package-plugin (default-package-plugin) @ org.eclipse.passage.lic.equinox.tests.data.requirements ---
[INFO] Building jar: /home/jenkins/agent/workspace/passage-base/tests/org.eclipse.passage.lic.equinox.tests.data.requirements/target/org.eclipse.passage.lic.equinox.tests.data.requirements-0.1.0-SNAPSHOT.jar
[INFO] 
[INFO] --- tycho-p2-plugin:1.5.1:p2-metadata-default (default-p2-metadata-default) @ org.eclipse.passage.lic.equinox.tests.data.requirements ---
[INFO] 
[INFO] --- tycho-source-feature-plugin:1.5.1:source-feature (source-feature) @ org.eclipse.passage.lic.equinox.tests.data.requirements ---
[INFO] 
[INFO] --- tycho-p2-plugin:1.5.1:p2-metadata (attached-p2-metadata) @ org.eclipse.passage.lic.equinox.tests.data.requirements ---
[INFO] No baseline version MavenProject: org.eclipse.passage:org.eclipse.passage.lic.equinox.tests.data.requirements:0.1.0-SNAPSHOT @ /home/jenkins/agent/workspace/passage-base/tests/org.eclipse.passage.lic.equinox.tests.data.requirements/.polyglot..META-INF_MANIFEST.MF
[INFO] 
[INFO] --- tycho-pack200a-plugin:1.7.0:normalize (pack200-normalize) @ org.eclipse.passage.lic.equinox.tests.data.requirements ---
[INFO] Pack200 normalizing jar /home/jenkins/agent/workspace/passage-base/tests/org.eclipse.passage.lic.equinox.tests.data.requirements/target/org.eclipse.passage.lic.equinox.tests.data.requirements-0.1.0-SNAPSHOT.jar
[INFO] 
[INFO] --- eclipse-jarsigner-plugin:1.1.7:sign (sign) @ org.eclipse.passage.lic.equinox.tests.data.requirements ---
[INFO] Signing jar: /home/jenkins/agent/workspace/passage-base/tests/org.eclipse.passage.lic.equinox.tests.data.requirements/target/org.eclipse.passage.lic.equinox.tests.data.requirements-0.1.0-SNAPSHOT.jar
[INFO] Signing jar: /home/jenkins/agent/workspace/passage-base/tests/org.eclipse.passage.lic.equinox.tests.data.requirements/target/org.eclipse.passage.lic.equinox.tests.data.requirements-0.1.0-SNAPSHOT-sources.jar
[INFO] 
[INFO] --- tycho-pack200b-plugin:1.7.0:pack (pack200-pack) @ org.eclipse.passage.lic.equinox.tests.data.requirements ---
[INFO] Pack200 packing jar /home/jenkins/agent/workspace/passage-base/tests/org.eclipse.passage.lic.equinox.tests.data.requirements/target/org.eclipse.passage.lic.equinox.tests.data.requirements-0.1.0-SNAPSHOT.jar
[INFO] 
[INFO] --- tycho-p2-plugin:1.5.1:p2-metadata (p2-metadata) @ org.eclipse.passage.lic.equinox.tests.data.requirements ---
[INFO] No baseline version MavenProject: org.eclipse.passage:org.eclipse.passage.lic.equinox.tests.data.requirements:0.1.0-SNAPSHOT @ /home/jenkins/agent/workspace/passage-base/tests/org.eclipse.passage.lic.equinox.tests.data.requirements/.polyglot..META-INF_MANIFEST.MF
[INFO] 
[INFO] --- tycho-p2-extras-plugin:1.5.1:compare-version-with-baselines (compare-attached-artifacts-with-release) @ org.eclipse.passage.lic.equinox.tests.data.requirements ---
[INFO] 
[INFO] -----< org.eclipse.passage:org.eclipse.passage.lic.equinox.tests >------
[INFO] Building Passage LIC Equinox Tests 0.6.0-SNAPSHOT                [9/140]
[INFO] ------------------------[ eclipse-test-plugin ]-------------------------
[INFO] 
[INFO] --- maven-clean-plugin:3.1.0:clean (default-clean) @ org.eclipse.passage.lic.equinox.tests ---
[INFO] 
[INFO] --- tycho-packaging-plugin:1.5.1:build-qualifier (default-build-qualifier) @ org.eclipse.passage.lic.equinox.tests ---
[INFO] The project's OSGi version is 0.6.0.v20200704-1747
[INFO] 
[INFO] --- tycho-packaging-plugin:1.5.1:validate-id (default-validate-id) @ org.eclipse.passage.lic.equinox.tests ---
[INFO] 
[INFO] --- tycho-packaging-plugin:1.5.1:validate-version (default-validate-version) @ org.eclipse.passage.lic.equinox.tests ---
[INFO] 
[INFO] --- eclipse-cbi-plugin:1.1.8-SNAPSHOT:generate-api-build-xml (default) @ org.eclipse.passage.lic.equinox.tests ---
Generating target/.apibuild.xml
[INFO] 
[INFO] --- maven-resources-plugin:3.1.0:resources (default-resources) @ org.eclipse.passage.lic.equinox.tests ---
[INFO] Using 'UTF-8' encoding to copy filtered resources.
[INFO] Copying 0 resource
[INFO] 
[INFO] --- tycho-compiler-plugin:1.5.1:compile (default-compile) @ org.eclipse.passage.lic.equinox.tests ---
[INFO] Compiling 20 source files to /home/jenkins/agent/workspace/passage-base/tests/org.eclipse.passage.lic.equinox.tests/target/classes
[WARNING] /home/jenkins/agent/workspace/passage-base/tests/org.eclipse.passage.lic.equinox.tests/src/org/eclipse/passage/lic/equinox/tests/ApplicationConfigurationsTest.java:[21] 
	import org.eclipse.passage.lic.base.LicensingConfigurations;
	       ^^^^^^^^^^^^^^^^^^^^^^^^^^^^^^^^^^^^^^^^^^^^^^^^^^^^
The type LicensingConfigurations is deprecated
[WARNING] /home/jenkins/agent/workspace/passage-base/tests/org.eclipse.passage.lic.equinox.tests/src/org/eclipse/passage/lic/equinox/tests/ApplicationConfigurationsTest.java:[22] 
	import org.eclipse.passage.lic.equinox.ApplicationConfigurations;
	       ^^^^^^^^^^^^^^^^^^^^^^^^^^^^^^^^^^^^^^^^^^^^^^^^^^^^^^^^^
The type ApplicationConfigurations is deprecated
[WARNING] /home/jenkins/agent/workspace/passage-base/tests/org.eclipse.passage.lic.equinox.tests/src/org/eclipse/passage/lic/equinox/tests/ApplicationConfigurationsTest.java:[76] 
	assertEquals(LicensingConfigurations.INVALID.getProductIdentifier(),
	             ^^^^^^^^^^^^^^^^^^^^^^^
The type LicensingConfigurations is deprecated
[WARNING] /home/jenkins/agent/workspace/passage-base/tests/org.eclipse.passage.lic.equinox.tests/src/org/eclipse/passage/lic/equinox/tests/ApplicationConfigurationsTest.java:[76] 
	assertEquals(LicensingConfigurations.INVALID.getProductIdentifier(),
	                                     ^^^^^^^
The field LicensingConfigurations.INVALID is deprecated
[WARNING] /home/jenkins/agent/workspace/passage-base/tests/org.eclipse.passage.lic.equinox.tests/src/org/eclipse/passage/lic/equinox/tests/ApplicationConfigurationsTest.java:[76] 
	assertEquals(LicensingConfigurations.INVALID.getProductIdentifier(),
	                                             ^^^^^^^^^^^^^^^^^^^^^^
The method getProductIdentifier() from the type LicensingConfiguration is deprecated
[WARNING] /home/jenkins/agent/workspace/passage-base/tests/org.eclipse.passage.lic.equinox.tests/src/org/eclipse/passage/lic/equinox/tests/ApplicationConfigurationsTest.java:[77] 
	ApplicationConfigurations.getLicensingProductIdentifier(null));
	^^^^^^^^^^^^^^^^^^^^^^^^^
The type ApplicationConfigurations is deprecated
[WARNING] /home/jenkins/agent/workspace/passage-base/tests/org.eclipse.passage.lic.equinox.tests/src/org/eclipse/passage/lic/equinox/tests/ApplicationConfigurationsTest.java:[77] 
	ApplicationConfigurations.getLicensingProductIdentifier(null));
	                          ^^^^^^^^^^^^^^^^^^^^^^^^^^^^^^^^^^^
The method getLicensingProductIdentifier(IApplicationContext) from the type ApplicationConfigurations is deprecated
[WARNING] /home/jenkins/agent/workspace/passage-base/tests/org.eclipse.passage.lic.equinox.tests/src/org/eclipse/passage/lic/equinox/tests/ApplicationConfigurationsTest.java:[78] 
	assertEquals(LicensingConfigurations.INVALID.getProductIdentifier(),
	             ^^^^^^^^^^^^^^^^^^^^^^^
The type LicensingConfigurations is deprecated
[WARNING] /home/jenkins/agent/workspace/passage-base/tests/org.eclipse.passage.lic.equinox.tests/src/org/eclipse/passage/lic/equinox/tests/ApplicationConfigurationsTest.java:[78] 
	assertEquals(LicensingConfigurations.INVALID.getProductIdentifier(),
	                                     ^^^^^^^
The field LicensingConfigurations.INVALID is deprecated
[WARNING] /home/jenkins/agent/workspace/passage-base/tests/org.eclipse.passage.lic.equinox.tests/src/org/eclipse/passage/lic/equinox/tests/ApplicationConfigurationsTest.java:[78] 
	assertEquals(LicensingConfigurations.INVALID.getProductIdentifier(),
	                                             ^^^^^^^^^^^^^^^^^^^^^^
The method getProductIdentifier() from the type LicensingConfiguration is deprecated
[WARNING] /home/jenkins/agent/workspace/passage-base/tests/org.eclipse.passage.lic.equinox.tests/src/org/eclipse/passage/lic/equinox/tests/ApplicationConfigurationsTest.java:[79] 
	ApplicationConfigurations.getLicensingProductIdentifier(new InvalidApplicationContext()));
	^^^^^^^^^^^^^^^^^^^^^^^^^
The type ApplicationConfigurations is deprecated
[WARNING] /home/jenkins/agent/workspace/passage-base/tests/org.eclipse.passage.lic.equinox.tests/src/org/eclipse/passage/lic/equinox/tests/ApplicationConfigurationsTest.java:[79] 
	ApplicationConfigurations.getLicensingProductIdentifier(new InvalidApplicationContext()));
	                          ^^^^^^^^^^^^^^^^^^^^^^^^^^^^^^^^^^^^^^^^^^^^^^^^^^^^^^^^^^^^^^
The method getLicensingProductIdentifier(IApplicationContext) from the type ApplicationConfigurations is deprecated
[WARNING] /home/jenkins/agent/workspace/passage-base/tests/org.eclipse.passage.lic.equinox.tests/src/org/eclipse/passage/lic/equinox/tests/ComponentConfigurationResolverTest.java:[17] 
	import org.eclipse.passage.lic.api.requirements.LicensingRequirement;
	       ^^^^^^^^^^^^^^^^^^^^^^^^^^^^^^^^^^^^^^^^^^^^^^^^^^^^^^^^^^^^^
The type LicensingRequirement is deprecated
[WARNING] /home/jenkins/agent/workspace/passage-base/tests/org.eclipse.passage.lic.equinox.tests/src/org/eclipse/passage/lic/equinox/tests/ComponentConfigurationResolverTest.java:[18] 
	import org.eclipse.passage.lic.internal.equinox.requirements.ComponentConfigurationResolver;
	       ^^^^^^^^^^^^^^^^^^^^^^^^^^^^^^^^^^^^^^^^^^^^^^^^^^^^^^^^^^^^^^^^^^^^^^^^^^^^^^^^^^^^
The type ComponentConfigurationResolver is deprecated
[WARNING] /home/jenkins/agent/workspace/passage-base/tests/org.eclipse.passage.lic.equinox.tests/src/org/eclipse/passage/lic/equinox/tests/ComponentConfigurationResolverTest.java:[26] 
	@SuppressWarnings("restriction")
	                  ^^^^^^^^^^^^^
Unnecessary @SuppressWarnings("restriction")
[WARNING] /home/jenkins/agent/workspace/passage-base/tests/org.eclipse.passage.lic.equinox.tests/src/org/eclipse/passage/lic/equinox/tests/ComponentConfigurationResolverTest.java:[31] 
	ComponentConfigurationResolver resolver = new ComponentConfigurationResolver();
	^^^^^^^^^^^^^^^^^^^^^^^^^^^^^^
The type ComponentConfigurationResolver is deprecated
[WARNING] /home/jenkins/agent/workspace/passage-base/tests/org.eclipse.passage.lic.equinox.tests/src/org/eclipse/passage/lic/equinox/tests/ComponentConfigurationResolverTest.java:[31] 
	ComponentConfigurationResolver resolver = new ComponentConfigurationResolver();
	                                              ^^^^^^^^^^^^^^^^^^^^^^^^^^^^^^
The type ComponentConfigurationResolver is deprecated
[WARNING] /home/jenkins/agent/workspace/passage-base/tests/org.eclipse.passage.lic.equinox.tests/src/org/eclipse/passage/lic/equinox/tests/ComponentConfigurationResolverTest.java:[31] 
	ComponentConfigurationResolver resolver = new ComponentConfigurationResolver();
	                                              ^^^^^^^^^^^^^^^^^^^^^^^^^^^^^^^^
The constructor ComponentConfigurationResolver() is deprecated
[WARNING] /home/jenkins/agent/workspace/passage-base/tests/org.eclipse.passage.lic.equinox.tests/src/org/eclipse/passage/lic/equinox/tests/ComponentConfigurationResolverTest.java:[33] 
	Mockito.doReturn(Mockito.mock(Logger.class)).when(factory).getLogger(ComponentConfigurationResolver.class);
	                                                                     ^^^^^^^^^^^^^^^^^^^^^^^^^^^^^^
The type ComponentConfigurationResolver is deprecated
[WARNING] /home/jenkins/agent/workspace/passage-base/tests/org.eclipse.passage.lic.equinox.tests/src/org/eclipse/passage/lic/equinox/tests/ComponentConfigurationResolverTest.java:[34] 
	resolver.bindLoggerFactory(factory);
	         ^^^^^^^^^^^^^^^^^^^^^^^^^^
The method bindLoggerFactory(LoggerFactory) from the type ComponentConfigurationResolver is deprecated
[WARNING] /home/jenkins/agent/workspace/passage-base/tests/org.eclipse.passage.lic.equinox.tests/src/org/eclipse/passage/lic/equinox/tests/ComponentConfigurationResolverTest.java:[35] 
	resolver.activate(null);
	         ^^^^^^^^^^^^^^
The method activate(BundleContext) from the type ComponentConfigurationResolver is deprecated
[WARNING] /home/jenkins/agent/workspace/passage-base/tests/org.eclipse.passage.lic.equinox.tests/src/org/eclipse/passage/lic/equinox/tests/ComponentConfigurationResolverTest.java:[36] 
	Iterable<LicensingRequirement> requirements = resolver.resolveLicensingRequirements(null);
	         ^^^^^^^^^^^^^^^^^^^^
The type LicensingRequirement is deprecated
[WARNING] /home/jenkins/agent/workspace/passage-base/tests/org.eclipse.passage.lic.equinox.tests/src/org/eclipse/passage/lic/equinox/tests/ComponentConfigurationResolverTest.java:[36] 
	Iterable<LicensingRequirement> requirements = resolver.resolveLicensingRequirements(null);
	                                                       ^^^^^^^^^^^^^^^^^^^^^^^^^^^^^^^^^^
The method resolveLicensingRequirements(LicensingConfiguration) from the type ComponentConfigurationResolver is deprecated
[WARNING] /home/jenkins/agent/workspace/passage-base/tests/org.eclipse.passage.lic.equinox.tests/src/org/eclipse/passage/lic/equinox/tests/ComponentConfigurationResolverTest.java:[42] 
	ComponentConfigurationResolver resolver = new ComponentConfigurationResolver();
	^^^^^^^^^^^^^^^^^^^^^^^^^^^^^^
The type ComponentConfigurationResolver is deprecated
[WARNING] /home/jenkins/agent/workspace/passage-base/tests/org.eclipse.passage.lic.equinox.tests/src/org/eclipse/passage/lic/equinox/tests/ComponentConfigurationResolverTest.java:[42] 
	ComponentConfigurationResolver resolver = new ComponentConfigurationResolver();
	                                              ^^^^^^^^^^^^^^^^^^^^^^^^^^^^^^
The type ComponentConfigurationResolver is deprecated
[WARNING] /home/jenkins/agent/workspace/passage-base/tests/org.eclipse.passage.lic.equinox.tests/src/org/eclipse/passage/lic/equinox/tests/ComponentConfigurationResolverTest.java:[42] 
	ComponentConfigurationResolver resolver = new ComponentConfigurationResolver();
	                                              ^^^^^^^^^^^^^^^^^^^^^^^^^^^^^^^^
The constructor ComponentConfigurationResolver() is deprecated
[WARNING] /home/jenkins/agent/workspace/passage-base/tests/org.eclipse.passage.lic.equinox.tests/src/org/eclipse/passage/lic/equinox/tests/ComponentConfigurationResolverTest.java:[44] 
	resolver.bindScr(src);
	         ^^^^^^^^^^^^
The method bindScr(ServiceComponentRuntime) from the type ComponentConfigurationResolver is deprecated
[WARNING] /home/jenkins/agent/workspace/passage-base/tests/org.eclipse.passage.lic.equinox.tests/src/org/eclipse/passage/lic/equinox/tests/ComponentConfigurationResolverTest.java:[46] 
	resolver.bindLoggerFactory(factory);
	         ^^^^^^^^^^^^^^^^^^^^^^^^^^
The method bindLoggerFactory(LoggerFactory) from the type ComponentConfigurationResolver is deprecated
[WARNING] /home/jenkins/agent/workspace/passage-base/tests/org.eclipse.passage.lic.equinox.tests/src/org/eclipse/passage/lic/equinox/tests/ComponentConfigurationResolverTest.java:[47] 
	resolver.activate(Mockito.mock(BundleContext.class));
	         ^^^^^^^^^^^^^^^^^^^^^^^^^^^^^^^^^^^^^^^^^^^
The method activate(BundleContext) from the type ComponentConfigurationResolver is deprecated
[WARNING] /home/jenkins/agent/workspace/passage-base/tests/org.eclipse.passage.lic.equinox.tests/src/org/eclipse/passage/lic/equinox/tests/ComponentConfigurationResolverTest.java:[48] 
	Iterable<LicensingRequirement> requirements = resolver.resolveLicensingRequirements(null);
	         ^^^^^^^^^^^^^^^^^^^^
The type LicensingRequirement is deprecated
[WARNING] /home/jenkins/agent/workspace/passage-base/tests/org.eclipse.passage.lic.equinox.tests/src/org/eclipse/passage/lic/equinox/tests/ComponentConfigurationResolverTest.java:[48] 
	Iterable<LicensingRequirement> requirements = resolver.resolveLicensingRequirements(null);
	                                                       ^^^^^^^^^^^^^^^^^^^^^^^^^^^^^^^^^^
The method resolveLicensingRequirements(LicensingConfiguration) from the type ComponentConfigurationResolver is deprecated
[WARNING] /home/jenkins/agent/workspace/passage-base/tests/org.eclipse.passage.lic.equinox.tests/src/org/eclipse/passage/lic/equinox/tests/ComponentConfigurationResolverTest.java:[50] 
	resolver.deactivate();
	         ^^^^^^^^^^^^
The method deactivate() from the type ComponentConfigurationResolver is deprecated
[WARNING] /home/jenkins/agent/workspace/passage-base/tests/org.eclipse.passage.lic.equinox.tests/src/org/eclipse/passage/lic/equinox/tests/ComponentConfigurationResolverTest.java:[51] 
	resolver.unbindLoggerFactory(factory);
	         ^^^^^^^^^^^^^^^^^^^^^^^^^^^^
The method unbindLoggerFactory(LoggerFactory) from the type ComponentConfigurationResolver is deprecated
[WARNING] /home/jenkins/agent/workspace/passage-base/tests/org.eclipse.passage.lic.equinox.tests/src/org/eclipse/passage/lic/equinox/tests/ComponentConfigurationResolverTest.java:[52] 
	resolver.unbindScr(src);
	         ^^^^^^^^^^^^^^
The method unbindScr(ServiceComponentRuntime) from the type ComponentConfigurationResolver is deprecated
[WARNING] /home/jenkins/agent/workspace/passage-base/tests/org.eclipse.passage.lic.equinox.tests/src/org/eclipse/passage/lic/equinox/tests/ComponentConfigurationResolverTest.java:[53] 
	resolver.unbindLoggerFactory(null);
	         ^^^^^^^^^^^^^^^^^^^^^^^^^
The method unbindLoggerFactory(LoggerFactory) from the type ComponentConfigurationResolver is deprecated
[WARNING] /home/jenkins/agent/workspace/passage-base/tests/org.eclipse.passage.lic.equinox.tests/src/org/eclipse/passage/lic/equinox/tests/ComponentConfigurationResolverTest.java:[54] 
	resolver.unbindScr(null);
	         ^^^^^^^^^^^^^^^
The method unbindScr(ServiceComponentRuntime) from the type ComponentConfigurationResolver is deprecated
[WARNING] /home/jenkins/agent/workspace/passage-base/tests/org.eclipse.passage.lic.equinox.tests/src/org/eclipse/passage/lic/equinox/tests/BundleCapabilityResolverTest.java:[17] 
	import org.eclipse.passage.lic.api.requirements.LicensingRequirement;
	       ^^^^^^^^^^^^^^^^^^^^^^^^^^^^^^^^^^^^^^^^^^^^^^^^^^^^^^^^^^^^^
The type LicensingRequirement is deprecated
[WARNING] /home/jenkins/agent/workspace/passage-base/tests/org.eclipse.passage.lic.equinox.tests/src/org/eclipse/passage/lic/equinox/tests/BundleCapabilityResolverTest.java:[18] 
	import org.eclipse.passage.lic.internal.equinox.requirements.BundleCapabilityResolver;
	       ^^^^^^^^^^^^^^^^^^^^^^^^^^^^^^^^^^^^^^^^^^^^^^^^^^^^^^^^^^^^^^^^^^^^^^^^^^^^^^
The type BundleCapabilityResolver is deprecated
[WARNING] /home/jenkins/agent/workspace/passage-base/tests/org.eclipse.passage.lic.equinox.tests/src/org/eclipse/passage/lic/equinox/tests/BundleCapabilityResolverTest.java:[31] 
	BundleCapabilityResolver resolver = new BundleCapabilityResolver();
	^^^^^^^^^^^^^^^^^^^^^^^^
The type BundleCapabilityResolver is deprecated
[WARNING] /home/jenkins/agent/workspace/passage-base/tests/org.eclipse.passage.lic.equinox.tests/src/org/eclipse/passage/lic/equinox/tests/BundleCapabilityResolverTest.java:[31] 
	BundleCapabilityResolver resolver = new BundleCapabilityResolver();
	                                        ^^^^^^^^^^^^^^^^^^^^^^^^
The type BundleCapabilityResolver is deprecated
[WARNING] /home/jenkins/agent/workspace/passage-base/tests/org.eclipse.passage.lic.equinox.tests/src/org/eclipse/passage/lic/equinox/tests/BundleCapabilityResolverTest.java:[31] 
	BundleCapabilityResolver resolver = new BundleCapabilityResolver();
	                                        ^^^^^^^^^^^^^^^^^^^^^^^^^^
The constructor BundleCapabilityResolver() is deprecated
[WARNING] /home/jenkins/agent/workspace/passage-base/tests/org.eclipse.passage.lic.equinox.tests/src/org/eclipse/passage/lic/equinox/tests/BundleCapabilityResolverTest.java:[33] 
	Mockito.doReturn(Mockito.mock(Logger.class)).when(factory).getLogger(BundleCapabilityResolver.class);
	                                                                     ^^^^^^^^^^^^^^^^^^^^^^^^
The type BundleCapabilityResolver is deprecated
[WARNING] /home/jenkins/agent/workspace/passage-base/tests/org.eclipse.passage.lic.equinox.tests/src/org/eclipse/passage/lic/equinox/tests/BundleCapabilityResolverTest.java:[34] 
	resolver.bindLoggerFactory(factory);
	         ^^^^^^^^^^^^^^^^^^^^^^^^^^
The method bindLoggerFactory(LoggerFactory) from the type BundleCapabilityResolver is deprecated
[WARNING] /home/jenkins/agent/workspace/passage-base/tests/org.eclipse.passage.lic.equinox.tests/src/org/eclipse/passage/lic/equinox/tests/BundleCapabilityResolverTest.java:[35] 
	resolver.activate(null);
	         ^^^^^^^^^^^^^^
The method activate(BundleContext) from the type BundleCapabilityResolver is deprecated
[WARNING] /home/jenkins/agent/workspace/passage-base/tests/org.eclipse.passage.lic.equinox.tests/src/org/eclipse/passage/lic/equinox/tests/BundleCapabilityResolverTest.java:[36] 
	Iterable<LicensingRequirement> requirements = resolver.resolveLicensingRequirements(null);
	         ^^^^^^^^^^^^^^^^^^^^
The type LicensingRequirement is deprecated
[WARNING] /home/jenkins/agent/workspace/passage-base/tests/org.eclipse.passage.lic.equinox.tests/src/org/eclipse/passage/lic/equinox/tests/BundleCapabilityResolverTest.java:[36] 
	Iterable<LicensingRequirement> requirements = resolver.resolveLicensingRequirements(null);
	                                                       ^^^^^^^^^^^^^^^^^^^^^^^^^^^^^^^^^^
The method resolveLicensingRequirements(LicensingConfiguration) from the type BundleCapabilityResolver is deprecated
[WARNING] /home/jenkins/agent/workspace/passage-base/tests/org.eclipse.passage.lic.equinox.tests/src/org/eclipse/passage/lic/equinox/tests/BundleCapabilityResolverTest.java:[42] 
	BundleCapabilityResolver resolver = new BundleCapabilityResolver();
	^^^^^^^^^^^^^^^^^^^^^^^^
The type BundleCapabilityResolver is deprecated
[WARNING] /home/jenkins/agent/workspace/passage-base/tests/org.eclipse.passage.lic.equinox.tests/src/org/eclipse/passage/lic/equinox/tests/BundleCapabilityResolverTest.java:[42] 
	BundleCapabilityResolver resolver = new BundleCapabilityResolver();
	                                        ^^^^^^^^^^^^^^^^^^^^^^^^
The type BundleCapabilityResolver is deprecated
[WARNING] /home/jenkins/agent/workspace/passage-base/tests/org.eclipse.passage.lic.equinox.tests/src/org/eclipse/passage/lic/equinox/tests/BundleCapabilityResolverTest.java:[42] 
	BundleCapabilityResolver resolver = new BundleCapabilityResolver();
	                                        ^^^^^^^^^^^^^^^^^^^^^^^^^^
The constructor BundleCapabilityResolver() is deprecated
[WARNING] /home/jenkins/agent/workspace/passage-base/tests/org.eclipse.passage.lic.equinox.tests/src/org/eclipse/passage/lic/equinox/tests/BundleCapabilityResolverTest.java:[44] 
	resolver.bindScr(scr);
	         ^^^^^^^^^^^^
The method bindScr(ServiceComponentRuntime) from the type BundleCapabilityResolver is deprecated
[WARNING] /home/jenkins/agent/workspace/passage-base/tests/org.eclipse.passage.lic.equinox.tests/src/org/eclipse/passage/lic/equinox/tests/BundleCapabilityResolverTest.java:[46] 
	resolver.bindLoggerFactory(factory);
	         ^^^^^^^^^^^^^^^^^^^^^^^^^^
The method bindLoggerFactory(LoggerFactory) from the type BundleCapabilityResolver is deprecated
[WARNING] /home/jenkins/agent/workspace/passage-base/tests/org.eclipse.passage.lic.equinox.tests/src/org/eclipse/passage/lic/equinox/tests/BundleCapabilityResolverTest.java:[49] 
	resolver.activate(mock);
	         ^^^^^^^^^^^^^^
The method activate(BundleContext) from the type BundleCapabilityResolver is deprecated
[WARNING] /home/jenkins/agent/workspace/passage-base/tests/org.eclipse.passage.lic.equinox.tests/src/org/eclipse/passage/lic/equinox/tests/BundleCapabilityResolverTest.java:[50] 
	Iterable<LicensingRequirement> requirements = resolver.resolveLicensingRequirements(null);
	         ^^^^^^^^^^^^^^^^^^^^
The type LicensingRequirement is deprecated
[WARNING] /home/jenkins/agent/workspace/passage-base/tests/org.eclipse.passage.lic.equinox.tests/src/org/eclipse/passage/lic/equinox/tests/BundleCapabilityResolverTest.java:[50] 
	Iterable<LicensingRequirement> requirements = resolver.resolveLicensingRequirements(null);
	                                                       ^^^^^^^^^^^^^^^^^^^^^^^^^^^^^^^^^^
The method resolveLicensingRequirements(LicensingConfiguration) from the type BundleCapabilityResolver is deprecated
[WARNING] /home/jenkins/agent/workspace/passage-base/tests/org.eclipse.passage.lic.equinox.tests/src/org/eclipse/passage/lic/equinox/tests/BundleCapabilityResolverTest.java:[52] 
	resolver.deactivate();
	         ^^^^^^^^^^^^
The method deactivate() from the type BundleCapabilityResolver is deprecated
[WARNING] /home/jenkins/agent/workspace/passage-base/tests/org.eclipse.passage.lic.equinox.tests/src/org/eclipse/passage/lic/equinox/tests/BundleCapabilityResolverTest.java:[53] 
	resolver.unbindLoggerFactory(factory);
	         ^^^^^^^^^^^^^^^^^^^^^^^^^^^^
The method unbindLoggerFactory(LoggerFactory) from the type BundleCapabilityResolver is deprecated
[WARNING] /home/jenkins/agent/workspace/passage-base/tests/org.eclipse.passage.lic.equinox.tests/src/org/eclipse/passage/lic/equinox/tests/BundleCapabilityResolverTest.java:[54] 
	resolver.unbindScr(scr);
	         ^^^^^^^^^^^^^^
The method unbindScr(ServiceComponentRuntime) from the type BundleCapabilityResolver is deprecated
[WARNING] /home/jenkins/agent/workspace/passage-base/tests/org.eclipse.passage.lic.equinox.tests/src/org/eclipse/passage/lic/equinox/tests/BundleCapabilityResolverTest.java:[55] 
	resolver.unbindLoggerFactory(null);
	         ^^^^^^^^^^^^^^^^^^^^^^^^^
The method unbindLoggerFactory(LoggerFactory) from the type BundleCapabilityResolver is deprecated
[WARNING] /home/jenkins/agent/workspace/passage-base/tests/org.eclipse.passage.lic.equinox.tests/src/org/eclipse/passage/lic/equinox/tests/BundleCapabilityResolverTest.java:[56] 
	resolver.unbindScr(null);
	         ^^^^^^^^^^^^^^^
The method unbindScr(ServiceComponentRuntime) from the type BundleCapabilityResolver is deprecated
[WARNING] /home/jenkins/agent/workspace/passage-base/tests/org.eclipse.passage.lic.equinox.tests/src/org/eclipse/passage/lic/equinox/tests/EquinoxAccessManagerTest.java:[19] 
	@SuppressWarnings("restriction")
	                  ^^^^^^^^^^^^^
Unnecessary @SuppressWarnings("restriction")
61 problems (0 errors, 60 warnings, 1 info)
[INFO] 
[INFO] --- tycho-eclipserun-plugin:1.5.1:eclipse-run (default) @ org.eclipse.passage.lic.equinox.tests ---
[INFO] Toolchain in tycho-eclipserun-plugin: JDK[/opt/tools/java/oracle/jdk-8/latest]
[INFO] Expected eclipse log file: /home/jenkins/agent/workspace/passage-base/tests/org.eclipse.passage.lic.equinox.tests/target/eclipserun-work/data/.metadata/.log
[INFO] Command line:
	[/opt/tools/java/oracle/jdk-8/latest/bin/java, -jar, /home/jenkins/.m2/repository/p2/osgi/bundle/org.eclipse.equinox.launcher/1.5.700.v20200207-2156/org.eclipse.equinox.launcher-1.5.700.v20200207-2156.jar, -install, /home/jenkins/agent/workspace/passage-base/tests/org.eclipse.passage.lic.equinox.tests/target/eclipserun-work, -configuration, /home/jenkins/agent/workspace/passage-base/tests/org.eclipse.passage.lic.equinox.tests/target/eclipserun-work/configuration, -data, target/apibuild-workspace, -application, org.eclipse.ant.core.antRunner, -buildfile, target/.apibuild.xml]
Buildfile: target/.apibuild.xml

apigen:
BUILD SUCCESSFUL

BUILD SUCCESSFUL
Total time: 0 seconds
[INFO] 
[INFO] --- maven-resources-plugin:3.1.0:testResources (default-testResources) @ org.eclipse.passage.lic.equinox.tests ---
[INFO] Using 'UTF-8' encoding to copy filtered resources.
[INFO] skip non existing resourceDirectory /home/jenkins/agent/workspace/passage-base/tests/org.eclipse.passage.lic.equinox.tests/src/test/resources
[INFO] 
[INFO] --- tycho-source-plugin:1.5.1:plugin-source (attach-source) @ org.eclipse.passage.lic.equinox.tests ---
[INFO] Building jar: /home/jenkins/agent/workspace/passage-base/tests/org.eclipse.passage.lic.equinox.tests/target/org.eclipse.passage.lic.equinox.tests-0.6.0-SNAPSHOT-sources.jar
[INFO] 
[INFO] --- target-platform-configuration:1.5.1:target-platform (default-target-platform) @ org.eclipse.passage.lic.equinox.tests ---
[INFO] 
[INFO] --- tycho-packaging-plugin:1.5.1:package-plugin (default-package-plugin) @ org.eclipse.passage.lic.equinox.tests ---
[INFO] Building jar: /home/jenkins/agent/workspace/passage-base/tests/org.eclipse.passage.lic.equinox.tests/target/org.eclipse.passage.lic.equinox.tests-0.6.0-SNAPSHOT.jar
[INFO] 
[INFO] --- tycho-p2-plugin:1.5.1:p2-metadata-default (default-p2-metadata-default) @ org.eclipse.passage.lic.equinox.tests ---
[INFO] 
[INFO] --- tycho-source-feature-plugin:1.5.1:source-feature (source-feature) @ org.eclipse.passage.lic.equinox.tests ---
[INFO] 
[INFO] --- tycho-p2-plugin:1.5.1:p2-metadata (attached-p2-metadata) @ org.eclipse.passage.lic.equinox.tests ---
[INFO] No baseline version MavenProject: org.eclipse.passage:org.eclipse.passage.lic.equinox.tests:0.6.0-SNAPSHOT @ /home/jenkins/agent/workspace/passage-base/tests/org.eclipse.passage.lic.equinox.tests/.polyglot..META-INF_MANIFEST.MF
[INFO] 
[INFO] --- tycho-surefire-plugin:1.5.1:test (default-test) @ org.eclipse.passage.lic.equinox.tests ---
[INFO] Expected eclipse log file: /home/jenkins/agent/workspace/passage-base/tests/org.eclipse.passage.lic.equinox.tests/target/work/data/.metadata/.log
[INFO] Command line:
	[/opt/tools/java/oracle/jdk-8/1.8.0_202/jre/bin/java, -Dosgi.noShutdown=false, -Dosgi.os=linux, -Dosgi.ws=gtk, -Dosgi.arch=x86_64, -Dosgi.clean=true, -jar, /home/jenkins/.m2/repository/p2/osgi/bundle/org.eclipse.equinox.launcher/1.5.700.v20200207-2156/org.eclipse.equinox.launcher-1.5.700.v20200207-2156.jar, -data, /home/jenkins/agent/workspace/passage-base/tests/org.eclipse.passage.lic.equinox.tests/target/work/data, -install, /home/jenkins/agent/workspace/passage-base/tests/org.eclipse.passage.lic.equinox.tests/target/work, -configuration, /home/jenkins/agent/workspace/passage-base/tests/org.eclipse.passage.lic.equinox.tests/target/work/configuration, -application, org.eclipse.tycho.surefire.osgibooter.headlesstest, -testproperties, /home/jenkins/agent/workspace/passage-base/tests/org.eclipse.passage.lic.equinox.tests/target/surefire.properties]
Running org.eclipse.passage.lic.internal.equinox.requirements.LicensingFeatureCapabilitiesFromBundleTest
Tests run: 1, Failures: 0, Errors: 0, Skipped: 0, Time elapsed: 0.04 s - in org.eclipse.passage.lic.internal.equinox.requirements.LicensingFeatureCapabilitiesFromBundleTest
read(org.eclipse.passage.lic.internal.equinox.requirements.LicensingFeatureCapabilitiesFromBundleTest)  Time elapsed: 0.013 s
Running org.eclipse.passage.lic.internal.equinox.requirements.BundleVendorTest
Tests run: 2, Failures: 0, Errors: 0, Skipped: 0, Time elapsed: 0.003 s - in org.eclipse.passage.lic.internal.equinox.requirements.BundleVendorTest
readVendor(org.eclipse.passage.lic.internal.equinox.requirements.BundleVendorTest)  Time elapsed: 0.003 s
prohibitNull(org.eclipse.passage.lic.internal.equinox.requirements.BundleVendorTest)  Time elapsed: 0 s
Running org.eclipse.passage.lic.internal.equinox.requirements.BundleRequirementsTest
SLF4J: Failed to load class "org.slf4j.impl.StaticLoggerBinder".
SLF4J: Defaulting to no-operation (NOP) logger implementation
SLF4J: See http://www.slf4j.org/codes.html#StaticLoggerBinder for further details.
Tests run: 4, Failures: 0, Errors: 0, Skipped: 0, Time elapsed: 0.034 s - in org.eclipse.passage.lic.internal.equinox.requirements.BundleRequirementsTest
allRequirements(org.eclipse.passage.lic.internal.equinox.requirements.BundleRequirementsTest)  Time elapsed: 0.011 s
requirementsForFeature(org.eclipse.passage.lic.internal.equinox.requirements.BundleRequirementsTest)  Time elapsed: 0.004 s
prohibitsInjections(org.eclipse.passage.lic.internal.equinox.requirements.BundleRequirementsTest)  Time elapsed: 0.008 s
prohibitsRemovals(org.eclipse.passage.lic.internal.equinox.requirements.BundleRequirementsTest)  Time elapsed: 0.01 s
Running org.eclipse.passage.lic.internal.equinox.requirements.CapabilityLicFeatureIdTest
Tests run: 3, Failures: 0, Errors: 0, Skipped: 0, Time elapsed: 0.003 s - in org.eclipse.passage.lic.internal.equinox.requirements.CapabilityLicFeatureIdTest
nullInputValue(org.eclipse.passage.lic.internal.equinox.requirements.CapabilityLicFeatureIdTest)  Time elapsed: 0 s
read(org.eclipse.passage.lic.internal.equinox.requirements.CapabilityLicFeatureIdTest)  Time elapsed: 0.001 s
nullInputMap(org.eclipse.passage.lic.internal.equinox.requirements.CapabilityLicFeatureIdTest)  Time elapsed: 0.001 s
Running org.eclipse.passage.lic.internal.equinox.requirements.WriteLicCapablitiesTest
Tests run: 1, Failures: 0, Errors: 0, Skipped: 0, Time elapsed: 0.003 s - in org.eclipse.passage.lic.internal.equinox.requirements.WriteLicCapablitiesTest
writeProvideCapabilityHeader(org.eclipse.passage.lic.internal.equinox.requirements.WriteLicCapablitiesTest)  Time elapsed: 0.002 s
Running org.eclipse.passage.lic.internal.equinox.requirements.CapabilityLicFeatureProviderTest
Tests run: 3, Failures: 0, Errors: 0, Skipped: 0, Time elapsed: 0.001 s - in org.eclipse.passage.lic.internal.equinox.requirements.CapabilityLicFeatureProviderTest
nullInputValue(org.eclipse.passage.lic.internal.equinox.requirements.CapabilityLicFeatureProviderTest)  Time elapsed: 0 s
read(org.eclipse.passage.lic.internal.equinox.requirements.CapabilityLicFeatureProviderTest)  Time elapsed: 0 s
nullInputMap(org.eclipse.passage.lic.internal.equinox.requirements.CapabilityLicFeatureProviderTest)  Time elapsed: 0 s
Running org.eclipse.passage.lic.internal.equinox.requirements.BundleNameTest
Tests run: 2, Failures: 0, Errors: 0, Skipped: 0, Time elapsed: 0.001 s - in org.eclipse.passage.lic.internal.equinox.requirements.BundleNameTest
readName(org.eclipse.passage.lic.internal.equinox.requirements.BundleNameTest)  Time elapsed: 0 s
prohibitNull(org.eclipse.passage.lic.internal.equinox.requirements.BundleNameTest)  Time elapsed: 0 s
Running org.eclipse.passage.lic.internal.equinox.requirements.CapabilityLicFeatureNameTest
Tests run: 3, Failures: 0, Errors: 0, Skipped: 0, Time elapsed: 0.001 s - in org.eclipse.passage.lic.internal.equinox.requirements.CapabilityLicFeatureNameTest
nullInputValue(org.eclipse.passage.lic.internal.equinox.requirements.CapabilityLicFeatureNameTest)  Time elapsed: 0 s
read(org.eclipse.passage.lic.internal.equinox.requirements.CapabilityLicFeatureNameTest)  Time elapsed: 0 s
nullInputMap(org.eclipse.passage.lic.internal.equinox.requirements.CapabilityLicFeatureNameTest)  Time elapsed: 0 s
Running org.eclipse.passage.lic.internal.equinox.requirements.RequirementsFromCapabilityTest
Tests run: 1, Failures: 0, Errors: 0, Skipped: 0, Time elapsed: 0.002 s - in org.eclipse.passage.lic.internal.equinox.requirements.RequirementsFromCapabilityTest
read(org.eclipse.passage.lic.internal.equinox.requirements.RequirementsFromCapabilityTest)  Time elapsed: 0.002 s
Running org.eclipse.passage.lic.internal.equinox.requirements.ComponentRequirementsTest
Tests run: 4, Failures: 0, Errors: 0, Skipped: 0, Time elapsed: 0.014 s - in org.eclipse.passage.lic.internal.equinox.requirements.ComponentRequirementsTest
allRequirements(org.eclipse.passage.lic.internal.equinox.requirements.ComponentRequirementsTest)  Time elapsed: 0.004 s
requirementsForFeature(org.eclipse.passage.lic.internal.equinox.requirements.ComponentRequirementsTest)  Time elapsed: 0.001 s
prohibitsInjections(org.eclipse.passage.lic.internal.equinox.requirements.ComponentRequirementsTest)  Time elapsed: 0.003 s
prohibitsRemovals(org.eclipse.passage.lic.internal.equinox.requirements.ComponentRequirementsTest)  Time elapsed: 0.005 s
Running org.eclipse.passage.lic.internal.equinox.requirements.CapabilityLicFeatureVersionTest
Tests run: 3, Failures: 0, Errors: 0, Skipped: 0, Time elapsed: 0.002 s - in org.eclipse.passage.lic.internal.equinox.requirements.CapabilityLicFeatureVersionTest
nullInputValue(org.eclipse.passage.lic.internal.equinox.requirements.CapabilityLicFeatureVersionTest)  Time elapsed: 0 s
read(org.eclipse.passage.lic.internal.equinox.requirements.CapabilityLicFeatureVersionTest)  Time elapsed: 0 s
nullInputMap(org.eclipse.passage.lic.internal.equinox.requirements.CapabilityLicFeatureVersionTest)  Time elapsed: 0.001 s
Running org.eclipse.passage.lic.internal.equinox.requirements.CapabilityLicFeatureRestrictionTest
Tests run: 3, Failures: 0, Errors: 0, Skipped: 0, Time elapsed: 0.001 s - in org.eclipse.passage.lic.internal.equinox.requirements.CapabilityLicFeatureRestrictionTest
nullInputValue(org.eclipse.passage.lic.internal.equinox.requirements.CapabilityLicFeatureRestrictionTest)  Time elapsed: 0 s
read(org.eclipse.passage.lic.internal.equinox.requirements.CapabilityLicFeatureRestrictionTest)  Time elapsed: 0 s
nullInputMap(org.eclipse.passage.lic.internal.equinox.requirements.CapabilityLicFeatureRestrictionTest)  Time elapsed: 0 s
Running org.eclipse.passage.lic.internal.equinox.io.BundleKeyKeeperTest
Tests run: 4, Failures: 0, Errors: 0, Skipped: 0, Time elapsed: 0.004 s - in org.eclipse.passage.lic.internal.equinox.io.BundleKeyKeeperTest
exisgingKeyFileFound(org.eclipse.passage.lic.internal.equinox.io.BundleKeyKeeperTest)  Time elapsed: 0.002 s
foreignProductKeyIsIgnired(org.eclipse.passage.lic.internal.equinox.io.BundleKeyKeeperTest)  Time elapsed: 0.001 s
bundleIsMandatory(org.eclipse.passage.lic.internal.equinox.io.BundleKeyKeeperTest)  Time elapsed: 0 s
productIsMandatory(org.eclipse.passage.lic.internal.equinox.io.BundleKeyKeeperTest)  Time elapsed: 0 s
Running org.eclipse.passage.lic.equinox.tests.ApplicationConfigurationsTest
Tests run: 1, Failures: 0, Errors: 0, Skipped: 0, Time elapsed: 0.002 s - in org.eclipse.passage.lic.equinox.tests.ApplicationConfigurationsTest
testInvalidProduct(org.eclipse.passage.lic.equinox.tests.ApplicationConfigurationsTest)  Time elapsed: 0.001 s
Running org.eclipse.passage.lic.equinox.tests.ComponentConfigurationResolverTest
Tests run: 2, Failures: 0, Errors: 0, Skipped: 0, Time elapsed: 0.283 s - in org.eclipse.passage.lic.equinox.tests.ComponentConfigurationResolverTest
testResolveRequirements(org.eclipse.passage.lic.equinox.tests.ComponentConfigurationResolverTest)  Time elapsed: 0.258 s
testNoBundleContext(org.eclipse.passage.lic.equinox.tests.ComponentConfigurationResolverTest)  Time elapsed: 0.024 s
Running org.eclipse.passage.lic.equinox.tests.BundleCapabilityResolverTest
Tests run: 2, Failures: 0, Errors: 0, Skipped: 0, Time elapsed: 0.001 s - in org.eclipse.passage.lic.equinox.tests.BundleCapabilityResolverTest
testResolveRequirements(org.eclipse.passage.lic.equinox.tests.BundleCapabilityResolverTest)  Time elapsed: 0.001 s
testNoBundleContext(org.eclipse.passage.lic.equinox.tests.BundleCapabilityResolverTest)  Time elapsed: 0 s
Running org.eclipse.passage.lic.equinox.tests.EquinoxAccessManagerTest
Invalid configuration
java.lang.NullPointerException
	at org.eclipse.passage.lic.base.access.BaseAccessManager.examinePermissions(BaseAccessManager.java:259)
	at org.eclipse.passage.lic.base.access.BaseAccessManager.executeAccessRestrictions(BaseAccessManager.java:134)
	at org.eclipse.passage.lic.equinox.tests.EquinoxAccessManagerTest.testExecuteRestrictions(EquinoxAccessManagerTest.java:26)
	at sun.reflect.NativeMethodAccessorImpl.invoke0(Native Method)
	at sun.reflect.NativeMethodAccessorImpl.invoke(NativeMethodAccessorImpl.java:62)
	at sun.reflect.DelegatingMethodAccessorImpl.invoke(DelegatingMethodAccessorImpl.java:43)
	at java.lang.reflect.Method.invoke(Method.java:498)
	at org.junit.runners.model.FrameworkMethod$1.runReflectiveCall(FrameworkMethod.java:59)
	at org.junit.internal.runners.model.ReflectiveCallable.run(ReflectiveCallable.java:12)
	at org.junit.runners.model.FrameworkMethod.invokeExplosively(FrameworkMethod.java:56)
	at org.junit.internal.runners.statements.InvokeMethod.evaluate(InvokeMethod.java:17)
	at org.junit.runners.ParentRunner$3.evaluate(ParentRunner.java:306)
	at org.junit.runners.BlockJUnit4ClassRunner$1.evaluate(BlockJUnit4ClassRunner.java:100)
	at org.junit.runners.ParentRunner.runLeaf(ParentRunner.java:366)
	at org.junit.runners.BlockJUnit4ClassRunner.runChild(BlockJUnit4ClassRunner.java:103)
	at org.junit.runners.BlockJUnit4ClassRunner.runChild(BlockJUnit4ClassRunner.java:63)
	at org.junit.runners.ParentRunner$4.run(ParentRunner.java:331)
	at org.junit.runners.ParentRunner$1.schedule(ParentRunner.java:79)
	at org.junit.runners.ParentRunner.runChildren(ParentRunner.java:329)
	at org.junit.runners.ParentRunner.access$100(ParentRunner.java:66)
	at org.junit.runners.ParentRunner$2.evaluate(ParentRunner.java:293)
	at org.junit.runners.ParentRunner$3.evaluate(ParentRunner.java:306)
	at org.junit.runners.ParentRunner.run(ParentRunner.java:413)
	at org.apache.maven.surefire.junit4.JUnit4Provider.execute(JUnit4Provider.java:365)
	at org.apache.maven.surefire.junit4.JUnit4Provider.executeWithRerun(JUnit4Provider.java:273)
	at org.apache.maven.surefire.junit4.JUnit4Provider.executeTestSet(JUnit4Provider.java:238)
	at org.apache.maven.surefire.junit4.JUnit4Provider.invoke(JUnit4Provider.java:159)
	at sun.reflect.NativeMethodAccessorImpl.invoke0(Native Method)
	at sun.reflect.NativeMethodAccessorImpl.invoke(NativeMethodAccessorImpl.java:62)
	at sun.reflect.DelegatingMethodAccessorImpl.invoke(DelegatingMethodAccessorImpl.java:43)
	at java.lang.reflect.Method.invoke(Method.java:498)
	at org.apache.maven.surefire.util.ReflectionUtils.invokeMethodWithArray2(ReflectionUtils.java:206)
	at org.apache.maven.surefire.booter.ProviderFactory$ProviderProxy.invoke(ProviderFactory.java:161)
	at org.apache.maven.surefire.booter.ProviderFactory.invokeProvider(ProviderFactory.java:84)
	at org.eclipse.tycho.surefire.osgibooter.OsgiSurefireBooter.run(OsgiSurefireBooter.java:113)
	at org.eclipse.tycho.surefire.osgibooter.HeadlessTestApplication.run(HeadlessTestApplication.java:21)
	at sun.reflect.NativeMethodAccessorImpl.invoke0(Native Method)
	at sun.reflect.NativeMethodAccessorImpl.invoke(NativeMethodAccessorImpl.java:62)
	at sun.reflect.DelegatingMethodAccessorImpl.invoke(DelegatingMethodAccessorImpl.java:43)
	at java.lang.reflect.Method.invoke(Method.java:498)
	at org.eclipse.equinox.internal.app.EclipseAppContainer.callMethodWithException(EclipseAppContainer.java:593)
	at org.eclipse.equinox.internal.app.EclipseAppHandle.run(EclipseAppHandle.java:205)
	at org.eclipse.core.runtime.internal.adaptor.EclipseAppLauncher.runApplication(EclipseAppLauncher.java:137)
	at org.eclipse.core.runtime.internal.adaptor.EclipseAppLauncher.start(EclipseAppLauncher.java:107)
	at org.eclipse.core.runtime.adaptor.EclipseStarter.run(EclipseStarter.java:401)
	at org.eclipse.core.runtime.adaptor.EclipseStarter.run(EclipseStarter.java:255)
	at sun.reflect.NativeMethodAccessorImpl.invoke0(Native Method)
	at sun.reflect.NativeMethodAccessorImpl.invoke(NativeMethodAccessorImpl.java:62)
	at sun.reflect.DelegatingMethodAccessorImpl.invoke(DelegatingMethodAccessorImpl.java:43)
	at java.lang.reflect.Method.invoke(Method.java:498)
	at org.eclipse.equinox.launcher.Main.invokeFramework(Main.java:657)
	at org.eclipse.equinox.launcher.Main.basicRun(Main.java:594)
	at org.eclipse.equinox.launcher.Main.run(Main.java:1447)
	at org.eclipse.equinox.launcher.Main.main(Main.java:1420)
Tests run: 1, Failures: 0, Errors: 0, Skipped: 0, Time elapsed: 0.004 s - in org.eclipse.passage.lic.equinox.tests.EquinoxAccessManagerTest
testExecuteRestrictions(org.eclipse.passage.lic.equinox.tests.EquinoxAccessManagerTest)  Time elapsed: 0.003 s

Results:

Tests run: 40, Failures: 0, Errors: 0, Skipped: 0

[INFO] All tests passed!
[INFO] 
[INFO] --- tycho-pack200a-plugin:1.7.0:normalize (pack200-normalize) @ org.eclipse.passage.lic.equinox.tests ---
[INFO] Pack200 normalizing jar /home/jenkins/agent/workspace/passage-base/tests/org.eclipse.passage.lic.equinox.tests/target/org.eclipse.passage.lic.equinox.tests-0.6.0-SNAPSHOT.jar
[INFO] 
[INFO] --- eclipse-jarsigner-plugin:1.1.7:sign (sign) @ org.eclipse.passage.lic.equinox.tests ---
[INFO] Signing jar: /home/jenkins/agent/workspace/passage-base/tests/org.eclipse.passage.lic.equinox.tests/target/org.eclipse.passage.lic.equinox.tests-0.6.0-SNAPSHOT.jar
[INFO] Signing jar: /home/jenkins/agent/workspace/passage-base/tests/org.eclipse.passage.lic.equinox.tests/target/org.eclipse.passage.lic.equinox.tests-0.6.0-SNAPSHOT-sources.jar
[INFO] 
[INFO] --- tycho-pack200b-plugin:1.7.0:pack (pack200-pack) @ org.eclipse.passage.lic.equinox.tests ---
[INFO] Pack200 packing jar /home/jenkins/agent/workspace/passage-base/tests/org.eclipse.passage.lic.equinox.tests/target/org.eclipse.passage.lic.equinox.tests-0.6.0-SNAPSHOT.jar
[INFO] 
[INFO] --- tycho-p2-plugin:1.5.1:p2-metadata (p2-metadata) @ org.eclipse.passage.lic.equinox.tests ---
[INFO] No baseline version MavenProject: org.eclipse.passage:org.eclipse.passage.lic.equinox.tests:0.6.0-SNAPSHOT @ /home/jenkins/agent/workspace/passage-base/tests/org.eclipse.passage.lic.equinox.tests/.polyglot..META-INF_MANIFEST.MF
[INFO] 
[INFO] --- tycho-p2-extras-plugin:1.5.1:compare-version-with-baselines (compare-attached-artifacts-with-release) @ org.eclipse.passage.lic.equinox.tests ---
[INFO] 
[INFO] -----------< org.eclipse.passage:org.eclipse.passage.lic.bc >-----------
[INFO] Building Passage LIC BC 0.5.100-SNAPSHOT                        [10/140]
[INFO] ---------------------------[ eclipse-plugin ]---------------------------
[INFO] 
[INFO] --- maven-clean-plugin:3.1.0:clean (default-clean) @ org.eclipse.passage.lic.bc ---
[INFO] 
[INFO] --- tycho-packaging-plugin:1.5.1:build-qualifier (default-build-qualifier) @ org.eclipse.passage.lic.bc ---
[INFO] The project's OSGi version is 0.5.100.v20200703-1245
[INFO] 
[INFO] --- tycho-packaging-plugin:1.5.1:validate-id (default-validate-id) @ org.eclipse.passage.lic.bc ---
[INFO] 
[INFO] --- tycho-packaging-plugin:1.5.1:validate-version (default-validate-version) @ org.eclipse.passage.lic.bc ---
[INFO] 
[INFO] --- eclipse-cbi-plugin:1.1.8-SNAPSHOT:generate-api-build-xml (default) @ org.eclipse.passage.lic.bc ---
Generating target/.apibuild.xml
[INFO] 
[INFO] --- maven-resources-plugin:3.1.0:resources (default-resources) @ org.eclipse.passage.lic.bc ---
[INFO] Using 'UTF-8' encoding to copy filtered resources.
[INFO] Copying 1 resource
[INFO] Copying 1 resource
[INFO] 
[INFO] --- tycho-compiler-plugin:1.5.1:compile (default-compile) @ org.eclipse.passage.lic.bc ---
[INFO] Compiling 10 source files to /home/jenkins/agent/workspace/passage-base/bundles/org.eclipse.passage.lic.bc/target/classes
[INFO] 
[INFO] --- tycho-eclipserun-plugin:1.5.1:eclipse-run (default) @ org.eclipse.passage.lic.bc ---
[INFO] Toolchain in tycho-eclipserun-plugin: JDK[/opt/tools/java/oracle/jdk-8/latest]
[INFO] Expected eclipse log file: /home/jenkins/agent/workspace/passage-base/bundles/org.eclipse.passage.lic.bc/target/eclipserun-work/data/.metadata/.log
[INFO] Command line:
	[/opt/tools/java/oracle/jdk-8/latest/bin/java, -jar, /home/jenkins/.m2/repository/p2/osgi/bundle/org.eclipse.equinox.launcher/1.5.700.v20200207-2156/org.eclipse.equinox.launcher-1.5.700.v20200207-2156.jar, -install, /home/jenkins/agent/workspace/passage-base/bundles/org.eclipse.passage.lic.bc/target/eclipserun-work, -configuration, /home/jenkins/agent/workspace/passage-base/bundles/org.eclipse.passage.lic.bc/target/eclipserun-work/configuration, -data, target/apibuild-workspace, -application, org.eclipse.ant.core.antRunner, -buildfile, target/.apibuild.xml]
Buildfile: target/.apibuild.xml

apigen:
BUILD SUCCESSFUL

BUILD SUCCESSFUL
Total time: 0 seconds
[INFO] 
[INFO] --- maven-resources-plugin:3.1.0:testResources (default-testResources) @ org.eclipse.passage.lic.bc ---
[INFO] Using 'UTF-8' encoding to copy filtered resources.
[INFO] skip non existing resourceDirectory /home/jenkins/agent/workspace/passage-base/bundles/org.eclipse.passage.lic.bc/src/test/resources
[INFO] 
[INFO] --- tycho-source-plugin:1.5.1:plugin-source (attach-source) @ org.eclipse.passage.lic.bc ---
[INFO] Building jar: /home/jenkins/agent/workspace/passage-base/bundles/org.eclipse.passage.lic.bc/target/org.eclipse.passage.lic.bc-0.5.100-SNAPSHOT-sources.jar
[INFO] 
[INFO] --- target-platform-configuration:1.5.1:target-platform (default-target-platform) @ org.eclipse.passage.lic.bc ---
[INFO] 
[INFO] --- tycho-packaging-plugin:1.5.1:package-plugin (default-package-plugin) @ org.eclipse.passage.lic.bc ---
[INFO] Building jar: /home/jenkins/agent/workspace/passage-base/bundles/org.eclipse.passage.lic.bc/target/org.eclipse.passage.lic.bc-0.5.100-SNAPSHOT.jar
[INFO] 
[INFO] --- tycho-p2-plugin:1.5.1:p2-metadata-default (default-p2-metadata-default) @ org.eclipse.passage.lic.bc ---
[INFO] 
[INFO] --- tycho-source-feature-plugin:1.5.1:source-feature (source-feature) @ org.eclipse.passage.lic.bc ---
[INFO] 
[INFO] --- tycho-p2-plugin:1.5.1:p2-metadata (attached-p2-metadata) @ org.eclipse.passage.lic.bc ---
[INFO] No baseline version MavenProject: org.eclipse.passage:org.eclipse.passage.lic.bc:0.5.100-SNAPSHOT @ /home/jenkins/agent/workspace/passage-base/bundles/org.eclipse.passage.lic.bc/.polyglot..META-INF_MANIFEST.MF
[INFO] 
[INFO] --- tycho-pack200a-plugin:1.7.0:normalize (pack200-normalize) @ org.eclipse.passage.lic.bc ---
[INFO] Pack200 normalizing jar /home/jenkins/agent/workspace/passage-base/bundles/org.eclipse.passage.lic.bc/target/org.eclipse.passage.lic.bc-0.5.100-SNAPSHOT.jar
[INFO] 
[INFO] --- eclipse-jarsigner-plugin:1.1.7:sign (sign) @ org.eclipse.passage.lic.bc ---
[INFO] Signing jar: /home/jenkins/agent/workspace/passage-base/bundles/org.eclipse.passage.lic.bc/target/org.eclipse.passage.lic.bc-0.5.100-SNAPSHOT.jar
[INFO] Signing jar: /home/jenkins/agent/workspace/passage-base/bundles/org.eclipse.passage.lic.bc/target/org.eclipse.passage.lic.bc-0.5.100-SNAPSHOT-sources.jar
[INFO] 
[INFO] --- tycho-pack200b-plugin:1.7.0:pack (pack200-pack) @ org.eclipse.passage.lic.bc ---
[INFO] Pack200 packing jar /home/jenkins/agent/workspace/passage-base/bundles/org.eclipse.passage.lic.bc/target/org.eclipse.passage.lic.bc-0.5.100-SNAPSHOT.jar
[INFO] 
[INFO] --- tycho-p2-plugin:1.5.1:p2-metadata (p2-metadata) @ org.eclipse.passage.lic.bc ---
[INFO] No baseline version MavenProject: org.eclipse.passage:org.eclipse.passage.lic.bc:0.5.100-SNAPSHOT @ /home/jenkins/agent/workspace/passage-base/bundles/org.eclipse.passage.lic.bc/.polyglot..META-INF_MANIFEST.MF
[INFO] 
[INFO] --- tycho-p2-extras-plugin:1.5.1:compare-version-with-baselines (compare-attached-artifacts-with-release) @ org.eclipse.passage.lic.bc ---
[INFO] 
[INFO] -------< org.eclipse.passage:org.eclipse.passage.lic.bc.feature >-------
[INFO] Building Passage LIC BC 0.6.100-SNAPSHOT                        [11/140]
[INFO] --------------------------[ eclipse-feature ]---------------------------
[INFO] 
[INFO] --- maven-clean-plugin:3.1.0:clean (default-clean) @ org.eclipse.passage.lic.bc.feature ---
[INFO] Deleting /home/jenkins/agent/workspace/passage-base/features/org.eclipse.passage.lic.bc.feature/target
[INFO] 
[INFO] --- tycho-packaging-plugin:1.5.1:build-qualifier-aggregator (default-build-qualifier-aggregator) @ org.eclipse.passage.lic.bc.feature ---
[INFO] The project's OSGi version is 0.6.100.v20200703-1245
[INFO] 
[INFO] --- tycho-packaging-plugin:1.5.1:validate-id (default-validate-id) @ org.eclipse.passage.lic.bc.feature ---
[INFO] 
[INFO] --- tycho-packaging-plugin:1.5.1:validate-version (default-validate-version) @ org.eclipse.passage.lic.bc.feature ---
[INFO] 
[INFO] --- eclipse-cbi-plugin:1.1.8-SNAPSHOT:generate-api-build-xml (default) @ org.eclipse.passage.lic.bc.feature ---
[INFO] 
[INFO] --- tycho-eclipserun-plugin:1.5.1:eclipse-run (default) @ org.eclipse.passage.lic.bc.feature ---
[INFO] 
[INFO] --- tycho-source-plugin:1.5.1:plugin-source (attach-source) @ org.eclipse.passage.lic.bc.feature ---
[INFO] 
[INFO] --- target-platform-configuration:1.5.1:target-platform (default-target-platform) @ org.eclipse.passage.lic.bc.feature ---
[INFO] 
[INFO] --- tycho-packaging-plugin:1.5.1:package-feature (default-package-feature) @ org.eclipse.passage.lic.bc.feature ---
[INFO] Building jar: /home/jenkins/agent/workspace/passage-base/features/org.eclipse.passage.lic.bc.feature/target/org.eclipse.passage.lic.bc.feature-0.6.100-SNAPSHOT.jar
[INFO] 
[INFO] --- tycho-p2-plugin:1.5.1:p2-metadata-default (default-p2-metadata-default) @ org.eclipse.passage.lic.bc.feature ---
[INFO] 
[INFO] --- tycho-p2-plugin:1.5.1:feature-p2-metadata (default-feature-p2-metadata) @ org.eclipse.passage.lic.bc.feature ---
[INFO] 
[INFO] --- tycho-source-feature-plugin:1.5.1:source-feature (source-feature) @ org.eclipse.passage.lic.bc.feature ---
[INFO] Fetching org.bouncycastle.bcpg.source_1.65.0.v20200527-1955.jar from https://download.eclipse.org/tools/orbit/downloads/drops2/S20200707174545/repository/plugins/ (298.2kB)
[INFO] Fetching org.bouncycastle.bcpg.source_1.65.0.v20200527-1955.jar from https://download.eclipse.org/tools/orbit/downloads/drops2/S20200707174545/repository/plugins/ (298.2kB)
[INFO] Fetching org.bouncycastle.bcpkix.source_1.65.0.v20200527-1955.jar from https://download.eclipse.org/tools/orbit/downloads/drops2/S20200707174545/repository/plugins/ (603.08kB)
[INFO] Fetching org.bouncycastle.bcpkix.source_1.65.0.v20200527-1955.jar from https://download.eclipse.org/tools/orbit/downloads/drops2/S20200707174545/repository/plugins/ (603.08kB)
[INFO] Fetching org.bouncycastle.bcprov.source_1.65.1.v20200529-1514.jar from https://download.eclipse.org/tools/orbit/downloads/drops2/S20200707174545/repository/plugins/ (3.25MB)
[INFO] Fetching org.bouncycastle.bcprov.source_1.65.1.v20200529-1514.jar from https://download.eclipse.org/tools/orbit/downloads/drops2/S20200707174545/repository/plugins/ (3.25MB)
[INFO] Building jar: /home/jenkins/agent/workspace/passage-base/features/org.eclipse.passage.lic.bc.feature/target/org.eclipse.passage.lic.bc.feature-0.6.100-SNAPSHOT-sources-feature.jar
[INFO] 
[INFO] --- tycho-p2-plugin:1.5.1:p2-metadata (attached-p2-metadata) @ org.eclipse.passage.lic.bc.feature ---
[INFO] No baseline version MavenProject: org.eclipse.passage:org.eclipse.passage.lic.bc.feature:0.6.100-SNAPSHOT @ /home/jenkins/agent/workspace/passage-base/features/org.eclipse.passage.lic.bc.feature/.polyglot.feature.xml.takari_issue_192
[INFO] 
[INFO] --- tycho-pack200a-plugin:1.7.0:normalize (pack200-normalize) @ org.eclipse.passage.lic.bc.feature ---
[INFO] 
[INFO] --- eclipse-jarsigner-plugin:1.1.7:sign (sign) @ org.eclipse.passage.lic.bc.feature ---
[INFO] Signing jar: /home/jenkins/agent/workspace/passage-base/features/org.eclipse.passage.lic.bc.feature/target/org.eclipse.passage.lic.bc.feature-0.6.100-SNAPSHOT.jar
[INFO] Signing jar: /home/jenkins/agent/workspace/passage-base/features/org.eclipse.passage.lic.bc.feature/target/org.eclipse.passage.lic.bc.feature-0.6.100-SNAPSHOT-sources-feature.jar
[INFO] 
[INFO] --- tycho-pack200b-plugin:1.7.0:pack (pack200-pack) @ org.eclipse.passage.lic.bc.feature ---
[INFO] 
[INFO] --- tycho-p2-plugin:1.5.1:p2-metadata (p2-metadata) @ org.eclipse.passage.lic.bc.feature ---
[INFO] No baseline version MavenProject: org.eclipse.passage:org.eclipse.passage.lic.bc.feature:0.6.100-SNAPSHOT @ /home/jenkins/agent/workspace/passage-base/features/org.eclipse.passage.lic.bc.feature/.polyglot.feature.xml.takari_issue_192
[INFO] 
[INFO] --- tycho-p2-extras-plugin:1.5.1:compare-version-with-baselines (compare-attached-artifacts-with-release) @ org.eclipse.passage.lic.bc.feature ---
[INFO] 
[INFO] --------< org.eclipse.passage:org.eclipse.passage.lic.bc.tests >--------
[INFO] Building Passage LIC BC Tests 0.5.0-SNAPSHOT                    [12/140]
[INFO] ------------------------[ eclipse-test-plugin ]-------------------------
[INFO] 
[INFO] --- maven-clean-plugin:3.1.0:clean (default-clean) @ org.eclipse.passage.lic.bc.tests ---
[INFO] 
[INFO] --- tycho-packaging-plugin:1.5.1:build-qualifier (default-build-qualifier) @ org.eclipse.passage.lic.bc.tests ---
[INFO] The project's OSGi version is 0.5.0.v20200703-1246
[INFO] 
[INFO] --- tycho-packaging-plugin:1.5.1:validate-id (default-validate-id) @ org.eclipse.passage.lic.bc.tests ---
[INFO] 
[INFO] --- tycho-packaging-plugin:1.5.1:validate-version (default-validate-version) @ org.eclipse.passage.lic.bc.tests ---
[INFO] 
[INFO] --- eclipse-cbi-plugin:1.1.8-SNAPSHOT:generate-api-build-xml (default) @ org.eclipse.passage.lic.bc.tests ---
Generating target/.apibuild.xml
[INFO] 
[INFO] --- maven-resources-plugin:3.1.0:resources (default-resources) @ org.eclipse.passage.lic.bc.tests ---
[INFO] Using 'UTF-8' encoding to copy filtered resources.
[INFO] Copying 0 resource
[INFO] 
[INFO] --- tycho-compiler-plugin:1.5.1:compile (default-compile) @ org.eclipse.passage.lic.bc.tests ---
[INFO] Compiling 12 source files to /home/jenkins/agent/workspace/passage-base/tests/org.eclipse.passage.lic.bc.tests/target/classes
[WARNING] /home/jenkins/agent/workspace/passage-base/tests/org.eclipse.passage.lic.bc.tests/src/org/eclipse/passage/lic/bc/tests/BcStreamCodecTest.java:[28] 
	import org.eclipse.passage.lic.base.io.LicensingPaths;
	       ^^^^^^^^^^^^^^^^^^^^^^^^^^^^^^^^^^^^^^^^^^^^^^
The type LicensingPaths is deprecated
[WARNING] /home/jenkins/agent/workspace/passage-base/tests/org.eclipse.passage.lic.bc.tests/src/org/eclipse/passage/lic/bc/tests/BcStreamCodecTest.java:[29] 
	import org.eclipse.passage.lic.bc.BcProperties;
	       ^^^^^^^^^^^^^^^^^^^^^^^^^^^^^^^^^^^^^^^
The type BcProperties is deprecated
[WARNING] /home/jenkins/agent/workspace/passage-base/tests/org.eclipse.passage.lic.bc.tests/src/org/eclipse/passage/lic/bc/tests/BcStreamCodecTest.java:[30] 
	import org.eclipse.passage.lic.bc.BcStreamCodec;
	       ^^^^^^^^^^^^^^^^^^^^^^^^^^^^^^^^^^^^^^^^
The type BcStreamCodec is deprecated
[WARNING] /home/jenkins/agent/workspace/passage-base/tests/org.eclipse.passage.lic.bc.tests/src/org/eclipse/passage/lic/bc/tests/BcStreamCodecTest.java:[61] 
	BcStreamCodec codec = new BcStreamCodec();
	^^^^^^^^^^^^^
The type BcStreamCodec is deprecated
[WARNING] /home/jenkins/agent/workspace/passage-base/tests/org.eclipse.passage.lic.bc.tests/src/org/eclipse/passage/lic/bc/tests/BcStreamCodecTest.java:[61] 
	BcStreamCodec codec = new BcStreamCodec();
	                          ^^^^^^^^^^^^^
The type BcStreamCodec is deprecated
[WARNING] /home/jenkins/agent/workspace/passage-base/tests/org.eclipse.passage.lic.bc.tests/src/org/eclipse/passage/lic/bc/tests/BcStreamCodecTest.java:[61] 
	BcStreamCodec codec = new BcStreamCodec();
	                          ^^^^^^^^^^^^^^^
The constructor BcStreamCodec() is deprecated
[WARNING] /home/jenkins/agent/workspace/passage-base/tests/org.eclipse.passage.lic.bc.tests/src/org/eclipse/passage/lic/bc/tests/BcStreamCodecTest.java:[62] 
	assertEquals(BcProperties.KEY_ALGO_DEFAULT, codec.getKeyAlgo());
	             ^^^^^^^^^^^^
The type BcProperties is deprecated
[WARNING] /home/jenkins/agent/workspace/passage-base/tests/org.eclipse.passage.lic.bc.tests/src/org/eclipse/passage/lic/bc/tests/BcStreamCodecTest.java:[62] 
	assertEquals(BcProperties.KEY_ALGO_DEFAULT, codec.getKeyAlgo());
	                          ^^^^^^^^^^^^^^^^
The field BcProperties.KEY_ALGO_DEFAULT is deprecated
[WARNING] /home/jenkins/agent/workspace/passage-base/tests/org.eclipse.passage.lic.bc.tests/src/org/eclipse/passage/lic/bc/tests/BcStreamCodecTest.java:[62] 
	assertEquals(BcProperties.KEY_ALGO_DEFAULT, codec.getKeyAlgo());
	                                                  ^^^^^^^^^^^^
The method getKeyAlgo() from the type BcStreamCodec is deprecated
[WARNING] /home/jenkins/agent/workspace/passage-base/tests/org.eclipse.passage.lic.bc.tests/src/org/eclipse/passage/lic/bc/tests/BcStreamCodecTest.java:[63] 
	assertEquals(BcProperties.KEY_SIZE_DEFAULT, codec.getKeySize());
	             ^^^^^^^^^^^^
The type BcProperties is deprecated
[WARNING] /home/jenkins/agent/workspace/passage-base/tests/org.eclipse.passage.lic.bc.tests/src/org/eclipse/passage/lic/bc/tests/BcStreamCodecTest.java:[63] 
	assertEquals(BcProperties.KEY_SIZE_DEFAULT, codec.getKeySize());
	                          ^^^^^^^^^^^^^^^^
The field BcProperties.KEY_SIZE_DEFAULT is deprecated
[WARNING] /home/jenkins/agent/workspace/passage-base/tests/org.eclipse.passage.lic.bc.tests/src/org/eclipse/passage/lic/bc/tests/BcStreamCodecTest.java:[63] 
	assertEquals(BcProperties.KEY_SIZE_DEFAULT, codec.getKeySize());
	                                                  ^^^^^^^^^^^^
The method getKeySize() from the type BcStreamCodec is deprecated
[WARNING] /home/jenkins/agent/workspace/passage-base/tests/org.eclipse.passage.lic.bc.tests/src/org/eclipse/passage/lic/bc/tests/BcStreamCodecTest.java:[67] 
	properties.put(LicensingProperties.LICENSING_SECURITY_KEY_ALGO, keyAlgo);
	                                   ^^^^^^^^^^^^^^^^^^^^^^^^^^^
The field LicensingProperties.LICENSING_SECURITY_KEY_ALGO is deprecated
[WARNING] /home/jenkins/agent/workspace/passage-base/tests/org.eclipse.passage.lic.bc.tests/src/org/eclipse/passage/lic/bc/tests/BcStreamCodecTest.java:[68] 
	properties.put(LicensingProperties.LICENSING_SECURITY_KEY_SIZE, keySize);
	                                   ^^^^^^^^^^^^^^^^^^^^^^^^^^^
The field LicensingProperties.LICENSING_SECURITY_KEY_SIZE is deprecated
[WARNING] /home/jenkins/agent/workspace/passage-base/tests/org.eclipse.passage.lic.bc.tests/src/org/eclipse/passage/lic/bc/tests/BcStreamCodecTest.java:[69] 
	codec.activate(properties);
	      ^^^^^^^^^^^^^^^^^^^^
The method activate(Map<String,Object>) from the type BcStreamCodec is deprecated
[WARNING] /home/jenkins/agent/workspace/passage-base/tests/org.eclipse.passage.lic.bc.tests/src/org/eclipse/passage/lic/bc/tests/BcStreamCodecTest.java:[70] 
	assertEquals(keyAlgo, codec.getKeyAlgo());
	                            ^^^^^^^^^^^^
The method getKeyAlgo() from the type BcStreamCodec is deprecated
[WARNING] /home/jenkins/agent/workspace/passage-base/tests/org.eclipse.passage.lic.bc.tests/src/org/eclipse/passage/lic/bc/tests/BcStreamCodecTest.java:[71] 
	assertEquals(keySize.intValue(), codec.getKeySize());
	                                       ^^^^^^^^^^^^
The method getKeySize() from the type BcStreamCodec is deprecated
[WARNING] /home/jenkins/agent/workspace/passage-base/tests/org.eclipse.passage.lic.bc.tests/src/org/eclipse/passage/lic/bc/tests/BcStreamCodecTest.java:[76] 
	BcStreamCodec codec = new BcStreamCodec();
	^^^^^^^^^^^^^
The type BcStreamCodec is deprecated
[WARNING] /home/jenkins/agent/workspace/passage-base/tests/org.eclipse.passage.lic.bc.tests/src/org/eclipse/passage/lic/bc/tests/BcStreamCodecTest.java:[76] 
	BcStreamCodec codec = new BcStreamCodec();
	                          ^^^^^^^^^^^^^
The type BcStreamCodec is deprecated
[WARNING] /home/jenkins/agent/workspace/passage-base/tests/org.eclipse.passage.lic.bc.tests/src/org/eclipse/passage/lic/bc/tests/BcStreamCodecTest.java:[76] 
	BcStreamCodec codec = new BcStreamCodec();
	                          ^^^^^^^^^^^^^^^
The constructor BcStreamCodec() is deprecated
[WARNING] /home/jenkins/agent/workspace/passage-base/tests/org.eclipse.passage.lic.bc.tests/src/org/eclipse/passage/lic/bc/tests/BcStreamCodecTest.java:[78] 
	File publicFile = keyFolder.newFile(keyName + LicensingPaths.EXTENSION_PRODUCT_PUBLIC);
	                                              ^^^^^^^^^^^^^^
The type LicensingPaths is deprecated
[WARNING] /home/jenkins/agent/workspace/passage-base/tests/org.eclipse.passage.lic.bc.tests/src/org/eclipse/passage/lic/bc/tests/BcStreamCodecTest.java:[78] 
	File publicFile = keyFolder.newFile(keyName + LicensingPaths.EXTENSION_PRODUCT_PUBLIC);
	                                                             ^^^^^^^^^^^^^^^^^^^^^^^^
The field LicensingPaths.EXTENSION_PRODUCT_PUBLIC is deprecated
[WARNING] /home/jenkins/agent/workspace/passage-base/tests/org.eclipse.passage.lic.bc.tests/src/org/eclipse/passage/lic/bc/tests/BcStreamCodecTest.java:[84] 
	codec.createKeyPair(publicKey, privateKey, username, password);
	      ^^^^^^^^^^^^^^^^^^^^^^^^^^^^^^^^^^^^^^^^^^^^^^^^^^^^^^^^
The method createKeyPair(String, String, String, String) from the type BcStreamCodec is deprecated
[WARNING] /home/jenkins/agent/workspace/passage-base/tests/org.eclipse.passage.lic.bc.tests/src/org/eclipse/passage/lic/bc/tests/BcStreamCodecTest.java:[92] 
	codec.encodeStream(openInput, encodedOutput, key, username, password);
	      ^^^^^^^^^^^^^^^^^^^^^^^^^^^^^^^^^^^^^^^^^^^^^^^^^^^^^^^^^^^^^^^
The method encodeStream(InputStream, OutputStream, InputStream, String, String) from the type BcStreamCodec is deprecated
[WARNING] /home/jenkins/agent/workspace/passage-base/tests/org.eclipse.passage.lic.bc.tests/src/org/eclipse/passage/lic/bc/tests/BcStreamCodecTest.java:[99] 
	Object decodeKey = codec.decodeStream(encodedSource, openOutput, key, null);
	                         ^^^^^^^^^^^^^^^^^^^^^^^^^^^^^^^^^^^^^^^^^^^^^^^^^^
The method decodeStream(InputStream, OutputStream, InputStream, byte[]) from the type BcStreamCodec is deprecated
[WARNING] /home/jenkins/agent/workspace/passage-base/tests/org.eclipse.passage.lic.bc.tests/src/org/eclipse/passage/lic/bc/tests/BcPropertiesTest.java:[29] 
	assertEquals("Key algo should match", KEY_ALGO_DEFAULT, extractKeyAlgo(null)); //$NON-NLS-1$
	                                      ^^^^^^^^^^^^^^^^
The field BcProperties.KEY_ALGO_DEFAULT is deprecated
[WARNING] /home/jenkins/agent/workspace/passage-base/tests/org.eclipse.passage.lic.bc.tests/src/org/eclipse/passage/lic/bc/tests/BcPropertiesTest.java:[29] 
	assertEquals("Key algo should match", KEY_ALGO_DEFAULT, extractKeyAlgo(null)); //$NON-NLS-1$
	                                                        ^^^^^^^^^^^^^^^^^^^^
The method extractKeyAlgo(Map<String,Object>) from the type BcProperties is deprecated
[WARNING] /home/jenkins/agent/workspace/passage-base/tests/org.eclipse.passage.lic.bc.tests/src/org/eclipse/passage/lic/bc/tests/BcPropertiesTest.java:[30] 
	assertEquals("Key algo should match", KEY_ALGO_DEFAULT, extractKeyAlgo(new HashMap<>())); //$NON-NLS-1$
	                                      ^^^^^^^^^^^^^^^^
The field BcProperties.KEY_ALGO_DEFAULT is deprecated
[WARNING] /home/jenkins/agent/workspace/passage-base/tests/org.eclipse.passage.lic.bc.tests/src/org/eclipse/passage/lic/bc/tests/BcPropertiesTest.java:[30] 
	assertEquals("Key algo should match", KEY_ALGO_DEFAULT, extractKeyAlgo(new HashMap<>())); //$NON-NLS-1$
	                                                        ^^^^^^^^^^^^^^^^^^^^^^^^^^^^^^^
The method extractKeyAlgo(Map<String,Object>) from the type BcProperties is deprecated
[WARNING] /home/jenkins/agent/workspace/passage-base/tests/org.eclipse.passage.lic.bc.tests/src/org/eclipse/passage/lic/bc/tests/BcPropertiesTest.java:[35] 
	assertEquals("Key size should match", KEY_SIZE_DEFAULT, extractKeySize(null)); //$NON-NLS-1$
	                                      ^^^^^^^^^^^^^^^^
The field BcProperties.KEY_SIZE_DEFAULT is deprecated
[WARNING] /home/jenkins/agent/workspace/passage-base/tests/org.eclipse.passage.lic.bc.tests/src/org/eclipse/passage/lic/bc/tests/BcPropertiesTest.java:[35] 
	assertEquals("Key size should match", KEY_SIZE_DEFAULT, extractKeySize(null)); //$NON-NLS-1$
	                                                        ^^^^^^^^^^^^^^^^^^^^
The method extractKeySize(Map<String,Object>) from the type BcProperties is deprecated
[WARNING] /home/jenkins/agent/workspace/passage-base/tests/org.eclipse.passage.lic.bc.tests/src/org/eclipse/passage/lic/bc/tests/BcPropertiesTest.java:[36] 
	assertEquals("Key size should match", KEY_SIZE_DEFAULT, extractKeySize(new HashMap<>())); //$NON-NLS-1$
	                                      ^^^^^^^^^^^^^^^^
The field BcProperties.KEY_SIZE_DEFAULT is deprecated
[WARNING] /home/jenkins/agent/workspace/passage-base/tests/org.eclipse.passage.lic.bc.tests/src/org/eclipse/passage/lic/bc/tests/BcPropertiesTest.java:[36] 
	assertEquals("Key size should match", KEY_SIZE_DEFAULT, extractKeySize(new HashMap<>())); //$NON-NLS-1$
	                                                        ^^^^^^^^^^^^^^^^^^^^^^^^^^^^^^^
The method extractKeySize(Map<String,Object>) from the type BcProperties is deprecated
33 problems (33 warnings)
[INFO] 
[INFO] --- tycho-eclipserun-plugin:1.5.1:eclipse-run (default) @ org.eclipse.passage.lic.bc.tests ---
[INFO] Toolchain in tycho-eclipserun-plugin: JDK[/opt/tools/java/oracle/jdk-8/latest]
[INFO] Expected eclipse log file: /home/jenkins/agent/workspace/passage-base/tests/org.eclipse.passage.lic.bc.tests/target/eclipserun-work/data/.metadata/.log
[INFO] Command line:
	[/opt/tools/java/oracle/jdk-8/latest/bin/java, -jar, /home/jenkins/.m2/repository/p2/osgi/bundle/org.eclipse.equinox.launcher/1.5.700.v20200207-2156/org.eclipse.equinox.launcher-1.5.700.v20200207-2156.jar, -install, /home/jenkins/agent/workspace/passage-base/tests/org.eclipse.passage.lic.bc.tests/target/eclipserun-work, -configuration, /home/jenkins/agent/workspace/passage-base/tests/org.eclipse.passage.lic.bc.tests/target/eclipserun-work/configuration, -data, target/apibuild-workspace, -application, org.eclipse.ant.core.antRunner, -buildfile, target/.apibuild.xml]
Buildfile: target/.apibuild.xml

apigen:
BUILD SUCCESSFUL

BUILD SUCCESSFUL
Total time: 0 seconds
[INFO] 
[INFO] --- maven-resources-plugin:3.1.0:testResources (default-testResources) @ org.eclipse.passage.lic.bc.tests ---
[INFO] Using 'UTF-8' encoding to copy filtered resources.
[INFO] skip non existing resourceDirectory /home/jenkins/agent/workspace/passage-base/tests/org.eclipse.passage.lic.bc.tests/src/test/resources
[INFO] 
[INFO] --- tycho-source-plugin:1.5.1:plugin-source (attach-source) @ org.eclipse.passage.lic.bc.tests ---
[INFO] Building jar: /home/jenkins/agent/workspace/passage-base/tests/org.eclipse.passage.lic.bc.tests/target/org.eclipse.passage.lic.bc.tests-0.5.0-SNAPSHOT-sources.jar
[INFO] 
[INFO] --- target-platform-configuration:1.5.1:target-platform (default-target-platform) @ org.eclipse.passage.lic.bc.tests ---
[INFO] 
[INFO] --- tycho-packaging-plugin:1.5.1:package-plugin (default-package-plugin) @ org.eclipse.passage.lic.bc.tests ---
[INFO] Building jar: /home/jenkins/agent/workspace/passage-base/tests/org.eclipse.passage.lic.bc.tests/target/org.eclipse.passage.lic.bc.tests-0.5.0-SNAPSHOT.jar
[INFO] 
[INFO] --- tycho-p2-plugin:1.5.1:p2-metadata-default (default-p2-metadata-default) @ org.eclipse.passage.lic.bc.tests ---
[INFO] 
[INFO] --- tycho-source-feature-plugin:1.5.1:source-feature (source-feature) @ org.eclipse.passage.lic.bc.tests ---
[INFO] 
[INFO] --- tycho-p2-plugin:1.5.1:p2-metadata (attached-p2-metadata) @ org.eclipse.passage.lic.bc.tests ---
[INFO] No baseline version MavenProject: org.eclipse.passage:org.eclipse.passage.lic.bc.tests:0.5.0-SNAPSHOT @ /home/jenkins/agent/workspace/passage-base/tests/org.eclipse.passage.lic.bc.tests/.polyglot..META-INF_MANIFEST.MF
[INFO] 
[INFO] --- tycho-surefire-plugin:1.5.1:test (default-test) @ org.eclipse.passage.lic.bc.tests ---
[INFO] Expected eclipse log file: /home/jenkins/agent/workspace/passage-base/tests/org.eclipse.passage.lic.bc.tests/target/work/data/.metadata/.log
[INFO] Command line:
	[/opt/tools/java/oracle/jdk-8/1.8.0_202/jre/bin/java, -Dosgi.noShutdown=false, -Dosgi.os=linux, -Dosgi.ws=gtk, -Dosgi.arch=x86_64, -Dosgi.clean=true, -jar, /home/jenkins/.m2/repository/p2/osgi/bundle/org.eclipse.equinox.launcher/1.5.700.v20200207-2156/org.eclipse.equinox.launcher-1.5.700.v20200207-2156.jar, -data, /home/jenkins/agent/workspace/passage-base/tests/org.eclipse.passage.lic.bc.tests/target/work/data, -install, /home/jenkins/agent/workspace/passage-base/tests/org.eclipse.passage.lic.bc.tests/target/work, -configuration, /home/jenkins/agent/workspace/passage-base/tests/org.eclipse.passage.lic.bc.tests/target/work/configuration, -application, org.eclipse.tycho.surefire.osgibooter.headlesstest, -testproperties, /home/jenkins/agent/workspace/passage-base/tests/org.eclipse.passage.lic.bc.tests/target/surefire.properties]
Running org.eclipse.passage.lic.internal.bc.tests.StreamEncodingTest
Tests run: 7, Failures: 0, Errors: 1, Skipped: 0, Time elapsed: 0.512 s <<< FAILURE! - in org.eclipse.passage.lic.internal.bc.tests.StreamEncodingTest
passwordIsMandatory(org.eclipse.passage.lic.internal.bc.tests.StreamEncodingTest)  Time elapsed: 0.075 s
sourceIsMandatory(org.eclipse.passage.lic.internal.bc.tests.StreamEncodingTest)  Time elapsed: 0.001 s
properKeyIsRequired(org.eclipse.passage.lic.internal.bc.tests.StreamEncodingTest)  Time elapsed: 0.014 s  <<< ERROR!
java.lang.RuntimeException: unsupported version: 213
	at org.eclipse.passage.lic.internal.bc.tests.StreamEncodingTest.properKeyIsRequired(StreamEncodingTest.java:75)

keyIsMandatory(org.eclipse.passage.lic.internal.bc.tests.StreamEncodingTest)  Time elapsed: 0.001 s
ownerIsMandatory(org.eclipse.passage.lic.internal.bc.tests.StreamEncodingTest)  Time elapsed: 0.001 s
destinationIsMandatory(org.eclipse.passage.lic.internal.bc.tests.StreamEncodingTest)  Time elapsed: 0 s
encodingIsFunctional(org.eclipse.passage.lic.internal.bc.tests.StreamEncodingTest)  Time elapsed: 0.403 s
Running org.eclipse.passage.lic.internal.bc.tests.StreamDecodingTest
Tests run: 8, Failures: 0, Errors: 0, Skipped: 0, Time elapsed: 0.231 s - in org.eclipse.passage.lic.internal.bc.tests.StreamDecodingTest
sourceIsMandatory(org.eclipse.passage.lic.internal.bc.tests.StreamDecodingTest)  Time elapsed: 0.001 s
validDigestDoesNotFailDecoding(org.eclipse.passage.lic.internal.bc.tests.StreamDecodingTest)  Time elapsed: 0.038 s
invalidDigestFailsDecoding(org.eclipse.passage.lic.internal.bc.tests.StreamDecodingTest)  Time elapsed: 0.062 s
properKeyIsRequired(org.eclipse.passage.lic.internal.bc.tests.StreamDecodingTest)  Time elapsed: 0.042 s
keyIsMandatory(org.eclipse.passage.lic.internal.bc.tests.StreamDecodingTest)  Time elapsed: 0.001 s
targetIsMandatory(org.eclipse.passage.lic.internal.bc.tests.StreamDecodingTest)  Time elapsed: 0 s
decodingIsFunctional(org.eclipse.passage.lic.internal.bc.tests.StreamDecodingTest)  Time elapsed: 0.086 s
digestIsMandatory(org.eclipse.passage.lic.internal.bc.tests.StreamDecodingTest)  Time elapsed: 0 s
Running org.eclipse.passage.lic.internal.bc.tests.KeyPairGenerationTest
Tests run: 9, Failures: 0, Errors: 0, Skipped: 0, Time elapsed: 0.24 s - in org.eclipse.passage.lic.internal.bc.tests.KeyPairGenerationTest
passwordIsMandatory(org.eclipse.passage.lic.internal.bc.tests.KeyPairGenerationTest)  Time elapsed: 0.001 s
absentPublicKeyFileIsCreated(org.eclipse.passage.lic.internal.bc.tests.KeyPairGenerationTest)  Time elapsed: 0.057 s
absentPrivateKeyFileIsCreated(org.eclipse.passage.lic.internal.bc.tests.KeyPairGenerationTest)  Time elapsed: 0.052 s
privateKeyPathIsMandatory(org.eclipse.passage.lic.internal.bc.tests.KeyPairGenerationTest)  Time elapsed: 0 s
usernameIsMandatory(org.eclipse.passage.lic.internal.bc.tests.KeyPairGenerationTest)  Time elapsed: 0.001 s
generationSucceeds(org.eclipse.passage.lic.internal.bc.tests.KeyPairGenerationTest)  Time elapsed: 0.042 s
publicKeyPathIsMandatory(org.eclipse.passage.lic.internal.bc.tests.KeyPairGenerationTest)  Time elapsed: 0.001 s
generatedPairIsFunctional(org.eclipse.passage.lic.internal.bc.tests.KeyPairGenerationTest)  Time elapsed: 0.022 s
subsequentPairDiffer(org.eclipse.passage.lic.internal.bc.tests.KeyPairGenerationTest)  Time elapsed: 0.063 s
Running org.eclipse.passage.lic.bc.tests.BcStreamCodecTest
Tests run: 2, Failures: 0, Errors: 0, Skipped: 0, Time elapsed: 0.039 s - in org.eclipse.passage.lic.bc.tests.BcStreamCodecTest
testActivate(org.eclipse.passage.lic.bc.tests.BcStreamCodecTest)  Time elapsed: 0.016 s
testCodecPositive(org.eclipse.passage.lic.bc.tests.BcStreamCodecTest)  Time elapsed: 0.023 s
Running org.eclipse.passage.lic.bc.tests.BcPropertiesTest
Tests run: 2, Failures: 0, Errors: 0, Skipped: 0, Time elapsed: 0 s - in org.eclipse.passage.lic.bc.tests.BcPropertiesTest
testExtractKeyAlgo(org.eclipse.passage.lic.bc.tests.BcPropertiesTest)  Time elapsed: 0 s
testExtractKeySize(org.eclipse.passage.lic.bc.tests.BcPropertiesTest)  Time elapsed: 0 s

Results:

Errors: 
  StreamEncodingTest.properKeyIsRequired:75 » Runtime unsupported version: 213

Tests run: 28, Failures: 0, Errors: 1, Skipped: 0

[INFO] ------------------------------------------------------------------------
[INFO] Reactor Summary:
[INFO] 
[INFO] org.eclipse.passage.target 1.0.0-SNAPSHOT .......... SUCCESS [ 27.819 s]
[INFO] Passage LIC API 0.7.100-SNAPSHOT ................... SUCCESS [ 15.550 s]
[INFO] Passage LIC API Tests 0.1.0-SNAPSHOT ............... SUCCESS [  8.141 s]
[INFO] Passage LIC Base 0.6.200-SNAPSHOT .................. SUCCESS [  7.660 s]
[INFO] Passage LIC Equinox 0.6.100-SNAPSHOT ............... SUCCESS [  6.253 s]
[INFO] Passage LIC Equinox 0.6.400-SNAPSHOT ............... SUCCESS [  2.494 s]
[INFO] Passage LIC Base Tests 0.5.100-SNAPSHOT ............ SUCCESS [ 18.380 s]
[INFO] Data for Passage LIC Equinox requirements tests 0.1.0-SNAPSHOT SUCCESS [  5.349 s]
[INFO] Passage LIC Equinox Tests 0.6.0-SNAPSHOT ........... SUCCESS [  6.997 s]
[INFO] Passage LIC BC 0.5.100-SNAPSHOT .................... SUCCESS [  5.319 s]
[INFO] Passage LIC BC 0.6.100-SNAPSHOT .................... SUCCESS [  3.207 s]
[INFO] Passage LIC BC Tests 0.5.0-SNAPSHOT ................ FAILURE [  5.561 s]
[INFO] Passage LIC Net 0.5.300-SNAPSHOT ................... SKIPPED
[INFO] Passage LIC Email 0.1.200-SNAPSHOT ................. SKIPPED
[INFO] Passage LIC Net 0.6.200-SNAPSHOT ................... SKIPPED
[INFO] Passage LIC Net Tests 0.5.0-SNAPSHOT ............... SKIPPED
[INFO] Passage LIC Mail 0.2.0-SNAPSHOT .................... SKIPPED
[INFO] Passage LIC Mail 0.2.0-SNAPSHOT .................... SKIPPED
[INFO] Passage LIC Mail Tests 0.2.0-SNAPSHOT .............. SKIPPED
[INFO] Passage LIC HC 0.5.400-SNAPSHOT .................... SKIPPED
[INFO] Passage LIC HC 0.6.300-SNAPSHOT .................... SKIPPED
[INFO] Passage LIC HC Tests 0.1.0-SNAPSHOT ................ SKIPPED
[INFO] Passage LIC JSON 0.5.300-SNAPSHOT .................. SKIPPED
[INFO] Passage LIC JSON 0.6.200-SNAPSHOT .................. SKIPPED
[INFO] Passage LIC JSON Tests 0.5.100-SNAPSHOT ............ SKIPPED
[INFO] Passage LIC OSHI 0.5.400-SNAPSHOT .................. SKIPPED
[INFO] Passage LIC OSHI 0.6.400-SNAPSHOT .................. SKIPPED
[INFO] Passage LIC OSHI Tests 0.5.100-SNAPSHOT ............ SKIPPED
[INFO] Passage LIC EMF 1.0.0-SNAPSHOT ..................... SKIPPED
[INFO] Passage LIC EMF Meta 0.6.0-SNAPSHOT ................ SKIPPED
[INFO] Passage LIC EMF 1.0.0-SNAPSHOT ..................... SKIPPED
[INFO] Passage LIC EMF Tests 0.1.0-SNAPSHOT ............... SKIPPED
[INFO] Passage LIC JFace 0.6.300-SNAPSHOT ................. SKIPPED
[INFO] Passage LIC E4 Core 0.5.200-SNAPSHOT ............... SKIPPED
[INFO] Passage LIC E4 UI 0.5.300-SNAPSHOT ................. SKIPPED
[INFO] Passage LIC E4 UI 0.6.200-SNAPSHOT ................. SKIPPED
[INFO] Passage LIC JFace Tests 0.5.0-SNAPSHOT ............. SKIPPED
[INFO] Passage LIC Features 0.5.300-SNAPSHOT .............. SKIPPED
[INFO] Passage LIC Features Ecore 0.5.200-SNAPSHOT ........ SKIPPED
[INFO] Passage LIC Features Model 0.5.300-SNAPSHOT ........ SKIPPED
[INFO] Passage LIC Features Migration 0.5.200-SNAPSHOT .... SKIPPED
[INFO] Passage LIC Features Edit Support 0.5.200-SNAPSHOT . SKIPPED
[INFO] Passage LIC Features E4 UI 0.5.100-SNAPSHOT ........ SKIPPED
[INFO] Passage LIC Features 0.6.300-SNAPSHOT .............. SKIPPED
[INFO] Passage LIC Features Model Tests 0.1.0-SNAPSHOT .... SKIPPED
[INFO] Passage LIC Features Migration Tests 0.5.0-SNAPSHOT  SKIPPED
[INFO] Passage LIC Products 0.5.300-SNAPSHOT .............. SKIPPED
[INFO] Passage LIC Products Ecore 0.5.200-SNAPSHOT ........ SKIPPED
[INFO] Passage LIC Products Model 0.5.200-SNAPSHOT ........ SKIPPED
[INFO] Passage LIC Products Migration 0.5.200-SNAPSHOT .... SKIPPED
[INFO] Passage LIC Products Edit Support 0.5.200-SNAPSHOT . SKIPPED
[INFO] Passage LIC Products E4 UI 0.5.100-SNAPSHOT ........ SKIPPED
[INFO] Passage LIC Products 0.6.300-SNAPSHOT .............. SKIPPED
[INFO] Passage LIC Products Model Tests 0.1.0-SNAPSHOT .... SKIPPED
[INFO] Passage LIC Products Migration Tests 0.5.0-SNAPSHOT  SKIPPED
[INFO] Passage LIC Users 0.5.300-SNAPSHOT ................. SKIPPED
[INFO] Passage LIC Users Ecore 0.5.200-SNAPSHOT ........... SKIPPED
[INFO] Passage LIC Users Model 0.5.200-SNAPSHOT ........... SKIPPED
[INFO] Passage LIC Users Migration 0.5.200-SNAPSHOT ....... SKIPPED
[INFO] Passage LIC Users Edit Support 0.5.200-SNAPSHOT .... SKIPPED
[INFO] Passage LIC Users E4 UI 0.5.100-SNAPSHOT ........... SKIPPED
[INFO] Passage LIC Users 0.6.300-SNAPSHOT ................. SKIPPED
[INFO] Passage LIC Users Model Tests 0.1.0-SNAPSHOT ....... SKIPPED
[INFO] Passage LIC Users Migration Tests 0.5.0-SNAPSHOT ... SKIPPED
[INFO] Passage LIC Licenses 0.5.300-SNAPSHOT .............. SKIPPED
[INFO] Passage LIC Licenses Ecore 0.5.200-SNAPSHOT ........ SKIPPED
[INFO] Passage LIC Licenses Model 0.5.200-SNAPSHOT ........ SKIPPED
[INFO] Passage LIC Licenses Migration 0.5.200-SNAPSHOT .... SKIPPED
[INFO] Passage LIC Licenses Edit Support 0.5.200-SNAPSHOT . SKIPPED
[INFO] Passage LIC Licenses E4 UI 0.5.100-SNAPSHOT ........ SKIPPED
[INFO] Passage LIC Licenses 0.6.300-SNAPSHOT .............. SKIPPED
[INFO] Passage LIC Licenses Model Tests 0.1.0-SNAPSHOT .... SKIPPED
[INFO] Passage LIC Licenses Migration Tests 0.5.0-SNAPSHOT  SKIPPED
[INFO] Passage LIC Compile Branding 0.1.100-SNAPSHOT ...... SKIPPED
[INFO] Passage LIC Compile 1.0.0-SNAPSHOT ................. SKIPPED
[INFO] Passage LIC Execute Branding 0.1.100-SNAPSHOT ...... SKIPPED
[INFO] Passage LIC Execute 1.0.0-SNAPSHOT ................. SKIPPED
[INFO] Passage LIC Define Branding 0.1.100-SNAPSHOT ....... SKIPPED
[INFO] Passage LIC Define 1.0.0-SNAPSHOT .................. SKIPPED
[INFO] Passage LIC Integration Tests 0.6.0-SNAPSHOT ....... SKIPPED
[INFO] org.eclipse.passage.lic.repository 1.0.0-SNAPSHOT .. SKIPPED
[INFO] org.eclipse.passage.lic.aggregator 1.0.0-SNAPSHOT .. SKIPPED
[INFO] Passage LOC API 0.6.0-SNAPSHOT ..................... SKIPPED
[INFO] Passage LOC Workbench 1.0.0-SNAPSHOT ............... SKIPPED
[INFO] Passage LOC Workbench EMF Forms 1.0.0-SNAPSHOT ..... SKIPPED
[INFO] Passage LOC Workbench 1.0.0-SNAPSHOT ............... SKIPPED
[INFO] Passage LOC API Tests 0.1.0-SNAPSHOT ............... SKIPPED
[INFO] Passage LOC Workbench Tests 0.1.100-SNAPSHOT ....... SKIPPED
[INFO] Passage LOC Edit UI 0.6.100-SNAPSHOT ............... SKIPPED
[INFO] Passage LOC Edit UI 0.7.0-SNAPSHOT ................. SKIPPED
[INFO] Passage LOC YARS API 0.1.0-SNAPSHOT ................ SKIPPED
[INFO] Passage LOC Report Core 0.2.0-SNAPSHOT ............. SKIPPED
[INFO] Passage LOC Report UI 0.2.0-SNAPSHOT ............... SKIPPED
[INFO] Passage LOC Report 0.6.0-SNAPSHOT .................. SKIPPED
[INFO] Passage LOC YARS API Tests 0.1.0-SNAPSHOT .......... SKIPPED
[INFO] Passage LOC Report Core Tests 0.1.0-SNAPSHOT ....... SKIPPED
[INFO] Passage LOC Features Core 0.6.0-SNAPSHOT ........... SKIPPED
[INFO] Passage LOC Features UI 0.6.0-SNAPSHOT ............. SKIPPED
[INFO] Passage LOC Features EMF Forms 0.6.0-SNAPSHOT ...... SKIPPED
[INFO] Passage LOC Features 0.7.0-SNAPSHOT ................ SKIPPED
[INFO] Passage LOC Features Core Tests 0.1.0-SNAPSHOT ..... SKIPPED
[INFO] Passage LOC Products Core 0.6.0-SNAPSHOT ........... SKIPPED
[INFO] Passage LOC Products UI 0.6.0-SNAPSHOT ............. SKIPPED
[INFO] Passage LOC Products EMF Forms 0.6.0-SNAPSHOT ...... SKIPPED
[INFO] Passage LOC Products 0.7.0-SNAPSHOT ................ SKIPPED
[INFO] Passage LOC Licenses Core 0.6.0-SNAPSHOT ........... SKIPPED
[INFO] Passage LOC Users Core 0.6.0-SNAPSHOT .............. SKIPPED
[INFO] Passage LOC Users UI 0.7.0-SNAPSHOT ................ SKIPPED
[INFO] Passage LOC Licenses UI 0.6.0-SNAPSHOT ............. SKIPPED
[INFO] Passage LOC Licenses EMF Forms 0.7.0-SNAPSHOT ...... SKIPPED
[INFO] Passage LOC Licenses 0.7.0-SNAPSHOT ................ SKIPPED
[INFO] Passage LOC Billing Core 0.1.0-SNAPSHOT ............ SKIPPED
[INFO] Passage LOC Billing Feature 0.1.0-SNAPSHOT ......... SKIPPED
[INFO] Passage LOC Billing Core Tests 0.1.0-SNAPSHOT ...... SKIPPED
[INFO] Passage LOC Users EMF Forms 0.6.0-SNAPSHOT ......... SKIPPED
[INFO] Passage LOC Users 0.7.0-SNAPSHOT ................... SKIPPED
[INFO] Passage LOC Dashboard 1.0.0-SNAPSHOT ............... SKIPPED
[INFO] Passage LOC Dashboard 1.0.0-SNAPSHOT ............... SKIPPED
[INFO] Passage LOC Workbench 1.0.0-SNAPSHOT ............... SKIPPED
[INFO] Passage LOC Operator 1.0.0-SNAPSHOT ................ SKIPPED
[INFO] org.eclipse.passage.loc.repository 1.0.0-SNAPSHOT .. SKIPPED
[INFO] org.eclipse.passage.loc.operator.product 1.0.0-SNAPSHOT SKIPPED
[INFO] org.eclipse.passage.loc.aggregator 1.0.0-SNAPSHOT .. SKIPPED
[INFO] Passage LBC Target 1.0.0-SNAPSHOT .................. SKIPPED
[INFO] Passage LBC API 0.5.100-SNAPSHOT ................... SKIPPED
[INFO] Passage LBC Base 0.5.100-SNAPSHOT .................. SKIPPED
[INFO] Passage LBC Core 0.5.100-SNAPSHOT .................. SKIPPED
[INFO] Passage LBC Jetty 0.5.100-SNAPSHOT ................. SKIPPED
[INFO] Passage LBC Server 0.5.100-SNAPSHOT ................ SKIPPED
[INFO] Passage LBC Server  1.0.0-SNAPSHOT ................. SKIPPED
[INFO] Passage LBC Server Tests 0.6.100-SNAPSHOT .......... SKIPPED
[INFO] org.eclipse.passage.lbc.repository 1.0.0-SNAPSHOT .. SKIPPED
[INFO] org.eclipse.passage.lbc.server.product 1.0.0-SNAPSHOT SKIPPED
[INFO] org.eclipse.passage.lbc.aggregator 1.0.0-SNAPSHOT .. SKIPPED
[INFO] Passage LDC PDE UI Templates 0.5.200-SNAPSHOT ...... SKIPPED
[INFO] Passage LDC 0.5.300-SNAPSHOT ....................... SKIPPED
[INFO] Passage LDC 1.0.0-SNAPSHOT ......................... SKIPPED
[INFO] org.eclipse.passage.ldc.repository 1.0.0-SNAPSHOT .. SKIPPED
[INFO] org.eclipse.passage.ldc.aggregator 1.0.0-SNAPSHOT .. SKIPPED
[INFO] org.eclipse.passage.root 1.0.0-SNAPSHOT ............ SKIPPED
[INFO] ------------------------------------------------------------------------
[INFO] BUILD FAILURE
[INFO] ------------------------------------------------------------------------
[INFO] Total time:  04:19 min
[INFO] Finished at: 2020-07-15T19:34:37Z
[INFO] ------------------------------------------------------------------------
[ERROR] Failed to execute goal org.eclipse.tycho:tycho-surefire-plugin:1.5.1:test (default-test) on project org.eclipse.passage.lic.bc.tests: There are test failures.
[ERROR] 
[ERROR] Please refer to /home/jenkins/agent/workspace/passage-base/tests/org.eclipse.passage.lic.bc.tests/target/surefire-reports for the individual test results.
[ERROR] -> [Help 1]
[ERROR] 
[ERROR] To see the full stack trace of the errors, re-run Maven with the -e switch.
[ERROR] Re-run Maven using the -X switch to enable full debug logging.
[ERROR] 
[ERROR] For more information about the errors and possible solutions, please read the following articles:
[ERROR] [Help 1] http://cwiki.apache.org/confluence/display/MAVEN/MojoFailureException
[ERROR] 
[ERROR] After correcting the problems, you can resume the build with the command
[ERROR]   mvn <args> -rf :org.eclipse.passage.lic.bc.tests
Build step 'Invoke top-level Maven targets' marked build as failure
$ ssh-agent -k
unset SSH_AUTH_SOCK;
unset SSH_AGENT_PID;
echo Agent pid 89 killed;
[ssh-agent] Stopped.
Not sending mail to unregistered user elena.parovyshnaya@gmail.com
Sending e-mails to: alexander.fedorov@arsysop.ru sergei.kovalchuk@arsysop.ru elena.parovyshnaia@arsysop.ru
Finished: FAILURE