FailedConsole Output

Skipping 1,402 KB.. Full Log
issionTransport.java:[24] 
	import org.eclipse.passage.lic.api.access.FeaturePermission;
	       ^^^^^^^^^^^^^^^^^^^^^^^^^^^^^^^^^^^^^^^^^^^^^^^^^^^^
The type FeaturePermission is deprecated
[WARNING] /home/jenkins/agent/workspace/passage-base/bundles/org.eclipse.passage.lic.json/src/org/eclipse/passage/lic/internal/json/JsonPermissionTransport.java:[30] 
	@Component(property = { LICENSING_CONTENT_TYPE + '=' + LICENSING_CONTENT_TYPE_JSON })
	                        ^^^^^^^^^^^^^^^^^^^^^^
The field LicensingProperties.LICENSING_CONTENT_TYPE is deprecated
[WARNING] /home/jenkins/agent/workspace/passage-base/bundles/org.eclipse.passage.lic.json/src/org/eclipse/passage/lic/internal/json/JsonPermissionTransport.java:[30] 
	@Component(property = { LICENSING_CONTENT_TYPE + '=' + LICENSING_CONTENT_TYPE_JSON })
	                                                       ^^^^^^^^^^^^^^^^^^^^^^^^^^^
The field LicensingProperties.LICENSING_CONTENT_TYPE_JSON is deprecated
[WARNING] /home/jenkins/agent/workspace/passage-base/bundles/org.eclipse.passage.lic.json/src/org/eclipse/passage/lic/internal/json/JsonPermissionTransport.java:[34] 
	public Iterable<FeaturePermission> readPermissions(InputStream input) throws IOException {
	                ^^^^^^^^^^^^^^^^^
The type FeaturePermission is deprecated
[WARNING] /home/jenkins/agent/workspace/passage-base/bundles/org.eclipse.passage.lic.json/src/org/eclipse/passage/lic/internal/json/JsonPermissionTransport.java:[35] 
	Collection<FeaturePermission> descriptors = new ArrayList<>();
	           ^^^^^^^^^^^^^^^^^
The type FeaturePermission is deprecated
[WARNING] /home/jenkins/agent/workspace/passage-base/bundles/org.eclipse.passage.lic.json/src/org/eclipse/passage/lic/internal/json/JsonPermissionTransport.java:[36] 
	ObjectMapper mapper = JsonTransport.createObjectMapper();
	                      ^^^^^^^^^^^^^
The type JsonTransport is deprecated
[WARNING] /home/jenkins/agent/workspace/passage-base/bundles/org.eclipse.passage.lic.json/src/org/eclipse/passage/lic/internal/json/JsonPermissionTransport.java:[36] 
	ObjectMapper mapper = JsonTransport.createObjectMapper();
	                                    ^^^^^^^^^^^^^^^^^^^^
The method createObjectMapper() from the type JsonTransport is deprecated
[WARNING] /home/jenkins/agent/workspace/passage-base/bundles/org.eclipse.passage.lic.json/src/org/eclipse/passage/lic/internal/json/JsonPermissionTransport.java:[43] 
	public void writePermissions(Iterable<FeaturePermission> permissions, OutputStream output) throws IOException {
	                                      ^^^^^^^^^^^^^^^^^
The type FeaturePermission is deprecated
[WARNING] /home/jenkins/agent/workspace/passage-base/bundles/org.eclipse.passage.lic.json/src/org/eclipse/passage/lic/internal/json/JsonPermissionTransport.java:[48] 
	for (FeaturePermission permission : permissions) {
	     ^^^^^^^^^^^^^^^^^
The type FeaturePermission is deprecated
[WARNING] /home/jenkins/agent/workspace/passage-base/bundles/org.eclipse.passage.lic.json/src/org/eclipse/passage/lic/internal/json/JsonPermissionTransport.java:[52] 
	ObjectMapper mapper = JsonTransport.createObjectMapper();
	                      ^^^^^^^^^^^^^
The type JsonTransport is deprecated
[WARNING] /home/jenkins/agent/workspace/passage-base/bundles/org.eclipse.passage.lic.json/src/org/eclipse/passage/lic/internal/json/JsonPermissionTransport.java:[52] 
	ObjectMapper mapper = JsonTransport.createObjectMapper();
	                                    ^^^^^^^^^^^^^^^^^^^^
The method createObjectMapper() from the type JsonTransport is deprecated
[WARNING] /home/jenkins/agent/workspace/passage-base/bundles/org.eclipse.passage.lic.json/src/org/eclipse/passage/lic/internal/json/FeaturePermissionAggregator.java:[18] 
	import org.eclipse.passage.lic.api.access.FeaturePermission;
	       ^^^^^^^^^^^^^^^^^^^^^^^^^^^^^^^^^^^^^^^^^^^^^^^^^^^^
The type FeaturePermission is deprecated
[WARNING] /home/jenkins/agent/workspace/passage-base/bundles/org.eclipse.passage.lic.json/src/org/eclipse/passage/lic/internal/json/FeaturePermissionAggregator.java:[24] 
	public void addFeaturePermission(FeaturePermission d) {
	                                 ^^^^^^^^^^^^^^^^^
The type FeaturePermission is deprecated
[WARNING] /home/jenkins/agent/workspace/passage-base/bundles/org.eclipse.passage.lic.json/src/org/eclipse/passage/lic/internal/json/FeaturePermissionMixIn.java:[17] 
	import org.eclipse.passage.lic.api.access.FeaturePermission;
	       ^^^^^^^^^^^^^^^^^^^^^^^^^^^^^^^^^^^^^^^^^^^^^^^^^^^^
The type FeaturePermission is deprecated
[WARNING] /home/jenkins/agent/workspace/passage-base/bundles/org.eclipse.passage.lic.json/src/org/eclipse/passage/lic/internal/json/FeaturePermissionMixIn.java:[22] 
	final class FeaturePermissionMixIn implements FeaturePermission {
	                                              ^^^^^^^^^^^^^^^^^
The type FeaturePermission is deprecated
[WARNING] /home/jenkins/agent/workspace/passage-base/bundles/org.eclipse.passage.lic.json/src/org/eclipse/passage/lic/internal/json/FeaturePermissionMixIn.java:[24] 
	static FeaturePermissionMixIn create(FeaturePermission d) {
	                                     ^^^^^^^^^^^^^^^^^
The type FeaturePermission is deprecated
[WARNING] /home/jenkins/agent/workspace/passage-base/bundles/org.eclipse.passage.lic.json/src/org/eclipse/passage/lic/internal/json/FeaturePermissionMixIn.java:[25] 
	LicensingConditionMixIn licensingCondition = LicensingConditionMixIn.create(d.getLicensingCondition());
	^^^^^^^^^^^^^^^^^^^^^^^
The type LicensingConditionMixIn is deprecated
[WARNING] /home/jenkins/agent/workspace/passage-base/bundles/org.eclipse.passage.lic.json/src/org/eclipse/passage/lic/internal/json/FeaturePermissionMixIn.java:[25] 
	LicensingConditionMixIn licensingCondition = LicensingConditionMixIn.create(d.getLicensingCondition());
	                                             ^^^^^^^^^^^^^^^^^^^^^^^
The type LicensingConditionMixIn is deprecated
[WARNING] /home/jenkins/agent/workspace/passage-base/bundles/org.eclipse.passage.lic.json/src/org/eclipse/passage/lic/internal/json/FeaturePermissionMixIn.java:[25] 
	LicensingConditionMixIn licensingCondition = LicensingConditionMixIn.create(d.getLicensingCondition());
	                                                                     ^^^^^^^^^^^^^^^^^^^^^^^^^^^^^^^^^
The method create(LicensingCondition) from the type LicensingConditionMixIn is deprecated
[WARNING] /home/jenkins/agent/workspace/passage-base/bundles/org.eclipse.passage.lic.json/src/org/eclipse/passage/lic/internal/json/FeaturePermissionMixIn.java:[25] 
	LicensingConditionMixIn licensingCondition = LicensingConditionMixIn.create(d.getLicensingCondition());
	                                                                              ^^^^^^^^^^^^^^^^^^^^^^^
The method getLicensingCondition() from the type FeaturePermission is deprecated
[WARNING] /home/jenkins/agent/workspace/passage-base/bundles/org.eclipse.passage.lic.json/src/org/eclipse/passage/lic/internal/json/FeaturePermissionMixIn.java:[26] 
	LicensingConfigurationMixIn licensingConfiguration = LicensingConfigurationMixIn
	^^^^^^^^^^^^^^^^^^^^^^^^^^^
The type LicensingConfigurationMixIn is deprecated
[WARNING] /home/jenkins/agent/workspace/passage-base/bundles/org.eclipse.passage.lic.json/src/org/eclipse/passage/lic/internal/json/FeaturePermissionMixIn.java:[26] 
	LicensingConfigurationMixIn licensingConfiguration = LicensingConfigurationMixIn
	                                                     ^^^^^^^^^^^^^^^^^^^^^^^^^^^
The type LicensingConfigurationMixIn is deprecated
[WARNING] /home/jenkins/agent/workspace/passage-base/bundles/org.eclipse.passage.lic.json/src/org/eclipse/passage/lic/internal/json/FeaturePermissionMixIn.java:[27] 
	.create(d.getLicensingConfiguration());
	 ^^^^^^^^^^^^^^^^^^^^^^^^^^^^^^^^^^^^^
The method create(LicensingConfiguration) from the type LicensingConfigurationMixIn is deprecated
[WARNING] /home/jenkins/agent/workspace/passage-base/bundles/org.eclipse.passage.lic.json/src/org/eclipse/passage/lic/internal/json/FeaturePermissionMixIn.java:[27] 
	.create(d.getLicensingConfiguration());
	          ^^^^^^^^^^^^^^^^^^^^^^^^^^^
The method getLicensingConfiguration() from the type FeaturePermission is deprecated
[WARNING] /home/jenkins/agent/workspace/passage-base/bundles/org.eclipse.passage.lic.json/src/org/eclipse/passage/lic/internal/json/FeaturePermissionMixIn.java:[28] 
	Date leaseDate = d.getLeaseDate();
	                   ^^^^^^^^^^^^^^
The method getLeaseDate() from the type FeaturePermission is deprecated
[WARNING] /home/jenkins/agent/workspace/passage-base/bundles/org.eclipse.passage.lic.json/src/org/eclipse/passage/lic/internal/json/FeaturePermissionMixIn.java:[29] 
	Date expireDate = d.getExpireDate();
	                    ^^^^^^^^^^^^^^^
The method getExpireDate() from the type FeaturePermission is deprecated
[WARNING] /home/jenkins/agent/workspace/passage-base/bundles/org.eclipse.passage.lic.json/src/org/eclipse/passage/lic/internal/json/FeaturePermissionMixIn.java:[35] 
	private final LicensingConfigurationMixIn licensingConfiguration;
	              ^^^^^^^^^^^^^^^^^^^^^^^^^^^
The type LicensingConfigurationMixIn is deprecated
[WARNING] /home/jenkins/agent/workspace/passage-base/bundles/org.eclipse.passage.lic.json/src/org/eclipse/passage/lic/internal/json/FeaturePermissionMixIn.java:[36] 
	private final LicensingConditionMixIn licensingCondition;
	              ^^^^^^^^^^^^^^^^^^^^^^^
The type LicensingConditionMixIn is deprecated
[WARNING] /home/jenkins/agent/workspace/passage-base/bundles/org.eclipse.passage.lic.json/src/org/eclipse/passage/lic/internal/json/FeaturePermissionMixIn.java:[41] 
	FeaturePermissionMixIn(@JsonProperty("licensingConfiguration") LicensingConfigurationMixIn licensingConfiguration,
	                                                               ^^^^^^^^^^^^^^^^^^^^^^^^^^^
The type LicensingConfigurationMixIn is deprecated
[WARNING] /home/jenkins/agent/workspace/passage-base/bundles/org.eclipse.passage.lic.json/src/org/eclipse/passage/lic/internal/json/FeaturePermissionMixIn.java:[42] 
	@JsonProperty("licensingCondition") LicensingConditionMixIn licensingCondition,
	                                    ^^^^^^^^^^^^^^^^^^^^^^^
The type LicensingConditionMixIn is deprecated
[WARNING] /home/jenkins/agent/workspace/passage-base/bundles/org.eclipse.passage.lic.json/src/org/eclipse/passage/lic/internal/json/FeaturePermissionMixIn.java:[51] 
	public LicensingConditionMixIn getLicensingCondition() {
	       ^^^^^^^^^^^^^^^^^^^^^^^
The type LicensingConditionMixIn is deprecated
[WARNING] /home/jenkins/agent/workspace/passage-base/bundles/org.eclipse.passage.lic.json/src/org/eclipse/passage/lic/internal/json/FeaturePermissionMixIn.java:[56] 
	public LicensingConfigurationMixIn getLicensingConfiguration() {
	       ^^^^^^^^^^^^^^^^^^^^^^^^^^^
The type LicensingConfigurationMixIn is deprecated
32 problems (32 warnings)
[INFO] 
[INFO] --- tycho-eclipserun-plugin:1.5.1:eclipse-run (default) @ org.eclipse.passage.lic.json ---
[INFO] Toolchain in tycho-eclipserun-plugin: JDK[/opt/tools/java/oracle/jdk-8/latest]
[INFO] Expected eclipse log file: /home/jenkins/agent/workspace/passage-base/bundles/org.eclipse.passage.lic.json/target/eclipserun-work/data/.metadata/.log
[INFO] Command line:
	[/opt/tools/java/oracle/jdk-8/latest/bin/java, -jar, /home/jenkins/.m2/repository/p2/osgi/bundle/org.eclipse.equinox.launcher/1.5.700.v20200207-2156/org.eclipse.equinox.launcher-1.5.700.v20200207-2156.jar, -install, /home/jenkins/agent/workspace/passage-base/bundles/org.eclipse.passage.lic.json/target/eclipserun-work, -configuration, /home/jenkins/agent/workspace/passage-base/bundles/org.eclipse.passage.lic.json/target/eclipserun-work/configuration, -data, target/apibuild-workspace, -application, org.eclipse.ant.core.antRunner, -buildfile, target/.apibuild.xml]
Buildfile: target/.apibuild.xml

apigen:
BUILD SUCCESSFUL

BUILD SUCCESSFUL
Total time: 0 seconds
[INFO] 
[INFO] --- maven-resources-plugin:3.1.0:testResources (default-testResources) @ org.eclipse.passage.lic.json ---
[INFO] Using 'UTF-8' encoding to copy filtered resources.
[INFO] skip non existing resourceDirectory /home/jenkins/agent/workspace/passage-base/bundles/org.eclipse.passage.lic.json/src/test/resources
[INFO] 
[INFO] --- tycho-source-plugin:1.5.1:plugin-source (attach-source) @ org.eclipse.passage.lic.json ---
[INFO] Building jar: /home/jenkins/agent/workspace/passage-base/bundles/org.eclipse.passage.lic.json/target/org.eclipse.passage.lic.json-0.5.300-SNAPSHOT-sources.jar
[INFO] 
[INFO] --- target-platform-configuration:1.5.1:target-platform (default-target-platform) @ org.eclipse.passage.lic.json ---
[INFO] 
[INFO] --- tycho-packaging-plugin:1.5.1:package-plugin (default-package-plugin) @ org.eclipse.passage.lic.json ---
[INFO] Building jar: /home/jenkins/agent/workspace/passage-base/bundles/org.eclipse.passage.lic.json/target/org.eclipse.passage.lic.json-0.5.300-SNAPSHOT.jar
[INFO] 
[INFO] --- tycho-p2-plugin:1.5.1:p2-metadata-default (default-p2-metadata-default) @ org.eclipse.passage.lic.json ---
[INFO] 
[INFO] --- tycho-source-feature-plugin:1.5.1:source-feature (source-feature) @ org.eclipse.passage.lic.json ---
[INFO] 
[INFO] --- tycho-p2-plugin:1.5.1:p2-metadata (attached-p2-metadata) @ org.eclipse.passage.lic.json ---
[INFO] No baseline version MavenProject: org.eclipse.passage:org.eclipse.passage.lic.json:0.5.300-SNAPSHOT @ /home/jenkins/agent/workspace/passage-base/bundles/org.eclipse.passage.lic.json/.polyglot..META-INF_MANIFEST.MF
[INFO] 
[INFO] --- tycho-pack200a-plugin:1.7.0:normalize (pack200-normalize) @ org.eclipse.passage.lic.json ---
[INFO] Pack200 normalizing jar /home/jenkins/agent/workspace/passage-base/bundles/org.eclipse.passage.lic.json/target/org.eclipse.passage.lic.json-0.5.300-SNAPSHOT.jar
[INFO] 
[INFO] --- eclipse-jarsigner-plugin:1.1.7:sign (sign) @ org.eclipse.passage.lic.json ---
[INFO] Signing jar: /home/jenkins/agent/workspace/passage-base/bundles/org.eclipse.passage.lic.json/target/org.eclipse.passage.lic.json-0.5.300-SNAPSHOT.jar
[INFO] Signing jar: /home/jenkins/agent/workspace/passage-base/bundles/org.eclipse.passage.lic.json/target/org.eclipse.passage.lic.json-0.5.300-SNAPSHOT-sources.jar
[INFO] 
[INFO] --- tycho-pack200b-plugin:1.7.0:pack (pack200-pack) @ org.eclipse.passage.lic.json ---
[INFO] Pack200 packing jar /home/jenkins/agent/workspace/passage-base/bundles/org.eclipse.passage.lic.json/target/org.eclipse.passage.lic.json-0.5.300-SNAPSHOT.jar
[INFO] 
[INFO] --- tycho-p2-plugin:1.5.1:p2-metadata (p2-metadata) @ org.eclipse.passage.lic.json ---
[INFO] No baseline version MavenProject: org.eclipse.passage:org.eclipse.passage.lic.json:0.5.300-SNAPSHOT @ /home/jenkins/agent/workspace/passage-base/bundles/org.eclipse.passage.lic.json/.polyglot..META-INF_MANIFEST.MF
[INFO] 
[INFO] --- tycho-p2-extras-plugin:1.5.1:compare-version-with-baselines (compare-attached-artifacts-with-release) @ org.eclipse.passage.lic.json ---
[INFO] Fetching org.eclipse.passage.lic.json_0.5.200.v20200128-0518.jar.pack.gz from https://download.eclipse.org/passage/updates/release/0.9.0/ldc/plugins/ (13.48kB)
[INFO] Fetching org.eclipse.passage.lic.json_0.5.200.v20200128-0518.jar.pack.gz from https://download.eclipse.org/passage/updates/release/0.9.0/ldc/plugins/ (13.48kB)
[INFO] Fetching org.eclipse.passage.lic.json.source_0.5.200.v20200128-0518.jar from https://download.eclipse.org/passage/updates/release/0.9.0/ldc/plugins/ (14.8kB)
[INFO] Fetching org.eclipse.passage.lic.json.source_0.5.200.v20200128-0518.jar from https://download.eclipse.org/passage/updates/release/0.9.0/ldc/plugins/ (14.8kB)
[INFO] 
[INFO] ------< org.eclipse.passage:org.eclipse.passage.lic.json.feature >------
[INFO] Building Passage LIC JSON 0.6.200-SNAPSHOT                      [24/140]
[INFO] --------------------------[ eclipse-feature ]---------------------------
[INFO] 
[INFO] --- maven-clean-plugin:3.1.0:clean (default-clean) @ org.eclipse.passage.lic.json.feature ---
[INFO] Deleting /home/jenkins/agent/workspace/passage-base/features/org.eclipse.passage.lic.json.feature/target
[INFO] 
[INFO] --- tycho-packaging-plugin:1.5.1:build-qualifier-aggregator (default-build-qualifier-aggregator) @ org.eclipse.passage.lic.json.feature ---
[INFO] The project's OSGi version is 0.6.200.v20200708-0507
[INFO] 
[INFO] --- tycho-packaging-plugin:1.5.1:validate-id (default-validate-id) @ org.eclipse.passage.lic.json.feature ---
[INFO] 
[INFO] --- tycho-packaging-plugin:1.5.1:validate-version (default-validate-version) @ org.eclipse.passage.lic.json.feature ---
[INFO] 
[INFO] --- eclipse-cbi-plugin:1.1.8-SNAPSHOT:generate-api-build-xml (default) @ org.eclipse.passage.lic.json.feature ---
[INFO] 
[INFO] --- tycho-eclipserun-plugin:1.5.1:eclipse-run (default) @ org.eclipse.passage.lic.json.feature ---
[INFO] 
[INFO] --- tycho-source-plugin:1.5.1:plugin-source (attach-source) @ org.eclipse.passage.lic.json.feature ---
[INFO] 
[INFO] --- target-platform-configuration:1.5.1:target-platform (default-target-platform) @ org.eclipse.passage.lic.json.feature ---
[INFO] 
[INFO] --- tycho-packaging-plugin:1.5.1:package-feature (default-package-feature) @ org.eclipse.passage.lic.json.feature ---
[INFO] Building jar: /home/jenkins/agent/workspace/passage-base/features/org.eclipse.passage.lic.json.feature/target/org.eclipse.passage.lic.json.feature-0.6.200-SNAPSHOT.jar
[INFO] 
[INFO] --- tycho-p2-plugin:1.5.1:p2-metadata-default (default-p2-metadata-default) @ org.eclipse.passage.lic.json.feature ---
[INFO] 
[INFO] --- tycho-p2-plugin:1.5.1:feature-p2-metadata (default-feature-p2-metadata) @ org.eclipse.passage.lic.json.feature ---
[INFO] 
[INFO] --- tycho-source-feature-plugin:1.5.1:source-feature (source-feature) @ org.eclipse.passage.lic.json.feature ---
[INFO] Building jar: /home/jenkins/agent/workspace/passage-base/features/org.eclipse.passage.lic.json.feature/target/org.eclipse.passage.lic.json.feature-0.6.200-SNAPSHOT-sources-feature.jar
[INFO] 
[INFO] --- tycho-p2-plugin:1.5.1:p2-metadata (attached-p2-metadata) @ org.eclipse.passage.lic.json.feature ---
[INFO] No baseline version MavenProject: org.eclipse.passage:org.eclipse.passage.lic.json.feature:0.6.200-SNAPSHOT @ /home/jenkins/agent/workspace/passage-base/features/org.eclipse.passage.lic.json.feature/.polyglot.feature.xml.takari_issue_192
[INFO] 
[INFO] --- tycho-pack200a-plugin:1.7.0:normalize (pack200-normalize) @ org.eclipse.passage.lic.json.feature ---
[INFO] 
[INFO] --- eclipse-jarsigner-plugin:1.1.7:sign (sign) @ org.eclipse.passage.lic.json.feature ---
[INFO] Signing jar: /home/jenkins/agent/workspace/passage-base/features/org.eclipse.passage.lic.json.feature/target/org.eclipse.passage.lic.json.feature-0.6.200-SNAPSHOT.jar
[INFO] Signing jar: /home/jenkins/agent/workspace/passage-base/features/org.eclipse.passage.lic.json.feature/target/org.eclipse.passage.lic.json.feature-0.6.200-SNAPSHOT-sources-feature.jar
[INFO] 
[INFO] --- tycho-pack200b-plugin:1.7.0:pack (pack200-pack) @ org.eclipse.passage.lic.json.feature ---
[INFO] 
[INFO] --- tycho-p2-plugin:1.5.1:p2-metadata (p2-metadata) @ org.eclipse.passage.lic.json.feature ---
[INFO] No baseline version MavenProject: org.eclipse.passage:org.eclipse.passage.lic.json.feature:0.6.200-SNAPSHOT @ /home/jenkins/agent/workspace/passage-base/features/org.eclipse.passage.lic.json.feature/.polyglot.feature.xml.takari_issue_192
[INFO] 
[INFO] --- tycho-p2-extras-plugin:1.5.1:compare-version-with-baselines (compare-attached-artifacts-with-release) @ org.eclipse.passage.lic.json.feature ---
[INFO] Fetching org.eclipse.passage.lic.json.feature_0.6.100.v20200128-0518.jar from https://download.eclipse.org/passage/updates/release/0.9.0/ldc/features/ (18.99kB)
[INFO] Fetching org.eclipse.passage.lic.json.feature_0.6.100.v20200128-0518.jar from https://download.eclipse.org/passage/updates/release/0.9.0/ldc/features/ (18.99kB)
[INFO] Fetching org.eclipse.passage.lic.json.feature.source_0.6.100.v20200128-0518.jar from https://download.eclipse.org/passage/updates/release/0.9.0/ldc/features/ (18.52kB)
[INFO] Fetching org.eclipse.passage.lic.json.feature.source_0.6.100.v20200128-0518.jar from https://download.eclipse.org/passage/updates/release/0.9.0/ldc/features/ (18.52kB)
[INFO] 
[INFO] -------< org.eclipse.passage:org.eclipse.passage.lic.json.tests >-------
[INFO] Building Passage LIC JSON Tests 0.5.100-SNAPSHOT                [25/140]
[INFO] ------------------------[ eclipse-test-plugin ]-------------------------
[INFO] 
[INFO] --- maven-clean-plugin:3.1.0:clean (default-clean) @ org.eclipse.passage.lic.json.tests ---
[INFO] 
[INFO] --- tycho-packaging-plugin:1.5.1:build-qualifier (default-build-qualifier) @ org.eclipse.passage.lic.json.tests ---
[INFO] The project's OSGi version is 0.5.100.v20200707-1854
[INFO] 
[INFO] --- tycho-packaging-plugin:1.5.1:validate-id (default-validate-id) @ org.eclipse.passage.lic.json.tests ---
[INFO] 
[INFO] --- tycho-packaging-plugin:1.5.1:validate-version (default-validate-version) @ org.eclipse.passage.lic.json.tests ---
[INFO] 
[INFO] --- eclipse-cbi-plugin:1.1.8-SNAPSHOT:generate-api-build-xml (default) @ org.eclipse.passage.lic.json.tests ---
Generating target/.apibuild.xml
[INFO] 
[INFO] --- maven-resources-plugin:3.1.0:resources (default-resources) @ org.eclipse.passage.lic.json.tests ---
[INFO] Using 'UTF-8' encoding to copy filtered resources.
[INFO] Copying 0 resource
[INFO] 
[INFO] --- tycho-compiler-plugin:1.5.1:compile (default-compile) @ org.eclipse.passage.lic.json.tests ---
[INFO] Compiling 4 source files to /home/jenkins/agent/workspace/passage-base/tests/org.eclipse.passage.lic.json.tests/target/classes
[WARNING] /home/jenkins/agent/workspace/passage-base/tests/org.eclipse.passage.lic.json.tests/src/org/eclipse/passage/lic/json/tests/JsonPermissionTransportTest.java:[21] 
	import org.eclipse.passage.lic.api.LicensingConfiguration;
	       ^^^^^^^^^^^^^^^^^^^^^^^^^^^^^^^^^^^^^^^^^^^^^^^^^^
The type LicensingConfiguration is deprecated
[WARNING] /home/jenkins/agent/workspace/passage-base/tests/org.eclipse.passage.lic.json.tests/src/org/eclipse/passage/lic/json/tests/JsonPermissionTransportTest.java:[22] 
	import org.eclipse.passage.lic.api.access.FeaturePermission;
	       ^^^^^^^^^^^^^^^^^^^^^^^^^^^^^^^^^^^^^^^^^^^^^^^^^^^^
The type FeaturePermission is deprecated
[WARNING] /home/jenkins/agent/workspace/passage-base/tests/org.eclipse.passage.lic.json.tests/src/org/eclipse/passage/lic/json/tests/JsonPermissionTransportTest.java:[23] 
	import org.eclipse.passage.lic.api.conditions.LicensingCondition;
	       ^^^^^^^^^^^^^^^^^^^^^^^^^^^^^^^^^^^^^^^^^^^^^^^^^^^^^^^^^
The type LicensingCondition is deprecated
[WARNING] /home/jenkins/agent/workspace/passage-base/tests/org.eclipse.passage.lic.json.tests/src/org/eclipse/passage/lic/json/tests/JsonPermissionTransportTest.java:[24] 
	import org.eclipse.passage.lic.base.LicensingConfigurations;
	       ^^^^^^^^^^^^^^^^^^^^^^^^^^^^^^^^^^^^^^^^^^^^^^^^^^^^
The type LicensingConfigurations is deprecated
[WARNING] /home/jenkins/agent/workspace/passage-base/tests/org.eclipse.passage.lic.json.tests/src/org/eclipse/passage/lic/json/tests/JsonPermissionTransportTest.java:[29] 
	import org.eclipse.passage.lic.internal.json.JsonTransport;
	       ^^^^^^^^^^^^^^^^^^^^^^^^^^^^^^^^^^^^^^^^^^^^^^^^^^^
The type JsonTransport is deprecated
[WARNING] /home/jenkins/agent/workspace/passage-base/tests/org.eclipse.passage.lic.json.tests/src/org/eclipse/passage/lic/json/tests/JsonPermissionTransportTest.java:[54] 
	ObjectMapper mapper = JsonTransport.createObjectMapper();
	                      ^^^^^^^^^^^^^
The type JsonTransport is deprecated
[WARNING] /home/jenkins/agent/workspace/passage-base/tests/org.eclipse.passage.lic.json.tests/src/org/eclipse/passage/lic/json/tests/JsonPermissionTransportTest.java:[54] 
	ObjectMapper mapper = JsonTransport.createObjectMapper();
	                                    ^^^^^^^^^^^^^^^^^^^^
The method createObjectMapper() from the type JsonTransport is deprecated
[WARNING] /home/jenkins/agent/workspace/passage-base/tests/org.eclipse.passage.lic.json.tests/src/org/eclipse/passage/lic/json/tests/JsonPermissionTransportTest.java:[60] 
	Iterable<FeaturePermission> permissions = transport.readPermissions(bis);
	         ^^^^^^^^^^^^^^^^^
The type FeaturePermission is deprecated
[WARNING] /home/jenkins/agent/workspace/passage-base/tests/org.eclipse.passage.lic.json.tests/src/org/eclipse/passage/lic/json/tests/JsonPermissionTransportTest.java:[62] 
	for (FeaturePermission permission : permissions) {
	     ^^^^^^^^^^^^^^^^^
The type FeaturePermission is deprecated
[WARNING] /home/jenkins/agent/workspace/passage-base/tests/org.eclipse.passage.lic.json.tests/src/org/eclipse/passage/lic/json/tests/JsonPermissionTransportTest.java:[63] 
	LicensingCondition condition = permission.getLicensingCondition();
	^^^^^^^^^^^^^^^^^^
The type LicensingCondition is deprecated
[WARNING] /home/jenkins/agent/workspace/passage-base/tests/org.eclipse.passage.lic.json.tests/src/org/eclipse/passage/lic/json/tests/JsonPermissionTransportTest.java:[63] 
	LicensingCondition condition = permission.getLicensingCondition();
	                                          ^^^^^^^^^^^^^^^^^^^^^^^
The method getLicensingCondition() from the type FeaturePermission is deprecated
[WARNING] /home/jenkins/agent/workspace/passage-base/tests/org.eclipse.passage.lic.json.tests/src/org/eclipse/passage/lic/json/tests/JsonPermissionTransportTest.java:[64] 
	LicensingConfiguration configuration = permission.getLicensingConfiguration();
	^^^^^^^^^^^^^^^^^^^^^^
The type LicensingConfiguration is deprecated
[WARNING] /home/jenkins/agent/workspace/passage-base/tests/org.eclipse.passage.lic.json.tests/src/org/eclipse/passage/lic/json/tests/JsonPermissionTransportTest.java:[64] 
	LicensingConfiguration configuration = permission.getLicensingConfiguration();
	                                                  ^^^^^^^^^^^^^^^^^^^^^^^^^^^
The method getLicensingConfiguration() from the type FeaturePermission is deprecated
[WARNING] /home/jenkins/agent/workspace/passage-base/tests/org.eclipse.passage.lic.json.tests/src/org/eclipse/passage/lic/json/tests/JsonPermissionTransportTest.java:[65] 
	assertEquals(FEATURE_TEST_ID, condition.getFeatureIdentifier());
	                                        ^^^^^^^^^^^^^^^^^^^^^^
The method getFeatureIdentifier() from the type LicensingCondition is deprecated
[WARNING] /home/jenkins/agent/workspace/passage-base/tests/org.eclipse.passage.lic.json.tests/src/org/eclipse/passage/lic/json/tests/JsonPermissionTransportTest.java:[66] 
	assertEquals(FEATURE_TEST_VERSION, condition.getMatchVersion());
	                                             ^^^^^^^^^^^^^^^^^
The method getMatchVersion() from the type LicensingCondition is deprecated
[WARNING] /home/jenkins/agent/workspace/passage-base/tests/org.eclipse.passage.lic.json.tests/src/org/eclipse/passage/lic/json/tests/JsonPermissionTransportTest.java:[67] 
	assertEquals(FEATURE_TEST_RULE, condition.getMatchRule());
	                                          ^^^^^^^^^^^^^^
The method getMatchRule() from the type LicensingCondition is deprecated
[WARNING] /home/jenkins/agent/workspace/passage-base/tests/org.eclipse.passage.lic.json.tests/src/org/eclipse/passage/lic/json/tests/JsonPermissionTransportTest.java:[68] 
	assertEquals(FEATURE_TEST_VALID_FROM, condition.getValidFrom());
	                                                ^^^^^^^^^^^^^^
The method getValidFrom() from the type LicensingCondition is deprecated
[WARNING] /home/jenkins/agent/workspace/passage-base/tests/org.eclipse.passage.lic.json.tests/src/org/eclipse/passage/lic/json/tests/JsonPermissionTransportTest.java:[69] 
	assertEquals(FEATURE_TEST_VALID_UNTIL, condition.getValidUntil());
	                                                 ^^^^^^^^^^^^^^^
The method getValidUntil() from the type LicensingCondition is deprecated
[WARNING] /home/jenkins/agent/workspace/passage-base/tests/org.eclipse.passage.lic.json.tests/src/org/eclipse/passage/lic/json/tests/JsonPermissionTransportTest.java:[70] 
	assertEquals(FEATURE_TEST_CONDITION_TYPE, condition.getConditionType());
	                                                    ^^^^^^^^^^^^^^^^^^
The method getConditionType() from the type LicensingCondition is deprecated
[WARNING] /home/jenkins/agent/workspace/passage-base/tests/org.eclipse.passage.lic.json.tests/src/org/eclipse/passage/lic/json/tests/JsonPermissionTransportTest.java:[71] 
	assertEquals(FEATURE_TEST_EXPRESSION, condition.getConditionExpression());
	                                                ^^^^^^^^^^^^^^^^^^^^^^^^
The method getConditionExpression() from the type LicensingCondition is deprecated
[WARNING] /home/jenkins/agent/workspace/passage-base/tests/org.eclipse.passage.lic.json.tests/src/org/eclipse/passage/lic/json/tests/JsonPermissionTransportTest.java:[73] 
	assertEquals(PRODUCT_TEST_ID, configuration.getProductIdentifier());
	                                            ^^^^^^^^^^^^^^^^^^^^^^
The method getProductIdentifier() from the type LicensingConfiguration is deprecated
[WARNING] /home/jenkins/agent/workspace/passage-base/tests/org.eclipse.passage.lic.json.tests/src/org/eclipse/passage/lic/json/tests/JsonPermissionTransportTest.java:[74] 
	assertEquals(PRODUCT_TEST_VERSION, configuration.getProductVersion());
	                                                 ^^^^^^^^^^^^^^^^^^^
The method getProductVersion() from the type LicensingConfiguration is deprecated
[WARNING] /home/jenkins/agent/workspace/passage-base/tests/org.eclipse.passage.lic.json.tests/src/org/eclipse/passage/lic/json/tests/JsonPermissionTransportTest.java:[76] 
	assertEquals(FEATURE_TEST_LEASE_TIME, permission.getLeaseDate());
	                                                 ^^^^^^^^^^^^^^
The method getLeaseDate() from the type FeaturePermission is deprecated
[WARNING] /home/jenkins/agent/workspace/passage-base/tests/org.eclipse.passage.lic.json.tests/src/org/eclipse/passage/lic/json/tests/JsonPermissionTransportTest.java:[77] 
	assertEquals(FEATURE_TEST_EXPIRE_TIME, permission.getExpireDate());
	                                                  ^^^^^^^^^^^^^^^
The method getExpireDate() from the type FeaturePermission is deprecated
[WARNING] /home/jenkins/agent/workspace/passage-base/tests/org.eclipse.passage.lic.json.tests/src/org/eclipse/passage/lic/json/tests/JsonPermissionTransportTest.java:[83] 
	LicensingConfiguration configuration = LicensingConfigurations.create(PRODUCT_TEST_ID, PRODUCT_TEST_VERSION);
	^^^^^^^^^^^^^^^^^^^^^^
The type LicensingConfiguration is deprecated
[WARNING] /home/jenkins/agent/workspace/passage-base/tests/org.eclipse.passage.lic.json.tests/src/org/eclipse/passage/lic/json/tests/JsonPermissionTransportTest.java:[83] 
	LicensingConfiguration configuration = LicensingConfigurations.create(PRODUCT_TEST_ID, PRODUCT_TEST_VERSION);
	                                       ^^^^^^^^^^^^^^^^^^^^^^^
The type LicensingConfigurations is deprecated
[WARNING] /home/jenkins/agent/workspace/passage-base/tests/org.eclipse.passage.lic.json.tests/src/org/eclipse/passage/lic/json/tests/JsonPermissionTransportTest.java:[83] 
	LicensingConfiguration configuration = LicensingConfigurations.create(PRODUCT_TEST_ID, PRODUCT_TEST_VERSION);
	                                                               ^^^^^^^^^^^^^^^^^^^^^^^^^^^^^^^^^^^^^^^^^^^^^
The method create(String, String) from the type LicensingConfigurations is deprecated
[WARNING] /home/jenkins/agent/workspace/passage-base/tests/org.eclipse.passage.lic.json.tests/src/org/eclipse/passage/lic/json/tests/JsonPermissionTransportTest.java:[88] 
	LicensingCondition condition = LicensingConditions.create(FEATURE_TEST_ID, FEATURE_TEST_VERSION, FEATURE_TEST_RULE, from, until, type, expression);
	^^^^^^^^^^^^^^^^^^
The type LicensingCondition is deprecated
[WARNING] /home/jenkins/agent/workspace/passage-base/tests/org.eclipse.passage.lic.json.tests/src/org/eclipse/passage/lic/json/tests/JsonPermissionTransportTest.java:[89] 
	FeaturePermission permission = FeaturePermissions.create(configuration, condition, FEATURE_TEST_LEASE_TIME, FEATURE_TEST_EXPIRE_TIME);
	^^^^^^^^^^^^^^^^^
The type FeaturePermission is deprecated
[WARNING] /home/jenkins/agent/workspace/passage-base/tests/org.eclipse.passage.lic.json.tests/src/org/eclipse/passage/lic/json/tests/JsonConditionTransportTest.java:[21] 
	import org.eclipse.passage.lic.api.conditions.LicensingCondition;
	       ^^^^^^^^^^^^^^^^^^^^^^^^^^^^^^^^^^^^^^^^^^^^^^^^^^^^^^^^^
The type LicensingCondition is deprecated
[WARNING] /home/jenkins/agent/workspace/passage-base/tests/org.eclipse.passage.lic.json.tests/src/org/eclipse/passage/lic/json/tests/JsonConditionTransportTest.java:[23] 
	import org.eclipse.passage.lic.internal.json.JsonConditionTransport;
	       ^^^^^^^^^^^^^^^^^^^^^^^^^^^^^^^^^^^^^^^^^^^^^^^^^^^^^^^^^^^^
The type JsonConditionTransport is deprecated
[WARNING] /home/jenkins/agent/workspace/passage-base/tests/org.eclipse.passage.lic.json.tests/src/org/eclipse/passage/lic/json/tests/JsonConditionTransportTest.java:[24] 
	import org.eclipse.passage.lic.internal.json.JsonTransport;
	       ^^^^^^^^^^^^^^^^^^^^^^^^^^^^^^^^^^^^^^^^^^^^^^^^^^^
The type JsonTransport is deprecated
[WARNING] /home/jenkins/agent/workspace/passage-base/tests/org.eclipse.passage.lic.json.tests/src/org/eclipse/passage/lic/json/tests/JsonConditionTransportTest.java:[25] 
	import org.eclipse.passage.lic.internal.json.LicensingConditionAggregator;
	       ^^^^^^^^^^^^^^^^^^^^^^^^^^^^^^^^^^^^^^^^^^^^^^^^^^^^^^^^^^^^^^^^^^
The type LicensingConditionAggregator is deprecated
[WARNING] /home/jenkins/agent/workspace/passage-base/tests/org.eclipse.passage.lic.json.tests/src/org/eclipse/passage/lic/json/tests/JsonConditionTransportTest.java:[45] 
	ObjectMapper mapper = JsonTransport.createObjectMapper();
	                      ^^^^^^^^^^^^^
The type JsonTransport is deprecated
[WARNING] /home/jenkins/agent/workspace/passage-base/tests/org.eclipse.passage.lic.json.tests/src/org/eclipse/passage/lic/json/tests/JsonConditionTransportTest.java:[45] 
	ObjectMapper mapper = JsonTransport.createObjectMapper();
	                                    ^^^^^^^^^^^^^^^^^^^^
The method createObjectMapper() from the type JsonTransport is deprecated
[WARNING] /home/jenkins/agent/workspace/passage-base/tests/org.eclipse.passage.lic.json.tests/src/org/eclipse/passage/lic/json/tests/JsonConditionTransportTest.java:[47] 
	LicensingConditionAggregator conditionAggregator = createConditionDescriptorAggregator();
	^^^^^^^^^^^^^^^^^^^^^^^^^^^^
The type LicensingConditionAggregator is deprecated
[WARNING] /home/jenkins/agent/workspace/passage-base/tests/org.eclipse.passage.lic.json.tests/src/org/eclipse/passage/lic/json/tests/JsonConditionTransportTest.java:[50] 
	JsonConditionTransport transport = new JsonConditionTransport();
	^^^^^^^^^^^^^^^^^^^^^^
The type JsonConditionTransport is deprecated
[WARNING] /home/jenkins/agent/workspace/passage-base/tests/org.eclipse.passage.lic.json.tests/src/org/eclipse/passage/lic/json/tests/JsonConditionTransportTest.java:[50] 
	JsonConditionTransport transport = new JsonConditionTransport();
	                                       ^^^^^^^^^^^^^^^^^^^^^^
The type JsonConditionTransport is deprecated
[WARNING] /home/jenkins/agent/workspace/passage-base/tests/org.eclipse.passage.lic.json.tests/src/org/eclipse/passage/lic/json/tests/JsonConditionTransportTest.java:[50] 
	JsonConditionTransport transport = new JsonConditionTransport();
	                                       ^^^^^^^^^^^^^^^^^^^^^^^^
The constructor JsonConditionTransport() is deprecated
[WARNING] /home/jenkins/agent/workspace/passage-base/tests/org.eclipse.passage.lic.json.tests/src/org/eclipse/passage/lic/json/tests/JsonConditionTransportTest.java:[51] 
	Iterable<LicensingCondition> conditions = transport.readConditions(bis);
	         ^^^^^^^^^^^^^^^^^^
The type LicensingCondition is deprecated
[WARNING] /home/jenkins/agent/workspace/passage-base/tests/org.eclipse.passage.lic.json.tests/src/org/eclipse/passage/lic/json/tests/JsonConditionTransportTest.java:[51] 
	Iterable<LicensingCondition> conditions = transport.readConditions(bis);
	                                                    ^^^^^^^^^^^^^^^^^^^
The method readConditions(InputStream) from the type JsonConditionTransport is deprecated
[WARNING] /home/jenkins/agent/workspace/passage-base/tests/org.eclipse.passage.lic.json.tests/src/org/eclipse/passage/lic/json/tests/JsonConditionTransportTest.java:[53] 
	for (LicensingCondition condition : conditions) {
	     ^^^^^^^^^^^^^^^^^^
The type LicensingCondition is deprecated
[WARNING] /home/jenkins/agent/workspace/passage-base/tests/org.eclipse.passage.lic.json.tests/src/org/eclipse/passage/lic/json/tests/JsonConditionTransportTest.java:[54] 
	assertEquals(FEATURE_TEST_ID, condition.getFeatureIdentifier());
	                                        ^^^^^^^^^^^^^^^^^^^^^^
The method getFeatureIdentifier() from the type LicensingCondition is deprecated
[WARNING] /home/jenkins/agent/workspace/passage-base/tests/org.eclipse.passage.lic.json.tests/src/org/eclipse/passage/lic/json/tests/JsonConditionTransportTest.java:[55] 
	assertEquals(FEATURE_TEST_VERSION, condition.getMatchVersion());
	                                             ^^^^^^^^^^^^^^^^^
The method getMatchVersion() from the type LicensingCondition is deprecated
[WARNING] /home/jenkins/agent/workspace/passage-base/tests/org.eclipse.passage.lic.json.tests/src/org/eclipse/passage/lic/json/tests/JsonConditionTransportTest.java:[56] 
	assertEquals(FEATURE_TEST_RULE, condition.getMatchRule());
	                                          ^^^^^^^^^^^^^^
The method getMatchRule() from the type LicensingCondition is deprecated
[WARNING] /home/jenkins/agent/workspace/passage-base/tests/org.eclipse.passage.lic.json.tests/src/org/eclipse/passage/lic/json/tests/JsonConditionTransportTest.java:[57] 
	assertEquals(FEATURE_TEST_VALID_FROM, condition.getValidFrom());
	                                                ^^^^^^^^^^^^^^
The method getValidFrom() from the type LicensingCondition is deprecated
[WARNING] /home/jenkins/agent/workspace/passage-base/tests/org.eclipse.passage.lic.json.tests/src/org/eclipse/passage/lic/json/tests/JsonConditionTransportTest.java:[58] 
	assertEquals(FEATURE_TEST_VALID_UNTIL, condition.getValidUntil());
	                                                 ^^^^^^^^^^^^^^^
The method getValidUntil() from the type LicensingCondition is deprecated
[WARNING] /home/jenkins/agent/workspace/passage-base/tests/org.eclipse.passage.lic.json.tests/src/org/eclipse/passage/lic/json/tests/JsonConditionTransportTest.java:[59] 
	assertEquals(FEATURE_TEST_CONDITION_TYPE, condition.getConditionType());
	                                                    ^^^^^^^^^^^^^^^^^^
The method getConditionType() from the type LicensingCondition is deprecated
[WARNING] /home/jenkins/agent/workspace/passage-base/tests/org.eclipse.passage.lic.json.tests/src/org/eclipse/passage/lic/json/tests/JsonConditionTransportTest.java:[60] 
	assertEquals(FEATURE_TEST_EXPRESSION, condition.getConditionExpression());
	                                                ^^^^^^^^^^^^^^^^^^^^^^^^
The method getConditionExpression() from the type LicensingCondition is deprecated
[WARNING] /home/jenkins/agent/workspace/passage-base/tests/org.eclipse.passage.lic.json.tests/src/org/eclipse/passage/lic/json/tests/JsonConditionTransportTest.java:[64] 
	private LicensingConditionAggregator createConditionDescriptorAggregator() {
	        ^^^^^^^^^^^^^^^^^^^^^^^^^^^^
The type LicensingConditionAggregator is deprecated
[WARNING] /home/jenkins/agent/workspace/passage-base/tests/org.eclipse.passage.lic.json.tests/src/org/eclipse/passage/lic/json/tests/JsonConditionTransportTest.java:[65] 
	LicensingConditionAggregator conditionAggregator = new LicensingConditionAggregator();
	^^^^^^^^^^^^^^^^^^^^^^^^^^^^
The type LicensingConditionAggregator is deprecated
[WARNING] /home/jenkins/agent/workspace/passage-base/tests/org.eclipse.passage.lic.json.tests/src/org/eclipse/passage/lic/json/tests/JsonConditionTransportTest.java:[65] 
	LicensingConditionAggregator conditionAggregator = new LicensingConditionAggregator();
	                                                       ^^^^^^^^^^^^^^^^^^^^^^^^^^^^
The type LicensingConditionAggregator is deprecated
[WARNING] /home/jenkins/agent/workspace/passage-base/tests/org.eclipse.passage.lic.json.tests/src/org/eclipse/passage/lic/json/tests/JsonConditionTransportTest.java:[65] 
	LicensingConditionAggregator conditionAggregator = new LicensingConditionAggregator();
	                                                       ^^^^^^^^^^^^^^^^^^^^^^^^^^^^^^
The constructor LicensingConditionAggregator() is deprecated
[WARNING] /home/jenkins/agent/workspace/passage-base/tests/org.eclipse.passage.lic.json.tests/src/org/eclipse/passage/lic/json/tests/JsonConditionTransportTest.java:[73] 
	LicensingCondition descriptor = LicensingConditions.create(id, version, rule, from, until, type, expression);
	^^^^^^^^^^^^^^^^^^
The type LicensingCondition is deprecated
[WARNING] /home/jenkins/agent/workspace/passage-base/tests/org.eclipse.passage.lic.json.tests/src/org/eclipse/passage/lic/json/tests/JsonConditionTransportTest.java:[74] 
	conditionAggregator.addLicensingCondition(descriptor);
	                    ^^^^^^^^^^^^^^^^^^^^^^^^^^^^^^^^^
The method addLicensingCondition(LicensingCondition) from the type LicensingConditionAggregator is deprecated
55 problems (55 warnings)
[INFO] 
[INFO] --- tycho-eclipserun-plugin:1.5.1:eclipse-run (default) @ org.eclipse.passage.lic.json.tests ---
[INFO] Toolchain in tycho-eclipserun-plugin: JDK[/opt/tools/java/oracle/jdk-8/latest]
[INFO] Expected eclipse log file: /home/jenkins/agent/workspace/passage-base/tests/org.eclipse.passage.lic.json.tests/target/eclipserun-work/data/.metadata/.log
[INFO] Command line:
	[/opt/tools/java/oracle/jdk-8/latest/bin/java, -jar, /home/jenkins/.m2/repository/p2/osgi/bundle/org.eclipse.equinox.launcher/1.5.700.v20200207-2156/org.eclipse.equinox.launcher-1.5.700.v20200207-2156.jar, -install, /home/jenkins/agent/workspace/passage-base/tests/org.eclipse.passage.lic.json.tests/target/eclipserun-work, -configuration, /home/jenkins/agent/workspace/passage-base/tests/org.eclipse.passage.lic.json.tests/target/eclipserun-work/configuration, -data, target/apibuild-workspace, -application, org.eclipse.ant.core.antRunner, -buildfile, target/.apibuild.xml]
Buildfile: target/.apibuild.xml

apigen:
BUILD SUCCESSFUL

BUILD SUCCESSFUL
Total time: 0 seconds
[INFO] 
[INFO] --- maven-resources-plugin:3.1.0:testResources (default-testResources) @ org.eclipse.passage.lic.json.tests ---
[INFO] Using 'UTF-8' encoding to copy filtered resources.
[INFO] skip non existing resourceDirectory /home/jenkins/agent/workspace/passage-base/tests/org.eclipse.passage.lic.json.tests/src/test/resources
[INFO] 
[INFO] --- tycho-source-plugin:1.5.1:plugin-source (attach-source) @ org.eclipse.passage.lic.json.tests ---
[INFO] Building jar: /home/jenkins/agent/workspace/passage-base/tests/org.eclipse.passage.lic.json.tests/target/org.eclipse.passage.lic.json.tests-0.5.100-SNAPSHOT-sources.jar
[INFO] 
[INFO] --- target-platform-configuration:1.5.1:target-platform (default-target-platform) @ org.eclipse.passage.lic.json.tests ---
[INFO] 
[INFO] --- tycho-packaging-plugin:1.5.1:package-plugin (default-package-plugin) @ org.eclipse.passage.lic.json.tests ---
[INFO] Building jar: /home/jenkins/agent/workspace/passage-base/tests/org.eclipse.passage.lic.json.tests/target/org.eclipse.passage.lic.json.tests-0.5.100-SNAPSHOT.jar
[INFO] 
[INFO] --- tycho-p2-plugin:1.5.1:p2-metadata-default (default-p2-metadata-default) @ org.eclipse.passage.lic.json.tests ---
[INFO] 
[INFO] --- tycho-source-feature-plugin:1.5.1:source-feature (source-feature) @ org.eclipse.passage.lic.json.tests ---
[INFO] 
[INFO] --- tycho-p2-plugin:1.5.1:p2-metadata (attached-p2-metadata) @ org.eclipse.passage.lic.json.tests ---
[INFO] No baseline version MavenProject: org.eclipse.passage:org.eclipse.passage.lic.json.tests:0.5.100-SNAPSHOT @ /home/jenkins/agent/workspace/passage-base/tests/org.eclipse.passage.lic.json.tests/.polyglot..META-INF_MANIFEST.MF
[INFO] 
[INFO] --- tycho-surefire-plugin:1.5.1:test (default-test) @ org.eclipse.passage.lic.json.tests ---
[INFO] Expected eclipse log file: /home/jenkins/agent/workspace/passage-base/tests/org.eclipse.passage.lic.json.tests/target/work/data/.metadata/.log
[INFO] Command line:
	[/opt/tools/java/oracle/jdk-8/1.8.0_202/jre/bin/java, -Dosgi.noShutdown=false, -Dosgi.os=linux, -Dosgi.ws=gtk, -Dosgi.arch=x86_64, -Dosgi.clean=true, -jar, /home/jenkins/.m2/repository/p2/osgi/bundle/org.eclipse.equinox.launcher/1.5.700.v20200207-2156/org.eclipse.equinox.launcher-1.5.700.v20200207-2156.jar, -data, /home/jenkins/agent/workspace/passage-base/tests/org.eclipse.passage.lic.json.tests/target/work/data, -install, /home/jenkins/agent/workspace/passage-base/tests/org.eclipse.passage.lic.json.tests/target/work, -configuration, /home/jenkins/agent/workspace/passage-base/tests/org.eclipse.passage.lic.json.tests/target/work/configuration, -application, org.eclipse.tycho.surefire.osgibooter.headlesstest, -testproperties, /home/jenkins/agent/workspace/passage-base/tests/org.eclipse.passage.lic.json.tests/target/surefire.properties]
Running org.eclipse.passage.lic.json.tests.tobemoved.JsonConditionTransportTest
Tests run: 2, Failures: 0, Errors: 0, Skipped: 0, Time elapsed: 0.216 s - in org.eclipse.passage.lic.json.tests.tobemoved.JsonConditionTransportTest
identifiedByContentType(org.eclipse.passage.lic.json.tests.tobemoved.JsonConditionTransportTest)  Time elapsed: 0.009 s
readYourOwnWritings(org.eclipse.passage.lic.json.tests.tobemoved.JsonConditionTransportTest)  Time elapsed: 0.178 s
Running org.eclipse.passage.lic.json.tests.JsonPermissionTransportTest
Tests run: 1, Failures: 0, Errors: 0, Skipped: 0, Time elapsed: 0.019 s - in org.eclipse.passage.lic.json.tests.JsonPermissionTransportTest
netFeaturePermissionTransportTest(org.eclipse.passage.lic.json.tests.JsonPermissionTransportTest)  Time elapsed: 0.018 s
Running org.eclipse.passage.lic.json.tests.JsonConditionTransportTest
Tests run: 1, Failures: 0, Errors: 0, Skipped: 0, Time elapsed: 0.004 s - in org.eclipse.passage.lic.json.tests.JsonConditionTransportTest
netConditionDescriptorTransportTest(org.eclipse.passage.lic.json.tests.JsonConditionTransportTest)  Time elapsed: 0.004 s

Results:

Tests run: 4, Failures: 0, Errors: 0, Skipped: 0

[INFO] All tests passed!
[INFO] 
[INFO] --- tycho-pack200a-plugin:1.7.0:normalize (pack200-normalize) @ org.eclipse.passage.lic.json.tests ---
[INFO] Pack200 normalizing jar /home/jenkins/agent/workspace/passage-base/tests/org.eclipse.passage.lic.json.tests/target/org.eclipse.passage.lic.json.tests-0.5.100-SNAPSHOT.jar
[INFO] 
[INFO] --- eclipse-jarsigner-plugin:1.1.7:sign (sign) @ org.eclipse.passage.lic.json.tests ---
[INFO] Signing jar: /home/jenkins/agent/workspace/passage-base/tests/org.eclipse.passage.lic.json.tests/target/org.eclipse.passage.lic.json.tests-0.5.100-SNAPSHOT.jar
[INFO] Signing jar: /home/jenkins/agent/workspace/passage-base/tests/org.eclipse.passage.lic.json.tests/target/org.eclipse.passage.lic.json.tests-0.5.100-SNAPSHOT-sources.jar
[INFO] 
[INFO] --- tycho-pack200b-plugin:1.7.0:pack (pack200-pack) @ org.eclipse.passage.lic.json.tests ---
[INFO] Pack200 packing jar /home/jenkins/agent/workspace/passage-base/tests/org.eclipse.passage.lic.json.tests/target/org.eclipse.passage.lic.json.tests-0.5.100-SNAPSHOT.jar
[INFO] 
[INFO] --- tycho-p2-plugin:1.5.1:p2-metadata (p2-metadata) @ org.eclipse.passage.lic.json.tests ---
[INFO] No baseline version MavenProject: org.eclipse.passage:org.eclipse.passage.lic.json.tests:0.5.100-SNAPSHOT @ /home/jenkins/agent/workspace/passage-base/tests/org.eclipse.passage.lic.json.tests/.polyglot..META-INF_MANIFEST.MF
[INFO] 
[INFO] --- tycho-p2-extras-plugin:1.5.1:compare-version-with-baselines (compare-attached-artifacts-with-release) @ org.eclipse.passage.lic.json.tests ---
[INFO] 
[INFO] ----------< org.eclipse.passage:org.eclipse.passage.lic.oshi >----------
[INFO] Building Passage LIC OSHI 0.5.400-SNAPSHOT                      [26/140]
[INFO] ---------------------------[ eclipse-plugin ]---------------------------
[INFO] 
[INFO] --- maven-clean-plugin:3.1.0:clean (default-clean) @ org.eclipse.passage.lic.oshi ---
[INFO] 
[INFO] --- tycho-packaging-plugin:1.5.1:build-qualifier (default-build-qualifier) @ org.eclipse.passage.lic.oshi ---
[INFO] The project's OSGi version is 0.5.400.v20200715-1823
[INFO] 
[INFO] --- tycho-packaging-plugin:1.5.1:validate-id (default-validate-id) @ org.eclipse.passage.lic.oshi ---
[INFO] 
[INFO] --- tycho-packaging-plugin:1.5.1:validate-version (default-validate-version) @ org.eclipse.passage.lic.oshi ---
[INFO] 
[INFO] --- eclipse-cbi-plugin:1.1.8-SNAPSHOT:generate-api-build-xml (default) @ org.eclipse.passage.lic.oshi ---
Generating target/.apibuild.xml
[INFO] 
[INFO] --- maven-resources-plugin:3.1.0:resources (default-resources) @ org.eclipse.passage.lic.oshi ---
[INFO] Using 'UTF-8' encoding to copy filtered resources.
[INFO] Copying 1 resource
[INFO] Copying 1 resource
[INFO] 
[INFO] --- tycho-compiler-plugin:1.5.1:compile (default-compile) @ org.eclipse.passage.lic.oshi ---
[INFO] Compiling 9 source files to /home/jenkins/agent/workspace/passage-base/bundles/org.eclipse.passage.lic.oshi/target/classes
[INFO] 
[INFO] --- tycho-eclipserun-plugin:1.5.1:eclipse-run (default) @ org.eclipse.passage.lic.oshi ---
[INFO] Toolchain in tycho-eclipserun-plugin: JDK[/opt/tools/java/oracle/jdk-8/latest]
[INFO] Expected eclipse log file: /home/jenkins/agent/workspace/passage-base/bundles/org.eclipse.passage.lic.oshi/target/eclipserun-work/data/.metadata/.log
[INFO] Command line:
	[/opt/tools/java/oracle/jdk-8/latest/bin/java, -jar, /home/jenkins/.m2/repository/p2/osgi/bundle/org.eclipse.equinox.launcher/1.5.700.v20200207-2156/org.eclipse.equinox.launcher-1.5.700.v20200207-2156.jar, -install, /home/jenkins/agent/workspace/passage-base/bundles/org.eclipse.passage.lic.oshi/target/eclipserun-work, -configuration, /home/jenkins/agent/workspace/passage-base/bundles/org.eclipse.passage.lic.oshi/target/eclipserun-work/configuration, -data, target/apibuild-workspace, -application, org.eclipse.ant.core.antRunner, -buildfile, target/.apibuild.xml]
Buildfile: target/.apibuild.xml

apigen:
BUILD SUCCESSFUL

BUILD SUCCESSFUL
Total time: 0 seconds
[INFO] 
[INFO] --- maven-resources-plugin:3.1.0:testResources (default-testResources) @ org.eclipse.passage.lic.oshi ---
[INFO] Using 'UTF-8' encoding to copy filtered resources.
[INFO] skip non existing resourceDirectory /home/jenkins/agent/workspace/passage-base/bundles/org.eclipse.passage.lic.oshi/src/test/resources
[INFO] 
[INFO] --- tycho-source-plugin:1.5.1:plugin-source (attach-source) @ org.eclipse.passage.lic.oshi ---
[INFO] Building jar: /home/jenkins/agent/workspace/passage-base/bundles/org.eclipse.passage.lic.oshi/target/org.eclipse.passage.lic.oshi-0.5.400-SNAPSHOT-sources.jar
[INFO] 
[INFO] --- target-platform-configuration:1.5.1:target-platform (default-target-platform) @ org.eclipse.passage.lic.oshi ---
[INFO] 
[INFO] --- tycho-packaging-plugin:1.5.1:package-plugin (default-package-plugin) @ org.eclipse.passage.lic.oshi ---
[INFO] Building jar: /home/jenkins/agent/workspace/passage-base/bundles/org.eclipse.passage.lic.oshi/target/org.eclipse.passage.lic.oshi-0.5.400-SNAPSHOT.jar
[INFO] 
[INFO] --- tycho-p2-plugin:1.5.1:p2-metadata-default (default-p2-metadata-default) @ org.eclipse.passage.lic.oshi ---
[INFO] 
[INFO] --- tycho-source-feature-plugin:1.5.1:source-feature (source-feature) @ org.eclipse.passage.lic.oshi ---
[INFO] 
[INFO] --- tycho-p2-plugin:1.5.1:p2-metadata (attached-p2-metadata) @ org.eclipse.passage.lic.oshi ---
[INFO] No baseline version MavenProject: org.eclipse.passage:org.eclipse.passage.lic.oshi:0.5.400-SNAPSHOT @ /home/jenkins/agent/workspace/passage-base/bundles/org.eclipse.passage.lic.oshi/.polyglot..META-INF_MANIFEST.MF
[INFO] 
[INFO] --- tycho-pack200a-plugin:1.7.0:normalize (pack200-normalize) @ org.eclipse.passage.lic.oshi ---
[INFO] Pack200 normalizing jar /home/jenkins/agent/workspace/passage-base/bundles/org.eclipse.passage.lic.oshi/target/org.eclipse.passage.lic.oshi-0.5.400-SNAPSHOT.jar
[INFO] 
[INFO] --- eclipse-jarsigner-plugin:1.1.7:sign (sign) @ org.eclipse.passage.lic.oshi ---
[INFO] Signing jar: /home/jenkins/agent/workspace/passage-base/bundles/org.eclipse.passage.lic.oshi/target/org.eclipse.passage.lic.oshi-0.5.400-SNAPSHOT.jar
[INFO] Signing jar: /home/jenkins/agent/workspace/passage-base/bundles/org.eclipse.passage.lic.oshi/target/org.eclipse.passage.lic.oshi-0.5.400-SNAPSHOT-sources.jar
[INFO] 
[INFO] --- tycho-pack200b-plugin:1.7.0:pack (pack200-pack) @ org.eclipse.passage.lic.oshi ---
[INFO] Pack200 packing jar /home/jenkins/agent/workspace/passage-base/bundles/org.eclipse.passage.lic.oshi/target/org.eclipse.passage.lic.oshi-0.5.400-SNAPSHOT.jar
[INFO] 
[INFO] --- tycho-p2-plugin:1.5.1:p2-metadata (p2-metadata) @ org.eclipse.passage.lic.oshi ---
[INFO] No baseline version MavenProject: org.eclipse.passage:org.eclipse.passage.lic.oshi:0.5.400-SNAPSHOT @ /home/jenkins/agent/workspace/passage-base/bundles/org.eclipse.passage.lic.oshi/.polyglot..META-INF_MANIFEST.MF
[INFO] 
[INFO] --- tycho-p2-extras-plugin:1.5.1:compare-version-with-baselines (compare-attached-artifacts-with-release) @ org.eclipse.passage.lic.oshi ---
[INFO] Fetching org.eclipse.passage.lic.oshi_0.5.300.v20200528-1737.jar.pack.gz from https://download.eclipse.org/passage/updates/release/0.9.0/ldc/plugins/ (14.39kB)
[INFO] Fetching org.eclipse.passage.lic.oshi_0.5.300.v20200528-1737.jar.pack.gz from https://download.eclipse.org/passage/updates/release/0.9.0/ldc/plugins/ (14.39kB)
[INFO] Fetching org.eclipse.passage.lic.oshi.source_0.5.300.v20200528-1737.jar from https://download.eclipse.org/passage/updates/release/0.9.0/ldc/plugins/ (13.72kB)
[INFO] Fetching org.eclipse.passage.lic.oshi.source_0.5.300.v20200528-1737.jar from https://download.eclipse.org/passage/updates/release/0.9.0/ldc/plugins/ (13.72kB)
[INFO] 
[INFO] ------< org.eclipse.passage:org.eclipse.passage.lic.oshi.feature >------
[INFO] Building Passage LIC OSHI 0.6.400-SNAPSHOT                      [27/140]
[INFO] --------------------------[ eclipse-feature ]---------------------------
[INFO] 
[INFO] --- maven-clean-plugin:3.1.0:clean (default-clean) @ org.eclipse.passage.lic.oshi.feature ---
[INFO] Deleting /home/jenkins/agent/workspace/passage-base/features/org.eclipse.passage.lic.oshi.feature/target
[INFO] 
[INFO] --- tycho-packaging-plugin:1.5.1:build-qualifier-aggregator (default-build-qualifier-aggregator) @ org.eclipse.passage.lic.oshi.feature ---
[INFO] The project's OSGi version is 0.6.400.v20200715-1823
[INFO] 
[INFO] --- tycho-packaging-plugin:1.5.1:validate-id (default-validate-id) @ org.eclipse.passage.lic.oshi.feature ---
[INFO] 
[INFO] --- tycho-packaging-plugin:1.5.1:validate-version (default-validate-version) @ org.eclipse.passage.lic.oshi.feature ---
[INFO] 
[INFO] --- eclipse-cbi-plugin:1.1.8-SNAPSHOT:generate-api-build-xml (default) @ org.eclipse.passage.lic.oshi.feature ---
[INFO] 
[INFO] --- tycho-eclipserun-plugin:1.5.1:eclipse-run (default) @ org.eclipse.passage.lic.oshi.feature ---
[INFO] 
[INFO] --- tycho-source-plugin:1.5.1:plugin-source (attach-source) @ org.eclipse.passage.lic.oshi.feature ---
[INFO] 
[INFO] --- target-platform-configuration:1.5.1:target-platform (default-target-platform) @ org.eclipse.passage.lic.oshi.feature ---
[INFO] 
[INFO] --- tycho-packaging-plugin:1.5.1:package-feature (default-package-feature) @ org.eclipse.passage.lic.oshi.feature ---
[INFO] Building jar: /home/jenkins/agent/workspace/passage-base/features/org.eclipse.passage.lic.oshi.feature/target/org.eclipse.passage.lic.oshi.feature-0.6.400-SNAPSHOT.jar
[INFO] 
[INFO] --- tycho-p2-plugin:1.5.1:p2-metadata-default (default-p2-metadata-default) @ org.eclipse.passage.lic.oshi.feature ---
[INFO] 
[INFO] --- tycho-p2-plugin:1.5.1:feature-p2-metadata (default-feature-p2-metadata) @ org.eclipse.passage.lic.oshi.feature ---
[INFO] 
[INFO] --- tycho-source-feature-plugin:1.5.1:source-feature (source-feature) @ org.eclipse.passage.lic.oshi.feature ---
[INFO] Fetching org.slf4j.api.source_1.7.30.v20200204-2150.jar from https://download.eclipse.org/tools/orbit/downloads/drops2/S20200707174545/repository/plugins/ (67.32kB)
[INFO] Fetching org.slf4j.api.source_1.7.30.v20200204-2150.jar from https://download.eclipse.org/tools/orbit/downloads/drops2/S20200707174545/repository/plugins/ (67.32kB)
[INFO] Fetching com.sun.jna.source_4.5.1.v20190425-1842.jar from https://download.eclipse.org/eclipse/updates/4.17-I-builds/I20200710-1800/plugins/ (163.15kB)
[INFO] Fetching com.sun.jna.source_4.5.1.v20190425-1842.jar from https://download.eclipse.org/eclipse/updates/4.17-I-builds/I20200710-1800/plugins/ (163.15kB)
[INFO] Fetching com.sun.jna.platform.source_4.5.1.v20190425-1842.jar from https://download.eclipse.org/eclipse/updates/4.17-I-builds/I20200710-1800/plugins/ (912.59kB)
[INFO] Fetching com.sun.jna.platform.source_4.5.1.v20190425-1842.jar from https://download.eclipse.org/eclipse/updates/4.17-I-builds/I20200710-1800/plugins/ (912.59kB)
[INFO] Fetching com.github.oshi.oshi-core.source_3.8.0.v20200204-2150.jar from https://download.eclipse.org/tools/orbit/downloads/drops2/S20200707174545/repository/plugins/ (338.97kB)
[INFO] Fetching com.github.oshi.oshi-core.source_3.8.0.v20200204-2150.jar from https://download.eclipse.org/tools/orbit/downloads/drops2/S20200707174545/repository/plugins/ (338.97kB)
[INFO] Building jar: /home/jenkins/agent/workspace/passage-base/features/org.eclipse.passage.lic.oshi.feature/target/org.eclipse.passage.lic.oshi.feature-0.6.400-SNAPSHOT-sources-feature.jar
[INFO] 
[INFO] --- tycho-p2-plugin:1.5.1:p2-metadata (attached-p2-metadata) @ org.eclipse.passage.lic.oshi.feature ---
[INFO] No baseline version MavenProject: org.eclipse.passage:org.eclipse.passage.lic.oshi.feature:0.6.400-SNAPSHOT @ /home/jenkins/agent/workspace/passage-base/features/org.eclipse.passage.lic.oshi.feature/.polyglot.feature.xml.takari_issue_192
[INFO] 
[INFO] --- tycho-pack200a-plugin:1.7.0:normalize (pack200-normalize) @ org.eclipse.passage.lic.oshi.feature ---
[INFO] 
[INFO] --- eclipse-jarsigner-plugin:1.1.7:sign (sign) @ org.eclipse.passage.lic.oshi.feature ---
[INFO] Signing jar: /home/jenkins/agent/workspace/passage-base/features/org.eclipse.passage.lic.oshi.feature/target/org.eclipse.passage.lic.oshi.feature-0.6.400-SNAPSHOT.jar
[INFO] Signing jar: /home/jenkins/agent/workspace/passage-base/features/org.eclipse.passage.lic.oshi.feature/target/org.eclipse.passage.lic.oshi.feature-0.6.400-SNAPSHOT-sources-feature.jar
[INFO] 
[INFO] --- tycho-pack200b-plugin:1.7.0:pack (pack200-pack) @ org.eclipse.passage.lic.oshi.feature ---
[INFO] 
[INFO] --- tycho-p2-plugin:1.5.1:p2-metadata (p2-metadata) @ org.eclipse.passage.lic.oshi.feature ---
[INFO] No baseline version MavenProject: org.eclipse.passage:org.eclipse.passage.lic.oshi.feature:0.6.400-SNAPSHOT @ /home/jenkins/agent/workspace/passage-base/features/org.eclipse.passage.lic.oshi.feature/.polyglot.feature.xml.takari_issue_192
[INFO] 
[INFO] --- tycho-p2-extras-plugin:1.5.1:compare-version-with-baselines (compare-attached-artifacts-with-release) @ org.eclipse.passage.lic.oshi.feature ---
[INFO] Fetching org.eclipse.passage.lic.oshi.feature_0.6.300.v20200528-1737.jar from https://download.eclipse.org/passage/updates/release/0.9.0/ldc/features/ (19.1kB)
[INFO] Fetching org.eclipse.passage.lic.oshi.feature_0.6.300.v20200528-1737.jar from https://download.eclipse.org/passage/updates/release/0.9.0/ldc/features/ (19.1kB)
[INFO] Fetching org.eclipse.passage.lic.oshi.feature.source_0.6.300.v20200528-1737.jar from https://download.eclipse.org/passage/updates/release/0.9.0/ldc/features/ (18.6kB)
[INFO] Fetching org.eclipse.passage.lic.oshi.feature.source_0.6.300.v20200528-1737.jar from https://download.eclipse.org/passage/updates/release/0.9.0/ldc/features/ (18.6kB)
[INFO] 
[INFO] -------< org.eclipse.passage:org.eclipse.passage.lic.oshi.tests >-------
[INFO] Building Passage LIC OSHI Tests 0.5.100-SNAPSHOT                [28/140]
[INFO] ------------------------[ eclipse-test-plugin ]-------------------------
[INFO] 
[INFO] --- maven-clean-plugin:3.1.0:clean (default-clean) @ org.eclipse.passage.lic.oshi.tests ---
[INFO] 
[INFO] --- tycho-packaging-plugin:1.5.1:build-qualifier (default-build-qualifier) @ org.eclipse.passage.lic.oshi.tests ---
[INFO] The project's OSGi version is 0.5.100.v20200712-0819
[INFO] 
[INFO] --- tycho-packaging-plugin:1.5.1:validate-id (default-validate-id) @ org.eclipse.passage.lic.oshi.tests ---
[INFO] 
[INFO] --- tycho-packaging-plugin:1.5.1:validate-version (default-validate-version) @ org.eclipse.passage.lic.oshi.tests ---
[INFO] 
[INFO] --- eclipse-cbi-plugin:1.1.8-SNAPSHOT:generate-api-build-xml (default) @ org.eclipse.passage.lic.oshi.tests ---
Generating target/.apibuild.xml
[INFO] 
[INFO] --- maven-resources-plugin:3.1.0:resources (default-resources) @ org.eclipse.passage.lic.oshi.tests ---
[INFO] Using 'UTF-8' encoding to copy filtered resources.
[INFO] Copying 0 resource
[INFO] 
[INFO] --- tycho-compiler-plugin:1.5.1:compile (default-compile) @ org.eclipse.passage.lic.oshi.tests ---
[INFO] Compiling 4 source files to /home/jenkins/agent/workspace/passage-base/tests/org.eclipse.passage.lic.oshi.tests/target/classes
[WARNING] /home/jenkins/agent/workspace/passage-base/tests/org.eclipse.passage.lic.oshi.tests/src/org/eclipse/passage/lic/oshi/tests/OshiHalTest.java:[20] 
	import org.eclipse.passage.lic.oshi.OshiHal;
	       ^^^^^^^^^^^^^^^^^^^^^^^^^^^^^^^^^^^^
The type OshiHal is deprecated
[WARNING] /home/jenkins/agent/workspace/passage-base/tests/org.eclipse.passage.lic.oshi.tests/src/org/eclipse/passage/lic/oshi/tests/OshiHalTest.java:[28] 
	OshiHal.dumpOperatingSystem(baos, new HashMap<String, String>());
	^^^^^^^
The type OshiHal is deprecated
[WARNING] /home/jenkins/agent/workspace/passage-base/tests/org.eclipse.passage.lic.oshi.tests/src/org/eclipse/passage/lic/oshi/tests/OshiHalTest.java:[28] 
	OshiHal.dumpOperatingSystem(baos, new HashMap<String, String>());
	        ^^^^^^^^^^^^^^^^^^^^^^^^^^^^^^^^^^^^^^^^^^^^^^^^^^^^^^^^
The method dumpOperatingSystem(OutputStream, Map<String,String>) from the type OshiHal is deprecated
[WARNING] /home/jenkins/agent/workspace/passage-base/tests/org.eclipse.passage.lic.oshi.tests/src/org/eclipse/passage/lic/oshi/tests/OshiHardwareInspectorTest.java:[23] 
	import org.eclipse.passage.lic.internal.oshi.OshiHardwareInspector;
	       ^^^^^^^^^^^^^^^^^^^^^^^^^^^^^^^^^^^^^^^^^^^^^^^^^^^^^^^^^^^
The type OshiHardwareInspector is deprecated
[WARNING] /home/jenkins/agent/workspace/passage-base/tests/org.eclipse.passage.lic.oshi.tests/src/org/eclipse/passage/lic/oshi/tests/OshiHardwareInspectorTest.java:[31] 
	OshiHardwareInspector inspector = new OshiHardwareInspector();
	^^^^^^^^^^^^^^^^^^^^^
The type OshiHardwareInspector is deprecated
[WARNING] /home/jenkins/agent/workspace/passage-base/tests/org.eclipse.passage.lic.oshi.tests/src/org/eclipse/passage/lic/oshi/tests/OshiHardwareInspectorTest.java:[31] 
	OshiHardwareInspector inspector = new OshiHardwareInspector();
	                                      ^^^^^^^^^^^^^^^^^^^^^
The type OshiHardwareInspector is deprecated
[WARNING] /home/jenkins/agent/workspace/passage-base/tests/org.eclipse.passage.lic.oshi.tests/src/org/eclipse/passage/lic/oshi/tests/OshiHardwareInspectorTest.java:[31] 
	OshiHardwareInspector inspector = new OshiHardwareInspector();
	                                      ^^^^^^^^^^^^^^^^^^^^^^^
The constructor OshiHardwareInspector() is deprecated
[WARNING] /home/jenkins/agent/workspace/passage-base/tests/org.eclipse.passage.lic.oshi.tests/src/org/eclipse/passage/lic/oshi/tests/OshiHardwareInspectorTest.java:[32] 
	Iterable<String> knownProperties = inspector.getKnownProperties();
	                                             ^^^^^^^^^^^^^^^^^^^^
The method getKnownProperties() from the type OshiHardwareInspector is deprecated
[WARNING] /home/jenkins/agent/workspace/passage-base/tests/org.eclipse.passage.lic.oshi.tests/src/org/eclipse/passage/lic/oshi/tests/OshiHardwareInspectorTest.java:[35] 
	String property = inspector.inspectProperty(name);
	                            ^^^^^^^^^^^^^^^^^^^^^
The method inspectProperty(String) from the type OshiHardwareInspector is deprecated
[WARNING] /home/jenkins/agent/workspace/passage-base/tests/org.eclipse.passage.lic.oshi.tests/src/org/eclipse/passage/lic/oshi/tests/OshiHardwareInspectorTest.java:[42] 
	OshiHardwareInspector inspector = new OshiHardwareInspector();
	^^^^^^^^^^^^^^^^^^^^^
The type OshiHardwareInspector is deprecated
[WARNING] /home/jenkins/agent/workspace/passage-base/tests/org.eclipse.passage.lic.oshi.tests/src/org/eclipse/passage/lic/oshi/tests/OshiHardwareInspectorTest.java:[42] 
	OshiHardwareInspector inspector = new OshiHardwareInspector();
	                                      ^^^^^^^^^^^^^^^^^^^^^
The type OshiHardwareInspector is deprecated
[WARNING] /home/jenkins/agent/workspace/passage-base/tests/org.eclipse.passage.lic.oshi.tests/src/org/eclipse/passage/lic/oshi/tests/OshiHardwareInspectorTest.java:[42] 
	OshiHardwareInspector inspector = new OshiHardwareInspector();
	                                      ^^^^^^^^^^^^^^^^^^^^^^^
The constructor OshiHardwareInspector() is deprecated
[WARNING] /home/jenkins/agent/workspace/passage-base/tests/org.eclipse.passage.lic.oshi.tests/src/org/eclipse/passage/lic/oshi/tests/OshiHardwareInspectorTest.java:[45] 
	inspector.dumpHardwareInfo(baos);
	          ^^^^^^^^^^^^^^^^^^^^^^
The method dumpHardwareInfo(OutputStream) from the type OshiHardwareInspector is deprecated
[WARNING] /home/jenkins/agent/workspace/passage-base/tests/org.eclipse.passage.lic.oshi.tests/src/org/eclipse/passage/lic/oshi/tests/OshiHardwareInspectorTest.java:[57] 
	long known = StreamSupport.stream(inspector.getKnownProperties().spliterator(), false).count();
	                                            ^^^^^^^^^^^^^^^^^^^^
The method getKnownProperties() from the type OshiHardwareInspector is deprecated
[WARNING] /home/jenkins/agent/workspace/passage-base/tests/org.eclipse.passage.lic.oshi.tests/src/org/eclipse/passage/lic/oshi/tests/OshiPermissionEmitterTest.java:[25] 
	import org.eclipse.passage.lic.api.LicensingConfiguration;
	       ^^^^^^^^^^^^^^^^^^^^^^^^^^^^^^^^^^^^^^^^^^^^^^^^^^
The type LicensingConfiguration is deprecated
[WARNING] /home/jenkins/agent/workspace/passage-base/tests/org.eclipse.passage.lic.oshi.tests/src/org/eclipse/passage/lic/oshi/tests/OshiPermissionEmitterTest.java:[26] 
	import org.eclipse.passage.lic.api.LicensingException;
	       ^^^^^^^^^^^^^^^^^^^^^^^^^^^^^^^^^^^^^^^^^^^^^^
The type LicensingException is deprecated
[WARNING] /home/jenkins/agent/workspace/passage-base/tests/org.eclipse.passage.lic.oshi.tests/src/org/eclipse/passage/lic/oshi/tests/OshiPermissionEmitterTest.java:[27] 
	import org.eclipse.passage.lic.api.access.FeaturePermission;
	       ^^^^^^^^^^^^^^^^^^^^^^^^^^^^^^^^^^^^^^^^^^^^^^^^^^^^
The type FeaturePermission is deprecated
[WARNING] /home/jenkins/agent/workspace/passage-base/tests/org.eclipse.passage.lic.oshi.tests/src/org/eclipse/passage/lic/oshi/tests/OshiPermissionEmitterTest.java:[28] 
	import org.eclipse.passage.lic.api.access.PermissionEmitter;
	       ^^^^^^^^^^^^^^^^^^^^^^^^^^^^^^^^^^^^^^^^^^^^^^^^^^^^
The type PermissionEmitter is deprecated
[WARNING] /home/jenkins/agent/workspace/passage-base/tests/org.eclipse.passage.lic.oshi.tests/src/org/eclipse/passage/lic/oshi/tests/OshiPermissionEmitterTest.java:[29] 
	import org.eclipse.passage.lic.api.conditions.LicensingCondition;
	       ^^^^^^^^^^^^^^^^^^^^^^^^^^^^^^^^^^^^^^^^^^^^^^^^^^^^^^^^^
The type LicensingCondition is deprecated
[WARNING] /home/jenkins/agent/workspace/passage-base/tests/org.eclipse.passage.lic.oshi.tests/src/org/eclipse/passage/lic/oshi/tests/OshiPermissionEmitterTest.java:[31] 
	import org.eclipse.passage.lic.internal.oshi.OshiHardwareInspector;
	       ^^^^^^^^^^^^^^^^^^^^^^^^^^^^^^^^^^^^^^^^^^^^^^^^^^^^^^^^^^^
The type OshiHardwareInspector is deprecated
[WARNING] /home/jenkins/agent/workspace/passage-base/tests/org.eclipse.passage.lic.oshi.tests/src/org/eclipse/passage/lic/oshi/tests/OshiPermissionEmitterTest.java:[32] 
	import org.eclipse.passage.lic.internal.oshi.OshiPermissionEmitter;
	       ^^^^^^^^^^^^^^^^^^^^^^^^^^^^^^^^^^^^^^^^^^^^^^^^^^^^^^^^^^^
The type OshiPermissionEmitter is deprecated
[WARNING] /home/jenkins/agent/workspace/passage-base/tests/org.eclipse.passage.lic.oshi.tests/src/org/eclipse/passage/lic/oshi/tests/OshiPermissionEmitterTest.java:[33] 
	import org.eclipse.passage.lic.oshi.OshiHal;
	       ^^^^^^^^^^^^^^^^^^^^^^^^^^^^^^^^^^^^
The type OshiHal is deprecated
[WARNING] /home/jenkins/agent/workspace/passage-base/tests/org.eclipse.passage.lic.oshi.tests/src/org/eclipse/passage/lic/oshi/tests/OshiPermissionEmitterTest.java:[48] 
	OshiPermissionEmitter evaluator = new OshiPermissionEmitter();
	^^^^^^^^^^^^^^^^^^^^^
The type OshiPermissionEmitter is deprecated
[WARNING] /home/jenkins/agent/workspace/passage-base/tests/org.eclipse.passage.lic.oshi.tests/src/org/eclipse/passage/lic/oshi/tests/OshiPermissionEmitterTest.java:[48] 
	OshiPermissionEmitter evaluator = new OshiPermissionEmitter();
	                                      ^^^^^^^^^^^^^^^^^^^^^
The type OshiPermissionEmitter is deprecated
[WARNING] /home/jenkins/agent/workspace/passage-base/tests/org.eclipse.passage.lic.oshi.tests/src/org/eclipse/passage/lic/oshi/tests/OshiPermissionEmitterTest.java:[48] 
	OshiPermissionEmitter evaluator = new OshiPermissionEmitter();
	                                      ^^^^^^^^^^^^^^^^^^^^^^^
The constructor OshiPermissionEmitter() is deprecated
[WARNING] /home/jenkins/agent/workspace/passage-base/tests/org.eclipse.passage.lic.oshi.tests/src/org/eclipse/passage/lic/oshi/tests/OshiPermissionEmitterTest.java:[51] 
	Set<LicensingCondition> empty = Collections.singleton(createOshiCondition(new String()));
	    ^^^^^^^^^^^^^^^^^^
The type LicensingCondition is deprecated
[WARNING] /home/jenkins/agent/workspace/passage-base/tests/org.eclipse.passage.lic.oshi.tests/src/org/eclipse/passage/lic/oshi/tests/OshiPermissionEmitterTest.java:[54] 
	Set<LicensingCondition> unknown = Collections.singleton(createOshiCondition(EXPRESSION_OS_X3));
	    ^^^^^^^^^^^^^^^^^^
The type LicensingCondition is deprecated
[WARNING] /home/jenkins/agent/workspace/passage-base/tests/org.eclipse.passage.lic.oshi.tests/src/org/eclipse/passage/lic/oshi/tests/OshiPermissionEmitterTest.java:[58] 
	private void evaluate(PermissionEmitter emitter, Set<LicensingCondition> conditions,
	                      ^^^^^^^^^^^^^^^^^
The type PermissionEmitter is deprecated
[WARNING] /home/jenkins/agent/workspace/passage-base/tests/org.eclipse.passage.lic.oshi.tests/src/org/eclipse/passage/lic/oshi/tests/OshiPermissionEmitterTest.java:[58] 
	private void evaluate(PermissionEmitter emitter, Set<LicensingCondition> conditions,
	                                                     ^^^^^^^^^^^^^^^^^^
The type LicensingCondition is deprecated
[WARNING] /home/jenkins/agent/workspace/passage-base/tests/org.eclipse.passage.lic.oshi.tests/src/org/eclipse/passage/lic/oshi/tests/OshiPermissionEmitterTest.java:[59] 
	LicensingConfiguration configuration) {
	^^^^^^^^^^^^^^^^^^^^^^
The type LicensingConfiguration is deprecated
[WARNING] /home/jenkins/agent/workspace/passage-base/tests/org.eclipse.passage.lic.oshi.tests/src/org/eclipse/passage/lic/oshi/tests/OshiPermissionEmitterTest.java:[61] 
	emitter.emitPermissions(configuration, conditions);
	        ^^^^^^^^^^^^^^^^^^^^^^^^^^^^^^^^^^^^^^^^^^
The method emitPermissions(LicensingConfiguration, Iterable<LicensingCondition>) from the type PermissionEmitter is deprecated
[WARNING] /home/jenkins/agent/workspace/passage-base/tests/org.eclipse.passage.lic.oshi.tests/src/org/eclipse/passage/lic/oshi/tests/OshiPermissionEmitterTest.java:[63] 
	} catch (LicensingException e) {
	         ^^^^^^^^^^^^^^^^^^
The type LicensingException is deprecated
[WARNING] /home/jenkins/agent/workspace/passage-base/tests/org.eclipse.passage.lic.oshi.tests/src/org/eclipse/passage/lic/oshi/tests/OshiPermissionEmitterTest.java:[70] 
	OshiPermissionEmitter evaluator = new OshiPermissionEmitter();
	^^^^^^^^^^^^^^^^^^^^^
The type OshiPermissionEmitter is deprecated
[WARNING] /home/jenkins/agent/workspace/passage-base/tests/org.eclipse.passage.lic.oshi.tests/src/org/eclipse/passage/lic/oshi/tests/OshiPermissionEmitterTest.java:[70] 
	OshiPermissionEmitter evaluator = new OshiPermissionEmitter();
	                                      ^^^^^^^^^^^^^^^^^^^^^
The type OshiPermissionEmitter is deprecated
[WARNING] /home/jenkins/agent/workspace/passage-base/tests/org.eclipse.passage.lic.oshi.tests/src/org/eclipse/passage/lic/oshi/tests/OshiPermissionEmitterTest.java:[70] 
	OshiPermissionEmitter evaluator = new OshiPermissionEmitter();
	                                      ^^^^^^^^^^^^^^^^^^^^^^^
The constructor OshiPermissionEmitter() is deprecated
[WARNING] /home/jenkins/agent/workspace/passage-base/tests/org.eclipse.passage.lic.oshi.tests/src/org/eclipse/passage/lic/oshi/tests/OshiPermissionEmitterTest.java:[71] 
	OshiHardwareInspector inspector = new OshiHardwareInspector();
	^^^^^^^^^^^^^^^^^^^^^
The type OshiHardwareInspector is deprecated
[WARNING] /home/jenkins/agent/workspace/passage-base/tests/org.eclipse.passage.lic.oshi.tests/src/org/eclipse/passage/lic/oshi/tests/OshiPermissionEmitterTest.java:[71] 
	OshiHardwareInspector inspector = new OshiHardwareInspector();
	                                      ^^^^^^^^^^^^^^^^^^^^^
The type OshiHardwareInspector is deprecated
[WARNING] /home/jenkins/agent/workspace/passage-base/tests/org.eclipse.passage.lic.oshi.tests/src/org/eclipse/passage/lic/oshi/tests/OshiPermissionEmitterTest.java:[71] 
	OshiHardwareInspector inspector = new OshiHardwareInspector();
	                                      ^^^^^^^^^^^^^^^^^^^^^^^
The constructor OshiHardwareInspector() is deprecated
[WARNING] /home/jenkins/agent/workspace/passage-base/tests/org.eclipse.passage.lic.oshi.tests/src/org/eclipse/passage/lic/oshi/tests/OshiPermissionEmitterTest.java:[72] 
	evaluator.bindHardwareInspector(inspector);
	          ^^^^^^^^^^^^^^^^^^^^^^^^^^^^^^^^
The method bindHardwareInspector(HardwareInspector) from the type OshiPermissionEmitter is deprecated
[WARNING] /home/jenkins/agent/workspace/passage-base/tests/org.eclipse.passage.lic.oshi.tests/src/org/eclipse/passage/lic/oshi/tests/OshiPermissionEmitterTest.java:[73] 
	Set<LicensingCondition> future = Collections.singleton(createOshiCondition(EXPRESSION_OS_ANY));
	    ^^^^^^^^^^^^^^^^^^
The type LicensingCondition is deprecated
[WARNING] /home/jenkins/agent/workspace/passage-base/tests/org.eclipse.passage.lic.oshi.tests/src/org/eclipse/passage/lic/oshi/tests/OshiPermissionEmitterTest.java:[74] 
	Iterator<FeaturePermission> iterator = evaluator.emitPermissions(null, future).iterator();
	         ^^^^^^^^^^^^^^^^^
The type FeaturePermission is deprecated
[WARNING] /home/jenkins/agent/workspace/passage-base/tests/org.eclipse.passage.lic.oshi.tests/src/org/eclipse/passage/lic/oshi/tests/OshiPermissionEmitterTest.java:[74] 
	Iterator<FeaturePermission> iterator = evaluator.emitPermissions(null, future).iterator();
	                                                 ^^^^^^^^^^^^^^^^^^^^^^^^^^^^^
The method emitPermissions(LicensingConfiguration, Iterable<LicensingCondition>) from the type BasePermissionEmitter is deprecated
[WARNING] /home/jenkins/agent/workspace/passage-base/tests/org.eclipse.passage.lic.oshi.tests/src/org/eclipse/passage/lic/oshi/tests/OshiPermissionEmitterTest.java:[76] 
	FeaturePermission permission = iterator.next();
	^^^^^^^^^^^^^^^^^
The type FeaturePermission is deprecated
[WARNING] /home/jenkins/agent/workspace/passage-base/tests/org.eclipse.passage.lic.oshi.tests/src/org/eclipse/passage/lic/oshi/tests/OshiPermissionEmitterTest.java:[77] 
	LicensingCondition condition = permission.getLicensingCondition();
	^^^^^^^^^^^^^^^^^^
The type LicensingCondition is deprecated
[WARNING] /home/jenkins/agent/workspace/passage-base/tests/org.eclipse.passage.lic.oshi.tests/src/org/eclipse/passage/lic/oshi/tests/OshiPermissionEmitterTest.java:[77] 
	LicensingCondition condition = permission.getLicensingCondition();
	                                          ^^^^^^^^^^^^^^^^^^^^^^^
The method getLicensingCondition() from the type FeaturePermission is deprecated
[WARNING] /home/jenkins/agent/workspace/passage-base/tests/org.eclipse.passage.lic.oshi.tests/src/org/eclipse/passage/lic/oshi/tests/OshiPermissionEmitterTest.java:[79] 
	assertEquals(OSHI_HARDWARE_FEATURE_ID, condition.getFeatureIdentifier());
	                                                 ^^^^^^^^^^^^^^^^^^^^^^
The method getFeatureIdentifier() from the type LicensingCondition is deprecated
[WARNING] /home/jenkins/agent/workspace/passage-base/tests/org.eclipse.passage.lic.oshi.tests/src/org/eclipse/passage/lic/oshi/tests/OshiPermissionEmitterTest.java:[80] 
	assertEquals(OSHI_HARDWARE_MATCH_RULE, condition.getMatchRule());
	                                                 ^^^^^^^^^^^^^^
The method getMatchRule() from the type LicensingCondition is deprecated
[WARNING] /home/jenkins/agent/workspace/passage-base/tests/org.eclipse.passage.lic.oshi.tests/src/org/eclipse/passage/lic/oshi/tests/OshiPermissionEmitterTest.java:[81] 
	assertEquals(OSHI_HARDWARE_MATCH_VERSION, condition.getMatchVersion());
	                                                    ^^^^^^^^^^^^^^^^^
The method getMatchVersion() from the type LicensingCondition is deprecated
[WARNING] /home/jenkins/agent/workspace/passage-base/tests/org.eclipse.passage.lic.oshi.tests/src/org/eclipse/passage/lic/oshi/tests/OshiPermissionEmitterTest.java:[82] 
	evaluator.unbindHardwareInspector(null);
	          ^^^^^^^^^^^^^^^^^^^^^^^^^^^^^
The method unbindHardwareInspector(HardwareInspector) from the type OshiPermissionEmitter is deprecated
[WARNING] /home/jenkins/agent/workspace/passage-base/tests/org.eclipse.passage.lic.oshi.tests/src/org/eclipse/passage/lic/oshi/tests/OshiPermissionEmitterTest.java:[83] 
	evaluator.unbindHardwareInspector(inspector);
	          ^^^^^^^^^^^^^^^^^^^^^^^^^^^^^^^^^^
The method unbindHardwareInspector(HardwareInspector) from the type OshiPermissionEmitter is deprecated
[WARNING] /home/jenkins/agent/workspace/passage-base/tests/org.eclipse.passage.lic.oshi.tests/src/org/eclipse/passage/lic/oshi/tests/OshiPermissionEmitterTest.java:[88] 
	LicensingCondition condition = createOshiCondition(EXPRESSION_OS_X3);
	^^^^^^^^^^^^^^^^^^
The type LicensingCondition is deprecated
[WARNING] /home/jenkins/agent/workspace/passage-base/tests/org.eclipse.passage.lic.oshi.tests/src/org/eclipse/passage/lic/oshi/tests/OshiPermissionEmitterTest.java:[89] 
	assertEquals(EXPRESSION_OS_X3, condition.getConditionExpression());
	                                         ^^^^^^^^^^^^^^^^^^^^^^^^
The method getConditionExpression() from the type LicensingCondition is deprecated
[WARNING] /home/jenkins/agent/workspace/passage-base/tests/org.eclipse.passage.lic.oshi.tests/src/org/eclipse/passage/lic/oshi/tests/OshiPermissionEmitterTest.java:[90] 
	assertEquals(OshiHal.CONDITION_TYPE_HARDWARE, condition.getConditionType());
	             ^^^^^^^
The type OshiHal is deprecated
[WARNING] /home/jenkins/agent/workspace/passage-base/tests/org.eclipse.passage.lic.oshi.tests/src/org/eclipse/passage/lic/oshi/tests/OshiPermissionEmitterTest.java:[90] 
	assertEquals(OshiHal.CONDITION_TYPE_HARDWARE, condition.getConditionType());
	                     ^^^^^^^^^^^^^^^^^^^^^^^
The field OshiHal.CONDITION_TYPE_HARDWARE is deprecated
[WARNING] /home/jenkins/agent/workspace/passage-base/tests/org.eclipse.passage.lic.oshi.tests/src/org/eclipse/passage/lic/oshi/tests/OshiPermissionEmitterTest.java:[90] 
	assertEquals(OshiHal.CONDITION_TYPE_HARDWARE, condition.getConditionType());
	                                                        ^^^^^^^^^^^^^^^^^^
The method getConditionType() from the type LicensingCondition is deprecated
[WARNING] /home/jenkins/agent/workspace/passage-base/tests/org.eclipse.passage.lic.oshi.tests/src/org/eclipse/passage/lic/oshi/tests/OshiPermissionEmitterTest.java:[91] 
	assertEquals(OSHI_HARDWARE_FEATURE_ID, condition.getFeatureIdentifier());
	                                                 ^^^^^^^^^^^^^^^^^^^^^^
The method getFeatureIdentifier() from the type LicensingCondition is deprecated
[WARNING] /home/jenkins/agent/workspace/passage-base/tests/org.eclipse.passage.lic.oshi.tests/src/org/eclipse/passage/lic/oshi/tests/OshiPermissionEmitterTest.java:[92] 
	assertEquals(OSHI_HARDWARE_MATCH_RULE, condition.getMatchRule());
	                                                 ^^^^^^^^^^^^^^
The method getMatchRule() from the type LicensingCondition is deprecated
[WARNING] /home/jenkins/agent/workspace/passage-base/tests/org.eclipse.passage.lic.oshi.tests/src/org/eclipse/passage/lic/oshi/tests/OshiPermissionEmitterTest.java:[93] 
	assertEquals(OSHI_HARDWARE_MATCH_VERSION, condition.getMatchVersion());
	                                                    ^^^^^^^^^^^^^^^^^
The method getMatchVersion() from the type LicensingCondition is deprecated
[WARNING] /home/jenkins/agent/workspace/passage-base/tests/org.eclipse.passage.lic.oshi.tests/src/org/eclipse/passage/lic/oshi/tests/OshiPermissionEmitterTest.java:[96] 
	public static LicensingCondition createOshiCondition(String expression) {
	              ^^^^^^^^^^^^^^^^^^
The type LicensingCondition is deprecated
[WARNING] /home/jenkins/agent/workspace/passage-base/tests/org.eclipse.passage.lic.oshi.tests/src/org/eclipse/passage/lic/oshi/tests/OshiPermissionEmitterTest.java:[100] 
	String type = OshiHal.CONDITION_TYPE_HARDWARE;
	              ^^^^^^^
The type OshiHal is deprecated
[WARNING] /home/jenkins/agent/workspace/passage-base/tests/org.eclipse.passage.lic.oshi.tests/src/org/eclipse/passage/lic/oshi/tests/OshiPermissionEmitterTest.java:[100] 
	String type = OshiHal.CONDITION_TYPE_HARDWARE;
	                      ^^^^^^^^^^^^^^^^^^^^^^^
The field OshiHal.CONDITION_TYPE_HARDWARE is deprecated
61 problems (61 warnings)
[INFO] 
[INFO] --- tycho-eclipserun-plugin:1.5.1:eclipse-run (default) @ org.eclipse.passage.lic.oshi.tests ---
[INFO] Toolchain in tycho-eclipserun-plugin: JDK[/opt/tools/java/oracle/jdk-8/latest]
[INFO] Expected eclipse log file: /home/jenkins/agent/workspace/passage-base/tests/org.eclipse.passage.lic.oshi.tests/target/eclipserun-work/data/.metadata/.log
[INFO] Command line:
	[/opt/tools/java/oracle/jdk-8/latest/bin/java, -jar, /home/jenkins/.m2/repository/p2/osgi/bundle/org.eclipse.equinox.launcher/1.5.700.v20200207-2156/org.eclipse.equinox.launcher-1.5.700.v20200207-2156.jar, -install, /home/jenkins/agent/workspace/passage-base/tests/org.eclipse.passage.lic.oshi.tests/target/eclipserun-work, -configuration, /home/jenkins/agent/workspace/passage-base/tests/org.eclipse.passage.lic.oshi.tests/target/eclipserun-work/configuration, -data, target/apibuild-workspace, -application, org.eclipse.ant.core.antRunner, -buildfile, target/.apibuild.xml]
Buildfile: target/.apibuild.xml

apigen:
BUILD SUCCESSFUL

BUILD SUCCESSFUL
Total time: 0 seconds
[INFO] 
[INFO] --- maven-resources-plugin:3.1.0:testResources (default-testResources) @ org.eclipse.passage.lic.oshi.tests ---
[INFO] Using 'UTF-8' encoding to copy filtered resources.
[INFO] skip non existing resourceDirectory /home/jenkins/agent/workspace/passage-base/tests/org.eclipse.passage.lic.oshi.tests/src/test/resources
[INFO] 
[INFO] --- tycho-source-plugin:1.5.1:plugin-source (attach-source) @ org.eclipse.passage.lic.oshi.tests ---
[INFO] Building jar: /home/jenkins/agent/workspace/passage-base/tests/org.eclipse.passage.lic.oshi.tests/target/org.eclipse.passage.lic.oshi.tests-0.5.100-SNAPSHOT-sources.jar
[INFO] 
[INFO] --- target-platform-configuration:1.5.1:target-platform (default-target-platform) @ org.eclipse.passage.lic.oshi.tests ---
[INFO] 
[INFO] --- tycho-packaging-plugin:1.5.1:package-plugin (default-package-plugin) @ org.eclipse.passage.lic.oshi.tests ---
[INFO] Building jar: /home/jenkins/agent/workspace/passage-base/tests/org.eclipse.passage.lic.oshi.tests/target/org.eclipse.passage.lic.oshi.tests-0.5.100-SNAPSHOT.jar
[INFO] 
[INFO] --- tycho-p2-plugin:1.5.1:p2-metadata-default (default-p2-metadata-default) @ org.eclipse.passage.lic.oshi.tests ---
[INFO] 
[INFO] --- tycho-source-feature-plugin:1.5.1:source-feature (source-feature) @ org.eclipse.passage.lic.oshi.tests ---
[INFO] 
[INFO] --- tycho-p2-plugin:1.5.1:p2-metadata (attached-p2-metadata) @ org.eclipse.passage.lic.oshi.tests ---
[INFO] No baseline version MavenProject: org.eclipse.passage:org.eclipse.passage.lic.oshi.tests:0.5.100-SNAPSHOT @ /home/jenkins/agent/workspace/passage-base/tests/org.eclipse.passage.lic.oshi.tests/.polyglot..META-INF_MANIFEST.MF
[INFO] 
[INFO] --- tycho-surefire-plugin:1.5.1:test (default-test) @ org.eclipse.passage.lic.oshi.tests ---
[INFO] Expected eclipse log file: /home/jenkins/agent/workspace/passage-base/tests/org.eclipse.passage.lic.oshi.tests/target/work/data/.metadata/.log
[INFO] Command line:
	[/opt/tools/java/oracle/jdk-8/1.8.0_202/jre/bin/java, -Dosgi.noShutdown=false, -Dosgi.os=linux, -Dosgi.ws=gtk, -Dosgi.arch=x86_64, -Dosgi.clean=true, -jar, /home/jenkins/.m2/repository/p2/osgi/bundle/org.eclipse.equinox.launcher/1.5.700.v20200207-2156/org.eclipse.equinox.launcher-1.5.700.v20200207-2156.jar, -data, /home/jenkins/agent/workspace/passage-base/tests/org.eclipse.passage.lic.oshi.tests/target/work/data, -install, /home/jenkins/agent/workspace/passage-base/tests/org.eclipse.passage.lic.oshi.tests/target/work, -configuration, /home/jenkins/agent/workspace/passage-base/tests/org.eclipse.passage.lic.oshi.tests/target/work/configuration, -application, org.eclipse.tycho.surefire.osgibooter.headlesstest, -testproperties, /home/jenkins/agent/workspace/passage-base/tests/org.eclipse.passage.lic.oshi.tests/target/surefire.properties]
Running org.eclipse.passage.lic.oshi.tests.tobemoved.HardwareEnvironmentTest
SLF4J: Failed to load class "org.slf4j.impl.StaticLoggerBinder".
SLF4J: Defaulting to no-operation (NOP) logger implementation
SLF4J: See http://www.slf4j.org/codes.html#StaticLoggerBinder for further details.
Tests run: 7, Failures: 1, Errors: 0, Skipped: 3, Time elapsed: 2.942 s <<< FAILURE! - in org.eclipse.passage.lic.oshi.tests.tobemoved.HardwareEnvironmentTest
isDedicatedToProperEvaluationType(org.eclipse.passage.lic.oshi.tests.tobemoved.HardwareEnvironmentTest)  Time elapsed: 0.001 s
doesNotInspectNullProperty(org.eclipse.passage.lic.oshi.tests.tobemoved.HardwareEnvironmentTest)  Time elapsed: 0 s
standsSimultaneousRequests(org.eclipse.passage.lic.oshi.tests.tobemoved.HardwareEnvironmentTest)  Time elapsed: 2.905 s  <<< FAILURE!
java.lang.AssertionError

inspects(org.eclipse.passage.lic.oshi.tests.tobemoved.HardwareEnvironmentTest) skipped
doesNotInspectForNullValue(org.eclipse.passage.lic.oshi.tests.tobemoved.HardwareEnvironmentTest)  Time elapsed: 0 s
depictsState(org.eclipse.passage.lic.oshi.tests.tobemoved.HardwareEnvironmentTest) skipped
knowsSimpleRegexp(org.eclipse.passage.lic.oshi.tests.tobemoved.HardwareEnvironmentTest) skipped
Running org.eclipse.passage.lic.oshi.tests.OshiHalTest
Tests run: 1, Failures: 0, Errors: 0, Skipped: 0, Time elapsed: 0 s - in org.eclipse.passage.lic.oshi.tests.OshiHalTest
testExtractPropertyNegative(org.eclipse.passage.lic.oshi.tests.OshiHalTest)  Time elapsed: 0 s
Running org.eclipse.passage.lic.oshi.tests.OshiHardwareInspectorTest
Unable to read hardware
java.lang.NoClassDefFoundError: Could not initialize class oshi.jna.platform.linux.Udev
	at oshi.hardware.platform.linux.LinuxDisks.getDisks(LinuxDisks.java:102)
	at oshi.hardware.platform.linux.LinuxHardwareAbstractionLayer.getDiskStores(LinuxHardwareAbstractionLayer.java:82)
	at org.eclipse.passage.lic.internal.oshi.OshiHardwareInspector.inspect(OshiHardwareInspector.java:96)
	at java.util.concurrent.CompletableFuture$AsyncSupply.run(CompletableFuture.java:1590)
	at java.lang.Thread.run(Thread.java:748)
Unable to read hardware
java.lang.NoClassDefFoundError: Could not initialize class oshi.jna.platform.linux.Udev
	at oshi.hardware.platform.linux.LinuxDisks.getDisks(LinuxDisks.java:102)
	at oshi.hardware.platform.linux.LinuxHardwareAbstractionLayer.getDiskStores(LinuxHardwareAbstractionLayer.java:82)
	at org.eclipse.passage.lic.internal.oshi.OshiHardwareInspector.inspect(OshiHardwareInspector.java:96)
	at java.util.concurrent.CompletableFuture$AsyncSupply.run(CompletableFuture.java:1590)
	at java.lang.Thread.run(Thread.java:748)
Tests run: 2, Failures: 0, Errors: 0, Skipped: 0, Time elapsed: 0.019 s - in org.eclipse.passage.lic.oshi.tests.OshiHardwareInspectorTest
testDump(org.eclipse.passage.lic.oshi.tests.OshiHardwareInspectorTest)  Time elapsed: 0.013 s
testKnownProperties(org.eclipse.passage.lic.oshi.tests.OshiHardwareInspectorTest)  Time elapsed: 0.006 s
Running org.eclipse.passage.lic.oshi.tests.OshiPermissionEmitterTest
Unable to read hardware
java.lang.NoClassDefFoundError: Could not initialize class oshi.jna.platform.linux.Udev
	at oshi.hardware.platform.linux.LinuxDisks.getDisks(LinuxDisks.java:102)
	at oshi.hardware.platform.linux.LinuxHardwareAbstractionLayer.getDiskStores(LinuxHardwareAbstractionLayer.java:82)
	at org.eclipse.passage.lic.internal.oshi.OshiHardwareInspector.inspect(OshiHardwareInspector.java:96)
	at java.util.concurrent.CompletableFuture$AsyncSupply.run(CompletableFuture.java:1590)
	at java.lang.Thread.run(Thread.java:748)
Tests run: 3, Failures: 0, Errors: 0, Skipped: 0, Time elapsed: 0.01 s - in org.eclipse.passage.lic.oshi.tests.OshiPermissionEmitterTest
testEvaluateConditionPositive(org.eclipse.passage.lic.oshi.tests.OshiPermissionEmitterTest)  Time elapsed: 0.009 s
testEvaluateConditionNegative(org.eclipse.passage.lic.oshi.tests.OshiPermissionEmitterTest)  Time elapsed: 0.001 s
testOshiCondition(org.eclipse.passage.lic.oshi.tests.OshiPermissionEmitterTest)  Time elapsed: 0 s

Results:

Failures: 
  HardwareEnvironmentTest>RuntimeEnvironmentContractTest.standsSimultaneousRequests:112

Tests run: 13, Failures: 1, Errors: 0, Skipped: 3

[INFO] ------------------------------------------------------------------------
[INFO] Reactor Summary:
[INFO] 
[INFO] org.eclipse.passage.target 1.0.0-SNAPSHOT .......... SUCCESS [ 20.921 s]
[INFO] Passage LIC API 0.7.100-SNAPSHOT ................... SUCCESS [ 12.183 s]
[INFO] Passage LIC API Tests 0.1.0-SNAPSHOT ............... SUCCESS [  6.874 s]
[INFO] Passage LIC Base 0.6.200-SNAPSHOT .................. SUCCESS [  6.808 s]
[INFO] Passage LIC Equinox 0.6.100-SNAPSHOT ............... SUCCESS [  5.824 s]
[INFO] Passage LIC Equinox 0.6.400-SNAPSHOT ............... SUCCESS [  2.583 s]
[INFO] Passage LIC Base Tests 0.5.100-SNAPSHOT ............ SUCCESS [ 17.406 s]
[INFO] Data for Passage LIC Equinox requirements tests 0.1.0-SNAPSHOT SUCCESS [  4.974 s]
[INFO] Passage LIC Equinox Tests 0.6.0-SNAPSHOT ........... SUCCESS [  7.233 s]
[INFO] Passage LIC BC 0.5.100-SNAPSHOT .................... SUCCESS [  5.128 s]
[INFO] Passage LIC BC 0.6.100-SNAPSHOT .................... SUCCESS [  2.900 s]
[INFO] Passage LIC BC Tests 0.5.0-SNAPSHOT ................ SUCCESS [  7.910 s]
[INFO] Passage LIC Net 0.5.300-SNAPSHOT ................... SUCCESS [  5.192 s]
[INFO] Passage LIC Email 0.1.200-SNAPSHOT ................. SUCCESS [  2.486 s]
[INFO] Passage LIC Net 0.6.200-SNAPSHOT ................... SUCCESS [  2.423 s]
[INFO] Passage LIC Net Tests 0.5.0-SNAPSHOT ............... SUCCESS [  6.759 s]
[INFO] Passage LIC Mail 0.2.0-SNAPSHOT .................... SUCCESS [  2.317 s]
[INFO] Passage LIC Mail 0.2.0-SNAPSHOT .................... SUCCESS [  2.442 s]
[INFO] Passage LIC Mail Tests 0.2.0-SNAPSHOT .............. SUCCESS [  4.034 s]
[INFO] Passage LIC HC 0.5.400-SNAPSHOT .................... SUCCESS [  5.307 s]
[INFO] Passage LIC HC 0.6.300-SNAPSHOT .................... SUCCESS [  2.567 s]
[INFO] Passage LIC HC Tests 0.1.0-SNAPSHOT ................ SUCCESS [  6.494 s]
[INFO] Passage LIC JSON 0.5.300-SNAPSHOT .................. SUCCESS [  5.157 s]
[INFO] Passage LIC JSON 0.6.200-SNAPSHOT .................. SUCCESS [  2.447 s]
[INFO] Passage LIC JSON Tests 0.5.100-SNAPSHOT ............ SUCCESS [  6.919 s]
[INFO] Passage LIC OSHI 0.5.400-SNAPSHOT .................. SUCCESS [  5.177 s]
[INFO] Passage LIC OSHI 0.6.400-SNAPSHOT .................. SUCCESS [  3.168 s]
[INFO] Passage LIC OSHI Tests 0.5.100-SNAPSHOT ............ FAILURE [  7.187 s]
[INFO] Passage LIC EMF 1.0.0-SNAPSHOT ..................... SKIPPED
[INFO] Passage LIC EMF Meta 0.6.0-SNAPSHOT ................ SKIPPED
[INFO] Passage LIC EMF 1.0.0-SNAPSHOT ..................... SKIPPED
[INFO] Passage LIC EMF Tests 0.1.0-SNAPSHOT ............... SKIPPED
[INFO] Passage LIC JFace 0.6.300-SNAPSHOT ................. SKIPPED
[INFO] Passage LIC E4 Core 0.5.200-SNAPSHOT ............... SKIPPED
[INFO] Passage LIC E4 UI 0.5.300-SNAPSHOT ................. SKIPPED
[INFO] Passage LIC E4 UI 0.6.200-SNAPSHOT ................. SKIPPED
[INFO] Passage LIC JFace Tests 0.5.0-SNAPSHOT ............. SKIPPED
[INFO] Passage LIC Features 0.5.300-SNAPSHOT .............. SKIPPED
[INFO] Passage LIC Features Ecore 0.5.200-SNAPSHOT ........ SKIPPED
[INFO] Passage LIC Features Model 0.5.300-SNAPSHOT ........ SKIPPED
[INFO] Passage LIC Features Migration 0.5.200-SNAPSHOT .... SKIPPED
[INFO] Passage LIC Features Edit Support 0.5.200-SNAPSHOT . SKIPPED
[INFO] Passage LIC Features E4 UI 0.5.100-SNAPSHOT ........ SKIPPED
[INFO] Passage LIC Features 0.6.300-SNAPSHOT .............. SKIPPED
[INFO] Passage LIC Features Model Tests 0.1.0-SNAPSHOT .... SKIPPED
[INFO] Passage LIC Features Migration Tests 0.5.0-SNAPSHOT  SKIPPED
[INFO] Passage LIC Products 0.5.300-SNAPSHOT .............. SKIPPED
[INFO] Passage LIC Products Ecore 0.5.200-SNAPSHOT ........ SKIPPED
[INFO] Passage LIC Products Model 0.5.200-SNAPSHOT ........ SKIPPED
[INFO] Passage LIC Products Migration 0.5.200-SNAPSHOT .... SKIPPED
[INFO] Passage LIC Products Edit Support 0.5.200-SNAPSHOT . SKIPPED
[INFO] Passage LIC Products E4 UI 0.5.100-SNAPSHOT ........ SKIPPED
[INFO] Passage LIC Products 0.6.300-SNAPSHOT .............. SKIPPED
[INFO] Passage LIC Products Model Tests 0.1.0-SNAPSHOT .... SKIPPED
[INFO] Passage LIC Products Migration Tests 0.5.0-SNAPSHOT  SKIPPED
[INFO] Passage LIC Users 0.5.300-SNAPSHOT ................. SKIPPED
[INFO] Passage LIC Users Ecore 0.5.200-SNAPSHOT ........... SKIPPED
[INFO] Passage LIC Users Model 0.5.200-SNAPSHOT ........... SKIPPED
[INFO] Passage LIC Users Migration 0.5.200-SNAPSHOT ....... SKIPPED
[INFO] Passage LIC Users Edit Support 0.5.200-SNAPSHOT .... SKIPPED
[INFO] Passage LIC Users E4 UI 0.5.100-SNAPSHOT ........... SKIPPED
[INFO] Passage LIC Users 0.6.300-SNAPSHOT ................. SKIPPED
[INFO] Passage LIC Users Model Tests 0.1.0-SNAPSHOT ....... SKIPPED
[INFO] Passage LIC Users Migration Tests 0.5.0-SNAPSHOT ... SKIPPED
[INFO] Passage LIC Licenses 0.5.300-SNAPSHOT .............. SKIPPED
[INFO] Passage LIC Licenses Ecore 0.5.200-SNAPSHOT ........ SKIPPED
[INFO] Passage LIC Licenses Model 0.5.200-SNAPSHOT ........ SKIPPED
[INFO] Passage LIC Licenses Migration 0.5.200-SNAPSHOT .... SKIPPED
[INFO] Passage LIC Licenses Edit Support 0.5.200-SNAPSHOT . SKIPPED
[INFO] Passage LIC Licenses E4 UI 0.5.100-SNAPSHOT ........ SKIPPED
[INFO] Passage LIC Licenses 0.6.300-SNAPSHOT .............. SKIPPED
[INFO] Passage LIC Licenses Model Tests 0.1.0-SNAPSHOT .... SKIPPED
[INFO] Passage LIC Licenses Migration Tests 0.5.0-SNAPSHOT  SKIPPED
[INFO] Passage LIC Compile Branding 0.1.100-SNAPSHOT ...... SKIPPED
[INFO] Passage LIC Compile 1.0.0-SNAPSHOT ................. SKIPPED
[INFO] Passage LIC Execute Branding 0.1.100-SNAPSHOT ...... SKIPPED
[INFO] Passage LIC Execute 1.0.0-SNAPSHOT ................. SKIPPED
[INFO] Passage LIC Define Branding 0.1.100-SNAPSHOT ....... SKIPPED
[INFO] Passage LIC Define 1.0.0-SNAPSHOT .................. SKIPPED
[INFO] Passage LIC Integration Tests 0.6.0-SNAPSHOT ....... SKIPPED
[INFO] org.eclipse.passage.lic.repository 1.0.0-SNAPSHOT .. SKIPPED
[INFO] org.eclipse.passage.lic.aggregator 1.0.0-SNAPSHOT .. SKIPPED
[INFO] Passage LOC API 0.6.0-SNAPSHOT ..................... SKIPPED
[INFO] Passage LOC Workbench 1.0.0-SNAPSHOT ............... SKIPPED
[INFO] Passage LOC Workbench EMF Forms 1.0.0-SNAPSHOT ..... SKIPPED
[INFO] Passage LOC Workbench 1.0.0-SNAPSHOT ............... SKIPPED
[INFO] Passage LOC API Tests 0.1.0-SNAPSHOT ............... SKIPPED
[INFO] Passage LOC Workbench Tests 0.1.100-SNAPSHOT ....... SKIPPED
[INFO] Passage LOC Edit UI 0.6.100-SNAPSHOT ............... SKIPPED
[INFO] Passage LOC Edit UI 0.7.0-SNAPSHOT ................. SKIPPED
[INFO] Passage LOC YARS API 0.1.0-SNAPSHOT ................ SKIPPED
[INFO] Passage LOC Report Core 0.2.0-SNAPSHOT ............. SKIPPED
[INFO] Passage LOC Report UI 0.2.0-SNAPSHOT ............... SKIPPED
[INFO] Passage LOC Report 0.6.0-SNAPSHOT .................. SKIPPED
[INFO] Passage LOC YARS API Tests 0.1.0-SNAPSHOT .......... SKIPPED
[INFO] Passage LOC Report Core Tests 0.1.0-SNAPSHOT ....... SKIPPED
[INFO] Passage LOC Features Core 0.6.0-SNAPSHOT ........... SKIPPED
[INFO] Passage LOC Features UI 0.6.0-SNAPSHOT ............. SKIPPED
[INFO] Passage LOC Features EMF Forms 0.6.0-SNAPSHOT ...... SKIPPED
[INFO] Passage LOC Features 0.7.0-SNAPSHOT ................ SKIPPED
[INFO] Passage LOC Features Core Tests 0.1.0-SNAPSHOT ..... SKIPPED
[INFO] Passage LOC Products Core 0.6.0-SNAPSHOT ........... SKIPPED
[INFO] Passage LOC Products UI 0.6.0-SNAPSHOT ............. SKIPPED
[INFO] Passage LOC Products EMF Forms 0.6.0-SNAPSHOT ...... SKIPPED
[INFO] Passage LOC Products 0.7.0-SNAPSHOT ................ SKIPPED
[INFO] Passage LOC Licenses Core 0.6.0-SNAPSHOT ........... SKIPPED
[INFO] Passage LOC Users Core 0.6.0-SNAPSHOT .............. SKIPPED
[INFO] Passage LOC Users UI 0.7.0-SNAPSHOT ................ SKIPPED
[INFO] Passage LOC Licenses UI 0.6.0-SNAPSHOT ............. SKIPPED
[INFO] Passage LOC Licenses EMF Forms 0.7.0-SNAPSHOT ...... SKIPPED
[INFO] Passage LOC Licenses 0.7.0-SNAPSHOT ................ SKIPPED
[INFO] Passage LOC Billing Core 0.1.0-SNAPSHOT ............ SKIPPED
[INFO] Passage LOC Billing Feature 0.1.0-SNAPSHOT ......... SKIPPED
[INFO] Passage LOC Billing Core Tests 0.1.0-SNAPSHOT ...... SKIPPED
[INFO] Passage LOC Users EMF Forms 0.6.0-SNAPSHOT ......... SKIPPED
[INFO] Passage LOC Users 0.7.0-SNAPSHOT ................... SKIPPED
[INFO] Passage LOC Dashboard 1.0.0-SNAPSHOT ............... SKIPPED
[INFO] Passage LOC Dashboard 1.0.0-SNAPSHOT ............... SKIPPED
[INFO] Passage LOC Workbench 1.0.0-SNAPSHOT ............... SKIPPED
[INFO] Passage LOC Operator 1.0.0-SNAPSHOT ................ SKIPPED
[INFO] org.eclipse.passage.loc.repository 1.0.0-SNAPSHOT .. SKIPPED
[INFO] org.eclipse.passage.loc.operator.product 1.0.0-SNAPSHOT SKIPPED
[INFO] org.eclipse.passage.loc.aggregator 1.0.0-SNAPSHOT .. SKIPPED
[INFO] Passage LBC Target 1.0.0-SNAPSHOT .................. SKIPPED
[INFO] Passage LBC API 0.5.100-SNAPSHOT ................... SKIPPED
[INFO] Passage LBC Base 0.5.100-SNAPSHOT .................. SKIPPED
[INFO] Passage LBC Core 0.5.100-SNAPSHOT .................. SKIPPED
[INFO] Passage LBC Jetty 0.5.100-SNAPSHOT ................. SKIPPED
[INFO] Passage LBC Server 0.5.100-SNAPSHOT ................ SKIPPED
[INFO] Passage LBC Server  1.0.0-SNAPSHOT ................. SKIPPED
[INFO] Passage LBC Server Tests 0.6.100-SNAPSHOT .......... SKIPPED
[INFO] org.eclipse.passage.lbc.repository 1.0.0-SNAPSHOT .. SKIPPED
[INFO] org.eclipse.passage.lbc.server.product 1.0.0-SNAPSHOT SKIPPED
[INFO] org.eclipse.passage.lbc.aggregator 1.0.0-SNAPSHOT .. SKIPPED
[INFO] Passage LDC PDE UI Templates 0.5.200-SNAPSHOT ...... SKIPPED
[INFO] Passage LDC 0.5.300-SNAPSHOT ....................... SKIPPED
[INFO] Passage LDC 1.0.0-SNAPSHOT ......................... SKIPPED
[INFO] org.eclipse.passage.ldc.repository 1.0.0-SNAPSHOT .. SKIPPED
[INFO] org.eclipse.passage.ldc.aggregator 1.0.0-SNAPSHOT .. SKIPPED
[INFO] org.eclipse.passage.root 1.0.0-SNAPSHOT ............ SKIPPED
[INFO] ------------------------------------------------------------------------
[INFO] BUILD FAILURE
[INFO] ------------------------------------------------------------------------
[INFO] Total time:  05:06 min
[INFO] Finished at: 2020-07-15T18:40:50Z
[INFO] ------------------------------------------------------------------------
[ERROR] Failed to execute goal org.eclipse.tycho:tycho-surefire-plugin:1.5.1:test (default-test) on project org.eclipse.passage.lic.oshi.tests: There are test failures.
[ERROR] 
[ERROR] Please refer to /home/jenkins/agent/workspace/passage-base/tests/org.eclipse.passage.lic.oshi.tests/target/surefire-reports for the individual test results.
[ERROR] -> [Help 1]
[ERROR] 
[ERROR] To see the full stack trace of the errors, re-run Maven with the -e switch.
[ERROR] Re-run Maven using the -X switch to enable full debug logging.
[ERROR] 
[ERROR] For more information about the errors and possible solutions, please read the following articles:
[ERROR] [Help 1] http://cwiki.apache.org/confluence/display/MAVEN/MojoFailureException
[ERROR] 
[ERROR] After correcting the problems, you can resume the build with the command
[ERROR]   mvn <args> -rf :org.eclipse.passage.lic.oshi.tests
Build step 'Invoke top-level Maven targets' marked build as failure
$ ssh-agent -k
unset SSH_AUTH_SOCK;
unset SSH_AGENT_PID;
echo Agent pid 73 killed;
[ssh-agent] Stopped.
Not sending mail to unregistered user elena.parovyshnaya@gmail.com
Sending e-mails to: alexander.fedorov@arsysop.ru sergei.kovalchuk@arsysop.ru elena.parovyshnaia@arsysop.ru
Finished: FAILURE