UnstableConsole Output

Skipping 3,816 KB.. Full Log
-platform) @ org.eclipse.papyrus.uml.validation.tests.genvalidation ---
13:16:37 [INFO] 
13:16:37 [INFO] --- tycho-packaging-plugin:1.0.0:package-plugin (default-package-plugin) @ org.eclipse.papyrus.uml.validation.tests.genvalidation ---
13:16:37 [INFO] Building jar: /jobs/genie.papyrus/Papyrus-Oxygen-Tests/workspace/source/tests/junit/plugins/uml/validation/org.eclipse.papyrus.uml.validation.tests.genvalidation/target/org.eclipse.papyrus.uml.validation.tests.genvalidation-1.2.0-SNAPSHOT.jar
13:16:37 [INFO] 
13:16:37 [INFO] --- tycho-p2-plugin:1.0.0:p2-metadata-default (default-p2-metadata-default) @ org.eclipse.papyrus.uml.validation.tests.genvalidation ---
13:16:37 [INFO] 
13:16:37 [INFO] --- tycho-surefire-plugin:1.0.0:test (default-test) @ org.eclipse.papyrus.uml.validation.tests.genvalidation ---
13:16:37 [INFO] Skipping tests
13:16:37 [INFO] 
13:16:37 [INFO] --- jacoco-maven-plugin:0.7.9:report (default-report) @ org.eclipse.papyrus.uml.validation.tests.genvalidation ---
13:16:37 [INFO] Skipping JaCoCo execution due to missing execution data file.
13:16:37 [INFO] 
13:16:37 [INFO] --< org.eclipse.papyrus.tests:org.eclipse.papyrus.uml.validation.tests >--
13:16:37 [INFO] Building org.eclipse.papyrus.uml.validation.tests 1.2.0-SNAPSHOT [146/155]
13:16:37 [INFO] ------------------------[ eclipse-test-plugin ]-------------------------
13:16:37 [INFO] 
13:16:37 [INFO] --- maven-clean-plugin:2.6:clean (default-clean) @ org.eclipse.papyrus.uml.validation.tests ---
13:16:37 [INFO] 
13:16:37 [INFO] --- tycho-packaging-plugin:1.0.0:build-qualifier (default-build-qualifier) @ org.eclipse.papyrus.uml.validation.tests ---
13:16:37 [INFO] The project's OSGi version is 1.2.0.202003101629
13:16:37 [INFO] 
13:16:37 [INFO] --- tycho-packaging-plugin:1.0.0:validate-id (default-validate-id) @ org.eclipse.papyrus.uml.validation.tests ---
13:16:37 [INFO] 
13:16:37 [INFO] --- tycho-packaging-plugin:1.0.0:validate-version (default-validate-version) @ org.eclipse.papyrus.uml.validation.tests ---
13:16:37 [INFO] 
13:16:37 [INFO] --- jacoco-maven-plugin:0.7.9:prepare-agent (default-prepare-agent) @ org.eclipse.papyrus.uml.validation.tests ---
13:16:37 [INFO] tycho.testArgLine set to -javaagent:/home/hudson/genie.papyrus/.jenkins/jobs/Papyrus-Oxygen-Tests/workspace/.repository/org/jacoco/org.jacoco.agent/0.7.9/org.jacoco.agent-0.7.9-runtime.jar=destfile=/jobs/genie.papyrus/Papyrus-Oxygen-Tests/workspace/source/tests/junit/plugins/uml/validation/org.eclipse.papyrus.uml.validation.tests/target/jacoco.exec,includes=org.eclipse.papyrus.*,excludes=org.eclipse.uml2
13:16:37 [INFO] 
13:16:37 [INFO] --- maven-resources-plugin:2.6:resources (default-resources) @ org.eclipse.papyrus.uml.validation.tests ---
13:16:37 [INFO] Using 'UTF-8' encoding to copy filtered resources.
13:16:37 [INFO] skip non existing resourceDirectory /jobs/genie.papyrus/Papyrus-Oxygen-Tests/workspace/source/tests/junit/plugins/uml/validation/org.eclipse.papyrus.uml.validation.tests/src/main/resources
13:16:37 [INFO] 
13:16:37 [INFO] --- tycho-compiler-plugin:1.0.0:compile (default-compile) @ org.eclipse.papyrus.uml.validation.tests ---
13:16:37 [INFO] Compiling 10 source files to /jobs/genie.papyrus/Papyrus-Oxygen-Tests/workspace/source/tests/junit/plugins/uml/validation/org.eclipse.papyrus.uml.validation.tests/target/classes
13:16:38 [INFO] 
13:16:38 [INFO] --- maven-resources-plugin:2.6:testResources (default-testResources) @ org.eclipse.papyrus.uml.validation.tests ---
13:16:38 [INFO] Using 'UTF-8' encoding to copy filtered resources.
13:16:38 [INFO] skip non existing resourceDirectory /jobs/genie.papyrus/Papyrus-Oxygen-Tests/workspace/source/tests/junit/plugins/uml/validation/org.eclipse.papyrus.uml.validation.tests/src/test/resources
13:16:38 [INFO] 
13:16:38 [INFO] --- target-platform-configuration:1.0.0:target-platform (default-target-platform) @ org.eclipse.papyrus.uml.validation.tests ---
13:16:38 [INFO] 
13:16:38 [INFO] --- tycho-packaging-plugin:1.0.0:package-plugin (default-package-plugin) @ org.eclipse.papyrus.uml.validation.tests ---
13:16:38 [INFO] Building jar: /jobs/genie.papyrus/Papyrus-Oxygen-Tests/workspace/source/tests/junit/plugins/uml/validation/org.eclipse.papyrus.uml.validation.tests/target/org.eclipse.papyrus.uml.validation.tests-1.2.0-SNAPSHOT.jar
13:16:38 [INFO] 
13:16:38 [INFO] --- tycho-p2-plugin:1.0.0:p2-metadata-default (default-p2-metadata-default) @ org.eclipse.papyrus.uml.validation.tests ---
13:16:38 [INFO] 
13:16:38 [INFO] --- tycho-surefire-plugin:1.0.0:test (default-test) @ org.eclipse.papyrus.uml.validation.tests ---
13:16:38 [INFO] Skipping tests
13:16:38 [INFO] 
13:16:38 [INFO] --- jacoco-maven-plugin:0.7.9:report (default-report) @ org.eclipse.papyrus.uml.validation.tests ---
13:16:38 [INFO] Skipping JaCoCo execution due to missing execution data file.
13:16:38 [INFO] 
13:16:38 [INFO] ---< org.eclipse.papyrus.tests:org.eclipse.papyrus.uml.suite.tests >----
13:16:38 [INFO] Building org.eclipse.papyrus.uml.suite.tests 0.0.1-SNAPSHOT    [147/155]
13:16:38 [INFO] ------------------------[ eclipse-test-plugin ]-------------------------
13:16:38 [INFO] 
13:16:38 [INFO] --- maven-clean-plugin:2.6:clean (default-clean) @ org.eclipse.papyrus.uml.suite.tests ---
13:16:38 [INFO] 
13:16:38 [INFO] --- tycho-packaging-plugin:1.0.0:build-qualifier (default-build-qualifier) @ org.eclipse.papyrus.uml.suite.tests ---
13:16:38 [INFO] The project's OSGi version is 0.0.1.202003101629
13:16:38 [INFO] 
13:16:38 [INFO] --- tycho-packaging-plugin:1.0.0:validate-id (default-validate-id) @ org.eclipse.papyrus.uml.suite.tests ---
13:16:38 [INFO] 
13:16:38 [INFO] --- tycho-packaging-plugin:1.0.0:validate-version (default-validate-version) @ org.eclipse.papyrus.uml.suite.tests ---
13:16:38 [INFO] 
13:16:38 [INFO] --- jacoco-maven-plugin:0.7.9:prepare-agent (default-prepare-agent) @ org.eclipse.papyrus.uml.suite.tests ---
13:16:38 [INFO] tycho.testArgLine set to -javaagent:/home/hudson/genie.papyrus/.jenkins/jobs/Papyrus-Oxygen-Tests/workspace/.repository/org/jacoco/org.jacoco.agent/0.7.9/org.jacoco.agent-0.7.9-runtime.jar=destfile=/jobs/genie.papyrus/Papyrus-Oxygen-Tests/workspace/source/tests/junit/plugins/uml/org.eclipse.papyrus.uml.suite.tests/target/jacoco.exec,includes=org.eclipse.papyrus.*,excludes=org.eclipse.uml2
13:16:38 [INFO] 
13:16:38 [INFO] --- maven-resources-plugin:2.6:resources (default-resources) @ org.eclipse.papyrus.uml.suite.tests ---
13:16:38 [INFO] Using 'UTF-8' encoding to copy filtered resources.
13:16:38 [INFO] skip non existing resourceDirectory /jobs/genie.papyrus/Papyrus-Oxygen-Tests/workspace/source/tests/junit/plugins/uml/org.eclipse.papyrus.uml.suite.tests/src/main/resources
13:16:38 [INFO] 
13:16:38 [INFO] --- tycho-compiler-plugin:1.0.0:compile (default-compile) @ org.eclipse.papyrus.uml.suite.tests ---
13:16:38 [INFO] Compiling 2 source files to /jobs/genie.papyrus/Papyrus-Oxygen-Tests/workspace/source/tests/junit/plugins/uml/org.eclipse.papyrus.uml.suite.tests/target/classes
13:16:38 [INFO] 
13:16:38 [INFO] --- maven-resources-plugin:2.6:testResources (default-testResources) @ org.eclipse.papyrus.uml.suite.tests ---
13:16:38 [INFO] Using 'UTF-8' encoding to copy filtered resources.
13:16:38 [INFO] skip non existing resourceDirectory /jobs/genie.papyrus/Papyrus-Oxygen-Tests/workspace/source/tests/junit/plugins/uml/org.eclipse.papyrus.uml.suite.tests/src/test/resources
13:16:38 [INFO] 
13:16:38 [INFO] --- target-platform-configuration:1.0.0:target-platform (default-target-platform) @ org.eclipse.papyrus.uml.suite.tests ---
13:16:38 [INFO] 
13:16:38 [INFO] --- tycho-packaging-plugin:1.0.0:package-plugin (default-package-plugin) @ org.eclipse.papyrus.uml.suite.tests ---
13:16:38 [INFO] Building jar: /jobs/genie.papyrus/Papyrus-Oxygen-Tests/workspace/source/tests/junit/plugins/uml/org.eclipse.papyrus.uml.suite.tests/target/org.eclipse.papyrus.uml.suite.tests-0.0.1-SNAPSHOT.jar
13:16:38 [INFO] 
13:16:38 [INFO] --- tycho-p2-plugin:1.0.0:p2-metadata-default (default-p2-metadata-default) @ org.eclipse.papyrus.uml.suite.tests ---
13:16:38 [INFO] 
13:16:38 [INFO] --- tycho-surefire-plugin:1.0.0:test (default-test) @ org.eclipse.papyrus.uml.suite.tests ---
13:16:39 [INFO] Expected eclipse log file: /jobs/genie.papyrus/Papyrus-Oxygen-Tests/workspace/source/tests/junit/plugins/uml/org.eclipse.papyrus.uml.suite.tests/target/work/data/.metadata/.log
13:16:39 [INFO] Command line:
13:16:39 	[/opt/public/common/java/oracle/jdk1.8.0_202_x64/jre/bin/java, -Dosgi.noShutdown=false, -Dosgi.os=linux, -Dosgi.ws=gtk, -Dosgi.arch=x86_64, -javaagent:/home/hudson/genie.papyrus/.jenkins/jobs/Papyrus-Oxygen-Tests/workspace/.repository/org/jacoco/org.jacoco.agent/0.7.9/org.jacoco.agent-0.7.9-runtime.jar=destfile=/jobs/genie.papyrus/Papyrus-Oxygen-Tests/workspace/source/tests/junit/plugins/uml/org.eclipse.papyrus.uml.suite.tests/target/jacoco.exec,includes=org.eclipse.papyrus.*,excludes=org.eclipse.uml2, -Xms512m, -Xmx2048m, -XX:SoftRefLRUPolicyMSPerMB=100, -Dosgi.clean=true, -jar, /jobs/genie.papyrus/Papyrus-Oxygen-Tests/workspace/.repository/p2/osgi/bundle/org.eclipse.equinox.launcher/1.4.0.v20161219-1356/org.eclipse.equinox.launcher-1.4.0.v20161219-1356.jar, -data, /jobs/genie.papyrus/Papyrus-Oxygen-Tests/workspace/source/tests/junit/plugins/uml/org.eclipse.papyrus.uml.suite.tests/target/work/data, -install, /jobs/genie.papyrus/Papyrus-Oxygen-Tests/workspace/source/tests/junit/plugins/uml/org.eclipse.papyrus.uml.suite.tests/target/work, -configuration, /jobs/genie.papyrus/Papyrus-Oxygen-Tests/workspace/source/tests/junit/plugins/uml/org.eclipse.papyrus.uml.suite.tests/target/work/configuration, -application, org.eclipse.tycho.surefire.osgibooter.uitest, -testproperties, /jobs/genie.papyrus/Papyrus-Oxygen-Tests/workspace/source/tests/junit/plugins/uml/org.eclipse.papyrus.uml.suite.tests/target/surefire.properties, -product, org.eclipse.sdk.ide, -testConfig=CI_TESTS_CONFIG]
13:16:39 Picked up JAVA_TOOL_OPTIONS: -Xmx2G -Djava.io.tmpdir=/tmp/genie.papyrus -DforkCount=1
13:16:52 
13:16:52 -------------------------------------------------------
13:16:52  T E S T S
13:16:52 -------------------------------------------------------
13:16:52 Running org.eclipse.papyrus.uml.suite.tests.AllTests
13:17:06 Warning: NLS unused message: "Select in: messages
13:17:28 Plugin org.eclipse.papyrus.uml.architecture, extension org.eclipse.papyrus.infra.nattable.common.tableReconciler
13:17:28 Error processing extension: org.eclipse.core.internal.registry.ConfigurationElementHandle@408a
13:20:01 log4j:WARN No appenders could be found for logger (org.eclipse.ocl.pivot.internal.resource.StandaloneProjectMap).
13:20:01 log4j:WARN Please initialize the log4j system properly.
13:20:57 Tests run: 576, Failures: 1, Errors: 0, Skipped: 38, Time elapsed: 244.356 sec <<< FAILURE! - in org.eclipse.papyrus.uml.suite.tests.AllTests
13:20:57 testUML(org.eclipse.papyrus.uml.service.types.tests.creation.CreatePureUMLElementTest)  Time elapsed: 0.042 sec
13:20:57 test(org.eclipse.papyrus.uml.service.types.tests.creation.CreatePureUMLElementTest)  Time elapsed: 0.12 sec
13:20:57 testDeleteOneAddVariableValueAction(org.eclipse.papyrus.uml.service.types.tests.deletion.DeletePureUMLElementTest)  Time elapsed: 0.052 sec
13:20:57 testDeleteOneCentralBufferNode(org.eclipse.papyrus.uml.service.types.tests.deletion.DeletePureUMLElementTest)  Time elapsed: 0.007 sec
13:20:57 stereotypeApplicationsDeleted:command(org.eclipse.papyrus.uml.service.types.tests.deletion.DeleteDependentWithStereotypeApplications458685)  Time elapsed: 1.832 sec
13:20:57 stereotypeApplicationsDeleted:elements(org.eclipse.papyrus.uml.service.types.tests.deletion.DeleteDependentWithStereotypeApplications458685)  Time elapsed: 0 sec
13:20:57 stereotypeApplicationsDeleted:stereotypes(org.eclipse.papyrus.uml.service.types.tests.deletion.DeleteDependentWithStereotypeApplications458685)  Time elapsed: 0 sec
13:20:57 stereotypeApplicationsDeleted:undo(org.eclipse.papyrus.uml.service.types.tests.deletion.DeleteDependentWithStereotypeApplications458685)  Time elapsed: 0 sec
13:20:57 stereotypeApplicationsDeleted:redo(org.eclipse.papyrus.uml.service.types.tests.deletion.DeleteDependentWithStereotypeApplications458685)  Time elapsed: 0 sec
13:20:57 deleteInitialState(org.eclipse.papyrus.uml.service.types.tests.deletion.DeleteTransitionsWithVertexTest)  Time elapsed: 0.465 sec
13:20:57 deleteS1(org.eclipse.papyrus.uml.service.types.tests.deletion.DeleteTransitionsWithVertexTest)  Time elapsed: 0.219 sec
13:20:57 deleteS2(org.eclipse.papyrus.uml.service.types.tests.deletion.DeleteTransitionsWithVertexTest)  Time elapsed: 0.189 sec
13:20:57 deleteFinalState(org.eclipse.papyrus.uml.service.types.tests.deletion.DeleteTransitionsWithVertexTest)  Time elapsed: 0.14 sec
13:20:57 deleteFromContainmentSubset(org.eclipse.papyrus.uml.service.types.tests.deletion.DeleteContainmentSubsetTest)  Time elapsed: 0.106 sec
13:20:57 deleteFromTwoContainmentSupersetsAtOnce(org.eclipse.papyrus.uml.service.types.tests.deletion.DeleteContainmentSubsetTest)  Time elapsed: 0.086 sec
13:20:57 createAssociationWritable(org.eclipse.papyrus.uml.service.types.tests.creation.ConnectorReadOnlyTestBug465899)  Time elapsed: 0.22 sec
13:20:57 createAssociationReadOnly_usecase(org.eclipse.papyrus.uml.service.types.tests.creation.ConnectorReadOnlyTestBug465899)  Time elapsed: 0.117 sec
13:20:57 createAssociationReadOnly(org.eclipse.papyrus.uml.service.types.tests.creation.ConnectorReadOnlyTestBug465899)  Time elapsed: 0.045 sec
13:20:57 createConnectorTargetReadOnly(org.eclipse.papyrus.uml.service.types.tests.creation.ConnectorReadOnlyTestBug465899)  Time elapsed: 0.036 sec
13:20:57 createConnectorSourceReadOnly(org.eclipse.papyrus.uml.service.types.tests.creation.ConnectorReadOnlyTestBug465899)  Time elapsed: 0.044 sec
13:20:57 testDeletion(org.eclipse.papyrus.uml.service.types.tests.deletion.DeleteAssociationPropertyTypeTest)  Time elapsed: 0.025 sec
13:20:57 testDeletionInCompositeDiagram(org.eclipse.papyrus.uml.service.types.tests.deletion.DeleteCommentLinkTest)  Time elapsed: 6.953 sec
13:20:57 testDeletionWithSetRequest(org.eclipse.papyrus.uml.service.types.tests.deletion.DeleteCommentLinkTest) skipped
13:20:57 testDeletionInClassDiagram(org.eclipse.papyrus.uml.service.types.tests.deletion.DeleteCommentLinkTest)  Time elapsed: 1.51 sec
13:20:57 testDeletionInComponentDiagram(org.eclipse.papyrus.uml.service.types.tests.deletion.DeleteCommentLinkTest)  Time elapsed: 1.721 sec
13:20:57 testCreation(org.eclipse.papyrus.uml.service.types.tests.creation.CreateAssociationTest)  Time elapsed: 0.018 sec
13:20:57 testCreation(org.eclipse.papyrus.uml.service.types.tests.creation.CreateAssociationDirectedTest)  Time elapsed: 0.022 sec
13:20:57 testCreation(org.eclipse.papyrus.uml.service.types.tests.creation.CreateAssociationCompositeTest)  Time elapsed: 0.005 sec
13:20:57 testCreation(org.eclipse.papyrus.uml.service.types.tests.creation.CreateAssociationCompositeDirectedTest)  Time elapsed: 0.009 sec
13:20:57 testCreation(org.eclipse.papyrus.uml.service.types.tests.creation.CreateAssociationSharedTest)  Time elapsed: 0.007 sec
13:20:57 testCreation(org.eclipse.papyrus.uml.service.types.tests.creation.CreateAssociationSharedDirectedTest)  Time elapsed: 0.009 sec
13:20:57 deleteInteractionFragmentInOperand(org.eclipse.papyrus.uml.service.types.tests.deletion.InteractionDeletionTest)  Time elapsed: 0.614 sec
13:20:57 deleteAllOperandsOfCombinedFragment(org.eclipse.papyrus.uml.service.types.tests.deletion.InteractionDeletionTest)  Time elapsed: 0.569 sec
13:20:57 deleteCombinedFragment(org.eclipse.papyrus.uml.service.types.tests.deletion.InteractionDeletionTest)  Time elapsed: 0.535 sec
13:20:57 deleteCombinedFragmentNested(org.eclipse.papyrus.uml.service.types.tests.deletion.InteractionDeletionTest)  Time elapsed: 0.478 sec
13:20:57 deleteOperandsOfCombinedFragment(org.eclipse.papyrus.uml.service.types.tests.deletion.InteractionDeletionTest)  Time elapsed: 0.501 sec
13:20:57 deleteCombinedFragmentDeeplyNested(org.eclipse.papyrus.uml.service.types.tests.deletion.InteractionDeletionTest)  Time elapsed: 0.457 sec
13:20:57 deleteInteractionWithNesting(org.eclipse.papyrus.uml.service.types.tests.deletion.InteractionDeletionTest)  Time elapsed: 0.457 sec
13:20:57 deleteInteraction(org.eclipse.papyrus.uml.service.types.tests.deletion.InteractionDeletionTest)  Time elapsed: 0.368 sec
13:20:57 testCreateClassInModel(org.eclipse.papyrus.uml.service.types.ui.tests.creation.CreateElementTest)  Time elapsed: 0.008 sec
13:20:57 testCreateCentralBufferNodeInActivity(org.eclipse.papyrus.uml.service.types.ui.tests.creation.CreateElementTest)  Time elapsed: 0.01 sec
13:20:57 testCreateCentralBufferNodeInActivityWithNode(org.eclipse.papyrus.uml.service.types.ui.tests.creation.CreateElementTest)  Time elapsed: 0.006 sec
13:20:57 testCannotCreateOperationRedefinableTemplateSignature_bug468071(org.eclipse.papyrus.uml.service.types.ui.tests.creation.CreateElementTest)  Time elapsed: 0 sec
13:20:57 testCreateOperationTemplateSignature_bug468071(org.eclipse.papyrus.uml.service.types.ui.tests.creation.CreateElementTest)  Time elapsed: 0.008 sec
13:20:57 testCreateModelInClass(org.eclipse.papyrus.uml.service.types.ui.tests.creation.CreateElementTest)  Time elapsed: 0 sec
13:20:57 testCreateDeploymentBetweenNodeAndArtifactInNode(org.eclipse.papyrus.uml.service.types.ui.tests.creation.CreateRelationshipTest)  Time elapsed: 0.007 sec
13:20:57 testCreatePackageMergeBetweenPackageAndPackageInPackage2(org.eclipse.papyrus.uml.service.types.ui.tests.creation.CreateRelationshipTest)  Time elapsed: 0.009 sec
13:20:57 testCreateTraceBetweenClassAndNullInPackage(org.eclipse.papyrus.uml.service.types.ui.tests.creation.CreateRelationshipTest)  Time elapsed: 0.005 sec
13:20:57 testCreateDependencyBetweenClassesInPackage(org.eclipse.papyrus.uml.service.types.ui.tests.creation.CreateRelationshipTest)  Time elapsed: 0.004 sec
13:20:57 testCreateProtocolConformanceBetweenPackageAndPackageInPackage(org.eclipse.papyrus.uml.service.types.ui.tests.creation.CreateRelationshipTest)  Time elapsed: 0.004 sec
13:20:57 testCreateInformationfloweBetweenClasses2InPackage(org.eclipse.papyrus.uml.service.types.ui.tests.creation.CreateRelationshipTest)  Time elapsed: 0.01 sec
13:20:57 testCreateUsageBetweenClassAndNullInPackage(org.eclipse.papyrus.uml.service.types.ui.tests.creation.CreateRelationshipTest)  Time elapsed: 0.001 sec
13:20:57 testCreateAbstractionBetweenPackageAndClassesInModel(org.eclipse.papyrus.uml.service.types.ui.tests.creation.CreateRelationshipTest)  Time elapsed: 0.011 sec
13:20:57 testCreateComponentRealizationBetweenClassAndComponentInComponent(org.eclipse.papyrus.uml.service.types.ui.tests.creation.CreateRelationshipTest)  Time elapsed: 0.015 sec
13:20:57 testCreateAbstractionBetweenClassesInPackage(org.eclipse.papyrus.uml.service.types.ui.tests.creation.CreateRelationshipTest)  Time elapsed: 0.004 sec
13:20:57 testCreateUsageBetweenClassesInPackage(org.eclipse.papyrus.uml.service.types.ui.tests.creation.CreateRelationshipTest)  Time elapsed: 0.004 sec
13:20:57 testCreatePackageImportBetweenPackageAndPackageInPackage(org.eclipse.papyrus.uml.service.types.ui.tests.creation.CreateRelationshipTest)  Time elapsed: 0.006 sec
13:20:57 testCreateComponentRealizationBetweenComponentAndClassInComponent(org.eclipse.papyrus.uml.service.types.ui.tests.creation.CreateRelationshipTest)  Time elapsed: 0.007 sec
13:20:57 testCreateElementImportBetweenPackageAndPackageInPackage(org.eclipse.papyrus.uml.service.types.ui.tests.creation.CreateRelationshipTest)  Time elapsed: 0.012 sec
13:20:57 testCreateDeploymentBetweenNodeAndArtifactInArtifact(org.eclipse.papyrus.uml.service.types.ui.tests.creation.CreateRelationshipTest)  Time elapsed: 0.001 sec
13:20:57 testCreateGeneralizationBetweenClassesInPackage(org.eclipse.papyrus.uml.service.types.ui.tests.creation.CreateRelationshipTest)  Time elapsed: 0.005 sec
13:20:57 testCreateGeneralizationBetweenClassAndNullInClass(org.eclipse.papyrus.uml.service.types.ui.tests.creation.CreateRelationshipTest)  Time elapsed: 0.002 sec
13:20:57 testCreateDeploymentBetweenArtifactAndNodeInArtifact(org.eclipse.papyrus.uml.service.types.ui.tests.creation.CreateRelationshipTest)  Time elapsed: 0.01 sec
13:20:57 testCreateExtendBetweenClasses2InPackage(org.eclipse.papyrus.uml.service.types.ui.tests.creation.CreateRelationshipTest)  Time elapsed: 0.001 sec
13:20:57 testCreateProtocolConformanceBetweenPackageAndPackageInPackage2(org.eclipse.papyrus.uml.service.types.ui.tests.creation.CreateRelationshipTest)  Time elapsed: 0 sec
13:20:57 testCreateTransitionBetweenInitialAndState(org.eclipse.papyrus.uml.service.types.ui.tests.creation.CreateRelationshipTest) skipped
13:20:57 testCreateInformationfloweBetweenUseCases2InUseCase(org.eclipse.papyrus.uml.service.types.ui.tests.creation.CreateRelationshipTest)  Time elapsed: 0.004 sec
13:20:57 testCreateRefineBetweenClassesInPackage(org.eclipse.papyrus.uml.service.types.ui.tests.creation.CreateRelationshipTest)  Time elapsed: 0.048 sec
13:20:57 testCreateComponentRealizationBetweenClassAndComponentInClass(org.eclipse.papyrus.uml.service.types.ui.tests.creation.CreateRelationshipTest)  Time elapsed: 0.007 sec
13:20:57 testCreateRealizationBetweenClassAndNullInPackage(org.eclipse.papyrus.uml.service.types.ui.tests.creation.CreateRelationshipTest)  Time elapsed: 0.001 sec
13:20:57 testCreateExtensionBetweenClassAndNullInNull(org.eclipse.papyrus.uml.service.types.ui.tests.creation.CreateRelationshipTest)  Time elapsed: 0.001 sec
13:20:57 testCreateExtendBetweenUseCases2InUseCase(org.eclipse.papyrus.uml.service.types.ui.tests.creation.CreateRelationshipTest)  Time elapsed: 0.014 sec
13:20:57 testCreateElementImportBetweenPackageAndPackageInPackage2(org.eclipse.papyrus.uml.service.types.ui.tests.creation.CreateRelationshipTest)  Time elapsed: 0.004 sec
13:20:57 testCreateAssociationBetweenClassesInPackage(org.eclipse.papyrus.uml.service.types.ui.tests.creation.CreateRelationshipTest)  Time elapsed: 0.004 sec
13:20:57 testCreateTraceBetweenClassesInClass(org.eclipse.papyrus.uml.service.types.ui.tests.creation.CreateRelationshipTest)  Time elapsed: 0.036 sec
13:20:57 testCreateManifestationBetweenArtifactAndPackage2InArtifact(org.eclipse.papyrus.uml.service.types.ui.tests.creation.CreateRelationshipTest)  Time elapsed: 0.008 sec
13:20:57 testCreateSubstitutionBetweenClassesInPackage(org.eclipse.papyrus.uml.service.types.ui.tests.creation.CreateRelationshipTest)  Time elapsed: 0.007 sec
13:20:57 testCreateAbstractionBetweenClassAndNullInPackage(org.eclipse.papyrus.uml.service.types.ui.tests.creation.CreateRelationshipTest)  Time elapsed: 0.002 sec
13:20:57 testCreateAbstractionBetweenClassAndClassInClass(org.eclipse.papyrus.uml.service.types.ui.tests.creation.CreateRelationshipTest)  Time elapsed: 0.009 sec
13:20:57 testCreatePackageMergeBetweenPackageAndPackageInPackage(org.eclipse.papyrus.uml.service.types.ui.tests.creation.CreateRelationshipTest)  Time elapsed: 0.005 sec
13:20:57 testCreateRealizationBetweenClassesInPackage(org.eclipse.papyrus.uml.service.types.ui.tests.creation.CreateRelationshipTest)  Time elapsed: 0.005 sec
13:20:57 testCreateTransitionBetweenStateAndInitial(org.eclipse.papyrus.uml.service.types.ui.tests.creation.CreateRelationshipTest) skipped
13:20:57 testCreateAssociationBetweenClassAndNullInPackage(org.eclipse.papyrus.uml.service.types.ui.tests.creation.CreateRelationshipTest)  Time elapsed: 0.002 sec
13:20:57 testCreateRefineBetweenClassAndNullInPackage(org.eclipse.papyrus.uml.service.types.ui.tests.creation.CreateRelationshipTest)  Time elapsed: 0.002 sec
13:20:57 testCreateDeploymentBetweenArtifactAndNodeInNode(org.eclipse.papyrus.uml.service.types.ui.tests.creation.CreateRelationshipTest)  Time elapsed: 0.006 sec
13:20:57 testCreateIncludeBetweenUseCases2InUseCase(org.eclipse.papyrus.uml.service.types.ui.tests.creation.CreateRelationshipTest)  Time elapsed: 0.006 sec
13:20:57 testCreateGeneralizationBetweenClassesInClass(org.eclipse.papyrus.uml.service.types.ui.tests.creation.CreateRelationshipTest)  Time elapsed: 0.003 sec
13:20:57 testCreateExtensionBetweenClassAndNullInClass(org.eclipse.papyrus.uml.service.types.ui.tests.creation.CreateRelationshipTest)  Time elapsed: 0.001 sec
13:20:57 testCreateDependencyBetweenClassAndNullInPackage(org.eclipse.papyrus.uml.service.types.ui.tests.creation.CreateRelationshipTest)  Time elapsed: 0.001 sec
13:20:57 testCreatePackageImportBetweenPackageAndPackageInPackage2(org.eclipse.papyrus.uml.service.types.ui.tests.creation.CreateRelationshipTest)  Time elapsed: 0.004 sec
13:20:57 testCreateComponentRealizationBetweenComponentAndClass(org.eclipse.papyrus.uml.service.types.ui.tests.creation.CreateRelationshipTest)  Time elapsed: 0.002 sec
13:20:57 testCreateSubstitutionBetweenClassAndNullInPackage(org.eclipse.papyrus.uml.service.types.ui.tests.creation.CreateRelationshipTest)  Time elapsed: 0.001 sec
13:20:57 testCreateInterfaceRealizationBetweenClassAndInterfaceInClass(org.eclipse.papyrus.uml.service.types.ui.tests.creation.CreateRelationshipTest)  Time elapsed: 0.009 sec
13:20:57 testCreateTraceBetweenClassesInPackage(org.eclipse.papyrus.uml.service.types.ui.tests.creation.CreateRelationshipTest)  Time elapsed: 0.011 sec
13:20:57 testCreateTransitionBetweenStateAndFinal(org.eclipse.papyrus.uml.service.types.ui.tests.creation.CreateRelationshipTest) skipped
13:20:57 testCreateAbstractionBetweenClassAndPackageInModel(org.eclipse.papyrus.uml.service.types.ui.tests.creation.CreateRelationshipTest)  Time elapsed: 0.004 sec
13:20:57 testCreateRefineBetweenClassesInClass(org.eclipse.papyrus.uml.service.types.ui.tests.creation.CreateRelationshipTest)  Time elapsed: 0.009 sec
13:20:57 testCreateTransitionBetweenFinalAndState(org.eclipse.papyrus.uml.service.types.ui.tests.creation.CreateRelationshipTest) skipped
13:20:57 testCreateManifestationBetweenClassAndPackage2InArtifact(org.eclipse.papyrus.uml.service.types.ui.tests.creation.CreateRelationshipTest)  Time elapsed: 0.004 sec
13:20:57 testCreateInterfaceRealizationBetweenUseCases2InUseCase(org.eclipse.papyrus.uml.service.types.ui.tests.creation.CreateRelationshipTest)  Time elapsed: 0.001 sec
13:20:57 testCreateIncludeBetweenClasses2InPackage(org.eclipse.papyrus.uml.service.types.ui.tests.creation.CreateRelationshipTest)  Time elapsed: 0.001 sec
13:20:57 testCreateExtensionBetweenStereotypeAndMetaClassInPackage(org.eclipse.papyrus.uml.service.types.ui.tests.creation.CreateProfileRelationshipTest)  Time elapsed: 0.014 sec
13:20:57 testMoveTemplateSignatureToOperation_bug468071(org.eclipse.papyrus.uml.service.types.ui.tests.creation.MoveElementTest)  Time elapsed: 0.034 sec
13:20:57 testMoveRedefinableTemplateSignatureToClass_bug468071(org.eclipse.papyrus.uml.service.types.ui.tests.creation.MoveElementTest)  Time elapsed: 0.004 sec
13:20:57 testCannotMoveRedefinableTemplateSignatureToOperation_bug468071(org.eclipse.papyrus.uml.service.types.ui.tests.creation.MoveElementTest)  Time elapsed: 0.001 sec
13:20:57 testSetTemplateSignatureOfOperation_bug468071(org.eclipse.papyrus.uml.service.types.ui.tests.creation.SetFeatureTest)  Time elapsed: 0.004 sec
13:20:57 testSetRedefinableTemplateSignatureOfClass_bug468071(org.eclipse.papyrus.uml.service.types.ui.tests.creation.SetFeatureTest)  Time elapsed: 0.004 sec
13:20:57 testCannotSetRedefinableTemplateSignatureOfOperation_bug468071(org.eclipse.papyrus.uml.service.types.ui.tests.creation.SetFeatureTest)  Time elapsed: 0 sec
13:20:57 deleteAssociation(org.eclipse.papyrus.uml.service.types.ui.tests.deletion.DeleteAssociationTest)  Time elapsed: 0.253 sec
13:20:57 deleteAssociationTarget(org.eclipse.papyrus.uml.service.types.ui.tests.deletion.DeleteAssociationTest)  Time elapsed: 0.232 sec
13:20:57 deleteReadOnlyElement(org.eclipse.papyrus.uml.modelexplorer.tests.DeleteModelExplorerTest)  Time elapsed: 1.799 sec
13:20:57 deleteClassInTheModel(org.eclipse.papyrus.uml.modelexplorer.tests.DeleteModelExplorerTest)  Time elapsed: 1.202 sec
13:20:57 deleteRootOfTheModel(org.eclipse.papyrus.uml.modelexplorer.tests.DeleteModelExplorerTest)  Time elapsed: 0.749 sec
13:20:57 renameUMLUnnamedElementTest(org.eclipse.papyrus.uml.modelexplorer.tests.RenameHandlerTest) skipped
13:20:57 renameUMLNamedElementTest(org.eclipse.papyrus.uml.modelexplorer.tests.RenameHandlerTest) skipped
13:20:57 revealSemanticElement_selectRootTest(org.eclipse.papyrus.uml.modelexplorer.tests.ModelExplorerViewTests)  Time elapsed: 1.117 sec
13:20:57 revealSemanticElement_selectChildrenTest(org.eclipse.papyrus.uml.modelexplorer.tests.ModelExplorerViewTests)  Time elapsed: 1.304 sec
13:20:57 revealSemanticElement_selectImportedPackage(org.eclipse.papyrus.uml.modelexplorer.tests.ModelExplorerViewTests)  Time elapsed: 1.501 sec
13:20:57 revealSemanticElement_selectImportedPackageList(org.eclipse.papyrus.uml.modelexplorer.tests.ModelExplorerViewTests)  Time elapsed: 1.22 sec
13:20:57 revealSemanticElement_selectChildrenTestList(org.eclipse.papyrus.uml.modelexplorer.tests.ModelExplorerViewTests)  Time elapsed: 1.207 sec
13:20:57 cutReadOnlyElement(org.eclipse.papyrus.uml.modelexplorer.tests.paste.CutPasteModelExplorerTest)  Time elapsed: 0.782 sec
13:20:57 cutClassTest(org.eclipse.papyrus.uml.modelexplorer.tests.paste.CutPasteModelExplorerTest)  Time elapsed: 0.927 sec
13:20:57 cutRootOfTheModel(org.eclipse.papyrus.uml.modelexplorer.tests.paste.CutPasteModelExplorerTest)  Time elapsed: 1.343 sec
13:20:57 copyPasteofClass1Test(org.eclipse.papyrus.uml.modelexplorer.tests.paste.CopyPasteModelExplorerTest)  Time elapsed: 0.737 sec
13:20:57 pasteOnReadOnlyElement(org.eclipse.papyrus.uml.modelexplorer.tests.paste.CopyPasteModelExplorerTest)  Time elapsed: 0.83 sec
13:20:57 copyPasteofClass1And2Test(org.eclipse.papyrus.uml.modelexplorer.tests.paste.CopyPasteModelExplorerTest)  Time elapsed: 0.953 sec
13:20:57 copyPasteDiagramTest(org.eclipse.papyrus.uml.modelexplorer.tests.paste.DiagramCopyPasteModelExplorerTest)  Time elapsed: 0.972 sec
13:20:57 copyPasteTableTest(org.eclipse.papyrus.uml.modelexplorer.tests.paste.TableCopyPasteModelExplorerTest)  Time elapsed: 2.429 sec  <<< FAILURE!
13:20:57 java.lang.AssertionError: TableOfViews0 TreeElement is null
13:20:57 	at org.junit.Assert.fail(Assert.java:88)
13:20:57 	at org.junit.Assert.assertTrue(Assert.java:41)
13:20:57 	at org.junit.Assert.assertNotNull(Assert.java:712)
13:20:57 	at org.eclipse.papyrus.uml.modelexplorer.tests.paste.TableCopyPasteModelExplorerTest.copyPasteTableTest(TableCopyPasteModelExplorerTest.java:119)
13:20:57 
13:20:57 copyPasteofClass1Test(org.eclipse.papyrus.uml.modelexplorer.tests.paste.StereotypeCopyPasteModelExplorerTest)  Time elapsed: 1.224 sec
13:20:57 advancedModeDoesNotCollapseItself(org.eclipse.papyrus.uml.modelexplorer.tests.AdvancedModeTest)  Time elapsed: 1.539 sec
13:20:57 dropInterface(org.eclipse.papyrus.uml.diagram.dnd.tests.tests.InstanceSpecificationTest)  Time elapsed: 0.146 sec
13:20:57 dropClass(org.eclipse.papyrus.uml.diagram.dnd.tests.tests.InstanceSpecificationTest)  Time elapsed: 0.02 sec
13:20:57 testPropertyContentProvider(org.eclipse.papyrus.uml.diagram.dnd.tests.tests.InstanceSpecificationTest)  Time elapsed: 0.003 sec
13:20:57 dropClassAndInterface(org.eclipse.papyrus.uml.diagram.dnd.tests.tests.InstanceSpecificationTest)  Time elapsed: 0.03 sec
13:20:57 dropClassAndSuperclass(org.eclipse.papyrus.uml.diagram.dnd.tests.tests.InstanceSpecificationTest)  Time elapsed: 0.034 sec
13:20:57 singleValuePropertyGraphicalTest(org.eclipse.papyrus.uml.tools.tests.tests.ContentProviderTest)  Time elapsed: 0.084 sec
13:20:57 singleValuePropertyTest(org.eclipse.papyrus.uml.tools.tests.tests.ContentProviderTest)  Time elapsed: 0.017 sec
13:20:57 multipleValuePropertyTest(org.eclipse.papyrus.uml.tools.tests.tests.ContentProviderTest) skipped
13:20:57 enumPropertyTest(org.eclipse.papyrus.uml.tools.tests.tests.ContentProviderTest)  Time elapsed: 0.007 sec
13:20:57 testProfileContentWithBaseClassPropertyWithoutInheritedProperties(org.eclipse.papyrus.uml.tools.tests.tests.UMLStereotypePropertyContentProviderTest)  Time elapsed: 0.181 sec
13:20:57 testProfileContentWithoutBaseClassPropertyWithoutInheritedProperties(org.eclipse.papyrus.uml.tools.tests.tests.UMLStereotypePropertyContentProviderTest)  Time elapsed: 0.146 sec
13:20:57 testProfileContentWithBaseClassPropertyWithInheritedProperties(org.eclipse.papyrus.uml.tools.tests.tests.UMLStereotypePropertyContentProviderTest)  Time elapsed: 0.137 sec
13:20:57 testProfileContentWithoutBaseClassPropertyWithInheritedProperties(org.eclipse.papyrus.uml.tools.tests.tests.UMLStereotypePropertyContentProviderTest)  Time elapsed: 0.128 sec
13:20:57 testSwitchToProxy(org.eclipse.papyrus.uml.tools.tests.tests.DependencyManagementTest) skipped
13:20:57 testSwitchProfilesWithStereotypes(org.eclipse.papyrus.uml.tools.tests.tests.DependencyManagementTest)  Time elapsed: 1.449 sec
13:20:57 testSwitchFromRegistererdToLocal(org.eclipse.papyrus.uml.tools.tests.tests.DependencyManagementTest)  Time elapsed: 1.315 sec
13:20:57 testSwitchProfilesWithStereotypeProperties(org.eclipse.papyrus.uml.tools.tests.tests.DependencyManagementTest)  Time elapsed: 1.094 sec
13:20:57 testSwitchProfilesWithMissingDefinitions(org.eclipse.papyrus.uml.tools.tests.tests.DependencyManagementTest)  Time elapsed: 1.02 sec
13:20:57 testSwitchFromLocalToRegistered(org.eclipse.papyrus.uml.tools.tests.tests.DependencyManagementTest)  Time elapsed: 1.305 sec
13:20:57 testSwitchToDifferentVersion(org.eclipse.papyrus.uml.tools.tests.tests.DependencyManagementTest) skipped
13:20:57 testSimpleSwitch(org.eclipse.papyrus.uml.tools.tests.tests.DependencyManagementTest)  Time elapsed: 1.167 sec
13:20:57 testSwitchFromProxy(org.eclipse.papyrus.uml.tools.tests.tests.DependencyManagementTest) skipped
13:20:57 testSwitchProfilesStereotypeIdentities(org.eclipse.papyrus.uml.tools.tests.tests.DependencyManagementTest)  Time elapsed: 1.102 sec
13:20:57 testSwitchProfilesWithRequiredStereotypes(org.eclipse.papyrus.uml.tools.tests.tests.DependencyManagementTest)  Time elapsed: 1.016 sec
13:20:57 testOverloadDoesNotClash(org.eclipse.papyrus.uml.tools.tests.tests.NamedElementValidatorTest)  Time elapsed: 0.034 sec
13:20:57 testNameClash(org.eclipse.papyrus.uml.tools.tests.tests.NamedElementValidatorTest)  Time elapsed: 0.029 sec
13:20:57 testElementOfDifferentKindDoesNotClash(org.eclipse.papyrus.uml.tools.tests.tests.NamedElementValidatorTest)  Time elapsed: 0.027 sec
13:20:57 testModifiedSysMLStereotype(org.eclipse.papyrus.uml.tools.tests.tests.StereotypeElementListenerTest) skipped
13:20:57 testUndoUnapplyProfile(org.eclipse.papyrus.uml.tools.tests.tests.StereotypeElementListenerTest)  Time elapsed: 0.604 sec
13:20:57 testAddStereotype(org.eclipse.papyrus.uml.tools.tests.tests.StereotypeElementListenerTest)  Time elapsed: 0.4 sec
13:20:57 testStereotypeUnsetAttributeChange(org.eclipse.papyrus.uml.tools.tests.tests.StereotypeElementListenerTest)  Time elapsed: 0.38 sec
13:20:57 testUndoAddStereotype(org.eclipse.papyrus.uml.tools.tests.tests.StereotypeElementListenerTest)  Time elapsed: 0.512 sec
13:20:57 testAddStereotypes(org.eclipse.papyrus.uml.tools.tests.tests.StereotypeElementListenerTest)  Time elapsed: 0.378 sec
13:20:57 testUndoRemoveStereotype(org.eclipse.papyrus.uml.tools.tests.tests.StereotypeElementListenerTest)  Time elapsed: 0.347 sec
13:20:57 testAddSysMLStereotype(org.eclipse.papyrus.uml.tools.tests.tests.StereotypeElementListenerTest)  Time elapsed: 0.321 sec
13:20:57 testModifiedStereotype(org.eclipse.papyrus.uml.tools.tests.tests.StereotypeElementListenerTest)  Time elapsed: 0.358 sec
13:20:57 testAddStereotypeOnSeveralElements(org.eclipse.papyrus.uml.tools.tests.tests.StereotypeElementListenerTest)  Time elapsed: 0.311 sec
13:20:57 testUndoAddStereotypes(org.eclipse.papyrus.uml.tools.tests.tests.StereotypeElementListenerTest)  Time elapsed: 0.371 sec
13:20:57 testFakeBasedProperty(org.eclipse.papyrus.uml.tools.tests.tests.StereotypeElementListenerTest)  Time elapsed: 0.359 sec
13:20:57 testRemoveStereotype(org.eclipse.papyrus.uml.tools.tests.tests.StereotypeElementListenerTest)  Time elapsed: 0.311 sec
13:20:57 testRemoveSysMLStereotype(org.eclipse.papyrus.uml.tools.tests.tests.StereotypeElementListenerTest)  Time elapsed: 0.345 sec
13:20:57 testUndoAddSysMLStereotype(org.eclipse.papyrus.uml.tools.tests.tests.StereotypeElementListenerTest)  Time elapsed: 0.591 sec
13:20:57 testUndoModifiedStereotype(org.eclipse.papyrus.uml.tools.tests.tests.StereotypeElementListenerTest)  Time elapsed: 0.409 sec
13:20:57 testUndoAddStereotypeOnSeveralElements(org.eclipse.papyrus.uml.tools.tests.tests.StereotypeElementListenerTest)  Time elapsed: 0.53 sec
13:20:57 testUndoRedoAddStereotypeTiming(org.eclipse.papyrus.uml.tools.tests.tests.StereotypeElementListenerTest)  Time elapsed: 0.37 sec
13:20:57 testUnapplyProfile(org.eclipse.papyrus.uml.tools.tests.tests.StereotypeElementListenerTest)  Time elapsed: 0.325 sec
13:20:57 testUndoRemoveSysMLStereotype(org.eclipse.papyrus.uml.tools.tests.tests.StereotypeElementListenerTest)  Time elapsed: 0.342 sec
13:20:57 testUndoModifiedSysMLStereotype(org.eclipse.papyrus.uml.tools.tests.tests.StereotypeElementListenerTest) skipped
13:20:57 testStereotypeListAttributeChange(org.eclipse.papyrus.uml.tools.tests.tests.StereotypeElementListenerTest)  Time elapsed: 0.295 sec
13:20:57 twoProfilesUnapplied(org.eclipse.papyrus.uml.tools.tests.tests.ProfileApplicationListenerTest)  Time elapsed: 0.084 sec
13:20:57 moveProfileApplication(org.eclipse.papyrus.uml.tools.tests.tests.ProfileApplicationListenerTest)  Time elapsed: 0.107 sec
13:20:57 applyProfileThenMoveApplication(org.eclipse.papyrus.uml.tools.tests.tests.ProfileApplicationListenerTest)  Time elapsed: 0.098 sec
13:20:57 twoProfilesApplied(org.eclipse.papyrus.uml.tools.tests.tests.ProfileApplicationListenerTest)  Time elapsed: 0.241 sec
13:20:57 profileReplacedInAnApplication(org.eclipse.papyrus.uml.tools.tests.tests.ProfileApplicationListenerTest)  Time elapsed: 0.117 sec
13:20:57 simpleNewProfileApplication(org.eclipse.papyrus.uml.tools.tests.tests.ProfileApplicationListenerTest)  Time elapsed: 0.142 sec
13:20:57 simpleProfileUnapplication(org.eclipse.papyrus.uml.tools.tests.tests.ProfileApplicationListenerTest)  Time elapsed: 0.18 sec
13:20:57 profileAppliedThenReplacedInSameApplication(org.eclipse.papyrus.uml.tools.tests.tests.ProfileApplicationListenerTest)  Time elapsed: 0.154 sec
13:20:57 testEditToDisplaySingleString_1(org.eclipse.papyrus.uml.tools.tests.tests.UMLReferenceConverterTest)  Time elapsed: 0.048 sec
13:20:57 testList(org.eclipse.papyrus.uml.tools.tests.tests.UMLReferenceConverterTest)  Time elapsed: 0.192 sec
13:20:57 testNull(org.eclipse.papyrus.uml.tools.tests.tests.UMLReferenceConverterTest)  Time elapsed: 0.066 sec
13:20:57 testDisplayToEditString_1(org.eclipse.papyrus.uml.tools.tests.tests.UMLReferenceConverterTest)  Time elapsed: 0.056 sec
13:20:57 testEmptyString(org.eclipse.papyrus.uml.tools.tests.tests.UMLReferenceConverterTest)  Time elapsed: 0.059 sec
13:20:57 testClass2(org.eclipse.papyrus.uml.tools.tests.tests.UMLReferenceConverterTest)  Time elapsed: 0.058 sec
13:20:57 testClass3(org.eclipse.papyrus.uml.tools.tests.tests.UMLReferenceConverterTest)  Time elapsed: 0.064 sec
13:20:57 testMatchingElementstSingleValue1(org.eclipse.papyrus.uml.tools.tests.tests.UMLReferenceConverterTest)  Time elapsed: 0.07 sec
13:20:57 testMatchingElementstSingleValue2(org.eclipse.papyrus.uml.tools.tests.tests.UMLReferenceConverterTest)  Time elapsed: 0.053 sec
13:20:57 testCompletionToFindClass_1(org.eclipse.papyrus.uml.tools.tests.tests.UMLReferenceConverterCompletionTest)  Time elapsed: 0.066 sec
13:20:57 testCompletionToFindClass_3(org.eclipse.papyrus.uml.tools.tests.tests.UMLReferenceConverterCompletionTest)  Time elapsed: 0.031 sec
13:20:57 testCompletionToFindClass_4(org.eclipse.papyrus.uml.tools.tests.tests.UMLReferenceConverterCompletionTest)  Time elapsed: 0.036 sec
13:20:57 testCompletionToFindClass_5(org.eclipse.papyrus.uml.tools.tests.tests.UMLReferenceConverterCompletionTest)  Time elapsed: 0.055 sec
13:20:57 testCompletionToFindClass_6(org.eclipse.papyrus.uml.tools.tests.tests.UMLReferenceConverterCompletionTest)  Time elapsed: 0.038 sec
13:20:57 testCompletionToFindClass_7(org.eclipse.papyrus.uml.tools.tests.tests.UMLReferenceConverterCompletionTest)  Time elapsed: 0.03 sec
13:20:57 testCompletionToFindClass_8(org.eclipse.papyrus.uml.tools.tests.tests.UMLReferenceConverterCompletionTest)  Time elapsed: 0.035 sec
13:20:57 testSplitString_1(org.eclipse.papyrus.uml.tools.tests.tests.UMLReferenceConverterCompletionTest)  Time elapsed: 0.044 sec
13:20:57 testSplitString_2(org.eclipse.papyrus.uml.tools.tests.tests.UMLReferenceConverterCompletionTest)  Time elapsed: 0.055 sec
13:20:57 testCompletionToFindConstraint_1(org.eclipse.papyrus.uml.tools.tests.tests.UMLReferenceConverterCompletionTest)  Time elapsed: 0.034 sec
13:20:57 testCompletionToFindConstraint_2(org.eclipse.papyrus.uml.tools.tests.tests.UMLReferenceConverterCompletionTest)  Time elapsed: 0.036 sec
13:20:57 testCompletionMultiValueConverterEmptyString(org.eclipse.papyrus.uml.tools.tests.tests.UMLReferenceConverterCompletionTest)  Time elapsed: 0.03 sec
13:20:57 testCompletionToFindPackage_1(org.eclipse.papyrus.uml.tools.tests.tests.UMLReferenceConverterCompletionTest)  Time elapsed: 0.034 sec
13:20:57 testCompletionToFindPackage_2(org.eclipse.papyrus.uml.tools.tests.tests.UMLReferenceConverterCompletionTest)  Time elapsed: 0.037 sec
13:20:57 testCompletionSingleValueConverterEmptyString(org.eclipse.papyrus.uml.tools.tests.tests.UMLReferenceConverterCompletionTest)  Time elapsed: 0.043 sec
13:20:57 profileLanguage(org.eclipse.papyrus.uml.tools.tests.tests.UMLLanguageProvidersTest)  Time elapsed: 0.003 sec
13:20:57 umlLanguage(org.eclipse.papyrus.uml.tools.tests.tests.UMLLanguageProvidersTest)  Time elapsed: 0.001 sec
13:20:57 ValidationStereotypesListClass1Test(org.eclipse.papyrus.uml.tools.tests.tests.IconsStereotypesTest)  Time elapsed: 1.107 sec
13:20:57 ValidationStereotypesListClass2Test(org.eclipse.papyrus.uml.tools.tests.tests.IconsStereotypesTest)  Time elapsed: 1.009 sec
13:20:57 ValidationStereotypesListClass3Test(org.eclipse.papyrus.uml.tools.tests.tests.IconsStereotypesTest)  Time elapsed: 2.295 sec
13:20:57 ValidationStereotypesListClass4Test(org.eclipse.papyrus.uml.tools.tests.tests.IconsStereotypesTest)  Time elapsed: 1.304 sec
13:20:57 ValidationImageClass1Test(org.eclipse.papyrus.uml.tools.tests.tests.IconsStereotypesTest)  Time elapsed: 1.192 sec
13:20:57 ValidationImageClass2Test(org.eclipse.papyrus.uml.tools.tests.tests.IconsStereotypesTest)  Time elapsed: 1.134 sec
13:20:57 ValidationImageClass3Test(org.eclipse.papyrus.uml.tools.tests.tests.IconsStereotypesTest)  Time elapsed: 0.973 sec
13:20:57 ValidationImageClass4Test(org.eclipse.papyrus.uml.tools.tests.tests.IconsStereotypesTest)  Time elapsed: 1.079 sec
13:20:57 returnedTextTest(org.eclipse.papyrus.uml.tools.tests.tests.CustomizableDelegatingItemLabelProviderTest)  Time elapsed: 1.102 sec
13:20:57 returnedStyledTextTest(org.eclipse.papyrus.uml.tools.tests.tests.CustomizableDelegatingItemLabelProviderTest)  Time elapsed: 1.09 sec
13:20:57 notifyChange(org.eclipse.papyrus.uml.tools.tests.tests.DelegatingItemLabelProviderTest)  Time elapsed: 0.108 sec
13:20:57 copyingInterfaceRealizationDoesNotCorruptTheModel(org.eclipse.papyrus.uml.tools.tests.tests.UMLCopyTest)  Time elapsed: 0.004 sec
13:20:57 recursiveImportPackage(org.eclipse.papyrus.uml.tools.utils.tests.tests.NameResolutionHelperTest)  Time elapsed: 0.145 sec
13:20:57 testIsAutoNamed(org.eclipse.papyrus.uml.tools.utils.tests.tests.NamedElementUtilTest)  Time elapsed: 0.031 sec
13:20:57 testGetDefaultNameWithIncrement(org.eclipse.papyrus.uml.tools.utils.tests.tests.NamedElementUtilTest)  Time elapsed: 0.002 sec
13:20:57 testAutoNameIncrement(org.eclipse.papyrus.uml.tools.utils.tests.tests.NamedElementUtilTest)  Time elapsed: 0.001 sec
13:20:57 testExistingElementHavingNameNotRenamed(org.eclipse.papyrus.uml.tools.utils.tests.tests.NamedElementUtilTest)  Time elapsed: 0 sec
13:20:57 testGetAppliedSuperstereotype(org.eclipse.papyrus.uml.tools.utils.tests.tests.UMLUtilTest)  Time elapsed: 0.085 sec
13:20:57 testGetApplicableStereotype_notStrict_notApplicable(org.eclipse.papyrus.uml.tools.utils.tests.tests.UMLUtilTest)  Time elapsed: 0.254 sec
13:20:57 testGetApplicableStereotype_notStrict_applicable(org.eclipse.papyrus.uml.tools.utils.tests.tests.UMLUtilTest)  Time elapsed: 0.234 sec
13:20:57 testGetApplicableStereotype_strict_applicable(org.eclipse.papyrus.uml.tools.utils.tests.tests.UMLUtilTest)  Time elapsed: 0.456 sec
13:20:57 testGetAppliedSubstereotype_notApplied(org.eclipse.papyrus.uml.tools.utils.tests.tests.UMLUtilTest)  Time elapsed: 0.088 sec
13:20:57 testGetApplicableStereotype_strict_notApplicable(org.eclipse.papyrus.uml.tools.utils.tests.tests.UMLUtilTest)  Time elapsed: 0.291 sec
13:20:57 testGetAppliedSubstereotype_applied(org.eclipse.papyrus.uml.tools.utils.tests.tests.UMLUtilTest)  Time elapsed: 0.091 sec
13:20:57 testUnApplyStereotypeApplication(org.eclipse.papyrus.uml.diagram.stereotypeproperty.TestBadUnapplyProfile2ClosedDiagComment)  Time elapsed: 1.512 sec
13:20:57 testStereotypeApplicationOnClass(org.eclipse.papyrus.uml.diagram.stereotypeproperty.TestDropStereotypedClass)  Time elapsed: 0.787 sec
13:20:57 testProfileApplicationOnModel(org.eclipse.papyrus.uml.diagram.stereotypeproperty.TestProfileApplication)  Time elapsed: 0.426 sec
13:20:57 testBrace(org.eclipse.papyrus.uml.diagram.stereotypeproperty.tests.asbrace.TestDisplayAsBrace)  Time elapsed: 0.837 sec
13:20:57 testReopenStereotypeAsComment(org.eclipse.papyrus.uml.diagram.stereotypeproperty.tests.asbrace.TestReopenAsBrace)  Time elapsed: 1.957 sec
13:20:57 testStereotypeApplicationOnClass(org.eclipse.papyrus.uml.diagram.stereotypeproperty.tests.ascomment.TestDisplayAsComment)  Time elapsed: 0.666 sec
13:20:57 testReopenStereotypeAsComment(org.eclipse.papyrus.uml.diagram.stereotypeproperty.tests.ascomment.TestReopenAsComment)  Time elapsed: 2.039 sec
13:20:57 testStereotypeApplicationOnClass(org.eclipse.papyrus.uml.diagram.stereotypeproperty.tests.ascompartment.TestDisplayAsCompartment)  Time elapsed: 1.051 sec
13:20:57 testReopenStereotypeAsComment(org.eclipse.papyrus.uml.diagram.stereotypeproperty.tests.ascompartment.TestReopenAsCompartment)  Time elapsed: 2.103 sec
13:20:57 test2StereotypeApplicationsOnClass(org.eclipse.papyrus.uml.diagram.stereotypeproperty.tests.displayname.Test2StereotypeApplications)  Time elapsed: 0.482 sec
13:20:57 testStereotypeApplicationOnPackage(org.eclipse.papyrus.uml.diagram.stereotypeproperty.tests.displayname.TestStereotypeApplication)  Time elapsed: 0.671 sec
13:20:57 testStereotypeApplicationOnClass(org.eclipse.papyrus.uml.diagram.stereotypeproperty.tests.displayname.TestStereotypeApplication)  Time elapsed: 0.07 sec
13:20:57 testQNStereotypeApplicationOnClass(org.eclipse.papyrus.uml.diagram.stereotypeproperty.tests.displayname.TestStereotypeApplicationQualifiedName)  Time elapsed: 0.493 sec
13:20:57 testLayoutStereotypeApplicationOnClass(org.eclipse.papyrus.uml.diagram.stereotypeproperty.tests.layout.TestLayoutWithStereotype) skipped
13:20:57 testLayoutOnClass(org.eclipse.papyrus.uml.diagram.stereotypeproperty.tests.layout.TestLayoutWithStereotype) skipped
13:20:57 testLayoutStereotypeApplicationOnClass(org.eclipse.papyrus.uml.diagram.stereotypeproperty.tests.layout.TestLayoutWithStereotypeOnEclipseHIPPInstance) skipped
13:20:57 testLayoutOnClass(org.eclipse.papyrus.uml.diagram.stereotypeproperty.tests.layout.TestLayoutWithStereotypeOnEclipseHIPPInstance) skipped
13:20:57 testDiagramFileExtentionLabel(org.eclipse.papyrus.uml.diagram.wizards.TestCreateModelWizard)  Time elapsed: 0.322 sec
13:20:57 testDiagramFileExtenstionForUML(org.eclipse.papyrus.uml.diagram.wizards.TestCreateModelWizard)  Time elapsed: 0.088 sec
13:20:57 testOrderOfPages(org.eclipse.papyrus.uml.diagram.wizards.TestCreateModelWizard)  Time elapsed: 0.09 sec
13:20:57 testDiagramFileExtentionLabel(org.eclipse.papyrus.uml.diagram.wizards.TestInitModelWizard)  Time elapsed: 0.091 sec
13:20:57 testDiagramFileExtenstionForUML(org.eclipse.papyrus.uml.diagram.wizards.TestInitModelWizard)  Time elapsed: 0.088 sec
13:20:57 testOrderOfPages(org.eclipse.papyrus.uml.diagram.wizards.TestInitModelWizard)  Time elapsed: 0.072 sec
13:20:57 testOrderOfPages(org.eclipse.papyrus.uml.diagram.wizards.TestNewProjectWizard)  Time elapsed: 0.084 sec
13:20:57 testForSimpleModel(org.eclipse.papyrus.uml.diagram.wizards.TestCreateModelFromExistingModelWizard)  Time elapsed: 0.103 sec
13:20:57 testOrderOfPages(org.eclipse.papyrus.uml.diagram.wizards.TestCreateModelFromExistingModelWizard)  Time elapsed: 0.076 sec
13:20:57 testForModelWithDot(org.eclipse.papyrus.uml.diagram.wizards.TestCreateModelFromExistingModelWizard)  Time elapsed: 0.072 sec
13:20:57 missingSchema(org.eclipse.papyrus.uml.modelrepair.internal.stereotypes.StereotypeApplicationRepairSnippetTest)  Time elapsed: 0.333 sec
13:20:57 noCorruptionControlCase(org.eclipse.papyrus.uml.modelrepair.internal.stereotypes.StereotypeApplicationRepairSnippetTest)  Time elapsed: 0.077 sec
13:20:57 wrongProfileVersion(org.eclipse.papyrus.uml.modelrepair.internal.stereotypes.StereotypeApplicationRepairSnippetTest)  Time elapsed: 0.234 sec
13:20:57 missingProfileApplication(org.eclipse.papyrus.uml.modelrepair.internal.stereotypes.StereotypeApplicationRepairSnippetTest)  Time elapsed: 0.349 sec
13:20:57 deleteStereotypes(org.eclipse.papyrus.uml.modelrepair.internal.stereotypes.StereotypeApplicationRepairSnippetTest)  Time elapsed: 0.084 sec
13:20:57 nestedProfileApplicationsMissingNamespace_bug434302(org.eclipse.papyrus.uml.modelrepair.internal.stereotypes.StereotypeRepairRegressionTest)  Time elapsed: 0.294 sec
13:20:57 orphansOfWrongProfileVersion_bug436666(org.eclipse.papyrus.uml.modelrepair.internal.stereotypes.StereotypeRepairRegressionTest)  Time elapsed: 0.06 sec
13:20:57 badSchemaLocationInNonPackageFragment_bug459488(org.eclipse.papyrus.uml.modelrepair.internal.stereotypes.StereotypeRepairRegressionTest)  Time elapsed: 0.815 sec
13:20:57 nestedProfilesAndNestedApplicationsWellFormed_bug434302(org.eclipse.papyrus.uml.modelrepair.internal.stereotypes.StereotypeRepairRegressionTest)  Time elapsed: 0.297 sec
13:20:57 registeredDynamicProfie_bug455329(org.eclipse.papyrus.uml.modelrepair.internal.stereotypes.StereotypeRepairRegressionTest)  Time elapsed: 0.056 sec
13:20:57 nestedPackageSchemaMissing_bug436666(org.eclipse.papyrus.uml.modelrepair.internal.stereotypes.StereotypeRepairRegressionTest)  Time elapsed: 0.31 sec
13:20:57 incorrectZombieGroupingWithoutProfileNamespaceURIPattern_bug496307(org.eclipse.papyrus.uml.modelrepair.internal.stereotypes.StereotypeRepairRegressionTest)  Time elapsed: 0.751 sec
13:20:57 nonStereotypeApplicationsAreOK_bug436666(org.eclipse.papyrus.uml.modelrepair.internal.stereotypes.StereotypeRepairRegressionTest)  Time elapsed: 0.293 sec
13:20:57 nestedProfileApplications2Pkgs1Profile_bug434302(org.eclipse.papyrus.uml.modelrepair.internal.stereotypes.StereotypeRepairRegressionTest)  Time elapsed: 0.381 sec
13:20:57 crossReferencedPackageUnitWithoutOwnProfileApplication_bug458736(org.eclipse.papyrus.uml.modelrepair.internal.stereotypes.StereotypeRepairRegressionTest)  Time elapsed: 0.716 sec
13:20:57 correctZombieGroupingWithProfileNamespaceURIPattern_bug496307(org.eclipse.papyrus.uml.modelrepair.internal.stereotypes.StereotypeRepairRegressionTest)  Time elapsed: 0.059 sec
13:20:57 orphansOfValidSchema_bug436666(org.eclipse.papyrus.uml.modelrepair.internal.stereotypes.StereotypeRepairRegressionTest)  Time elapsed: 0.277 sec
13:20:57 packageUnitWithoutOwnProfileApplication_bug455248(org.eclipse.papyrus.uml.modelrepair.internal.stereotypes.StereotypeRepairRegressionTest)  Time elapsed: 0.042 sec
13:20:57 nestedPackageInProfileIsOK_bug436666(org.eclipse.papyrus.uml.modelrepair.internal.stereotypes.StereotypeRepairRegressionTest)  Time elapsed: 0.357 sec
13:20:57 compareMultiVersionSameURISameVersion(org.eclipse.papyrus.uml.modelrepair.internal.uripattern.ProfileNamespaceURIPatternTest)  Time elapsed: 0.001 sec
13:20:57 compareMultiVersionDifferentURIDifferentVersion(org.eclipse.papyrus.uml.modelrepair.internal.uripattern.ProfileNamespaceURIPatternTest)  Time elapsed: 0 sec
13:20:57 compareSingleVersionDifferentURISameVersion(org.eclipse.papyrus.uml.modelrepair.internal.uripattern.ProfileNamespaceURIPatternTest)  Time elapsed: 0 sec
13:20:57 compareMultiVersionDifferentURISameVersion(org.eclipse.papyrus.uml.modelrepair.internal.uripattern.ProfileNamespaceURIPatternTest)  Time elapsed: 0 sec
13:20:57 compareCorrectInvalidComparisonConstantBehavior(org.eclipse.papyrus.uml.modelrepair.internal.uripattern.ProfileNamespaceURIPatternTest)  Time elapsed: 0 sec
13:20:57 compareNoVersionSameURI(org.eclipse.papyrus.uml.modelrepair.internal.uripattern.ProfileNamespaceURIPatternTest)  Time elapsed: 0.001 sec
13:20:57 compareSingleVersionDifferentURIDifferentVersion(org.eclipse.papyrus.uml.modelrepair.internal.uripattern.ProfileNamespaceURIPatternTest)  Time elapsed: 0 sec
13:20:57 matchCorrectNoMatchConstantBehavior(org.eclipse.papyrus.uml.modelrepair.internal.uripattern.ProfileNamespaceURIPatternTest)  Time elapsed: 0.003 sec
13:20:57 matchSingleVersionCorrectURIGivenVersion(org.eclipse.papyrus.uml.modelrepair.internal.uripattern.ProfileNamespaceURIPatternTest)  Time elapsed: 0 sec
13:20:57 matchNoVersionCorrectURIDefaultVersion(org.eclipse.papyrus.uml.modelrepair.internal.uripattern.ProfileNamespaceURIPatternTest)  Time elapsed: 0 sec
13:20:57 matchMultipleVersionCorrectURIGivenVersion(org.eclipse.papyrus.uml.modelrepair.internal.uripattern.ProfileNamespaceURIPatternTest)  Time elapsed: 0 sec
13:20:57 matchMultipleVersionCorrectURIDefaultVersion(org.eclipse.papyrus.uml.modelrepair.internal.uripattern.ProfileNamespaceURIPatternTest)  Time elapsed: 0 sec
13:20:57 compareCorrectInvalidComparisonBehaviorWrongLHS(org.eclipse.papyrus.uml.modelrepair.internal.uripattern.ProfileNamespaceURIPatternTest)  Time elapsed: 0.001 sec
13:20:57 compareCorrectInvalidComparisonBehaviorWrongRHS(org.eclipse.papyrus.uml.modelrepair.internal.uripattern.ProfileNamespaceURIPatternTest)  Time elapsed: 0 sec
13:20:57 registryExtensionPointCorrectMatch(org.eclipse.papyrus.uml.modelrepair.internal.uripattern.ProfileNamespaceURIPatternTest)  Time elapsed: 0.001 sec
13:20:57 compareSingleVersionSameURIDifferentVersion(org.eclipse.papyrus.uml.modelrepair.internal.uripattern.ProfileNamespaceURIPatternTest)  Time elapsed: 0.001 sec
13:20:57 compareSingleVersionSameURISameVersion(org.eclipse.papyrus.uml.modelrepair.internal.uripattern.ProfileNamespaceURIPatternTest)  Time elapsed: 0 sec
13:20:57 compareMultiVersionSameURIDifferentVersion(org.eclipse.papyrus.uml.modelrepair.internal.uripattern.ProfileNamespaceURIPatternTest)  Time elapsed: 0 sec
13:20:57 registryCorrectUnregisterAndRegister(org.eclipse.papyrus.uml.modelrepair.internal.uripattern.ProfileNamespaceURIPatternTest)  Time elapsed: 0 sec
13:20:57 registryExtensionPointRegistered(org.eclipse.papyrus.uml.modelrepair.internal.uripattern.ProfileNamespaceURIPatternTest)  Time elapsed: 0 sec
13:20:57 compareCorrectInvalidComparisonBehaviorWrongPattern(org.eclipse.papyrus.uml.modelrepair.internal.uripattern.ProfileNamespaceURIPatternTest)  Time elapsed: 0 sec
13:20:57 matchNoVersionCorrectURIGivenVersion(org.eclipse.papyrus.uml.modelrepair.internal.uripattern.ProfileNamespaceURIPatternTest)  Time elapsed: 0 sec
13:20:57 compareNoVersionDifferentURI(org.eclipse.papyrus.uml.modelrepair.internal.uripattern.ProfileNamespaceURIPatternTest)  Time elapsed: 0 sec
13:20:57 matchSingleVersionCorrectURIDefaultVersion(org.eclipse.papyrus.uml.modelrepair.internal.uripattern.ProfileNamespaceURIPatternTest)  Time elapsed: 0 sec
13:20:57 matchCorrectNoMatchBehavior(org.eclipse.papyrus.uml.modelrepair.internal.uripattern.ProfileNamespaceURIPatternTest)  Time elapsed: 0 sec
13:20:57 outOfDateModelSkipMigration_papyrus(org.eclipse.papyrus.uml.profile.service.ReapplyProfilesServiceTest)  Time elapsed: 1.176 sec
13:20:57 upToDateModelDoesNotPromptForMigration_papyrus(org.eclipse.papyrus.uml.profile.service.ReapplyProfilesServiceTest)  Time elapsed: 1.313 sec
13:20:57 outOfDateModelDoMigration_dynamic(org.eclipse.papyrus.uml.profile.service.ReapplyProfilesServiceTest)  Time elapsed: 1.062 sec
13:20:57 outOfDateModelSkipMigration_uml2(org.eclipse.papyrus.uml.profile.service.ReapplyProfilesServiceTest)  Time elapsed: 1.454 sec
13:20:57 outOfDateModelDoMigration_papyrus(org.eclipse.papyrus.uml.profile.service.ReapplyProfilesServiceTest)  Time elapsed: 1.428 sec
13:20:57 outOfDateModelSkipMigration_dynamic(org.eclipse.papyrus.uml.profile.service.ReapplyProfilesServiceTest)  Time elapsed: 1.046 sec
13:20:57 outOfDateModelDoMigration_uml2(org.eclipse.papyrus.uml.profile.service.ReapplyProfilesServiceTest)  Time elapsed: 1.122 sec
13:20:57 upToDateModelDoesNotPromptForMigration_uml2(org.eclipse.papyrus.uml.profile.service.ReapplyProfilesServiceTest)  Time elapsed: 1.182 sec
13:20:57 upToDateModelDoesNotPromptForMigration_dynamic(org.eclipse.papyrus.uml.profile.service.ReapplyProfilesServiceTest)  Time elapsed: 0.938 sec
13:20:57 loadDecoratorAsMainModel(org.eclipse.papyrus.uml.decoratormodel.tests.ExternalizeProfileApplicationTest)  Time elapsed: 0.394 sec
13:20:57 externalizeApplication(org.eclipse.papyrus.uml.decoratormodel.tests.ExternalizeProfileApplicationTest)  Time elapsed: 0.462 sec
13:20:57 unloadApplication(org.eclipse.papyrus.uml.decoratormodel.tests.ExternalizeProfileApplicationTest)  Time elapsed: 0.445 sec
13:20:57 externalizeApplication_undo(org.eclipse.papyrus.uml.decoratormodel.tests.ExternalizeProfileApplicationTest)  Time elapsed: 0.473 sec
13:20:57 unloadedApplicationNotAvailable(org.eclipse.papyrus.uml.decoratormodel.tests.ExternalizeProfileApplicationTest)  Time elapsed: 0.463 sec
13:20:57 loadApplication(org.eclipse.papyrus.uml.decoratormodel.tests.ExternalizeProfileApplicationTest)  Time elapsed: 0.385 sec
13:20:57 externalizeApplication_undo_redo(org.eclipse.papyrus.uml.decoratormodel.tests.ExternalizeProfileApplicationTest)  Time elapsed: 0.452 sec
13:20:57 nestedPackageApplicationOfSameProfile_bug459613(org.eclipse.papyrus.uml.decoratormodel.tests.ExternalizeProfileApplicationTest)  Time elapsed: 0.509 sec
13:20:57 externalizeApplication_forNestedPackage(org.eclipse.papyrus.uml.decoratormodel.tests.ExternalizeProfileApplicationTest)  Time elapsed: 0.804 sec
13:20:57 internalizeApplication_undo(org.eclipse.papyrus.uml.decoratormodel.tests.InternalizeProfileApplicationTest)  Time elapsed: 0.415 sec
13:20:57 internalizeApplication_undo_redo(org.eclipse.papyrus.uml.decoratormodel.tests.InternalizeProfileApplicationTest)  Time elapsed: 0.474 sec
13:20:57 internalizeApplication(org.eclipse.papyrus.uml.decoratormodel.tests.InternalizeProfileApplicationTest)  Time elapsed: 0.708 sec
13:20:57 migrateProfile(org.eclipse.papyrus.uml.decoratormodel.tests.ProfileMigrationTest)  Time elapsed: 0.508 sec
13:20:57 missingSchema(org.eclipse.papyrus.uml.decoratormodel.tests.StereotypeApplicationRepairTest)  Time elapsed: 0.927 sec
13:20:57 wrongProfileVersion(org.eclipse.papyrus.uml.decoratormodel.tests.StereotypeApplicationRepairTest)  Time elapsed: 0.483 sec
13:20:57 missingProfileApplication(org.eclipse.papyrus.uml.decoratormodel.tests.StereotypeApplicationRepairTest)  Time elapsed: 0.657 sec
13:20:57 decoratorModelsForPackageAsync(org.eclipse.papyrus.uml.decoratormodel.internal.resource.tests.DecoratorModelIndexTest)  Time elapsed: 0.47 sec
13:20:57 decoratorModelsForPackage_none(org.eclipse.papyrus.uml.decoratormodel.internal.resource.tests.DecoratorModelIndexTest)  Time elapsed: 0.459 sec
13:20:57 removeResource(org.eclipse.papyrus.uml.decoratormodel.internal.resource.tests.DecoratorModelIndexTest)  Time elapsed: 0.832 sec
13:20:57 decoratorModelsAsync_uri(org.eclipse.papyrus.uml.decoratormodel.internal.resource.tests.DecoratorModelIndexTest)  Time elapsed: 0.608 sec
13:20:57 decoratorModelName(org.eclipse.papyrus.uml.decoratormodel.internal.resource.tests.DecoratorModelIndexTest)  Time elapsed: 0.604 sec
13:20:57 baseline(org.eclipse.papyrus.uml.decoratormodel.internal.resource.tests.DecoratorModelIndexTest)  Time elapsed: 0.557 sec
13:20:57 decoratorModelsForPackage(org.eclipse.papyrus.uml.decoratormodel.internal.resource.tests.DecoratorModelIndexTest)  Time elapsed: 0.594 sec
13:20:57 decoratorModelNameAsync(org.eclipse.papyrus.uml.decoratormodel.internal.resource.tests.DecoratorModelIndexTest)  Time elapsed: 0.524 sec
13:20:57 appliedProfilesByResourceIndex(org.eclipse.papyrus.uml.decoratormodel.internal.resource.tests.DecoratorModelIndexTest)  Time elapsed: 0.572 sec
13:20:57 decoratorModels(org.eclipse.papyrus.uml.decoratormodel.internal.resource.tests.DecoratorModelIndexTest)  Time elapsed: 0.661 sec
13:20:57 decoratorModelsAsync(org.eclipse.papyrus.uml.decoratormodel.internal.resource.tests.DecoratorModelIndexTest)  Time elapsed: 0.595 sec
13:20:57 allAppliedProfiles(org.eclipse.papyrus.uml.decoratormodel.internal.resource.tests.DecoratorModelIndexTest)  Time elapsed: 2.501 sec
13:20:57 decoratorModelNames(org.eclipse.papyrus.uml.decoratormodel.internal.resource.tests.DecoratorModelIndexTest)  Time elapsed: 0.589 sec
13:20:57 decoratorModels_uri(org.eclipse.papyrus.uml.decoratormodel.internal.resource.tests.DecoratorModelIndexTest)  Time elapsed: 0.608 sec
13:20:57 decoratorModelNamesAsync(org.eclipse.papyrus.uml.decoratormodel.internal.resource.tests.DecoratorModelIndexTest)  Time elapsed: 0.717 sec
13:20:57 listener(org.eclipse.papyrus.uml.decoratormodel.internal.resource.tests.DecoratorModelIndexTest)  Time elapsed: 0.82 sec
13:20:57 allAppliedProfilesAsync(org.eclipse.papyrus.uml.decoratormodel.internal.resource.tests.DecoratorModelIndexTest)  Time elapsed: 0.513 sec
13:20:57 addNewResource(org.eclipse.papyrus.uml.decoratormodel.internal.resource.tests.DecoratorModelIndexTest)  Time elapsed: 0.874 sec
13:20:57 decoratorModelsForPackageAsync_none(org.eclipse.papyrus.uml.decoratormodel.internal.resource.tests.DecoratorModelIndexTest)  Time elapsed: 0.641 sec
13:20:57 copy_subsetOfProfiles(org.eclipse.papyrus.uml.decoratormodel.internal.resource.tests.DecoratorModelCopierTest)  Time elapsed: 0.875 sec
13:20:57 copy_allProfiles(org.eclipse.papyrus.uml.decoratormodel.internal.resource.tests.DecoratorModelCopierTest)  Time elapsed: 0.764 sec
13:20:57 testHasUnloadedDecoratorModelsAsync_recursive(org.eclipse.papyrus.uml.decoratormodel.helper.tests.DecoratorModelUtilsTest)  Time elapsed: 0.973 sec
13:20:57 testIsDecoratorModelFor(org.eclipse.papyrus.uml.decoratormodel.helper.tests.DecoratorModelUtilsTest)  Time elapsed: 0.419 sec
13:20:57 testIsDecoratorModelURI(org.eclipse.papyrus.uml.decoratormodel.helper.tests.DecoratorModelUtilsTest)  Time elapsed: 0.442 sec
13:20:57 testInternalizeProfileApplications(org.eclipse.papyrus.uml.decoratormodel.helper.tests.DecoratorModelUtilsTest)  Time elapsed: 0.494 sec
13:20:57 testHasUnloadedDecoratorModelsAsync(org.eclipse.papyrus.uml.decoratormodel.helper.tests.DecoratorModelUtilsTest)  Time elapsed: 0.52 sec
13:20:57 testExternalizeProfileApplication(org.eclipse.papyrus.uml.decoratormodel.helper.tests.DecoratorModelUtilsTest)  Time elapsed: 0.602 sec
13:20:57 testGetDecoratorPackages(org.eclipse.papyrus.uml.decoratormodel.helper.tests.DecoratorModelUtilsTest)  Time elapsed: 0.49 sec
13:20:57 testGetDecoratorModelAppliedProfiles(org.eclipse.papyrus.uml.decoratormodel.helper.tests.DecoratorModelUtilsTest)  Time elapsed: 0.55 sec
13:20:57 testGetUnloadedDecoratorModelsAsyncResource(org.eclipse.papyrus.uml.decoratormodel.helper.tests.DecoratorModelUtilsTest)  Time elapsed: 0.607 sec
13:20:57 testGetExternalizationProfile(org.eclipse.papyrus.uml.decoratormodel.helper.tests.DecoratorModelUtilsTest)  Time elapsed: 0.532 sec
13:20:57 testIsDecoratorModelResource(org.eclipse.papyrus.uml.decoratormodel.helper.tests.DecoratorModelUtilsTest)  Time elapsed: 0.461 sec
13:20:57 testGetDecoratorModelProfileApplications(org.eclipse.papyrus.uml.decoratormodel.helper.tests.DecoratorModelUtilsTest)  Time elapsed: 0.363 sec
13:20:57 testGetUnloadedDecoratorModelsAsyncPackage(org.eclipse.papyrus.uml.decoratormodel.helper.tests.DecoratorModelUtilsTest)  Time elapsed: 0.53 sec
13:20:57 testGetLoadedDecoratorModels(org.eclipse.papyrus.uml.decoratormodel.helper.tests.DecoratorModelUtilsTest)  Time elapsed: 0.436 sec
13:20:57 testGetLoadedSubUnitPackages(org.eclipse.papyrus.uml.decoratormodel.helper.tests.DecoratorModelUtilsTest)  Time elapsed: 0.706 sec
13:20:57 testGetUnloadedDecoratorModels(org.eclipse.papyrus.uml.decoratormodel.helper.tests.DecoratorModelUtilsTest)  Time elapsed: 0.487 sec
13:20:57 testHasExternalizationProfile(org.eclipse.papyrus.uml.decoratormodel.helper.tests.DecoratorModelUtilsTest)  Time elapsed: 0.508 sec
13:20:57 testGetUnloadedDecoratorModelsAsyncIterableOfResource(org.eclipse.papyrus.uml.decoratormodel.helper.tests.DecoratorModelUtilsTest)  Time elapsed: 1.038 sec
13:20:57 testGetUserModelResources(org.eclipse.papyrus.uml.decoratormodel.helper.tests.DecoratorModelUtilsTest)  Time elapsed: 0.586 sec
13:20:57 testGetDecoratorProfileApplications(org.eclipse.papyrus.uml.decoratormodel.helper.tests.DecoratorModelUtilsTest)  Time elapsed: 0.412 sec
13:20:57 stereotypeApplication_inNestedPackage(org.eclipse.papyrus.uml.decoratormodel.helper.tests.PapyrusStereotypeApplicationHelperTest)  Time elapsed: 0.199 sec
13:20:57 stereotypeApplication_inNonPackageSubmodelUnit_bug459613(org.eclipse.papyrus.uml.decoratormodel.helper.tests.PapyrusStereotypeApplicationHelperTest)  Time elapsed: 0.192 sec
13:20:57 applyStereotype_resourceSet(org.eclipse.papyrus.uml.decoratormodel.helper.tests.PapyrusStereotypeApplicationHelperTest)  Time elapsed: 0.179 sec
13:20:57 applyStereotype_freeFloating(org.eclipse.papyrus.uml.decoratormodel.helper.tests.PapyrusStereotypeApplicationHelperTest)  Time elapsed: 0.166 sec
13:20:57 isDecoratorModel_decoratorModelUML(org.eclipse.papyrus.uml.decoratormodel.internal.expressions.tests.FilePropertyTesterTest)  Time elapsed: 0.308 sec
13:20:57 isDecoratorModel_decoratorModelNotation(org.eclipse.papyrus.uml.decoratormodel.internal.expressions.tests.FilePropertyTesterTest)  Time elapsed: 0.308 sec
13:20:57 isDecoratorModel_userModelUML(org.eclipse.papyrus.uml.decoratormodel.internal.expressions.tests.FilePropertyTesterTest)  Time elapsed: 0.318 sec
13:20:57 decoratorIndexing(org.eclipse.papyrus.uml.decoratormodel.internal.resource.index.tests.ProfileIndexTest)  Time elapsed: 0.402 sec
13:20:57 userModelIndexing(org.eclipse.papyrus.uml.decoratormodel.internal.resource.index.tests.ProfileIndexTest)  Time elapsed: 0 sec
13:20:57 decoratorAsUserModelIndexing(org.eclipse.papyrus.uml.decoratormodel.internal.resource.index.tests.ProfileIndexTest)  Time elapsed: 0 sec
13:20:57 migrateProfileExtendingDynamic_bug481302(org.eclipse.papyrus.uml.decoratormodel.tests.RegressionTest)  Time elapsed: 0.435 sec
13:20:57 basicUMLMigrateProfileExtendingStatic_bug481302(org.eclipse.papyrus.uml.decoratormodel.tests.RegressionTest) skipped
13:20:57 migrateProfileExtendingStatic_bug481302(org.eclipse.papyrus.uml.decoratormodel.tests.RegressionTest)  Time elapsed: 0.313 sec
13:20:57 control_undo_redo_allDecoratorsLoaded(org.eclipse.papyrus.uml.decoratormodel.controlmode.tests.ControlModeWithDecoratorModelsTest)  Time elapsed: 0.972 sec
13:20:57 uncontrol_undo_redo_allDecoratorsUnloaded(org.eclipse.papyrus.uml.decoratormodel.controlmode.tests.ControlModeWithDecoratorModelsTest)  Time elapsed: 3.067 sec
13:20:57 control_someDecoratorsLoaded(org.eclipse.papyrus.uml.decoratormodel.controlmode.tests.ControlModeWithDecoratorModelsTest)  Time elapsed: 1.185 sec
13:20:57 uncontrol_someDecoratorsLoaded(org.eclipse.papyrus.uml.decoratormodel.controlmode.tests.ControlModeWithDecoratorModelsTest)  Time elapsed: 1.724 sec
13:20:57 uncontrol_allDecoratorsUnloaded(org.eclipse.papyrus.uml.decoratormodel.controlmode.tests.ControlModeWithDecoratorModelsTest)  Time elapsed: 2.344 sec
13:20:57 control_undo_redo_someDecoratorsLoaded(org.eclipse.papyrus.uml.decoratormodel.controlmode.tests.ControlModeWithDecoratorModelsTest)  Time elapsed: 2.144 sec
13:20:57 control_allDecoratorsLoaded(org.eclipse.papyrus.uml.decoratormodel.controlmode.tests.ControlModeWithDecoratorModelsTest)  Time elapsed: 0.682 sec
13:20:57 control_undo_redo_allDecoratorsUnloaded(org.eclipse.papyrus.uml.decoratormodel.controlmode.tests.ControlModeWithDecoratorModelsTest)  Time elapsed: 2.111 sec
13:20:57 control_allDecoratorsUnloaded(org.eclipse.papyrus.uml.decoratormodel.controlmode.tests.ControlModeWithDecoratorModelsTest)  Time elapsed: 1.34 sec
13:20:57 uncontrol_undo_redo_someDecoratorsLoaded(org.eclipse.papyrus.uml.decoratormodel.controlmode.tests.ControlModeWithDecoratorModelsTest)  Time elapsed: 2.796 sec
13:20:57 uncontrol_undo_redo_allDecoratorsLoaded(org.eclipse.papyrus.uml.decoratormodel.controlmode.tests.ControlModeWithDecoratorModelsTest)  Time elapsed: 0.837 sec
13:20:57 uncontrol_allDecoratorsLoaded(org.eclipse.papyrus.uml.decoratormodel.controlmode.tests.ControlModeWithDecoratorModelsTest)  Time elapsed: 0.823 sec
13:20:57 nonBaseElementStereotypeCrossReferences(org.eclipse.papyrus.uml.decoratormodel.controlmode.tests.AdditionalModelStructuresTest)  Time elapsed: 1.115 sec
13:20:57 classUnitExternalizeParentUnitProfileApplication_bug459613(org.eclipse.papyrus.uml.decoratormodel.controlmode.tests.AdditionalModelStructuresTest)  Time elapsed: 0.405 sec
13:20:57 nestedPackagesInheritingExternalProfileApplications(org.eclipse.papyrus.uml.decoratormodel.controlmode.tests.AdditionalModelStructuresTest)  Time elapsed: 1.561 sec
13:20:57 validateOCLOnInstanceSpec(org.eclipse.papyrus.uml.validation.tests.rules.TestOCLConstraintOnInstanceSpec)  Time elapsed: 4.449 sec
13:20:57 validateCamelCaseRule(org.eclipse.papyrus.uml.validation.tests.rules.TestOCLValidationRuleFromFile)  Time elapsed: 1.209 sec
13:20:57 validateIsActiveOCLRule_inactiveClass(org.eclipse.papyrus.uml.validation.tests.rules.TestValidationRulesInPluginXML)  Time elapsed: 1.536 sec
13:20:57 validateIsPassiveJavaRule_inactiveClass(org.eclipse.papyrus.uml.validation.tests.rules.TestValidationRulesInPluginXML)  Time elapsed: 1.838 sec
13:20:57 validateIsPassiveJavaRule_activeClass(org.eclipse.papyrus.uml.validation.tests.rules.TestValidationRulesInPluginXML)  Time elapsed: 1.846 sec
13:20:57 validateMalformedActiveRule_notActiveCapsule(org.eclipse.papyrus.uml.validation.tests.rules.TestValidationRulesInProfile)  Time elapsed: 2.011 sec
13:20:57 validateIsActiveRule_notActiveCapsule(org.eclipse.papyrus.uml.validation.tests.rules.TestValidationRulesInProfile)  Time elapsed: 3.103 sec
13:20:57 validateIsActiveRule_ActiveCapsule(org.eclipse.papyrus.uml.validation.tests.rules.TestValidationRulesInProfile)  Time elapsed: 2.316 sec
13:20:57 validateNameClashDetection(org.eclipse.papyrus.uml.validation.tests.rules.TestUMLValidationRules)  Time elapsed: 1.147 sec
13:20:57 validateNonStandardMultiplicity(org.eclipse.papyrus.uml.validation.tests.rules.TestUMLValidationRules)  Time elapsed: 1.134 sec
13:20:57 validateUnsetStereotypeAttribute(org.eclipse.papyrus.uml.validation.tests.rules.TestStereotypeValidation)  Time elapsed: 1.295 sec
13:20:57 testResolveProfile__Object(org.eclipse.papyrus.uml.filters.tests.ProfileAppliedTest)  Time elapsed: 0.057 sec
13:20:57 testMatches__Object(org.eclipse.papyrus.uml.filters.tests.ProfileAppliedTest)  Time elapsed: 0.018 sec
13:20:57 profileAppliedFilterResourceURI_bug480221(org.eclipse.papyrus.uml.filters.tests.ProfileAppliedRegressionTest)  Time elapsed: 0.034 sec
13:20:57 profileAppliedFilterDoesNotLoadProfiles_miss_bug480221(org.eclipse.papyrus.uml.filters.tests.ProfileAppliedRegressionTest)  Time elapsed: 0.031 sec
13:20:57 profileAppliedFilterDoesNotLoadProfiles_hit_bug480221(org.eclipse.papyrus.uml.filters.tests.ProfileAppliedRegressionTest)  Time elapsed: 0.026 sec
13:20:57 popupsGenerated(org.eclipse.papyrus.uml.profile.assistants.generator.tests.BasicAssistantsGenerationTest)  Time elapsed: 0.015 sec
13:20:57 connectionTargetFilters(org.eclipse.papyrus.uml.profile.assistants.generator.tests.BasicAssistantsGenerationTest)  Time elapsed: 0.006 sec
13:20:57 popupFilters(org.eclipse.papyrus.uml.profile.assistants.generator.tests.BasicAssistantsGenerationTest)  Time elapsed: 0.001 sec
13:20:57 connectionSourceFilters(org.eclipse.papyrus.uml.profile.assistants.generator.tests.BasicAssistantsGenerationTest)  Time elapsed: 0 sec
13:20:57 connectionsGenerated(org.eclipse.papyrus.uml.profile.assistants.generator.tests.BasicAssistantsGenerationTest)  Time elapsed: 0.001 sec
13:20:57 popupsGenerated(org.eclipse.papyrus.uml.profile.assistants.generator.tests.DiagramSpecificAssistantsGenerationTest)  Time elapsed: 0.031 sec
13:20:57 connectionTargetFilters(org.eclipse.papyrus.uml.profile.assistants.generator.tests.DiagramSpecificAssistantsGenerationTest)  Time elapsed: 0.005 sec
13:20:57 distinctConnectionHintsGenerated(org.eclipse.papyrus.uml.profile.assistants.generator.tests.DiagramSpecificAssistantsGenerationTest)  Time elapsed: 0.003 sec
13:20:57 popupFilters(org.eclipse.papyrus.uml.profile.assistants.generator.tests.DiagramSpecificAssistantsGenerationTest)  Time elapsed: 0.001 sec
13:20:57 connectionSourceFilters(org.eclipse.papyrus.uml.profile.assistants.generator.tests.DiagramSpecificAssistantsGenerationTest)  Time elapsed: 0.002 sec
13:20:57 distinctPopupHintsGenerated(org.eclipse.papyrus.uml.profile.assistants.generator.tests.DiagramSpecificAssistantsGenerationTest)  Time elapsed: 0 sec
13:20:57 connectionsGenerated(org.eclipse.papyrus.uml.profile.assistants.generator.tests.DiagramSpecificAssistantsGenerationTest)  Time elapsed: 0 sec
13:20:57 popupsGenerated(org.eclipse.papyrus.uml.profile.assistants.generator.tests.ProfilesWithPackageNestingTest)  Time elapsed: 0.003 sec
13:20:57 connectionTargetFilters(org.eclipse.papyrus.uml.profile.assistants.generator.tests.ProfilesWithPackageNestingTest)  Time elapsed: 0.003 sec
13:20:57 popupFilters(org.eclipse.papyrus.uml.profile.assistants.generator.tests.ProfilesWithPackageNestingTest)  Time elapsed: 0 sec
13:20:57 connectionSourceFilters(org.eclipse.papyrus.uml.profile.assistants.generator.tests.ProfilesWithPackageNestingTest)  Time elapsed: 0.001 sec
13:20:57 connectionsGenerated(org.eclipse.papyrus.uml.profile.assistants.generator.tests.ProfilesWithPackageNestingTest)  Time elapsed: 0 sec
13:20:57 connectionsGenerated[<<Indirect>> Generalization](org.eclipse.papyrus.uml.profile.assistants.generator.tests.ConnectionTypesTest)  Time elapsed: 0.004 sec
13:20:57 connectionsGenerated[<<Indirect>> GeneralizationSet](org.eclipse.papyrus.uml.profile.assistants.generator.tests.ConnectionTypesTest)  Time elapsed: 0.001 sec
13:20:57 connectionsGenerated[<<Virtual>> ControlFlow](org.eclipse.papyrus.uml.profile.assistants.generator.tests.ConnectionTypesTest)  Time elapsed: 0 sec
13:20:57 connectionsGenerated[<<Virtual>> ObjectFlow](org.eclipse.papyrus.uml.profile.assistants.generator.tests.ConnectionTypesTest)  Time elapsed: 0.001 sec
13:20:57 connectionsGenerated[<<Virtual>> Transition](org.eclipse.papyrus.uml.profile.assistants.generator.tests.ConnectionTypesTest)  Time elapsed: 0 sec
13:20:57 connectionsGenerated[<<Virtual>> Message](org.eclipse.papyrus.uml.profile.assistants.generator.tests.ConnectionTypesTest)  Time elapsed: 0 sec
13:20:57 connectionsGenerated[<<Indirect>> Connector](org.eclipse.papyrus.uml.profile.assistants.generator.tests.ConnectionTypesTest)  Time elapsed: 0 sec
13:20:57 iconGenerated(org.eclipse.papyrus.uml.profile.types.generator.tests.BasicElementTypesGenerationTest)  Time elapsed: 0.009 sec
13:20:57 elementTypeSpecializedTypes_bug461717(org.eclipse.papyrus.uml.profile.types.generator.tests.BasicElementTypesGenerationTest)  Time elapsed: 0.02 sec
13:20:57 multipleElementTypesForOneStereotypeGenerated(org.eclipse.papyrus.uml.profile.types.generator.tests.BasicElementTypesGenerationTest)  Time elapsed: 0 sec
13:20:57 stereotypeAdviceGenerated(org.eclipse.papyrus.uml.profile.types.generator.tests.BasicElementTypesGenerationTest)  Time elapsed: 0.001 sec
13:20:57 elementTypesGenerated(org.eclipse.papyrus.uml.profile.types.generator.tests.BasicElementTypesGenerationTest)  Time elapsed: 0.001 sec
13:20:57 stereotypeMatcherGenerated(org.eclipse.papyrus.uml.profile.types.generator.tests.BasicElementTypesGenerationTest)  Time elapsed: 0.003 sec
13:20:57 stereotypeAdviceNotGenerated(org.eclipse.papyrus.uml.profile.types.generator.tests.DiagramSpecificElementTypesGenerationTest)  Time elapsed: 0.004 sec
13:20:57 distinctHintsGenerated(org.eclipse.papyrus.uml.profile.types.generator.tests.DiagramSpecificElementTypesGenerationTest)  Time elapsed: 0.003 sec
13:20:57 stereotypeMatcherNotGenerated(org.eclipse.papyrus.uml.profile.types.generator.tests.DiagramSpecificElementTypesGenerationTest)  Time elapsed: 0 sec
13:20:57 iconGenerated(org.eclipse.papyrus.uml.profile.types.generator.tests.DiagramSpecificElementTypesGenerationTest)  Time elapsed: 0.001 sec
13:20:57 elementTypeSpecializedTypes_bug461717(org.eclipse.papyrus.uml.profile.types.generator.tests.DiagramSpecificElementTypesGenerationTest)  Time elapsed: 0.046 sec
13:20:57 elementTypesGenerated(org.eclipse.papyrus.uml.profile.types.generator.tests.DiagramSpecificElementTypesGenerationTest)  Time elapsed: 0.001 sec
13:20:57 iconGenerated(org.eclipse.papyrus.uml.profile.types.generator.tests.ProfilesWithPackageNestingTest)  Time elapsed: 0.003 sec
13:20:57 stereotypeAdviceGenerated(org.eclipse.papyrus.uml.profile.types.generator.tests.ProfilesWithPackageNestingTest)  Time elapsed: 0.001 sec
13:20:57 elementTypesGenerated(org.eclipse.papyrus.uml.profile.types.generator.tests.ProfilesWithPackageNestingTest)  Time elapsed: 0 sec
13:20:57 stereotypeMatcherGenerated(org.eclipse.papyrus.uml.profile.types.generator.tests.ProfilesWithPackageNestingTest)  Time elapsed: 0 sec
13:20:57 elementTypeSpecializedTypes(org.eclipse.papyrus.uml.profile.types.generator.tests.DiagramSpecificElementTypesGenerationBug461717Test)  Time elapsed: 0.02 sec
13:20:57 stereotypeAdviceGenerated(org.eclipse.papyrus.uml.profile.types.generator.tests.DiagramSpecificElementTypesGenerationBug461717Test)  Time elapsed: 0 sec
13:20:57 stereotypeMatcherGenerated(org.eclipse.papyrus.uml.profile.types.generator.tests.DiagramSpecificElementTypesGenerationBug461717Test)  Time elapsed: 0.001 sec
13:20:57 testGetStereotypeNames(org.eclipse.papyrus.uml.profile.drafter.tests.ProfileCatalogTest)  Time elapsed: 0.038 sec
13:20:57 testGetStereotypes(org.eclipse.papyrus.uml.profile.drafter.tests.ProfileCatalogTest)  Time elapsed: 0.055 sec
13:20:57 testGetAllStereotypeNames(org.eclipse.papyrus.uml.profile.drafter.tests.ProfileCatalogTest) skipped
13:20:57 testGetProfileNames(org.eclipse.papyrus.uml.profile.drafter.tests.ProfileCatalogTest)  Time elapsed: 0.097 sec
13:20:57 testProfileCatalog(org.eclipse.papyrus.uml.profile.drafter.tests.ProfileCatalogTest)  Time elapsed: 0.062 sec
13:20:57 testLookupStereotype(org.eclipse.papyrus.uml.profile.drafter.tests.ProfileCatalogTest)  Time elapsed: 0.058 sec
13:20:57 testLookupStereotypeInAppliedProfile(org.eclipse.papyrus.uml.profile.drafter.tests.ProfileCatalogTest)  Time elapsed: 0.055 sec
13:20:57 testProfileCopy(org.eclipse.papyrus.uml.profile.drafter.tests.ProfileCatalogTest)  Time elapsed: 0.049 sec
13:20:57 testGetProfiles(org.eclipse.papyrus.uml.profile.drafter.tests.ProfileCatalogTest)  Time elapsed: 0.052 sec
13:20:57 testGetNamedElement(org.eclipse.papyrus.uml.profile.drafter.tests.ProfileCatalogTest)  Time elapsed: 0.057 sec
13:20:57 testIsModelsExist(org.eclipse.papyrus.uml.profile.drafter.tests.ProfileCatalogTest)  Time elapsed: 0.069 sec
13:20:57 testGetStereotypeQualifiedNames(org.eclipse.papyrus.uml.profile.drafter.tests.ProfileCatalogTest)  Time elapsed: 0.033 sec
13:20:57 testGetProfileQualifiedNames(org.eclipse.papyrus.uml.profile.drafter.tests.ProfileCatalogTest)  Time elapsed: 0.224 sec
13:20:57 testCopyResources(org.eclipse.papyrus.uml.profile.drafter.tests.EclipseProjectTest)  Time elapsed: 0.006 sec
13:20:57 testCopyResource(org.eclipse.papyrus.uml.profile.drafter.tests.EclipseProjectTest)  Time elapsed: 0.003 sec
13:20:57 testGetProject(org.eclipse.papyrus.uml.profile.drafter.tests.EclipseProjectTest)  Time elapsed: 0 sec
13:20:57 testEclipseProject(org.eclipse.papyrus.uml.profile.drafter.tests.EclipseProjectTest)  Time elapsed: 0 sec
13:20:57 testGetUmlModelWithIFile(org.eclipse.papyrus.uml.profile.drafter.tests.ModelSetManagerTest)  Time elapsed: 0.02 sec
13:20:57 testModelSetManagerString(org.eclipse.papyrus.uml.profile.drafter.tests.ModelSetManagerTest)  Time elapsed: 0.003 sec
13:20:57 testModelSetManagerURI(org.eclipse.papyrus.uml.profile.drafter.tests.ModelSetManagerTest)  Time elapsed: 0.004 sec
13:20:57 testGetNamedElementByNameString(org.eclipse.papyrus.uml.profile.drafter.tests.ModelSetManagerTest)  Time elapsed: 0.003 sec
13:20:57 testGetUmlModel(org.eclipse.papyrus.uml.profile.drafter.tests.ModelSetManagerTest)  Time elapsed: 0.048 sec
13:20:57 testModelSetManagerStringModels(org.eclipse.papyrus.uml.profile.drafter.tests.ModelSetManagerTest)  Time elapsed: 0.003 sec
13:20:57 testGetNamedElementByNameWithSterotype(org.eclipse.papyrus.uml.profile.drafter.tests.ModelSetManagerTest)  Time elapsed: 0.039 sec
13:20:57 testCreation(org.eclipse.papyrus.uml.profile.drafter.tests.utils.UMLModelCreatorTest)  Time elapsed: 0.005 sec
13:20:57 testCreateClass(org.eclipse.papyrus.uml.profile.drafter.tests.utils.UMLModelCreatorTest)  Time elapsed: 0 sec
13:20:57 testCreateModel(org.eclipse.papyrus.uml.profile.drafter.tests.utils.UMLModelCreatorTest)  Time elapsed: 0 sec
13:20:57 testCreatePackage(org.eclipse.papyrus.uml.profile.drafter.tests.utils.UMLModelCreatorTest)  Time elapsed: 0 sec
13:20:57 testCd(org.eclipse.papyrus.uml.profile.drafter.tests.utils.UMLModelCreatorTest)  Time elapsed: 0.001 sec
13:20:57 testUMLModelCreatorResourceFailing(org.eclipse.papyrus.uml.profile.drafter.tests.utils.UMLModelCreatorTest)  Time elapsed: 0 sec
13:20:57 testUMLModelCreatorStringString(org.eclipse.papyrus.uml.profile.drafter.tests.utils.UMLModelCreatorTest)  Time elapsed: 0 sec
13:20:57 testUMLModelCreatorResource(org.eclipse.papyrus.uml.profile.drafter.tests.utils.UMLModelCreatorTest)  Time elapsed: 0 sec
13:20:57 testCreateDatatype(org.eclipse.papyrus.uml.profile.drafter.tests.utils.UMLModelCreatorTest)  Time elapsed: 0 sec
13:20:57 testCompoundTypeProvider(org.eclipse.papyrus.uml.profile.drafter.ui.model.CompoundTypeProviderTest)  Time elapsed: 0.005 sec
13:20:57 testGetTypes(org.eclipse.papyrus.uml.profile.drafter.ui.model.CompoundTypeProviderTest)  Time elapsed: 0 sec
13:20:57 testAddITypeProvider(org.eclipse.papyrus.uml.profile.drafter.ui.model.CompoundTypeProviderTest)  Time elapsed: 0 sec
13:20:57 testIterator(org.eclipse.papyrus.uml.profile.drafter.ui.model.CompoundTypeProviderTest)  Time elapsed: 0 sec
13:20:57 testVisitMetaclassesModel(org.eclipse.papyrus.uml.profile.drafter.ui.model.SimpleModelVisitorTest) skipped
13:20:57 testVisitPropertyModel(org.eclipse.papyrus.uml.profile.drafter.ui.model.SimpleModelVisitorTest) skipped
13:20:57 testSimpleModelVisitor(org.eclipse.papyrus.uml.profile.drafter.ui.model.SimpleModelVisitorTest)  Time elapsed: 0.003 sec
13:20:57 testDoVisitStereoptypeModel(org.eclipse.papyrus.uml.profile.drafter.ui.model.SimpleModelVisitorTest) skipped
13:20:57 testDoVisitPropertyModel(org.eclipse.papyrus.uml.profile.drafter.ui.model.SimpleModelVisitorTest) skipped
13:20:57 testVisitStereoptypeModel(org.eclipse.papyrus.uml.profile.drafter.ui.model.SimpleModelVisitorTest) skipped
13:20:57 testDoVisitMetaclassesModel(org.eclipse.papyrus.uml.profile.drafter.ui.model.SimpleModelVisitorTest) skipped
13:20:57 testSetStereotypeName(org.eclipse.papyrus.uml.profile.drafter.ui.model.StereotypeURLTest)  Time elapsed: 0.02 sec
13:20:57 testGetProfileName(org.eclipse.papyrus.uml.profile.drafter.ui.model.StereotypeURLTest)  Time elapsed: 0 sec
13:20:57 testAddPropertyChangeListenerPropertyChangeListener(org.eclipse.papyrus.uml.profile.drafter.ui.model.StereotypeURLTest)  Time elapsed: 0.001 sec
13:20:57 testSetQualifiedNameComplex(org.eclipse.papyrus.uml.profile.drafter.ui.model.StereotypeURLTest)  Time elapsed: 0 sec
13:20:57 testClear(org.eclipse.papyrus.uml.profile.drafter.ui.model.StereotypeURLTest)  Time elapsed: 0 sec
13:20:57 testStereotypeURLString(org.eclipse.papyrus.uml.profile.drafter.ui.model.StereotypeURLTest)  Time elapsed: 0.001 sec
13:20:57 testToString(org.eclipse.papyrus.uml.profile.drafter.ui.model.StereotypeURLTest)  Time elapsed: 0 sec
13:20:57 testGetStereotypeName(org.eclipse.papyrus.uml.profile.drafter.ui.model.StereotypeURLTest)  Time elapsed: 0 sec
13:20:57 testAddPropertyChangeListenerStringPropertyChangeListener(org.eclipse.papyrus.uml.profile.drafter.ui.model.StereotypeURLTest)  Time elapsed: 0 sec
13:20:57 testStereotypeURL(org.eclipse.papyrus.uml.profile.drafter.ui.model.StereotypeURLTest)  Time elapsed: 0 sec
13:20:57 testRemovePropertyChangeListenerPropertyChangeListener(org.eclipse.papyrus.uml.profile.drafter.ui.model.StereotypeURLTest)  Time elapsed: 0 sec
13:20:57 testSetQualifiedNameSimple(org.eclipse.papyrus.uml.profile.drafter.ui.model.StereotypeURLTest)  Time elapsed: 0 sec
13:20:57 testSetProfileName(org.eclipse.papyrus.uml.profile.drafter.ui.model.StereotypeURLTest)  Time elapsed: 0 sec
13:20:57 testRemovePropertyChangeListenerStringPropertyChangeListener(org.eclipse.papyrus.uml.profile.drafter.ui.model.StereotypeURLTest)  Time elapsed: 0 sec
13:20:57 testComputeQualifiedName(org.eclipse.papyrus.uml.profile.drafter.ui.model.StereotypeURLTest)  Time elapsed: 0 sec
13:20:57 testGetQualifiedName(org.eclipse.papyrus.uml.profile.drafter.ui.model.StereotypeURLTest)  Time elapsed: 0 sec
13:20:57 testStereotypeURLStringString(org.eclipse.papyrus.uml.profile.drafter.ui.model.StereotypeURLTest)  Time elapsed: 0 sec
13:20:57 testGetTypes(org.eclipse.papyrus.uml.profile.drafter.ui.model.TypeProviderTest)  Time elapsed: 0.002 sec
13:20:57 testTypeProvider(org.eclipse.papyrus.uml.profile.drafter.ui.model.TypeProviderTest)  Time elapsed: 0.001 sec
13:20:57 testIterator(org.eclipse.papyrus.uml.profile.drafter.ui.model.TypeProviderTest)  Time elapsed: 0 sec
13:20:57 testGetTypes(org.eclipse.papyrus.uml.profile.drafter.ui.model.TypeProviderTest2)  Time elapsed: 0 sec
13:20:57 testAddType(org.eclipse.papyrus.uml.profile.drafter.ui.model.TypeProviderTest2)  Time elapsed: 0 sec
13:20:57 testAddTypeFromConstructor(org.eclipse.papyrus.uml.profile.drafter.ui.model.TypeProviderTest2)  Time elapsed: 0 sec
13:20:57 testTypeProvider(org.eclipse.papyrus.uml.profile.drafter.ui.model.TypeProviderTest2)  Time elapsed: 0 sec
13:20:57 testTypeProviderTypeArray(org.eclipse.papyrus.uml.profile.drafter.ui.model.TypeProviderTest2)  Time elapsed: 0.001 sec
13:20:57 testIterator(org.eclipse.papyrus.uml.profile.drafter.ui.model.TypeProviderTest2)  Time elapsed: 0 sec
13:20:57 testUMLPrimitiveTypesModel(org.eclipse.papyrus.uml.profile.drafter.utils.UMLPrimitiveTypesModelTest)  Time elapsed: 0.022 sec
13:20:57 testGetLibraryPackage(org.eclipse.papyrus.uml.profile.drafter.utils.UMLPrimitiveTypesModelTest)  Time elapsed: 0.014 sec
13:20:57 testUseInternationalizationModification(org.eclipse.papyrus.uml.internationalization.tests.tests.UMLInternationalizationChangePreferencesTest)  Time elapsed: 0.761 sec
13:20:57 testLanguageModification(org.eclipse.papyrus.uml.internationalization.tests.tests.UMLInternationalizationChangeLanguageTest)  Time elapsed: 1.132 sec
13:20:57 rebuildAdapters(org.eclipse.papyrus.uml.internationalization.tests.tests.InternationalizationUMLItemProviderAdapterFactoryTest)  Time elapsed: 0.902 sec
13:20:57 normalAdapters(org.eclipse.papyrus.uml.internationalization.tests.tests.InternationalizationUMLItemProviderAdapterFactoryTest)  Time elapsed: 0.916 sec
13:20:57 testMapping(org.eclipse.papyrus.uml.alf.tests.mapper.MappingTest) skipped
13:20:57 org.eclipse.papyrus.uml.alf.tests.mapper.MappingTest skipped
13:20:57 testMerging(org.eclipse.papyrus.uml.alf.tests.mapper.MergeTest) skipped
13:20:57 org.eclipse.papyrus.uml.alf.tests.mapper.MergeTest skipped
13:20:57 testStaticSemantics(org.eclipse.papyrus.uml.alf.tests.SemanticTest) skipped
13:20:57 org.eclipse.papyrus.uml.alf.tests.SemanticTest skipped
13:20:57 testOneFile(org.eclipse.papyrus.uml.alf.tests.SingleTest) skipped
13:20:57 org.eclipse.papyrus.uml.alf.tests.SingleTest skipped
13:20:57 testSyntax(org.eclipse.papyrus.uml.alf.tests.SyntacticTest) skipped
13:20:57 org.eclipse.papyrus.uml.alf.tests.SyntacticTest skipped
13:20:57 testGeneration(org.eclipse.papyrus.uml.alf.tests.generator.GenerationTest) skipped
13:20:57 org.eclipse.papyrus.uml.alf.tests.generator.GenerationTest skipped
13:20:57 org.eclipse.papyrus.uml.alf.tests.AllTests skipped
13:20:57 IsStereotypedWithExpression_Test10(org.eclipse.papyrus.uml.expressions.tests.IsStereotypedWithExpressionTests)  Time elapsed: 1.415 sec
13:20:57 IsStereotypedWithExpression_Test11(org.eclipse.papyrus.uml.expressions.tests.IsStereotypedWithExpressionTests)  Time elapsed: 1.727 sec
13:20:57 IsStereotypedWithExpression_Test12(org.eclipse.papyrus.uml.expressions.tests.IsStereotypedWithExpressionTests)  Time elapsed: 1.725 sec
13:20:57 IsStereotypedWithExpression_Test13(org.eclipse.papyrus.uml.expressions.tests.IsStereotypedWithExpressionTests)  Time elapsed: 1.391 sec
13:20:57 IsStereotypedWithExpression_Test1(org.eclipse.papyrus.uml.expressions.tests.IsStereotypedWithExpressionTests)  Time elapsed: 1.933 sec
13:20:57 IsStereotypedWithExpression_Test2(org.eclipse.papyrus.uml.expressions.tests.IsStereotypedWithExpressionTests)  Time elapsed: 1.517 sec
13:20:57 IsStereotypedWithExpression_Test3(org.eclipse.papyrus.uml.expressions.tests.IsStereotypedWithExpressionTests)  Time elapsed: 1.726 sec
13:20:57 IsStereotypedWithExpression_Test4(org.eclipse.papyrus.uml.expressions.tests.IsStereotypedWithExpressionTests)  Time elapsed: 1.29 sec
13:20:57 IsStereotypedWithExpression_Test5(org.eclipse.papyrus.uml.expressions.tests.IsStereotypedWithExpressionTests)  Time elapsed: 1.327 sec
13:20:57 IsStereotypedWithExpression_Test6(org.eclipse.papyrus.uml.expressions.tests.IsStereotypedWithExpressionTests)  Time elapsed: 1.26 sec
13:20:57 IsStereotypedWithExpression_Test7(org.eclipse.papyrus.uml.expressions.tests.IsStereotypedWithExpressionTests)  Time elapsed: 1.254 sec
13:20:57 IsStereotypedWithExpression_Test8(org.eclipse.papyrus.uml.expressions.tests.IsStereotypedWithExpressionTests)  Time elapsed: 1.143 sec
13:20:57 IsStereotypedWithExpression_Test9(org.eclipse.papyrus.uml.expressions.tests.IsStereotypedWithExpressionTests)  Time elapsed: 1.134 sec
13:20:57 HasStereotypeExpressionTests_Test1(org.eclipse.papyrus.uml.expressions.tests.HasAppliedStereotypeExpressionTests)  Time elapsed: 1.233 sec
13:20:57 HasStereotypeExpressionTests_Test2(org.eclipse.papyrus.uml.expressions.tests.HasAppliedStereotypeExpressionTests)  Time elapsed: 1.105 sec
13:20:57 HasStereotypeExpressionTests_Test3(org.eclipse.papyrus.uml.expressions.tests.HasAppliedStereotypeExpressionTests)  Time elapsed: 1.099 sec
13:20:57 HasStereotypeExpressionTests_Test4(org.eclipse.papyrus.uml.expressions.tests.HasAppliedStereotypeExpressionTests)  Time elapsed: 1.081 sec
13:20:57 metaclassAndNoContext(org.eclipse.papyrus.uml.expressions.tests.IsKindOfExpressionTest)  Time elapsed: 0.005 sec
13:20:57 noMetaclassAndNoContextTest(org.eclipse.papyrus.uml.expressions.tests.IsKindOfExpressionTest)  Time elapsed: 0 sec
13:20:57 metaclassAndValidContext_1(org.eclipse.papyrus.uml.expressions.tests.IsKindOfExpressionTest)  Time elapsed: 0 sec
13:20:57 metaclassAndValidContext_2(org.eclipse.papyrus.uml.expressions.tests.IsKindOfExpressionTest)  Time elapsed: 0 sec
13:20:57 metaclassAndInvalidContext(org.eclipse.papyrus.uml.expressions.tests.IsKindOfExpressionTest)  Time elapsed: 0 sec
13:20:57 metaclassAndNoContext(org.eclipse.papyrus.uml.expressions.tests.IsTypeOfExpressionTests)  Time elapsed: 0.003 sec
13:20:57 noMetaclassAndNoContextTest(org.eclipse.papyrus.uml.expressions.tests.IsTypeOfExpressionTests)  Time elapsed: 0 sec
13:20:57 metaclassAndValidContext_2(org.eclipse.papyrus.uml.expressions.tests.IsTypeOfExpressionTests)  Time elapsed: 0 sec
13:20:57 metaclassAndInValidContext_1(org.eclipse.papyrus.uml.expressions.tests.IsTypeOfExpressionTests)  Time elapsed: 0 sec
13:20:57 
13:20:57 Results :
13:20:57 
13:20:57 Failed tests: 
13:20:57   TableCopyPasteModelExplorerTest.copyPasteTableTest:119 TableOfViews0 TreeElement is null
13:20:57 
13:20:57 Tests run: 576, Failures: 1, Errors: 0, Skipped: 38
13:20:57 
13:20:59 [ERROR] There are test failures.
13:20:59 
13:20:59 Please refer to /jobs/genie.papyrus/Papyrus-Oxygen-Tests/workspace/source/tests/junit/plugins/uml/org.eclipse.papyrus.uml.suite.tests/target/surefire-reports for the individual test results.
13:20:59 [INFO] 
13:20:59 [INFO] --- jacoco-maven-plugin:0.7.9:report (default-report) @ org.eclipse.papyrus.uml.suite.tests ---
13:20:59 [INFO] Loading execution data file /jobs/genie.papyrus/Papyrus-Oxygen-Tests/workspace/source/tests/junit/plugins/uml/org.eclipse.papyrus.uml.suite.tests/target/jacoco.exec
13:20:59 [INFO] Analyzed bundle 'org.eclipse.papyrus.uml.suite.tests' with 0 classes
13:20:59 [INFO] 
13:20:59 [INFO] --< org.eclipse.papyrus.tests:org.eclipse.papyrus.uml.alf.tests.releng >--
13:20:59 [INFO] Building org.eclipse.papyrus.uml.alf.tests.releng 0.0.1-SNAPSHOT [148/155]
13:20:59 [INFO] --------------------------------[ pom ]---------------------------------
13:20:59 [INFO] 
13:20:59 [INFO] --- maven-clean-plugin:2.6:clean (default-clean) @ org.eclipse.papyrus.uml.alf.tests.releng ---
13:20:59 [INFO] 
13:20:59 [INFO] --- jacoco-maven-plugin:0.7.9:prepare-agent (default-prepare-agent) @ org.eclipse.papyrus.uml.alf.tests.releng ---
13:20:59 [INFO] argLine set to -javaagent:/home/hudson/genie.papyrus/.jenkins/jobs/Papyrus-Oxygen-Tests/workspace/.repository/org/jacoco/org.jacoco.agent/0.7.9/org.jacoco.agent-0.7.9-runtime.jar=destfile=/jobs/genie.papyrus/Papyrus-Oxygen-Tests/workspace/source/tests/junit/plugins/uml/alf/target/jacoco.exec,includes=org.eclipse.papyrus.*,excludes=org.eclipse.uml2
13:20:59 [INFO] 
13:20:59 [INFO] --- jacoco-maven-plugin:0.7.9:report (default-report) @ org.eclipse.papyrus.uml.alf.tests.releng ---
13:20:59 [INFO] Skipping JaCoCo execution due to missing execution data file.
13:20:59 [INFO] 
13:20:59 [INFO] --< org.eclipse.papyrus.tests:org.eclipse.papyrus.uml.alf.backend.tests >--
13:20:59 [INFO] Building org.eclipse.papyrus.uml.alf.backend.tests 1.1.0-SNAPSHOT [149/155]
13:20:59 [INFO] ------------------------[ eclipse-test-plugin ]-------------------------
13:20:59 [INFO] 
13:20:59 [INFO] --- maven-clean-plugin:2.6:clean (default-clean) @ org.eclipse.papyrus.uml.alf.backend.tests ---
13:20:59 [INFO] 
13:20:59 [INFO] --- tycho-packaging-plugin:1.0.0:build-qualifier (default-build-qualifier) @ org.eclipse.papyrus.uml.alf.backend.tests ---
13:20:59 [INFO] The project's OSGi version is 1.1.0.202003101629
13:20:59 [INFO] 
13:20:59 [INFO] --- tycho-packaging-plugin:1.0.0:validate-id (default-validate-id) @ org.eclipse.papyrus.uml.alf.backend.tests ---
13:20:59 [INFO] 
13:20:59 [INFO] --- tycho-packaging-plugin:1.0.0:validate-version (default-validate-version) @ org.eclipse.papyrus.uml.alf.backend.tests ---
13:20:59 [INFO] 
13:20:59 [INFO] --- jacoco-maven-plugin:0.7.9:prepare-agent (default-prepare-agent) @ org.eclipse.papyrus.uml.alf.backend.tests ---
13:20:59 [INFO] tycho.testArgLine set to -javaagent:/home/hudson/genie.papyrus/.jenkins/jobs/Papyrus-Oxygen-Tests/workspace/.repository/org/jacoco/org.jacoco.agent/0.7.9/org.jacoco.agent-0.7.9-runtime.jar=destfile=/jobs/genie.papyrus/Papyrus-Oxygen-Tests/workspace/source/tests/junit/plugins/uml/alf/org.eclipse.papyrus.uml.alf.backend.tests/target/jacoco.exec,includes=org.eclipse.papyrus.*,excludes=org.eclipse.uml2
13:20:59 [INFO] 
13:20:59 [INFO] --- xtend-maven-plugin:2.11.0:compile (default) @ org.eclipse.papyrus.uml.alf.backend.tests ---
13:21:00 [INFO] 
13:21:00 [INFO] --- maven-resources-plugin:2.6:resources (default-resources) @ org.eclipse.papyrus.uml.alf.backend.tests ---
13:21:00 [INFO] Using 'UTF-8' encoding to copy filtered resources.
13:21:00 [INFO] skip non existing resourceDirectory /jobs/genie.papyrus/Papyrus-Oxygen-Tests/workspace/source/tests/junit/plugins/uml/alf/org.eclipse.papyrus.uml.alf.backend.tests/src/main/resources
13:21:00 [INFO] 
13:21:00 [INFO] --- tycho-compiler-plugin:1.0.0:compile (default-compile) @ org.eclipse.papyrus.uml.alf.backend.tests ---
13:21:00 [INFO] Compiling 4 source files to /jobs/genie.papyrus/Papyrus-Oxygen-Tests/workspace/source/tests/junit/plugins/uml/alf/org.eclipse.papyrus.uml.alf.backend.tests/target/classes
13:21:00 [INFO] 
13:21:00 [INFO] --- maven-resources-plugin:2.6:testResources (default-testResources) @ org.eclipse.papyrus.uml.alf.backend.tests ---
13:21:00 [INFO] Using 'UTF-8' encoding to copy filtered resources.
13:21:00 [INFO] skip non existing resourceDirectory /jobs/genie.papyrus/Papyrus-Oxygen-Tests/workspace/source/tests/junit/plugins/uml/alf/org.eclipse.papyrus.uml.alf.backend.tests/src/test/resources
13:21:00 [INFO] 
13:21:00 [INFO] --- target-platform-configuration:1.0.0:target-platform (default-target-platform) @ org.eclipse.papyrus.uml.alf.backend.tests ---
13:21:00 [INFO] 
13:21:00 [INFO] --- tycho-packaging-plugin:1.0.0:package-plugin (default-package-plugin) @ org.eclipse.papyrus.uml.alf.backend.tests ---
13:21:00 [INFO] Building jar: /jobs/genie.papyrus/Papyrus-Oxygen-Tests/workspace/source/tests/junit/plugins/uml/alf/org.eclipse.papyrus.uml.alf.backend.tests/target/org.eclipse.papyrus.uml.alf.backend.tests-1.1.0-SNAPSHOT.jar
13:21:00 [INFO] 
13:21:00 [INFO] --- tycho-p2-plugin:1.0.0:p2-metadata-default (default-p2-metadata-default) @ org.eclipse.papyrus.uml.alf.backend.tests ---
13:21:00 [INFO] 
13:21:00 [INFO] --- tycho-surefire-plugin:1.0.0:test (default-test) @ org.eclipse.papyrus.uml.alf.backend.tests ---
13:21:00 [INFO] Skipping tests
13:21:00 [INFO] 
13:21:00 [INFO] --- jacoco-maven-plugin:0.7.9:report (default-report) @ org.eclipse.papyrus.uml.alf.backend.tests ---
13:21:00 [INFO] Skipping JaCoCo execution due to missing execution data file.
13:21:00 [INFO] 
13:21:00 [INFO] --< org.eclipse.papyrus.tests:org.eclipse.papyrus.uml.internationalization.controlmode.tests >--
13:21:00 [INFO] Building org.eclipse.papyrus.uml.internationalization.controlmode.tests 1.0.0-SNAPSHOT [150/155]
13:21:00 [INFO] ------------------------[ eclipse-test-plugin ]-------------------------
13:21:00 [INFO] 
13:21:00 [INFO] --- maven-clean-plugin:2.6:clean (default-clean) @ org.eclipse.papyrus.uml.internationalization.controlmode.tests ---
13:21:00 [INFO] 
13:21:00 [INFO] --- tycho-packaging-plugin:1.0.0:build-qualifier (default-build-qualifier) @ org.eclipse.papyrus.uml.internationalization.controlmode.tests ---
13:21:00 [INFO] The project's OSGi version is 1.0.0.202003101629
13:21:00 [INFO] 
13:21:00 [INFO] --- tycho-packaging-plugin:1.0.0:validate-id (default-validate-id) @ org.eclipse.papyrus.uml.internationalization.controlmode.tests ---
13:21:00 [INFO] 
13:21:00 [INFO] --- tycho-packaging-plugin:1.0.0:validate-version (default-validate-version) @ org.eclipse.papyrus.uml.internationalization.controlmode.tests ---
13:21:00 [INFO] 
13:21:00 [INFO] --- jacoco-maven-plugin:0.7.9:prepare-agent (default-prepare-agent) @ org.eclipse.papyrus.uml.internationalization.controlmode.tests ---
13:21:00 [INFO] tycho.testArgLine set to -javaagent:/home/hudson/genie.papyrus/.jenkins/jobs/Papyrus-Oxygen-Tests/workspace/.repository/org/jacoco/org.jacoco.agent/0.7.9/org.jacoco.agent-0.7.9-runtime.jar=destfile=/jobs/genie.papyrus/Papyrus-Oxygen-Tests/workspace/source/tests/junit/plugins/uml/internationalization/org.eclipse.papyrus.uml.internationalization.controlmode.tests/target/jacoco.exec,includes=org.eclipse.papyrus.*,excludes=org.eclipse.uml2
13:21:00 [INFO] 
13:21:00 [INFO] --- maven-resources-plugin:2.6:resources (default-resources) @ org.eclipse.papyrus.uml.internationalization.controlmode.tests ---
13:21:00 [INFO] Using 'UTF-8' encoding to copy filtered resources.
13:21:00 [INFO] skip non existing resourceDirectory /jobs/genie.papyrus/Papyrus-Oxygen-Tests/workspace/source/tests/junit/plugins/uml/internationalization/org.eclipse.papyrus.uml.internationalization.controlmode.tests/src/main/resources
13:21:00 [INFO] 
13:21:00 [INFO] --- tycho-compiler-plugin:1.0.0:compile (default-compile) @ org.eclipse.papyrus.uml.internationalization.controlmode.tests ---
13:21:00 [INFO] Compiling 5 source files to /jobs/genie.papyrus/Papyrus-Oxygen-Tests/workspace/source/tests/junit/plugins/uml/internationalization/org.eclipse.papyrus.uml.internationalization.controlmode.tests/target/classes
13:21:00 [INFO] 
13:21:00 [INFO] --- maven-resources-plugin:2.6:testResources (default-testResources) @ org.eclipse.papyrus.uml.internationalization.controlmode.tests ---
13:21:00 [INFO] Using 'UTF-8' encoding to copy filtered resources.
13:21:00 [INFO] skip non existing resourceDirectory /jobs/genie.papyrus/Papyrus-Oxygen-Tests/workspace/source/tests/junit/plugins/uml/internationalization/org.eclipse.papyrus.uml.internationalization.controlmode.tests/src/test/resources
13:21:00 [INFO] 
13:21:00 [INFO] --- target-platform-configuration:1.0.0:target-platform (default-target-platform) @ org.eclipse.papyrus.uml.internationalization.controlmode.tests ---
13:21:00 [INFO] 
13:21:00 [INFO] --- tycho-packaging-plugin:1.0.0:package-plugin (default-package-plugin) @ org.eclipse.papyrus.uml.internationalization.controlmode.tests ---
13:21:00 [INFO] Building jar: /jobs/genie.papyrus/Papyrus-Oxygen-Tests/workspace/source/tests/junit/plugins/uml/internationalization/org.eclipse.papyrus.uml.internationalization.controlmode.tests/target/org.eclipse.papyrus.uml.internationalization.controlmode.tests-1.0.0-SNAPSHOT.jar
13:21:00 [INFO] 
13:21:00 [INFO] --- tycho-p2-plugin:1.0.0:p2-metadata-default (default-p2-metadata-default) @ org.eclipse.papyrus.uml.internationalization.controlmode.tests ---
13:21:00 [INFO] 
13:21:00 [INFO] --- tycho-surefire-plugin:1.0.0:test (default-test) @ org.eclipse.papyrus.uml.internationalization.controlmode.tests ---
13:21:00 [INFO] Skipping tests
13:21:00 [INFO] 
13:21:00 [INFO] --- jacoco-maven-plugin:0.7.9:report (default-report) @ org.eclipse.papyrus.uml.internationalization.controlmode.tests ---
13:21:00 [INFO] Skipping JaCoCo execution due to missing execution data file.
13:21:00 [INFO] 
13:21:00 [INFO] --< org.eclipse.papyrus.tests:org.eclipse.papyrus.views.properties.toolsmiths.tests >--
13:21:00 [INFO] Building org.eclipse.papyrus.views.properties.toolsmiths.tests 1.2.0-SNAPSHOT [151/155]
13:21:00 [INFO] ------------------------[ eclipse-test-plugin ]-------------------------
13:21:01 [INFO] 
13:21:01 [INFO] --- maven-clean-plugin:2.6:clean (default-clean) @ org.eclipse.papyrus.views.properties.toolsmiths.tests ---
13:21:01 [INFO] 
13:21:01 [INFO] --- tycho-packaging-plugin:1.0.0:build-qualifier (default-build-qualifier) @ org.eclipse.papyrus.views.properties.toolsmiths.tests ---
13:21:01 [INFO] The project's OSGi version is 1.2.0.202003101629
13:21:01 [INFO] 
13:21:01 [INFO] --- tycho-packaging-plugin:1.0.0:validate-id (default-validate-id) @ org.eclipse.papyrus.views.properties.toolsmiths.tests ---
13:21:01 [INFO] 
13:21:01 [INFO] --- tycho-packaging-plugin:1.0.0:validate-version (default-validate-version) @ org.eclipse.papyrus.views.properties.toolsmiths.tests ---
13:21:01 [INFO] 
13:21:01 [INFO] --- jacoco-maven-plugin:0.7.9:prepare-agent (default-prepare-agent) @ org.eclipse.papyrus.views.properties.toolsmiths.tests ---
13:21:01 [INFO] tycho.testArgLine set to -javaagent:/home/hudson/genie.papyrus/.jenkins/jobs/Papyrus-Oxygen-Tests/workspace/.repository/org/jacoco/org.jacoco.agent/0.7.9/org.jacoco.agent-0.7.9-runtime.jar=destfile=/jobs/genie.papyrus/Papyrus-Oxygen-Tests/workspace/source/tests/junit/plugins/views/org.eclipse.papyrus.views.properties.toolsmiths.tests/target/jacoco.exec,includes=org.eclipse.papyrus.*,excludes=org.eclipse.uml2
13:21:01 [INFO] 
13:21:01 [INFO] --- maven-resources-plugin:2.6:resources (default-resources) @ org.eclipse.papyrus.views.properties.toolsmiths.tests ---
13:21:01 [INFO] Using 'UTF-8' encoding to copy filtered resources.
13:21:01 [INFO] skip non existing resourceDirectory /jobs/genie.papyrus/Papyrus-Oxygen-Tests/workspace/source/tests/junit/plugins/views/org.eclipse.papyrus.views.properties.toolsmiths.tests/src/main/resources
13:21:01 [INFO] 
13:21:01 [INFO] --- tycho-compiler-plugin:1.0.0:compile (default-compile) @ org.eclipse.papyrus.views.properties.toolsmiths.tests ---
13:21:01 [INFO] Compiling 3 source files to /jobs/genie.papyrus/Papyrus-Oxygen-Tests/workspace/source/tests/junit/plugins/views/org.eclipse.papyrus.views.properties.toolsmiths.tests/target/classes
13:21:01 [WARNING] /jobs/genie.papyrus/Papyrus-Oxygen-Tests/workspace/source/tests/junit/plugins/views/org.eclipse.papyrus.views.properties.toolsmiths.tests/src/org/eclipse/papyrus/views/properties/toolsmiths/tests/qvt/TransformationsTests.java:[164] 
13:21:01 	ModelExtent temp = new BasicModelExtent();
13:21:01 	            ^^^^
13:21:01 The value of the local variable temp is not used
13:21:01 [WARNING] /jobs/genie.papyrus/Papyrus-Oxygen-Tests/workspace/source/tests/junit/plugins/views/org.eclipse.papyrus.views.properties.toolsmiths.tests/src/org/eclipse/papyrus/views/properties/toolsmiths/tests/qvt/TransformationsTests.java:[275] 
13:21:01 	DataContextElement st3Element = findContextElement(context, "Stereotype3");
13:21:01 	                   ^^^^^^^^^^
13:21:01 The value of the local variable st3Element is not used
13:21:01 2 problems (2 warnings)
13:21:01 [INFO] 
13:21:01 [INFO] --- maven-resources-plugin:2.6:testResources (default-testResources) @ org.eclipse.papyrus.views.properties.toolsmiths.tests ---
13:21:01 [INFO] Using 'UTF-8' encoding to copy filtered resources.
13:21:01 [INFO] skip non existing resourceDirectory /jobs/genie.papyrus/Papyrus-Oxygen-Tests/workspace/source/tests/junit/plugins/views/org.eclipse.papyrus.views.properties.toolsmiths.tests/src/test/resources
13:21:01 [INFO] 
13:21:01 [INFO] --- target-platform-configuration:1.0.0:target-platform (default-target-platform) @ org.eclipse.papyrus.views.properties.toolsmiths.tests ---
13:21:01 [INFO] 
13:21:01 [INFO] --- tycho-packaging-plugin:1.0.0:package-plugin (default-package-plugin) @ org.eclipse.papyrus.views.properties.toolsmiths.tests ---
13:21:01 [INFO] Building jar: /jobs/genie.papyrus/Papyrus-Oxygen-Tests/workspace/source/tests/junit/plugins/views/org.eclipse.papyrus.views.properties.toolsmiths.tests/target/org.eclipse.papyrus.views.properties.toolsmiths.tests-1.2.0-SNAPSHOT.jar
13:21:01 [INFO] 
13:21:01 [INFO] --- tycho-p2-plugin:1.0.0:p2-metadata-default (default-p2-metadata-default) @ org.eclipse.papyrus.views.properties.toolsmiths.tests ---
13:21:01 [INFO] 
13:21:01 [INFO] --- tycho-surefire-plugin:1.0.0:test (default-test) @ org.eclipse.papyrus.views.properties.toolsmiths.tests ---
13:21:01 [INFO] Skipping tests
13:21:01 [INFO] 
13:21:01 [INFO] --- jacoco-maven-plugin:0.7.9:report (default-report) @ org.eclipse.papyrus.views.properties.toolsmiths.tests ---
13:21:01 [INFO] Skipping JaCoCo execution due to missing execution data file.
13:21:01 [INFO] 
13:21:01 [INFO] --< org.eclipse.papyrus.tests:org.eclipse.papyrus.views.suite.tests >---
13:21:01 [INFO] Building org.eclipse.papyrus.views.suite.tests 0.0.1-SNAPSHOT  [152/155]
13:21:01 [INFO] ------------------------[ eclipse-test-plugin ]-------------------------
13:21:01 [INFO] 
13:21:01 [INFO] --- maven-clean-plugin:2.6:clean (default-clean) @ org.eclipse.papyrus.views.suite.tests ---
13:21:01 [INFO] 
13:21:01 [INFO] --- tycho-packaging-plugin:1.0.0:build-qualifier (default-build-qualifier) @ org.eclipse.papyrus.views.suite.tests ---
13:21:01 [INFO] The project's OSGi version is 0.0.1.202003101629
13:21:01 [INFO] 
13:21:01 [INFO] --- tycho-packaging-plugin:1.0.0:validate-id (default-validate-id) @ org.eclipse.papyrus.views.suite.tests ---
13:21:01 [INFO] 
13:21:01 [INFO] --- tycho-packaging-plugin:1.0.0:validate-version (default-validate-version) @ org.eclipse.papyrus.views.suite.tests ---
13:21:01 [INFO] 
13:21:01 [INFO] --- jacoco-maven-plugin:0.7.9:prepare-agent (default-prepare-agent) @ org.eclipse.papyrus.views.suite.tests ---
13:21:01 [INFO] tycho.testArgLine set to -javaagent:/home/hudson/genie.papyrus/.jenkins/jobs/Papyrus-Oxygen-Tests/workspace/.repository/org/jacoco/org.jacoco.agent/0.7.9/org.jacoco.agent-0.7.9-runtime.jar=destfile=/jobs/genie.papyrus/Papyrus-Oxygen-Tests/workspace/source/tests/junit/plugins/views/org.eclipse.papyrus.views.suite.tests/target/jacoco.exec,includes=org.eclipse.papyrus.*,excludes=org.eclipse.uml2
13:21:01 [INFO] 
13:21:01 [INFO] --- maven-resources-plugin:2.6:resources (default-resources) @ org.eclipse.papyrus.views.suite.tests ---
13:21:01 [INFO] Using 'UTF-8' encoding to copy filtered resources.
13:21:01 [INFO] skip non existing resourceDirectory /jobs/genie.papyrus/Papyrus-Oxygen-Tests/workspace/source/tests/junit/plugins/views/org.eclipse.papyrus.views.suite.tests/src/main/resources
13:21:01 [INFO] 
13:21:01 [INFO] --- tycho-compiler-plugin:1.0.0:compile (default-compile) @ org.eclipse.papyrus.views.suite.tests ---
13:21:01 [INFO] Compiling 2 source files to /jobs/genie.papyrus/Papyrus-Oxygen-Tests/workspace/source/tests/junit/plugins/views/org.eclipse.papyrus.views.suite.tests/target/classes
13:21:01 [INFO] 
13:21:01 [INFO] --- maven-resources-plugin:2.6:testResources (default-testResources) @ org.eclipse.papyrus.views.suite.tests ---
13:21:01 [INFO] Using 'UTF-8' encoding to copy filtered resources.
13:21:01 [INFO] skip non existing resourceDirectory /jobs/genie.papyrus/Papyrus-Oxygen-Tests/workspace/source/tests/junit/plugins/views/org.eclipse.papyrus.views.suite.tests/src/test/resources
13:21:01 [INFO] 
13:21:01 [INFO] --- target-platform-configuration:1.0.0:target-platform (default-target-platform) @ org.eclipse.papyrus.views.suite.tests ---
13:21:01 [INFO] 
13:21:01 [INFO] --- tycho-packaging-plugin:1.0.0:package-plugin (default-package-plugin) @ org.eclipse.papyrus.views.suite.tests ---
13:21:01 [INFO] Building jar: /jobs/genie.papyrus/Papyrus-Oxygen-Tests/workspace/source/tests/junit/plugins/views/org.eclipse.papyrus.views.suite.tests/target/org.eclipse.papyrus.views.suite.tests-0.0.1-SNAPSHOT.jar
13:21:01 [INFO] 
13:21:01 [INFO] --- tycho-p2-plugin:1.0.0:p2-metadata-default (default-p2-metadata-default) @ org.eclipse.papyrus.views.suite.tests ---
13:21:01 [INFO] 
13:21:01 [INFO] --- tycho-surefire-plugin:1.0.0:test (default-test) @ org.eclipse.papyrus.views.suite.tests ---
13:21:02 [INFO] Expected eclipse log file: /jobs/genie.papyrus/Papyrus-Oxygen-Tests/workspace/source/tests/junit/plugins/views/org.eclipse.papyrus.views.suite.tests/target/work/data/.metadata/.log
13:21:02 [INFO] Command line:
13:21:02 	[/opt/public/common/java/oracle/jdk1.8.0_202_x64/jre/bin/java, -Dosgi.noShutdown=false, -Dosgi.os=linux, -Dosgi.ws=gtk, -Dosgi.arch=x86_64, -javaagent:/home/hudson/genie.papyrus/.jenkins/jobs/Papyrus-Oxygen-Tests/workspace/.repository/org/jacoco/org.jacoco.agent/0.7.9/org.jacoco.agent-0.7.9-runtime.jar=destfile=/jobs/genie.papyrus/Papyrus-Oxygen-Tests/workspace/source/tests/junit/plugins/views/org.eclipse.papyrus.views.suite.tests/target/jacoco.exec,includes=org.eclipse.papyrus.*,excludes=org.eclipse.uml2, -Xms512m, -Xmx2048m, -XX:SoftRefLRUPolicyMSPerMB=100, -Dosgi.clean=true, -jar, /jobs/genie.papyrus/Papyrus-Oxygen-Tests/workspace/.repository/p2/osgi/bundle/org.eclipse.equinox.launcher/1.4.0.v20161219-1356/org.eclipse.equinox.launcher-1.4.0.v20161219-1356.jar, -data, /jobs/genie.papyrus/Papyrus-Oxygen-Tests/workspace/source/tests/junit/plugins/views/org.eclipse.papyrus.views.suite.tests/target/work/data, -install, /jobs/genie.papyrus/Papyrus-Oxygen-Tests/workspace/source/tests/junit/plugins/views/org.eclipse.papyrus.views.suite.tests/target/work, -configuration, /jobs/genie.papyrus/Papyrus-Oxygen-Tests/workspace/source/tests/junit/plugins/views/org.eclipse.papyrus.views.suite.tests/target/work/configuration, -application, org.eclipse.tycho.surefire.osgibooter.uitest, -testproperties, /jobs/genie.papyrus/Papyrus-Oxygen-Tests/workspace/source/tests/junit/plugins/views/org.eclipse.papyrus.views.suite.tests/target/surefire.properties, -product, org.eclipse.sdk.ide, -testConfig=CI_TESTS_CONFIG]
13:21:02 Picked up JAVA_TOOL_OPTIONS: -Xmx2G -Djava.io.tmpdir=/tmp/genie.papyrus -DforkCount=1
13:21:12 
13:21:12 -------------------------------------------------------
13:21:12  T E S T S
13:21:12 -------------------------------------------------------
13:21:13 Running org.eclipse.papyrus.views.suite.tests.AllTests
13:21:31 Tests run: 10, Failures: 0, Errors: 0, Skipped: 0, Time elapsed: 17.96 sec - in org.eclipse.papyrus.views.suite.tests.AllTests
13:21:31 revealSemanticElement_rootTest(org.eclipse.papyrus.views.modelexplorer.tests.ModelExplorerViewTests)  Time elapsed: 10.461 sec
13:21:31 deleteDiagramTest(org.eclipse.papyrus.views.modelexplorer.tests.DeleteHandlerTest)  Time elapsed: 1.776 sec
13:21:31 deleteTableTest(org.eclipse.papyrus.views.modelexplorer.tests.DeleteHandlerTest)  Time elapsed: 1.128 sec
13:21:31 deleteLinkItemTest(org.eclipse.papyrus.views.modelexplorer.tests.DeleteHandlerTest)  Time elapsed: 1.279 sec
13:21:31 deleteRootOfTheModel(org.eclipse.papyrus.views.modelexplorer.tests.DeleteHandlerTest)  Time elapsed: 1.135 sec
13:21:31 testOpendiagramTest(org.eclipse.papyrus.views.modelexplorer.tests.OpendiagramTest)  Time elapsed: 0.448 sec
13:21:31 handleXWTFileFromResourceSet(org.eclipse.papyrus.views.properties.toolsmiths.tests.qvt.TransformationsTests)  Time elapsed: 0.804 sec
13:21:31 handleXWTFileFromResource(org.eclipse.papyrus.views.properties.toolsmiths.tests.qvt.TransformationsTests)  Time elapsed: 0.11 sec
13:21:31 generateEcoreContext(org.eclipse.papyrus.views.properties.toolsmiths.tests.qvt.TransformationsTests)  Time elapsed: 0.103 sec
13:21:31 generateProfileContext(org.eclipse.papyrus.views.properties.toolsmiths.tests.qvt.TransformationsTests)  Time elapsed: 0.351 sec
13:21:31 
13:21:31 Results :
13:21:31 
13:21:31 Tests run: 10, Failures: 0, Errors: 0, Skipped: 0
13:21:31 
13:21:33 [INFO] All tests passed!
13:21:33 [INFO] 
13:21:33 [INFO] --- jacoco-maven-plugin:0.7.9:report (default-report) @ org.eclipse.papyrus.views.suite.tests ---
13:21:33 [INFO] Loading execution data file /jobs/genie.papyrus/Papyrus-Oxygen-Tests/workspace/source/tests/junit/plugins/views/org.eclipse.papyrus.views.suite.tests/target/jacoco.exec
13:21:33 [INFO] Analyzed bundle 'org.eclipse.papyrus.views.suite.tests' with 0 classes
13:21:33 [INFO] 
13:21:33 [INFO] --< org.eclipse.papyrus.tests:org.eclipse.papyrus.toolsmiths.suite.tests >--
13:21:33 [INFO] Building org.eclipse.papyrus.toolsmiths.suite.tests 0.0.1-SNAPSHOT [153/155]
13:21:33 [INFO] ------------------------[ eclipse-test-plugin ]-------------------------
13:21:33 [INFO] 
13:21:33 [INFO] --- maven-clean-plugin:2.6:clean (default-clean) @ org.eclipse.papyrus.toolsmiths.suite.tests ---
13:21:33 [INFO] 
13:21:33 [INFO] --- tycho-packaging-plugin:1.0.0:build-qualifier (default-build-qualifier) @ org.eclipse.papyrus.toolsmiths.suite.tests ---
13:21:33 [INFO] The project's OSGi version is 0.0.1.202003101629
13:21:33 [INFO] 
13:21:33 [INFO] --- tycho-packaging-plugin:1.0.0:validate-id (default-validate-id) @ org.eclipse.papyrus.toolsmiths.suite.tests ---
13:21:33 [INFO] 
13:21:33 [INFO] --- tycho-packaging-plugin:1.0.0:validate-version (default-validate-version) @ org.eclipse.papyrus.toolsmiths.suite.tests ---
13:21:33 [INFO] 
13:21:33 [INFO] --- jacoco-maven-plugin:0.7.9:prepare-agent (default-prepare-agent) @ org.eclipse.papyrus.toolsmiths.suite.tests ---
13:21:33 [INFO] tycho.testArgLine set to -javaagent:/home/hudson/genie.papyrus/.jenkins/jobs/Papyrus-Oxygen-Tests/workspace/.repository/org/jacoco/org.jacoco.agent/0.7.9/org.jacoco.agent-0.7.9-runtime.jar=destfile=/jobs/genie.papyrus/Papyrus-Oxygen-Tests/workspace/source/tests/junit/plugins/toolsmiths/org.eclipse.papyrus.toolsmiths.suite.tests/target/jacoco.exec,includes=org.eclipse.papyrus.*,excludes=org.eclipse.uml2
13:21:33 [INFO] 
13:21:33 [INFO] --- maven-resources-plugin:2.6:resources (default-resources) @ org.eclipse.papyrus.toolsmiths.suite.tests ---
13:21:33 [INFO] Using 'UTF-8' encoding to copy filtered resources.
13:21:33 [INFO] skip non existing resourceDirectory /jobs/genie.papyrus/Papyrus-Oxygen-Tests/workspace/source/tests/junit/plugins/toolsmiths/org.eclipse.papyrus.toolsmiths.suite.tests/src/main/resources
13:21:33 [INFO] 
13:21:33 [INFO] --- tycho-compiler-plugin:1.0.0:compile (default-compile) @ org.eclipse.papyrus.toolsmiths.suite.tests ---
13:21:33 [INFO] Compiling 2 source files to /jobs/genie.papyrus/Papyrus-Oxygen-Tests/workspace/source/tests/junit/plugins/toolsmiths/org.eclipse.papyrus.toolsmiths.suite.tests/target/classes
13:21:34 [INFO] 
13:21:34 [INFO] --- maven-resources-plugin:2.6:testResources (default-testResources) @ org.eclipse.papyrus.toolsmiths.suite.tests ---
13:21:34 [INFO] Using 'UTF-8' encoding to copy filtered resources.
13:21:34 [INFO] skip non existing resourceDirectory /jobs/genie.papyrus/Papyrus-Oxygen-Tests/workspace/source/tests/junit/plugins/toolsmiths/org.eclipse.papyrus.toolsmiths.suite.tests/src/test/resources
13:21:34 [INFO] 
13:21:34 [INFO] --- target-platform-configuration:1.0.0:target-platform (default-target-platform) @ org.eclipse.papyrus.toolsmiths.suite.tests ---
13:21:34 [INFO] 
13:21:34 [INFO] --- tycho-packaging-plugin:1.0.0:package-plugin (default-package-plugin) @ org.eclipse.papyrus.toolsmiths.suite.tests ---
13:21:34 [INFO] Building jar: /jobs/genie.papyrus/Papyrus-Oxygen-Tests/workspace/source/tests/junit/plugins/toolsmiths/org.eclipse.papyrus.toolsmiths.suite.tests/target/org.eclipse.papyrus.toolsmiths.suite.tests-0.0.1-SNAPSHOT.jar
13:21:34 [INFO] 
13:21:34 [INFO] --- tycho-p2-plugin:1.0.0:p2-metadata-default (default-p2-metadata-default) @ org.eclipse.papyrus.toolsmiths.suite.tests ---
13:21:34 [INFO] 
13:21:34 [INFO] --- tycho-surefire-plugin:1.0.0:test (default-test) @ org.eclipse.papyrus.toolsmiths.suite.tests ---
13:21:35 [INFO] Expected eclipse log file: /jobs/genie.papyrus/Papyrus-Oxygen-Tests/workspace/source/tests/junit/plugins/toolsmiths/org.eclipse.papyrus.toolsmiths.suite.tests/target/work/data/.metadata/.log
13:21:35 [INFO] Command line:
13:21:35 	[/opt/public/common/java/oracle/jdk1.8.0_202_x64/jre/bin/java, -Dosgi.noShutdown=false, -Dosgi.os=linux, -Dosgi.ws=gtk, -Dosgi.arch=x86_64, -javaagent:/home/hudson/genie.papyrus/.jenkins/jobs/Papyrus-Oxygen-Tests/workspace/.repository/org/jacoco/org.jacoco.agent/0.7.9/org.jacoco.agent-0.7.9-runtime.jar=destfile=/jobs/genie.papyrus/Papyrus-Oxygen-Tests/workspace/source/tests/junit/plugins/toolsmiths/org.eclipse.papyrus.toolsmiths.suite.tests/target/jacoco.exec,includes=org.eclipse.papyrus.*,excludes=org.eclipse.uml2, -Xms512m, -Xmx2048m, -XX:SoftRefLRUPolicyMSPerMB=100, -Dosgi.clean=true, -jar, /jobs/genie.papyrus/Papyrus-Oxygen-Tests/workspace/.repository/p2/osgi/bundle/org.eclipse.equinox.launcher/1.4.0.v20161219-1356/org.eclipse.equinox.launcher-1.4.0.v20161219-1356.jar, -data, /jobs/genie.papyrus/Papyrus-Oxygen-Tests/workspace/source/tests/junit/plugins/toolsmiths/org.eclipse.papyrus.toolsmiths.suite.tests/target/work/data, -install, /jobs/genie.papyrus/Papyrus-Oxygen-Tests/workspace/source/tests/junit/plugins/toolsmiths/org.eclipse.papyrus.toolsmiths.suite.tests/target/work, -configuration, /jobs/genie.papyrus/Papyrus-Oxygen-Tests/workspace/source/tests/junit/plugins/toolsmiths/org.eclipse.papyrus.toolsmiths.suite.tests/target/work/configuration, -application, org.eclipse.tycho.surefire.osgibooter.uitest, -testproperties, /jobs/genie.papyrus/Papyrus-Oxygen-Tests/workspace/source/tests/junit/plugins/toolsmiths/org.eclipse.papyrus.toolsmiths.suite.tests/target/surefire.properties, -product, org.eclipse.sdk.ide, -testConfig=CI_TESTS_CONFIG]
13:21:35 Picked up JAVA_TOOL_OPTIONS: -Xmx2G -Djava.io.tmpdir=/tmp/genie.papyrus -DforkCount=1
13:21:44 
13:21:44 -------------------------------------------------------
13:21:44  T E S T S
13:21:44 -------------------------------------------------------
13:21:44 Running org.eclipse.papyrus.toolsmiths.suite.tests.AllTests
13:21:45 log4j:WARN No appenders could be found for logger (org.eclipse.emf.compare.EMFCompare).
13:21:45 log4j:WARN Please initialize the log4j system properly.
13:21:46 Tests run: 21, Failures: 0, Errors: 0, Skipped: 0, Time elapsed: 2.458 sec - in org.eclipse.papyrus.toolsmiths.suite.tests.AllTests
13:21:46 ProfileAutomaticMigrationTest(org.eclipse.papyrus.toolsmiths.profilemigration.tests.automatic.AutomaticMigrationTest)  Time elapsed: 0.003 sec
13:21:46 PackageAutomaticMigrationTest(org.eclipse.papyrus.toolsmiths.profilemigration.tests.automatic.AutomaticMigrationTest)  Time elapsed: 0.01 sec
13:21:46 StereotypeAutomaticMigrationTest_Stereotype_delete_Property(org.eclipse.papyrus.toolsmiths.profilemigration.tests.automatic.AutomaticMigrationTest)  Time elapsed: 0 sec
13:21:46 PropertyAutomaticMigrationTest(org.eclipse.papyrus.toolsmiths.profilemigration.tests.automatic.AutomaticMigrationTest)  Time elapsed: 0.001 sec
13:21:46 StereotypeAutomaticMigrationTest(org.eclipse.papyrus.toolsmiths.profilemigration.tests.automatic.AutomaticMigrationTest)  Time elapsed: 0 sec
13:21:46 GeneralizationAutomaticMigrationTest(org.eclipse.papyrus.toolsmiths.profilemigration.tests.automatic.AutomaticMigrationTest)  Time elapsed: 0.001 sec
13:21:46 atomicListTest(org.eclipse.papyrus.toolsmiths.profilemigration.tests.migrators.ChangeIsAbstractFromStereotypeTest)  Time elapsed: 0.001 sec
13:21:46 atomicListMoveProfileIntoNonApplyProfileTest(org.eclipse.papyrus.toolsmiths.profilemigration.tests.migrators.MoveMigratorTest)  Time elapsed: 0.031 sec
13:21:46 atomicListMoveStereotypeIntoNonApplyProfileTest(org.eclipse.papyrus.toolsmiths.profilemigration.tests.migrators.MoveMigratorTest)  Time elapsed: 0.024 sec
13:21:46 atomicListMovePackageIntoAlreadyApplyProfileTest(org.eclipse.papyrus.toolsmiths.profilemigration.tests.migrators.MoveMigratorTest)  Time elapsed: 0.026 sec
13:21:46 atomicListMoveStereotypeIntoAlreadyApplyProfileTest(org.eclipse.papyrus.toolsmiths.profilemigration.tests.migrators.MoveMigratorTest)  Time elapsed: 0.025 sec
13:21:46 atomicListMovePackageIntoNonApplyProfileTest(org.eclipse.papyrus.toolsmiths.profilemigration.tests.migrators.MoveMigratorTest)  Time elapsed: 0.024 sec
13:21:46 atomicListMoveProfileIntoAlreadyApplyProfileTest(org.eclipse.papyrus.toolsmiths.profilemigration.tests.migrators.MoveMigratorTest)  Time elapsed: 0.025 sec
13:21:46 UpperMultiplicityTest(org.eclipse.papyrus.toolsmiths.profilemigration.tests.migrators.ChangeMultiplicityFromPropertyMigratorTest)  Time elapsed: 0.002 sec
13:21:46 atomicListTest(org.eclipse.papyrus.toolsmiths.profilemigration.tests.migrators.ChangeMultiplicityFromPropertyMigratorTest)  Time elapsed: 0 sec
13:21:46 LowerMultiplicityTest(org.eclipse.papyrus.toolsmiths.profilemigration.tests.migrators.ChangeMultiplicityFromPropertyMigratorTest)  Time elapsed: 0 sec
13:21:46 DeleteEnumerationLiteralTest(org.eclipse.papyrus.toolsmiths.profilemigration.tests.migrators.DeleteEnumLiteralFromEnumerationTest)  Time elapsed: 0.002 sec
13:21:46 MoveEnumerationLiteralTest(org.eclipse.papyrus.toolsmiths.profilemigration.tests.migrators.DeleteEnumLiteralFromEnumerationTest)  Time elapsed: 0.001 sec
13:21:46 atomicListTest(org.eclipse.papyrus.toolsmiths.profilemigration.tests.migrators.DeleteEnumLiteralFromEnumerationTest)  Time elapsed: 0 sec
13:21:46 atomicListTest(org.eclipse.papyrus.toolsmiths.profilemigration.tests.migrators.ChangeIsStaticFromPropertyTest)  Time elapsed: 0.001 sec
13:21:46 atomicListTest(org.eclipse.papyrus.toolsmiths.profilemigration.tests.migrators.AddPropertyToStereotypeTest)  Time elapsed: 0.001 sec
13:21:46 
13:21:46 Results :
13:21:46 
13:21:46 Tests run: 21, Failures: 0, Errors: 0, Skipped: 0
13:21:46 
13:21:55 [INFO] All tests passed!
13:21:55 [INFO] 
13:21:55 [INFO] --- jacoco-maven-plugin:0.7.9:report (default-report) @ org.eclipse.papyrus.toolsmiths.suite.tests ---
13:21:55 [INFO] Loading execution data file /jobs/genie.papyrus/Papyrus-Oxygen-Tests/workspace/source/tests/junit/plugins/toolsmiths/org.eclipse.papyrus.toolsmiths.suite.tests/target/jacoco.exec
13:21:55 [INFO] Analyzed bundle 'org.eclipse.papyrus.toolsmiths.suite.tests' with 0 classes
13:21:55 [INFO] 
13:21:55 [INFO] --< org.eclipse.papyrus:org.eclipse.papyrus.main.tests.target.parent >--
13:21:55 [INFO] Building org.eclipse.papyrus.main.tests.target.parent 0.0.1-SNAPSHOT [154/155]
13:21:55 [INFO] --------------------------------[ pom ]---------------------------------
13:21:55 [INFO] 
13:21:55 [INFO] --- maven-clean-plugin:2.6:clean (default-clean) @ org.eclipse.papyrus.main.tests.target.parent ---
13:21:55 [INFO] 
13:21:55 [INFO] --- jacoco-maven-plugin:0.7.9:prepare-agent (default-prepare-agent) @ org.eclipse.papyrus.main.tests.target.parent ---
13:21:55 [INFO] argLine set to -javaagent:/home/hudson/genie.papyrus/.jenkins/jobs/Papyrus-Oxygen-Tests/workspace/.repository/org/jacoco/org.jacoco.agent/0.7.9/org.jacoco.agent-0.7.9-runtime.jar=destfile=/jobs/genie.papyrus/Papyrus-Oxygen-Tests/workspace/source/releng/main-tests/targetPlatform/target/jacoco.exec,includes=org.eclipse.papyrus.*,excludes=org.eclipse.uml2
13:21:55 [INFO] 
13:21:55 [INFO] --- jacoco-maven-plugin:0.7.9:report (default-report) @ org.eclipse.papyrus.main.tests.target.parent ---
13:21:55 [INFO] Skipping JaCoCo execution due to missing execution data file.
13:21:55 [INFO] 
13:21:55 [INFO] --< org.eclipse.papyrus:org.eclipse.papyrus.main.tests.portable.target >--
13:21:55 [INFO] Building org.eclipse.papyrus.main.tests.portable.target 0.0.1-SNAPSHOT [155/155]
13:21:55 [INFO] ---------------------[ eclipse-target-definition ]----------------------
13:21:55 [INFO] 
13:21:55 [INFO] --- maven-clean-plugin:2.6:clean (default-clean) @ org.eclipse.papyrus.main.tests.portable.target ---
13:21:55 [INFO] 
13:21:55 [INFO] --- jacoco-maven-plugin:0.7.9:prepare-agent (default-prepare-agent) @ org.eclipse.papyrus.main.tests.portable.target ---
13:21:55 [INFO] argLine set to -javaagent:/home/hudson/genie.papyrus/.jenkins/jobs/Papyrus-Oxygen-Tests/workspace/.repository/org/jacoco/org.jacoco.agent/0.7.9/org.jacoco.agent-0.7.9-runtime.jar=destfile=/jobs/genie.papyrus/Papyrus-Oxygen-Tests/workspace/source/releng/main-tests/targetPlatform/portable/target/jacoco.exec,includes=org.eclipse.papyrus.*,excludes=org.eclipse.uml2
13:21:55 [INFO] 
13:21:55 [INFO] --- tycho-packaging-plugin:1.0.0:package-target-definition (default-package-target-definition) @ org.eclipse.papyrus.main.tests.portable.target ---
13:21:55 [INFO] 
13:21:55 [INFO] --- jacoco-maven-plugin:0.7.9:report (default-report) @ org.eclipse.papyrus.main.tests.portable.target ---
13:21:55 [INFO] Skipping JaCoCo execution due to missing execution data file.
13:21:55 [INFO] ------------------------------------------------------------------------
13:21:55 [INFO] Reactor Summary:
13:21:55 [INFO] 
13:21:55 [INFO] org.eclipse.papyrus.tests.releng 1.2.0-SNAPSHOT .... SUCCESS [01:38 min]
13:21:55 [INFO] org.eclipse.papyrus.plugins.tests.releng 0.0.1-SNAPSHOT SUCCESS [  0.006 s]
13:21:55 [INFO] org.eclipse.papyrus.editor.tests.releng 0.0.1-SNAPSHOT SUCCESS [  0.005 s]
13:21:55 [INFO] org.eclipse.papyrus.editor.integration.tests 1.3.100-SNAPSHOT SUCCESS [01:06 min]
13:21:55 [INFO] org.eclipse.papyrus.infra.tests.releng 0.0.1-SNAPSHOT SUCCESS [  0.007 s]
13:21:55 [INFO] org.eclipse.papyrus.infra.core.tests.releng 0.0.1-SNAPSHOT SUCCESS [  0.009 s]
13:21:55 [INFO] org.eclipse.papyrus.infra.core.clipboard.tests 1.3.0-SNAPSHOT SUCCESS [  1.046 s]
13:21:55 [INFO] org.eclipse.papyrus.infra.core.sasheditor.tests 1.2.0-SNAPSHOT SUCCESS [  0.763 s]
13:21:55 [INFO] org.eclipse.papyrus.infra.core.sasheditor.di.tests 1.2.0-SNAPSHOT SUCCESS [  0.390 s]
13:21:55 [INFO] org.eclipse.papyrus.infra.core.tests 3.0.1-SNAPSHOT  SUCCESS [  6.200 s]
13:21:55 [INFO] org.eclipse.papyrus.infra.editor.tests.releng 0.0.1-SNAPSHOT SUCCESS [  0.008 s]
13:21:55 [INFO] org.eclipse.papyrus.infra.editor.welcome.tests 1.2.0-SNAPSHOT SUCCESS [  0.617 s]
13:21:55 [INFO] org.eclipse.papyrus.infra.emf.tests.releng 0.0.1-SNAPSHOT SUCCESS [  0.005 s]
13:21:55 [INFO] org.eclipse.papyrus.infra.emf.gmf.tests 1.2.100-SNAPSHOT SUCCESS [  0.458 s]
13:21:55 [INFO] org.eclipse.papyrus.infra.emf.readonly.tests 1.2.0-SNAPSHOT SUCCESS [  0.368 s]
13:21:55 [INFO] org.eclipse.papyrus.infra.emf.tests 1.4.0-SNAPSHOT . SUCCESS [  0.806 s]
13:21:55 [INFO] org.eclipse.papyrus.infra.filters.tests 1.2.0-SNAPSHOT SUCCESS [  0.135 s]
13:21:55 [INFO] org.eclipse.papyrus.infra.gmfdiag.tests.releng 0.0.1-SNAPSHOT SUCCESS [  0.006 s]
13:21:55 [INFO] org.eclipse.papyrus.infra.gmfdiag.assistant.tests.releng 0.0.1-SNAPSHOT SUCCESS [  0.004 s]
13:21:55 [INFO] org.eclipse.papyrus.infra.gmfdiag.assistant.tests 1.2.0-SNAPSHOT SUCCESS [  0.491 s]
13:21:55 [INFO] org.eclipse.papyrus.infra.gmfdiag.canonical.tests 1.2.0-SNAPSHOT SUCCESS [  0.584 s]
13:21:55 [INFO] org.eclipse.papyrus.infra.gmfdiag.commands.tests 1.2.0-SNAPSHOT SUCCESS [  0.582 s]
13:21:55 [INFO] org.eclipse.papyrus.infra.gmfdiag.common.tests 3.0.0-SNAPSHOT SUCCESS [  0.588 s]
13:21:55 [INFO] org.eclipse.papyrus.infra.gmfdiag.css.tests 1.2.0-SNAPSHOT SUCCESS [  0.523 s]
13:21:55 [INFO] org.eclipse.papyrus.infra.gmfdiag.menu.tests 1.2.0-SNAPSHOT SUCCESS [  0.347 s]
13:21:55 [INFO] org.eclipse.papyrus.infra.gmfdiag.paletteconfiguration.tests 1.2.0-SNAPSHOT SUCCESS [  0.312 s]
13:21:55 [INFO] org.eclipse.papyrus.infra.gmfdiag.welcome.tests 1.2.0-SNAPSHOT SUCCESS [  0.391 s]
13:21:55 [INFO] org.eclipse.papyrus.infra.nattable.main.test 1.2.0-SNAPSHOT SUCCESS [  0.004 s]
13:21:55 [INFO] org.eclipse.papyrus.infra.nattable.common.tests 1.2.100-SNAPSHOT SUCCESS [  0.416 s]
13:21:55 [INFO] org.eclipse.papyrus.infra.nattable.model.editor.tests 1.2.100-SNAPSHOT SUCCESS [  0.361 s]
13:21:55 [INFO] org.eclipse.papyrus.infra.nattable.model.tests 1.2.100-SNAPSHOT SUCCESS [  0.422 s]
13:21:55 [INFO] org.eclipse.papyrus.infra.nattable.tests 1.2.100-SNAPSHOT SUCCESS [  0.576 s]
13:21:55 [INFO] org.eclipse.papyrus.infra.nattable.views.tests 1.2.100-SNAPSHOT SUCCESS [  0.479 s]
13:21:55 [INFO] org.eclipse.papyrus.infra.properties.tests.releng 0.0.1-SNAPSHOT SUCCESS [  0.004 s]
13:21:55 [INFO] org.eclipse.papyrus.infra.properties.ui.tests 2.0.0-SNAPSHOT SUCCESS [  0.425 s]
13:21:55 [INFO] org.eclipse.papyrus.infra.services.tests.releng 0.0.1-SNAPSHOT SUCCESS [  0.003 s]
13:21:55 [INFO] org.eclipse.papyrus.infra.services.controlmode.tests 1.4.0-SNAPSHOT SUCCESS [  0.644 s]
13:21:55 [INFO] org.eclipse.papyrus.infra.services.edit.tests 1.2.0-SNAPSHOT SUCCESS [  0.457 s]
13:21:55 [INFO] org.eclipse.papyrus.infra.services.edit.ui.tests 1.2.0-SNAPSHOT SUCCESS [  0.415 s]
13:21:55 [INFO] org.eclipse.papyrus.infra.services.resourceloading.tests 1.2.0-SNAPSHOT SUCCESS [  0.348 s]
13:21:55 [INFO] org.eclipse.papyrus.infra.services.semantic.tests 1.2.100-SNAPSHOT SUCCESS [  0.385 s]
13:21:55 [INFO] org.eclipse.papyrus.infra.tools.tests 1.2.0-SNAPSHOT SUCCESS [  0.641 s]
13:21:55 [INFO] org.eclipse.papyrus.infra.types.tests.releng 0.0.1-SNAPSHOT SUCCESS [  0.004 s]
13:21:55 [INFO] org.eclipse.papyrus.infra.types.tests 3.0.0-SNAPSHOT SUCCESS [  0.458 s]
13:21:55 [INFO] org.eclipse.papyrus.infra.types.ui.tests 3.0.0-SNAPSHOT SUCCESS [  0.678 s]
13:21:55 [INFO] org.eclipse.papyrus.infra.ui.emf.tests 1.2.0-SNAPSHOT SUCCESS [  0.456 s]
13:21:55 [INFO] org.eclipse.papyrus.infra.ui.tests 1.2.0-SNAPSHOT .. SUCCESS [  0.523 s]
13:21:55 [INFO] org.eclipse.papyrus.infra.viewpoints.tests.releng 1.2.0-SNAPSHOT SUCCESS [  0.005 s]
13:21:55 [INFO] org.eclipse.papyrus.infra.viewpoints.policy.tests 1.2.0-SNAPSHOT SUCCESS [  0.799 s]
13:21:55 [INFO] org.eclipse.papyrus.uml.tests.releng 0.0.1-SNAPSHOT  SUCCESS [  0.006 s]
13:21:55 [INFO] org.eclipse.papyrus.uml.diagram.tests.releng 1.2.0-SNAPSHOT SUCCESS [  0.004 s]
13:21:55 [INFO] org.eclipse.papyrus.uml.diagram.tests 1.3.0-SNAPSHOT SUCCESS [  0.787 s]
13:21:55 [INFO] org.eclipse.papyrus.uml.diagram.clazz.tests 1.3.0-SNAPSHOT SUCCESS [  0.626 s]
13:21:55 [INFO] org.eclipse.papyrus.uml.diagram.activity.tests 1.2.0-SNAPSHOT SUCCESS [  0.994 s]
13:21:55 [INFO] org.eclipse.papyrus.uml.diagram.usecase.tests 1.2.0-SNAPSHOT SUCCESS [  0.571 s]
13:21:55 [INFO] org.eclipse.papyrus.uml.diagram.deployment.tests 1.2.0-SNAPSHOT SUCCESS [  0.703 s]
13:21:55 [INFO] org.eclipse.papyrus.uml.diagram.component.tests 1.2.0-SNAPSHOT SUCCESS [  0.546 s]
13:21:55 [INFO] org.eclipse.papyrus.uml.diagram.timing.tests 1.2.0-SNAPSHOT SUCCESS [  0.585 s]
13:21:55 [INFO] org.eclipse.papyrus.uml.diagram.stereotypeproperty.tests 1.2.0-SNAPSHOT SUCCESS [  0.517 s]
13:21:55 [INFO] org.eclipse.papyrus.uml.diagram.sequence.tests 1.3.100-SNAPSHOT SUCCESS [  0.991 s]
13:21:55 [INFO] org.eclipse.papyrus.uml.diagram.composite.tests 1.2.0-SNAPSHOT SUCCESS [  0.703 s]
13:21:55 [INFO] org.eclipse.papyrus.uml.diagram.wizards.tests 1.2.0-SNAPSHOT SUCCESS [  0.515 s]
13:21:55 [INFO] org.eclipse.papyrus.uml.diagram.profile.tests 1.2.0-SNAPSHOT SUCCESS [  0.494 s]
13:21:55 [INFO] org.eclipse.papyrus.uml.dynamic.profile.tests 1.2.0-SNAPSHOT SUCCESS [  0.027 s]
13:21:55 [INFO] org.eclipse.papyrus.uml.diagram.common.tests 1.3.0-SNAPSHOT SUCCESS [  0.701 s]
13:21:55 [INFO] org.eclipse.papyrus.tests.uml.diagram.feature 1.2.0-SNAPSHOT SUCCESS [  0.192 s]
13:21:55 [INFO] org.eclipse.papyrus.tests.infra.services.feature 1.2.0-SNAPSHOT SUCCESS [  0.064 s]
13:21:55 [INFO] org.eclipse.papyrus.views.tests.releng 0.0.1-SNAPSHOT SUCCESS [  0.002 s]
13:21:55 [INFO] org.eclipse.papyrus.views.modelexplorer.tests 1.2.100-SNAPSHOT SUCCESS [  0.338 s]
13:21:55 [INFO] org.eclipse.papyrus.uml.modelexplorer.tests.releng 0.0.1-SNAPSHOT SUCCESS [  0.003 s]
13:21:55 [INFO] org.eclipse.papyrus.uml.modelexplorer.tests 1.3.100-SNAPSHOT SUCCESS [  0.365 s]
13:21:55 [INFO] org.eclipse.papyrus.uml.modelrepair.tests 1.2.100-SNAPSHOT SUCCESS [  0.586 s]
13:21:55 [INFO] org.eclipse.papyrus.uml.service.types.tests 1.2.0-SNAPSHOT SUCCESS [  5.882 s]
13:21:55 [INFO] org.eclipse.papyrus.uml.service.types.ui.tests 1.2.0-SNAPSHOT SUCCESS [  0.720 s]
13:21:55 [INFO] org.eclipse.papyrus.uml.profile.tests.releng 0.0.1-SNAPSHOT SUCCESS [  0.004 s]
13:21:55 [INFO] org.eclipse.papyrus.uml.profile.drafter.tests 1.2.0-SNAPSHOT SUCCESS [  0.714 s]
13:21:55 [INFO] org.eclipse.papyrus.uml.filters.tests 1.2.0-SNAPSHOT SUCCESS [  0.509 s]
13:21:55 [INFO] org.eclipse.papyrus.uml.profile.tests 1.2.0-SNAPSHOT SUCCESS [  0.527 s]
13:21:55 [INFO] org.eclipse.papyrus.tests.uml.feature 1.2.0-SNAPSHOT SUCCESS [  0.132 s]
13:21:55 [INFO] org.eclipse.papyrus.tests.views.feature 1.2.0-SNAPSHOT SUCCESS [  0.041 s]
13:21:55 [INFO] org.eclipse.papyrus.tests.infra.nattable.feature 1.3.0-SNAPSHOT SUCCESS [  0.106 s]
13:21:55 [INFO] org.eclipse.papyrus.uml.nattable.main.test 1.2.0-SNAPSHOT SUCCESS [  0.004 s]
13:21:55 [INFO] org.eclipse.papyrus.uml.nattable.tests 1.2.100-SNAPSHOT SUCCESS [  0.500 s]
13:21:55 [INFO] org.eclipse.papyrus.uml.nattable.generic.tests 1.2.100-SNAPSHOT SUCCESS [  0.913 s]
13:21:55 [INFO] org.eclipse.papyrus.uml.nattable.clazz.config.tests 1.2.100-SNAPSHOT SUCCESS [  1.313 s]
13:21:55 [INFO] org.eclipse.papyrus.uml.nattable.stereotyped.elements.tests 1.0.100-SNAPSHOT SUCCESS [  0.773 s]
13:21:55 [INFO] org.eclipse.papyrus.uml.nattable.matrix.tests 1.0.0-SNAPSHOT SUCCESS [  0.549 s]
13:21:55 [INFO] org.eclipse.papyrus.tests.uml.nattable.feature 1.3.0-SNAPSHOT SUCCESS [  0.134 s]
13:21:55 [INFO] org.eclipse.papyrus.tests.infra.feature 1.2.0-SNAPSHOT SUCCESS [  0.249 s]
13:21:55 [INFO] org.eclipse.papyrus.tests.infra.core.feature 1.2.0-SNAPSHOT SUCCESS [  0.048 s]
13:21:55 [INFO] org.eclipse.papyrus.uml.tools.tests.releng 0.0.1-SNAPSHOT SUCCESS [  0.004 s]
13:21:55 [INFO] org.eclipse.papyrus.uml.tools.tests 3.0.0-SNAPSHOT . SUCCESS [  0.470 s]
13:21:55 [INFO] org.eclipse.papyrus.uml.tools.utils.tests 1.3.0-SNAPSHOT SUCCESS [  0.485 s]
13:21:55 [INFO] org.eclipse.papyrus.tests.uml.tools.feature 1.2.0-SNAPSHOT SUCCESS [  0.062 s]
13:21:55 [INFO] org.eclipse.papyrus.uml.decoratormodel.tests.releng 0.0.1-SNAPSHOT SUCCESS [  0.004 s]
13:21:55 [INFO] org.eclipse.papyrus.uml.decoratormodel.tests 1.2.0-SNAPSHOT SUCCESS [  0.554 s]
13:21:55 [INFO] org.eclipse.papyrus.uml.decoratormodel.controlmode.tests 1.2.0-SNAPSHOT SUCCESS [  0.354 s]
13:21:55 [INFO] org.eclipse.papyrus.tests.uml.decoratormodel.feature 1.2.0-SNAPSHOT SUCCESS [  0.047 s]
13:21:55 [INFO] org.eclipse.papyrus.uml.textedit.tests.releng 0.0.1-SNAPSHOT SUCCESS [  0.002 s]
13:21:55 [INFO] org.eclipse.papyrus.uml.textedit.tests 1.2.0-SNAPSHOT SUCCESS [  0.339 s]
13:21:55 [INFO] org.eclipse.papyrus.uml.textedit.parameter.tests 1.2.0-SNAPSHOT SUCCESS [  0.409 s]
13:21:55 [INFO] org.eclipse.papyrus.uml.textedit.port.tests 1.2.0-SNAPSHOT SUCCESS [  0.334 s]
13:21:55 [INFO] org.eclipse.papyrus.uml.textedit.property.tests 1.2.0-SNAPSHOT SUCCESS [  1.317 s]
13:21:55 [INFO] org.eclipse.papyrus.uml.textedit.tests.feature 1.2.0-SNAPSHOT SUCCESS [  0.093 s]
13:21:55 [INFO] org.eclipse.papyrus.uml.assistants.tests.releng 0.0.1-SNAPSHOT SUCCESS [  0.003 s]
13:21:55 [INFO] org.eclipse.papyrus.uml.profile.types.generator.tests 1.2.0-SNAPSHOT SUCCESS [  0.414 s]
13:21:55 [INFO] org.eclipse.papyrus.uml.profile.assistants.generator.tests 1.2.0-SNAPSHOT SUCCESS [  0.379 s]
13:21:55 [INFO] org.eclipse.papyrus.tests.uml.assistants.feature 1.2.0-SNAPSHOT SUCCESS [  0.056 s]
13:21:55 [INFO] org.eclipse.papyrus.toolsmiths.tests.releng 0.0.1-SNAPSHOT SUCCESS [  0.003 s]
13:21:55 [INFO] org.eclipse.papyrus.toolsmiths.profilemigration.tests 0.7.0-SNAPSHOT SUCCESS [  0.382 s]
13:21:55 [INFO] org.eclipse.papyrus.tests.toolsmiths.feature 1.0.0-SNAPSHOT SUCCESS [  0.041 s]
13:21:55 [INFO] org.eclipse.papyrus.tests.feature 1.3.0-SNAPSHOT ... SUCCESS [  0.799 s]
13:21:55 [INFO] org.eclipse.papyrus.infra.emf.expressions.main.tests 0.0.1-SNAPSHOT SUCCESS [  0.003 s]
13:21:55 [INFO] org.eclipse.papyrus.infra.emf.expressions.tests 1.0.0-SNAPSHOT SUCCESS [  0.095 s]
13:21:55 [INFO] org.eclipse.papyrus.tests.infra.emf.expressions.feature 1.0.0-SNAPSHOT SUCCESS [  0.022 s]
13:21:55 [INFO] org.eclipse.papyrus.uml.expressions.tests.releng 0.0.1-SNAPSHOT SUCCESS [  0.003 s]
13:21:55 [INFO] org.eclipse.papyrus.uml.expressions.tests 1.0.0-SNAPSHOT SUCCESS [  0.349 s]
13:21:55 [INFO] org.eclipse.papyrus.tests.uml.expressions.feature 1.0.0-SNAPSHOT SUCCESS [  0.050 s]
13:21:55 [INFO] org.eclipse.papyrus.uml.alf.tests 1.2.0-SNAPSHOT ... SUCCESS [03:56 min]
13:21:55 [INFO] org.eclipse.papyrus.uml.alf.tests.feature 1.2.0-SNAPSHOT SUCCESS [  0.133 s]
13:21:55 [INFO] org.eclipse.papyrus.developer.suite.tests 0.0.1-SNAPSHOT SUCCESS [ 19.764 s]
13:21:55 [INFO] org.eclipse.papyrus.developer.tests.releng 0.0.1-SNAPSHOT SUCCESS [  0.012 s]
13:21:55 [INFO] org.eclipse.papyrus.eclipse.project.editors.tests 2.0.0-SNAPSHOT SUCCESS [  0.431 s]
13:21:55 [INFO] org.eclipse.papyrus.editors.suite.tests 0.0.1-SNAPSHOT SUCCESS [03:50 min]
13:21:55 [INFO] org.eclipse.papyrus.infra.core.suite.tests 0.0.1-SNAPSHOT SUCCESS [ 46.210 s]
13:21:55 [INFO] org.eclipse.papyrus.infra.nattable.suite.tests 0.0.1-SNAPSHOT SUCCESS [ 41.563 s]
13:21:55 [INFO] org.eclipse.papyrus.infra.internationalization.main.test 1.0.0-SNAPSHOT SUCCESS [  0.006 s]
13:21:55 [INFO] org.eclipse.papyrus.infra.internationalization.tests 1.1.0-SNAPSHOT SUCCESS [  0.534 s]
13:21:55 [INFO] org.eclipse.papyrus.infra.services.labelprovider.tests 1.2.1-SNAPSHOT SUCCESS [  0.367 s]
13:21:55 [INFO] org.eclipse.papyrus.infra.suite.tests 0.0.1-SNAPSHOT SUCCESS [05:10 min]
13:21:55 [INFO] org.eclipse.papyrus.infra.newchild.tests 1.2.0-SNAPSHOT SUCCESS [  0.476 s]
13:21:55 [INFO] org.eclipse.papyrus.uml.diagram.communication.tests 1.2.0-SNAPSHOT SUCCESS [  0.436 s]
13:21:55 [INFO] org.eclipse.papyrus.uml.diagram.interactionoverview.tests 1.2.0-SNAPSHOT SUCCESS [  0.433 s]
13:21:55 [INFO] org.eclipse.papyrus.uml.diagram.statemachine.tests 1.2.0-SNAPSHOT SUCCESS [  0.576 s]
13:21:55 [INFO] org.eclipse.papyrus.uml.diagram.suite.tests 0.0.1-SNAPSHOT SUCCESS [08:23 min]
13:21:55 [INFO] org.eclipse.papyrus.uml.diagram.dnd.tests 1.2.0-SNAPSHOT SUCCESS [  0.455 s]
13:21:55 [INFO] org.eclipse.papyrus.uml.nattable.stereotype.display.tests 1.2.100-SNAPSHOT SUCCESS [  0.719 s]
13:21:55 [INFO] org.eclipse.papyrus.uml.nattable.suite.tests 0.0.1-SNAPSHOT SUCCESS [12:04 min]
13:21:55 [INFO] org.eclipse.papyrus.uml.textedit.valuespecification.tests 1.2.0-SNAPSHOT SUCCESS [  0.554 s]
13:21:55 [INFO] org.eclipse.papyrus.uml.textedit.suite.tests 0.0.1-SNAPSHOT SUCCESS [ 19.931 s]
13:21:55 [INFO] org.eclipse.papyrus.uml.internationalization.main.test 1.0.0-SNAPSHOT SUCCESS [  0.006 s]
13:21:55 [INFO] org.eclipse.papyrus.uml.internationalization.tests 1.1.0-SNAPSHOT SUCCESS [  0.395 s]
13:21:55 [INFO] org.eclipse.papyrus.uml.validation.tests.releng 0.0.1-SNAPSHOT SUCCESS [  0.003 s]
13:21:55 [INFO] org.eclipse.papyrus.uml.validation.tests.staticprofile 1.2.0-SNAPSHOT SUCCESS [  0.166 s]
13:21:55 [INFO] org.eclipse.papyrus.uml.validation.tests.genvalidation 1.2.0-SNAPSHOT SUCCESS [  0.368 s]
13:21:55 [INFO] org.eclipse.papyrus.uml.validation.tests 1.2.0-SNAPSHOT SUCCESS [  0.336 s]
13:21:55 [INFO] org.eclipse.papyrus.uml.suite.tests 0.0.1-SNAPSHOT . SUCCESS [04:21 min]
13:21:55 [INFO] org.eclipse.papyrus.uml.alf.tests.releng 0.0.1-SNAPSHOT SUCCESS [  0.004 s]
13:21:55 [INFO] org.eclipse.papyrus.uml.alf.backend.tests 1.1.0-SNAPSHOT SUCCESS [  0.898 s]
13:21:55 [INFO] org.eclipse.papyrus.uml.internationalization.controlmode.tests 1.0.0-SNAPSHOT SUCCESS [  0.409 s]
13:21:55 [INFO] org.eclipse.papyrus.views.properties.toolsmiths.tests 1.2.0-SNAPSHOT SUCCESS [  0.342 s]
13:21:55 [INFO] org.eclipse.papyrus.views.suite.tests 0.0.1-SNAPSHOT SUCCESS [ 32.170 s]
13:21:55 [INFO] org.eclipse.papyrus.toolsmiths.suite.tests 0.0.1-SNAPSHOT SUCCESS [ 22.175 s]
13:21:55 [INFO] org.eclipse.papyrus.main.tests.target.parent 0.0.1-SNAPSHOT SUCCESS [  0.005 s]
13:21:55 [INFO] org.eclipse.papyrus.main.tests.portable.target 0.0.1-SNAPSHOT SUCCESS [  0.006 s]
13:21:55 [INFO] ------------------------------------------------------------------------
13:21:55 [INFO] BUILD SUCCESS
13:21:55 [INFO] ------------------------------------------------------------------------
13:21:55 [INFO] Total time:  52:24 min
13:21:55 [INFO] Finished at: 2020-03-10T13:21:55-04:00
13:21:55 [INFO] ------------------------------------------------------------------------
13:21:57 Taking screenshot.
13:21:57 [workspace] $ echo $XAUTHORITY
13:21:57 /home/hudson/genie.papyrus/.jenkins/jobs/Papyrus-Oxygen-Tests/workspace/.Xauthority-1381371053546216649
13:21:57 [workspace] $ ls -l $XAUTHORITY
13:21:57 -rw-rw-r-- 1 genie.papyrus modeling.mdt.papyrus 0 Mar 10 12:28 /home/hudson/genie.papyrus/.jenkins/jobs/Papyrus-Oxygen-Tests/workspace/.Xauthority-1381371053546216649
13:21:57 [workspace] $ import -window root -display :729 screenshot.jpg
13:21:57 Terminating xvnc.
13:22:12 Sending e-mails to: patrick.tessier@cea.fr vincent.lorenzo@cea.fr quentin.lemenez@cea.fr
13:22:12 Recording test results
13:22:13 Build step 'Publish JUnit test result report' changed build result to UNSTABLE
13:22:13 Started calculate disk usage of build
13:22:13 Finished Calculation of disk usage of build in 0 seconds
13:22:13 Started calculate disk usage of workspace
13:22:15 Finished Calculation of disk usage of workspace in  1 second
13:22:15 [WS-CLEANUP] Deleting project workspace...
13:22:15 [WS-CLEANUP] Deferred wipeout is used...
13:22:15 [WS-CLEANUP] done
13:22:15 Finished: UNSTABLE