UnstableConsole Output

Skipping 4,028 KB.. Full Log
ration:1.0.0:target-platform (default-target-platform) @ org.eclipse.papyrus.uml.validation.tests.genvalidation ---
13:17:48 [INFO] 
13:17:48 [INFO] --- tycho-packaging-plugin:1.0.0:package-plugin (default-package-plugin) @ org.eclipse.papyrus.uml.validation.tests.genvalidation ---
13:17:48 [INFO] Building jar: /jobs/genie.papyrus/Papyrus-Oxygen-Tests/workspace/source/tests/junit/plugins/uml/validation/org.eclipse.papyrus.uml.validation.tests.genvalidation/target/org.eclipse.papyrus.uml.validation.tests.genvalidation-1.2.0-SNAPSHOT.jar
13:17:48 [INFO] 
13:17:48 [INFO] --- tycho-p2-plugin:1.0.0:p2-metadata-default (default-p2-metadata-default) @ org.eclipse.papyrus.uml.validation.tests.genvalidation ---
13:17:48 [INFO] 
13:17:48 [INFO] --- tycho-surefire-plugin:1.0.0:test (default-test) @ org.eclipse.papyrus.uml.validation.tests.genvalidation ---
13:17:48 [INFO] Skipping tests
13:17:48 [INFO] 
13:17:48 [INFO] --- jacoco-maven-plugin:0.7.9:report (default-report) @ org.eclipse.papyrus.uml.validation.tests.genvalidation ---
13:17:48 [INFO] Skipping JaCoCo execution due to missing execution data file.
13:17:48 [INFO] 
13:17:48 [INFO] --< org.eclipse.papyrus.tests:org.eclipse.papyrus.uml.validation.tests >--
13:17:48 [INFO] Building org.eclipse.papyrus.uml.validation.tests 1.2.0-SNAPSHOT [146/155]
13:17:48 [INFO] ------------------------[ eclipse-test-plugin ]-------------------------
13:17:48 [INFO] 
13:17:48 [INFO] --- maven-clean-plugin:2.6:clean (default-clean) @ org.eclipse.papyrus.uml.validation.tests ---
13:17:48 [INFO] 
13:17:48 [INFO] --- tycho-packaging-plugin:1.0.0:build-qualifier (default-build-qualifier) @ org.eclipse.papyrus.uml.validation.tests ---
13:17:48 [INFO] The project's OSGi version is 1.2.0.201911111728
13:17:48 [INFO] 
13:17:48 [INFO] --- tycho-packaging-plugin:1.0.0:validate-id (default-validate-id) @ org.eclipse.papyrus.uml.validation.tests ---
13:17:48 [INFO] 
13:17:48 [INFO] --- tycho-packaging-plugin:1.0.0:validate-version (default-validate-version) @ org.eclipse.papyrus.uml.validation.tests ---
13:17:48 [INFO] 
13:17:48 [INFO] --- jacoco-maven-plugin:0.7.9:prepare-agent (default-prepare-agent) @ org.eclipse.papyrus.uml.validation.tests ---
13:17:48 [INFO] tycho.testArgLine set to -javaagent:/home/hudson/genie.papyrus/.jenkins/jobs/Papyrus-Oxygen-Tests/workspace/.repository/org/jacoco/org.jacoco.agent/0.7.9/org.jacoco.agent-0.7.9-runtime.jar=destfile=/jobs/genie.papyrus/Papyrus-Oxygen-Tests/workspace/source/tests/junit/plugins/uml/validation/org.eclipse.papyrus.uml.validation.tests/target/jacoco.exec,includes=org.eclipse.papyrus.*,excludes=org.eclipse.uml2
13:17:48 [INFO] 
13:17:48 [INFO] --- maven-resources-plugin:2.6:resources (default-resources) @ org.eclipse.papyrus.uml.validation.tests ---
13:17:48 [INFO] Using 'UTF-8' encoding to copy filtered resources.
13:17:48 [INFO] skip non existing resourceDirectory /jobs/genie.papyrus/Papyrus-Oxygen-Tests/workspace/source/tests/junit/plugins/uml/validation/org.eclipse.papyrus.uml.validation.tests/src/main/resources
13:17:48 [INFO] 
13:17:48 [INFO] --- tycho-compiler-plugin:1.0.0:compile (default-compile) @ org.eclipse.papyrus.uml.validation.tests ---
13:17:48 [INFO] Compiling 10 source files to /jobs/genie.papyrus/Papyrus-Oxygen-Tests/workspace/source/tests/junit/plugins/uml/validation/org.eclipse.papyrus.uml.validation.tests/target/classes
13:17:48 [INFO] 
13:17:48 [INFO] --- maven-resources-plugin:2.6:testResources (default-testResources) @ org.eclipse.papyrus.uml.validation.tests ---
13:17:48 [INFO] Using 'UTF-8' encoding to copy filtered resources.
13:17:48 [INFO] skip non existing resourceDirectory /jobs/genie.papyrus/Papyrus-Oxygen-Tests/workspace/source/tests/junit/plugins/uml/validation/org.eclipse.papyrus.uml.validation.tests/src/test/resources
13:17:48 [INFO] 
13:17:48 [INFO] --- target-platform-configuration:1.0.0:target-platform (default-target-platform) @ org.eclipse.papyrus.uml.validation.tests ---
13:17:48 [INFO] 
13:17:48 [INFO] --- tycho-packaging-plugin:1.0.0:package-plugin (default-package-plugin) @ org.eclipse.papyrus.uml.validation.tests ---
13:17:48 [INFO] Building jar: /jobs/genie.papyrus/Papyrus-Oxygen-Tests/workspace/source/tests/junit/plugins/uml/validation/org.eclipse.papyrus.uml.validation.tests/target/org.eclipse.papyrus.uml.validation.tests-1.2.0-SNAPSHOT.jar
13:17:48 [INFO] 
13:17:48 [INFO] --- tycho-p2-plugin:1.0.0:p2-metadata-default (default-p2-metadata-default) @ org.eclipse.papyrus.uml.validation.tests ---
13:17:48 [INFO] 
13:17:48 [INFO] --- tycho-surefire-plugin:1.0.0:test (default-test) @ org.eclipse.papyrus.uml.validation.tests ---
13:17:48 [INFO] Skipping tests
13:17:48 [INFO] 
13:17:48 [INFO] --- jacoco-maven-plugin:0.7.9:report (default-report) @ org.eclipse.papyrus.uml.validation.tests ---
13:17:48 [INFO] Skipping JaCoCo execution due to missing execution data file.
13:17:48 [INFO] 
13:17:48 [INFO] ---< org.eclipse.papyrus.tests:org.eclipse.papyrus.uml.suite.tests >----
13:17:48 [INFO] Building org.eclipse.papyrus.uml.suite.tests 0.0.1-SNAPSHOT    [147/155]
13:17:48 [INFO] ------------------------[ eclipse-test-plugin ]-------------------------
13:17:48 [INFO] 
13:17:48 [INFO] --- maven-clean-plugin:2.6:clean (default-clean) @ org.eclipse.papyrus.uml.suite.tests ---
13:17:48 [INFO] 
13:17:48 [INFO] --- tycho-packaging-plugin:1.0.0:build-qualifier (default-build-qualifier) @ org.eclipse.papyrus.uml.suite.tests ---
13:17:48 [INFO] The project's OSGi version is 0.0.1.201911111728
13:17:48 [INFO] 
13:17:48 [INFO] --- tycho-packaging-plugin:1.0.0:validate-id (default-validate-id) @ org.eclipse.papyrus.uml.suite.tests ---
13:17:48 [INFO] 
13:17:48 [INFO] --- tycho-packaging-plugin:1.0.0:validate-version (default-validate-version) @ org.eclipse.papyrus.uml.suite.tests ---
13:17:48 [INFO] 
13:17:48 [INFO] --- jacoco-maven-plugin:0.7.9:prepare-agent (default-prepare-agent) @ org.eclipse.papyrus.uml.suite.tests ---
13:17:48 [INFO] tycho.testArgLine set to -javaagent:/home/hudson/genie.papyrus/.jenkins/jobs/Papyrus-Oxygen-Tests/workspace/.repository/org/jacoco/org.jacoco.agent/0.7.9/org.jacoco.agent-0.7.9-runtime.jar=destfile=/jobs/genie.papyrus/Papyrus-Oxygen-Tests/workspace/source/tests/junit/plugins/uml/org.eclipse.papyrus.uml.suite.tests/target/jacoco.exec,includes=org.eclipse.papyrus.*,excludes=org.eclipse.uml2
13:17:48 [INFO] 
13:17:48 [INFO] --- maven-resources-plugin:2.6:resources (default-resources) @ org.eclipse.papyrus.uml.suite.tests ---
13:17:48 [INFO] Using 'UTF-8' encoding to copy filtered resources.
13:17:48 [INFO] skip non existing resourceDirectory /jobs/genie.papyrus/Papyrus-Oxygen-Tests/workspace/source/tests/junit/plugins/uml/org.eclipse.papyrus.uml.suite.tests/src/main/resources
13:17:48 [INFO] 
13:17:48 [INFO] --- tycho-compiler-plugin:1.0.0:compile (default-compile) @ org.eclipse.papyrus.uml.suite.tests ---
13:17:48 [INFO] Compiling 2 source files to /jobs/genie.papyrus/Papyrus-Oxygen-Tests/workspace/source/tests/junit/plugins/uml/org.eclipse.papyrus.uml.suite.tests/target/classes
13:17:49 [INFO] 
13:17:49 [INFO] --- maven-resources-plugin:2.6:testResources (default-testResources) @ org.eclipse.papyrus.uml.suite.tests ---
13:17:49 [INFO] Using 'UTF-8' encoding to copy filtered resources.
13:17:49 [INFO] skip non existing resourceDirectory /jobs/genie.papyrus/Papyrus-Oxygen-Tests/workspace/source/tests/junit/plugins/uml/org.eclipse.papyrus.uml.suite.tests/src/test/resources
13:17:49 [INFO] 
13:17:49 [INFO] --- target-platform-configuration:1.0.0:target-platform (default-target-platform) @ org.eclipse.papyrus.uml.suite.tests ---
13:17:49 [INFO] 
13:17:49 [INFO] --- tycho-packaging-plugin:1.0.0:package-plugin (default-package-plugin) @ org.eclipse.papyrus.uml.suite.tests ---
13:17:49 [INFO] Building jar: /jobs/genie.papyrus/Papyrus-Oxygen-Tests/workspace/source/tests/junit/plugins/uml/org.eclipse.papyrus.uml.suite.tests/target/org.eclipse.papyrus.uml.suite.tests-0.0.1-SNAPSHOT.jar
13:17:49 [INFO] 
13:17:49 [INFO] --- tycho-p2-plugin:1.0.0:p2-metadata-default (default-p2-metadata-default) @ org.eclipse.papyrus.uml.suite.tests ---
13:17:49 [INFO] 
13:17:49 [INFO] --- tycho-surefire-plugin:1.0.0:test (default-test) @ org.eclipse.papyrus.uml.suite.tests ---
13:17:50 [INFO] Expected eclipse log file: /jobs/genie.papyrus/Papyrus-Oxygen-Tests/workspace/source/tests/junit/plugins/uml/org.eclipse.papyrus.uml.suite.tests/target/work/data/.metadata/.log
13:17:50 [INFO] Command line:
13:17:50 	[/opt/public/common/java/oracle/jdk1.8.0_192_x64/jre/bin/java, -Dosgi.noShutdown=false, -Dosgi.os=linux, -Dosgi.ws=gtk, -Dosgi.arch=x86_64, -javaagent:/home/hudson/genie.papyrus/.jenkins/jobs/Papyrus-Oxygen-Tests/workspace/.repository/org/jacoco/org.jacoco.agent/0.7.9/org.jacoco.agent-0.7.9-runtime.jar=destfile=/jobs/genie.papyrus/Papyrus-Oxygen-Tests/workspace/source/tests/junit/plugins/uml/org.eclipse.papyrus.uml.suite.tests/target/jacoco.exec,includes=org.eclipse.papyrus.*,excludes=org.eclipse.uml2, -Xms512m, -Xmx2048m, -XX:SoftRefLRUPolicyMSPerMB=100, -Dosgi.clean=true, -jar, /jobs/genie.papyrus/Papyrus-Oxygen-Tests/workspace/.repository/p2/osgi/bundle/org.eclipse.equinox.launcher/1.4.0.v20161219-1356/org.eclipse.equinox.launcher-1.4.0.v20161219-1356.jar, -data, /jobs/genie.papyrus/Papyrus-Oxygen-Tests/workspace/source/tests/junit/plugins/uml/org.eclipse.papyrus.uml.suite.tests/target/work/data, -install, /jobs/genie.papyrus/Papyrus-Oxygen-Tests/workspace/source/tests/junit/plugins/uml/org.eclipse.papyrus.uml.suite.tests/target/work, -configuration, /jobs/genie.papyrus/Papyrus-Oxygen-Tests/workspace/source/tests/junit/plugins/uml/org.eclipse.papyrus.uml.suite.tests/target/work/configuration, -application, org.eclipse.tycho.surefire.osgibooter.uitest, -testproperties, /jobs/genie.papyrus/Papyrus-Oxygen-Tests/workspace/source/tests/junit/plugins/uml/org.eclipse.papyrus.uml.suite.tests/target/surefire.properties, -product, org.eclipse.sdk.ide, -testConfig=CI_TESTS_CONFIG]
13:17:50 Picked up JAVA_TOOL_OPTIONS: -Xmx2G -Djava.io.tmpdir=/tmp/genie.papyrus -DforkCount=1
13:18:01 
13:18:01 -------------------------------------------------------
13:18:01  T E S T S
13:18:01 -------------------------------------------------------
13:18:01 Running org.eclipse.papyrus.uml.suite.tests.AllTests
13:18:14 Warning: NLS unused message: "Select in: messages
13:18:35 Plugin org.eclipse.papyrus.uml.architecture, extension org.eclipse.papyrus.infra.nattable.common.tableReconciler
13:18:35 Error processing extension: org.eclipse.core.internal.registry.ConfigurationElementHandle@408a
13:21:00 log4j:WARN No appenders could be found for logger (org.eclipse.ocl.pivot.internal.resource.StandaloneProjectMap).
13:21:00 log4j:WARN Please initialize the log4j system properly.
13:21:59 Tests run: 576, Failures: 1, Errors: 0, Skipped: 38, Time elapsed: 238.05 sec <<< FAILURE! - in org.eclipse.papyrus.uml.suite.tests.AllTests
13:21:59 testUML(org.eclipse.papyrus.uml.service.types.tests.creation.CreatePureUMLElementTest)  Time elapsed: 0.052 sec
13:21:59 test(org.eclipse.papyrus.uml.service.types.tests.creation.CreatePureUMLElementTest)  Time elapsed: 0.14 sec
13:21:59 testDeleteOneAddVariableValueAction(org.eclipse.papyrus.uml.service.types.tests.deletion.DeletePureUMLElementTest)  Time elapsed: 0.05 sec
13:21:59 testDeleteOneCentralBufferNode(org.eclipse.papyrus.uml.service.types.tests.deletion.DeletePureUMLElementTest)  Time elapsed: 0.007 sec
13:21:59 stereotypeApplicationsDeleted:command(org.eclipse.papyrus.uml.service.types.tests.deletion.DeleteDependentWithStereotypeApplications458685)  Time elapsed: 1.802 sec
13:21:59 stereotypeApplicationsDeleted:elements(org.eclipse.papyrus.uml.service.types.tests.deletion.DeleteDependentWithStereotypeApplications458685)  Time elapsed: 0 sec
13:21:59 stereotypeApplicationsDeleted:stereotypes(org.eclipse.papyrus.uml.service.types.tests.deletion.DeleteDependentWithStereotypeApplications458685)  Time elapsed: 0 sec
13:21:59 stereotypeApplicationsDeleted:undo(org.eclipse.papyrus.uml.service.types.tests.deletion.DeleteDependentWithStereotypeApplications458685)  Time elapsed: 0 sec
13:21:59 stereotypeApplicationsDeleted:redo(org.eclipse.papyrus.uml.service.types.tests.deletion.DeleteDependentWithStereotypeApplications458685)  Time elapsed: 0 sec
13:21:59 deleteInitialState(org.eclipse.papyrus.uml.service.types.tests.deletion.DeleteTransitionsWithVertexTest)  Time elapsed: 0.553 sec
13:21:59 deleteS1(org.eclipse.papyrus.uml.service.types.tests.deletion.DeleteTransitionsWithVertexTest)  Time elapsed: 0.215 sec
13:21:59 deleteS2(org.eclipse.papyrus.uml.service.types.tests.deletion.DeleteTransitionsWithVertexTest)  Time elapsed: 0.229 sec
13:21:59 deleteFinalState(org.eclipse.papyrus.uml.service.types.tests.deletion.DeleteTransitionsWithVertexTest)  Time elapsed: 0.217 sec
13:21:59 deleteFromContainmentSubset(org.eclipse.papyrus.uml.service.types.tests.deletion.DeleteContainmentSubsetTest)  Time elapsed: 0.151 sec
13:21:59 deleteFromTwoContainmentSupersetsAtOnce(org.eclipse.papyrus.uml.service.types.tests.deletion.DeleteContainmentSubsetTest)  Time elapsed: 0.217 sec
13:21:59 createAssociationWritable(org.eclipse.papyrus.uml.service.types.tests.creation.ConnectorReadOnlyTestBug465899)  Time elapsed: 0.268 sec
13:21:59 createAssociationReadOnly_usecase(org.eclipse.papyrus.uml.service.types.tests.creation.ConnectorReadOnlyTestBug465899)  Time elapsed: 0.329 sec
13:21:59 createAssociationReadOnly(org.eclipse.papyrus.uml.service.types.tests.creation.ConnectorReadOnlyTestBug465899)  Time elapsed: 0.115 sec
13:21:59 createConnectorTargetReadOnly(org.eclipse.papyrus.uml.service.types.tests.creation.ConnectorReadOnlyTestBug465899)  Time elapsed: 0.031 sec
13:21:59 createConnectorSourceReadOnly(org.eclipse.papyrus.uml.service.types.tests.creation.ConnectorReadOnlyTestBug465899)  Time elapsed: 0.033 sec
13:21:59 testDeletion(org.eclipse.papyrus.uml.service.types.tests.deletion.DeleteAssociationPropertyTypeTest)  Time elapsed: 0.028 sec
13:21:59 testDeletionInCompositeDiagram(org.eclipse.papyrus.uml.service.types.tests.deletion.DeleteCommentLinkTest)  Time elapsed: 5.288 sec
13:21:59 testDeletionWithSetRequest(org.eclipse.papyrus.uml.service.types.tests.deletion.DeleteCommentLinkTest) skipped
13:21:59 testDeletionInClassDiagram(org.eclipse.papyrus.uml.service.types.tests.deletion.DeleteCommentLinkTest)  Time elapsed: 1.341 sec
13:21:59 testDeletionInComponentDiagram(org.eclipse.papyrus.uml.service.types.tests.deletion.DeleteCommentLinkTest)  Time elapsed: 1.117 sec
13:21:59 testCreation(org.eclipse.papyrus.uml.service.types.tests.creation.CreateAssociationTest)  Time elapsed: 0.012 sec
13:21:59 testCreation(org.eclipse.papyrus.uml.service.types.tests.creation.CreateAssociationDirectedTest)  Time elapsed: 0.012 sec
13:21:59 testCreation(org.eclipse.papyrus.uml.service.types.tests.creation.CreateAssociationCompositeTest)  Time elapsed: 0.006 sec
13:21:59 testCreation(org.eclipse.papyrus.uml.service.types.tests.creation.CreateAssociationCompositeDirectedTest)  Time elapsed: 0.008 sec
13:21:59 testCreation(org.eclipse.papyrus.uml.service.types.tests.creation.CreateAssociationSharedTest)  Time elapsed: 0.007 sec
13:21:59 testCreation(org.eclipse.papyrus.uml.service.types.tests.creation.CreateAssociationSharedDirectedTest)  Time elapsed: 0.007 sec
13:21:59 deleteInteractionFragmentInOperand(org.eclipse.papyrus.uml.service.types.tests.deletion.InteractionDeletionTest)  Time elapsed: 0.557 sec
13:21:59 deleteAllOperandsOfCombinedFragment(org.eclipse.papyrus.uml.service.types.tests.deletion.InteractionDeletionTest)  Time elapsed: 0.401 sec
13:21:59 deleteCombinedFragment(org.eclipse.papyrus.uml.service.types.tests.deletion.InteractionDeletionTest)  Time elapsed: 0.389 sec
13:21:59 deleteCombinedFragmentNested(org.eclipse.papyrus.uml.service.types.tests.deletion.InteractionDeletionTest)  Time elapsed: 0.366 sec
13:21:59 deleteOperandsOfCombinedFragment(org.eclipse.papyrus.uml.service.types.tests.deletion.InteractionDeletionTest)  Time elapsed: 0.401 sec
13:21:59 deleteCombinedFragmentDeeplyNested(org.eclipse.papyrus.uml.service.types.tests.deletion.InteractionDeletionTest)  Time elapsed: 0.474 sec
13:21:59 deleteInteractionWithNesting(org.eclipse.papyrus.uml.service.types.tests.deletion.InteractionDeletionTest)  Time elapsed: 0.552 sec
13:21:59 deleteInteraction(org.eclipse.papyrus.uml.service.types.tests.deletion.InteractionDeletionTest)  Time elapsed: 0.356 sec
13:21:59 testCreateClassInModel(org.eclipse.papyrus.uml.service.types.ui.tests.creation.CreateElementTest)  Time elapsed: 0.008 sec
13:21:59 testCreateCentralBufferNodeInActivity(org.eclipse.papyrus.uml.service.types.ui.tests.creation.CreateElementTest)  Time elapsed: 0.014 sec
13:21:59 testCreateCentralBufferNodeInActivityWithNode(org.eclipse.papyrus.uml.service.types.ui.tests.creation.CreateElementTest)  Time elapsed: 0.006 sec
13:21:59 testCannotCreateOperationRedefinableTemplateSignature_bug468071(org.eclipse.papyrus.uml.service.types.ui.tests.creation.CreateElementTest)  Time elapsed: 0 sec
13:21:59 testCreateOperationTemplateSignature_bug468071(org.eclipse.papyrus.uml.service.types.ui.tests.creation.CreateElementTest)  Time elapsed: 0.007 sec
13:21:59 testCreateModelInClass(org.eclipse.papyrus.uml.service.types.ui.tests.creation.CreateElementTest)  Time elapsed: 0 sec
13:21:59 testCreateDeploymentBetweenNodeAndArtifactInNode(org.eclipse.papyrus.uml.service.types.ui.tests.creation.CreateRelationshipTest)  Time elapsed: 0.035 sec
13:21:59 testCreatePackageMergeBetweenPackageAndPackageInPackage2(org.eclipse.papyrus.uml.service.types.ui.tests.creation.CreateRelationshipTest)  Time elapsed: 0.013 sec
13:21:59 testCreateTraceBetweenClassAndNullInPackage(org.eclipse.papyrus.uml.service.types.ui.tests.creation.CreateRelationshipTest)  Time elapsed: 0.004 sec
13:21:59 testCreateDependencyBetweenClassesInPackage(org.eclipse.papyrus.uml.service.types.ui.tests.creation.CreateRelationshipTest)  Time elapsed: 0.007 sec
13:21:59 testCreateProtocolConformanceBetweenPackageAndPackageInPackage(org.eclipse.papyrus.uml.service.types.ui.tests.creation.CreateRelationshipTest)  Time elapsed: 0.007 sec
13:21:59 testCreateInformationfloweBetweenClasses2InPackage(org.eclipse.papyrus.uml.service.types.ui.tests.creation.CreateRelationshipTest)  Time elapsed: 0.009 sec
13:21:59 testCreateUsageBetweenClassAndNullInPackage(org.eclipse.papyrus.uml.service.types.ui.tests.creation.CreateRelationshipTest)  Time elapsed: 0.002 sec
13:21:59 testCreateAbstractionBetweenPackageAndClassesInModel(org.eclipse.papyrus.uml.service.types.ui.tests.creation.CreateRelationshipTest)  Time elapsed: 0.011 sec
13:21:59 testCreateComponentRealizationBetweenClassAndComponentInComponent(org.eclipse.papyrus.uml.service.types.ui.tests.creation.CreateRelationshipTest)  Time elapsed: 0.013 sec
13:21:59 testCreateAbstractionBetweenClassesInPackage(org.eclipse.papyrus.uml.service.types.ui.tests.creation.CreateRelationshipTest)  Time elapsed: 0.004 sec
13:21:59 testCreateUsageBetweenClassesInPackage(org.eclipse.papyrus.uml.service.types.ui.tests.creation.CreateRelationshipTest)  Time elapsed: 0.005 sec
13:21:59 testCreatePackageImportBetweenPackageAndPackageInPackage(org.eclipse.papyrus.uml.service.types.ui.tests.creation.CreateRelationshipTest)  Time elapsed: 0.005 sec
13:21:59 testCreateComponentRealizationBetweenComponentAndClassInComponent(org.eclipse.papyrus.uml.service.types.ui.tests.creation.CreateRelationshipTest)  Time elapsed: 0.007 sec
13:21:59 testCreateElementImportBetweenPackageAndPackageInPackage(org.eclipse.papyrus.uml.service.types.ui.tests.creation.CreateRelationshipTest)  Time elapsed: 0.005 sec
13:21:59 testCreateDeploymentBetweenNodeAndArtifactInArtifact(org.eclipse.papyrus.uml.service.types.ui.tests.creation.CreateRelationshipTest)  Time elapsed: 0 sec
13:21:59 testCreateGeneralizationBetweenClassesInPackage(org.eclipse.papyrus.uml.service.types.ui.tests.creation.CreateRelationshipTest)  Time elapsed: 0.003 sec
13:21:59 testCreateGeneralizationBetweenClassAndNullInClass(org.eclipse.papyrus.uml.service.types.ui.tests.creation.CreateRelationshipTest)  Time elapsed: 0.001 sec
13:21:59 testCreateDeploymentBetweenArtifactAndNodeInArtifact(org.eclipse.papyrus.uml.service.types.ui.tests.creation.CreateRelationshipTest)  Time elapsed: 0.008 sec
13:21:59 testCreateExtendBetweenClasses2InPackage(org.eclipse.papyrus.uml.service.types.ui.tests.creation.CreateRelationshipTest)  Time elapsed: 0 sec
13:21:59 testCreateProtocolConformanceBetweenPackageAndPackageInPackage2(org.eclipse.papyrus.uml.service.types.ui.tests.creation.CreateRelationshipTest)  Time elapsed: 0 sec
13:21:59 testCreateTransitionBetweenInitialAndState(org.eclipse.papyrus.uml.service.types.ui.tests.creation.CreateRelationshipTest) skipped
13:21:59 testCreateInformationfloweBetweenUseCases2InUseCase(org.eclipse.papyrus.uml.service.types.ui.tests.creation.CreateRelationshipTest)  Time elapsed: 0.003 sec
13:21:59 testCreateRefineBetweenClassesInPackage(org.eclipse.papyrus.uml.service.types.ui.tests.creation.CreateRelationshipTest)  Time elapsed: 0.022 sec
13:21:59 testCreateComponentRealizationBetweenClassAndComponentInClass(org.eclipse.papyrus.uml.service.types.ui.tests.creation.CreateRelationshipTest)  Time elapsed: 0.005 sec
13:21:59 testCreateRealizationBetweenClassAndNullInPackage(org.eclipse.papyrus.uml.service.types.ui.tests.creation.CreateRelationshipTest)  Time elapsed: 0.002 sec
13:21:59 testCreateExtensionBetweenClassAndNullInNull(org.eclipse.papyrus.uml.service.types.ui.tests.creation.CreateRelationshipTest)  Time elapsed: 0.001 sec
13:21:59 testCreateExtendBetweenUseCases2InUseCase(org.eclipse.papyrus.uml.service.types.ui.tests.creation.CreateRelationshipTest)  Time elapsed: 0.009 sec
13:21:59 testCreateElementImportBetweenPackageAndPackageInPackage2(org.eclipse.papyrus.uml.service.types.ui.tests.creation.CreateRelationshipTest)  Time elapsed: 0.003 sec
13:21:59 testCreateAssociationBetweenClassesInPackage(org.eclipse.papyrus.uml.service.types.ui.tests.creation.CreateRelationshipTest)  Time elapsed: 0.002 sec
13:21:59 testCreateTraceBetweenClassesInClass(org.eclipse.papyrus.uml.service.types.ui.tests.creation.CreateRelationshipTest)  Time elapsed: 0.014 sec
13:21:59 testCreateManifestationBetweenArtifactAndPackage2InArtifact(org.eclipse.papyrus.uml.service.types.ui.tests.creation.CreateRelationshipTest)  Time elapsed: 0.005 sec
13:21:59 testCreateSubstitutionBetweenClassesInPackage(org.eclipse.papyrus.uml.service.types.ui.tests.creation.CreateRelationshipTest)  Time elapsed: 0.006 sec
13:21:59 testCreateAbstractionBetweenClassAndNullInPackage(org.eclipse.papyrus.uml.service.types.ui.tests.creation.CreateRelationshipTest)  Time elapsed: 0.001 sec
13:21:59 testCreateAbstractionBetweenClassAndClassInClass(org.eclipse.papyrus.uml.service.types.ui.tests.creation.CreateRelationshipTest)  Time elapsed: 0.003 sec
13:21:59 testCreatePackageMergeBetweenPackageAndPackageInPackage(org.eclipse.papyrus.uml.service.types.ui.tests.creation.CreateRelationshipTest)  Time elapsed: 0.004 sec
13:21:59 testCreateRealizationBetweenClassesInPackage(org.eclipse.papyrus.uml.service.types.ui.tests.creation.CreateRelationshipTest)  Time elapsed: 0.003 sec
13:21:59 testCreateTransitionBetweenStateAndInitial(org.eclipse.papyrus.uml.service.types.ui.tests.creation.CreateRelationshipTest) skipped
13:21:59 testCreateAssociationBetweenClassAndNullInPackage(org.eclipse.papyrus.uml.service.types.ui.tests.creation.CreateRelationshipTest)  Time elapsed: 0.001 sec
13:21:59 testCreateRefineBetweenClassAndNullInPackage(org.eclipse.papyrus.uml.service.types.ui.tests.creation.CreateRelationshipTest)  Time elapsed: 0.002 sec
13:21:59 testCreateDeploymentBetweenArtifactAndNodeInNode(org.eclipse.papyrus.uml.service.types.ui.tests.creation.CreateRelationshipTest)  Time elapsed: 0.004 sec
13:21:59 testCreateIncludeBetweenUseCases2InUseCase(org.eclipse.papyrus.uml.service.types.ui.tests.creation.CreateRelationshipTest)  Time elapsed: 0.004 sec
13:21:59 testCreateGeneralizationBetweenClassesInClass(org.eclipse.papyrus.uml.service.types.ui.tests.creation.CreateRelationshipTest)  Time elapsed: 0.004 sec
13:21:59 testCreateExtensionBetweenClassAndNullInClass(org.eclipse.papyrus.uml.service.types.ui.tests.creation.CreateRelationshipTest)  Time elapsed: 0 sec
13:21:59 testCreateDependencyBetweenClassAndNullInPackage(org.eclipse.papyrus.uml.service.types.ui.tests.creation.CreateRelationshipTest)  Time elapsed: 0.001 sec
13:21:59 testCreatePackageImportBetweenPackageAndPackageInPackage2(org.eclipse.papyrus.uml.service.types.ui.tests.creation.CreateRelationshipTest)  Time elapsed: 0.002 sec
13:21:59 testCreateComponentRealizationBetweenComponentAndClass(org.eclipse.papyrus.uml.service.types.ui.tests.creation.CreateRelationshipTest)  Time elapsed: 0.001 sec
13:21:59 testCreateSubstitutionBetweenClassAndNullInPackage(org.eclipse.papyrus.uml.service.types.ui.tests.creation.CreateRelationshipTest)  Time elapsed: 0.001 sec
13:21:59 testCreateInterfaceRealizationBetweenClassAndInterfaceInClass(org.eclipse.papyrus.uml.service.types.ui.tests.creation.CreateRelationshipTest)  Time elapsed: 0.005 sec
13:21:59 testCreateTraceBetweenClassesInPackage(org.eclipse.papyrus.uml.service.types.ui.tests.creation.CreateRelationshipTest)  Time elapsed: 0.007 sec
13:21:59 testCreateTransitionBetweenStateAndFinal(org.eclipse.papyrus.uml.service.types.ui.tests.creation.CreateRelationshipTest) skipped
13:21:59 testCreateAbstractionBetweenClassAndPackageInModel(org.eclipse.papyrus.uml.service.types.ui.tests.creation.CreateRelationshipTest)  Time elapsed: 0.004 sec
13:21:59 testCreateRefineBetweenClassesInClass(org.eclipse.papyrus.uml.service.types.ui.tests.creation.CreateRelationshipTest)  Time elapsed: 0.009 sec
13:21:59 testCreateTransitionBetweenFinalAndState(org.eclipse.papyrus.uml.service.types.ui.tests.creation.CreateRelationshipTest) skipped
13:21:59 testCreateManifestationBetweenClassAndPackage2InArtifact(org.eclipse.papyrus.uml.service.types.ui.tests.creation.CreateRelationshipTest)  Time elapsed: 0.003 sec
13:21:59 testCreateInterfaceRealizationBetweenUseCases2InUseCase(org.eclipse.papyrus.uml.service.types.ui.tests.creation.CreateRelationshipTest)  Time elapsed: 0.001 sec
13:21:59 testCreateIncludeBetweenClasses2InPackage(org.eclipse.papyrus.uml.service.types.ui.tests.creation.CreateRelationshipTest)  Time elapsed: 0 sec
13:21:59 testCreateExtensionBetweenStereotypeAndMetaClassInPackage(org.eclipse.papyrus.uml.service.types.ui.tests.creation.CreateProfileRelationshipTest)  Time elapsed: 0.013 sec
13:21:59 testMoveTemplateSignatureToOperation_bug468071(org.eclipse.papyrus.uml.service.types.ui.tests.creation.MoveElementTest)  Time elapsed: 0.032 sec
13:21:59 testMoveRedefinableTemplateSignatureToClass_bug468071(org.eclipse.papyrus.uml.service.types.ui.tests.creation.MoveElementTest)  Time elapsed: 0.002 sec
13:21:59 testCannotMoveRedefinableTemplateSignatureToOperation_bug468071(org.eclipse.papyrus.uml.service.types.ui.tests.creation.MoveElementTest)  Time elapsed: 0 sec
13:21:59 testSetTemplateSignatureOfOperation_bug468071(org.eclipse.papyrus.uml.service.types.ui.tests.creation.SetFeatureTest)  Time elapsed: 0.004 sec
13:21:59 testSetRedefinableTemplateSignatureOfClass_bug468071(org.eclipse.papyrus.uml.service.types.ui.tests.creation.SetFeatureTest)  Time elapsed: 0.001 sec
13:21:59 testCannotSetRedefinableTemplateSignatureOfOperation_bug468071(org.eclipse.papyrus.uml.service.types.ui.tests.creation.SetFeatureTest)  Time elapsed: 0 sec
13:21:59 deleteAssociation(org.eclipse.papyrus.uml.service.types.ui.tests.deletion.DeleteAssociationTest)  Time elapsed: 0.195 sec
13:21:59 deleteAssociationTarget(org.eclipse.papyrus.uml.service.types.ui.tests.deletion.DeleteAssociationTest)  Time elapsed: 0.189 sec
13:21:59 deleteReadOnlyElement(org.eclipse.papyrus.uml.modelexplorer.tests.DeleteModelExplorerTest)  Time elapsed: 1.5 sec
13:21:59 deleteClassInTheModel(org.eclipse.papyrus.uml.modelexplorer.tests.DeleteModelExplorerTest)  Time elapsed: 1.061 sec
13:21:59 deleteRootOfTheModel(org.eclipse.papyrus.uml.modelexplorer.tests.DeleteModelExplorerTest)  Time elapsed: 0.752 sec
13:21:59 renameUMLUnnamedElementTest(org.eclipse.papyrus.uml.modelexplorer.tests.RenameHandlerTest) skipped
13:21:59 renameUMLNamedElementTest(org.eclipse.papyrus.uml.modelexplorer.tests.RenameHandlerTest) skipped
13:21:59 revealSemanticElement_selectRootTest(org.eclipse.papyrus.uml.modelexplorer.tests.ModelExplorerViewTests)  Time elapsed: 1.095 sec
13:21:59 revealSemanticElement_selectChildrenTest(org.eclipse.papyrus.uml.modelexplorer.tests.ModelExplorerViewTests)  Time elapsed: 1.292 sec
13:21:59 revealSemanticElement_selectImportedPackage(org.eclipse.papyrus.uml.modelexplorer.tests.ModelExplorerViewTests)  Time elapsed: 1.274 sec
13:21:59 revealSemanticElement_selectImportedPackageList(org.eclipse.papyrus.uml.modelexplorer.tests.ModelExplorerViewTests)  Time elapsed: 1.349 sec
13:21:59 revealSemanticElement_selectChildrenTestList(org.eclipse.papyrus.uml.modelexplorer.tests.ModelExplorerViewTests)  Time elapsed: 1.181 sec
13:21:59 cutReadOnlyElement(org.eclipse.papyrus.uml.modelexplorer.tests.paste.CutPasteModelExplorerTest)  Time elapsed: 0.794 sec
13:21:59 cutClassTest(org.eclipse.papyrus.uml.modelexplorer.tests.paste.CutPasteModelExplorerTest)  Time elapsed: 0.846 sec
13:21:59 cutRootOfTheModel(org.eclipse.papyrus.uml.modelexplorer.tests.paste.CutPasteModelExplorerTest)  Time elapsed: 0.818 sec
13:21:59 copyPasteofClass1Test(org.eclipse.papyrus.uml.modelexplorer.tests.paste.CopyPasteModelExplorerTest)  Time elapsed: 0.766 sec
13:21:59 pasteOnReadOnlyElement(org.eclipse.papyrus.uml.modelexplorer.tests.paste.CopyPasteModelExplorerTest)  Time elapsed: 0.877 sec
13:21:59 copyPasteofClass1And2Test(org.eclipse.papyrus.uml.modelexplorer.tests.paste.CopyPasteModelExplorerTest)  Time elapsed: 0.747 sec
13:21:59 copyPasteDiagramTest(org.eclipse.papyrus.uml.modelexplorer.tests.paste.DiagramCopyPasteModelExplorerTest)  Time elapsed: 0.858 sec
13:21:59 copyPasteTableTest(org.eclipse.papyrus.uml.modelexplorer.tests.paste.TableCopyPasteModelExplorerTest)  Time elapsed: 0.778 sec  <<< FAILURE!
13:21:59 java.lang.AssertionError: TableOfViews0 TreeElement is null
13:21:59 	at org.junit.Assert.fail(Assert.java:88)
13:21:59 	at org.junit.Assert.assertTrue(Assert.java:41)
13:21:59 	at org.junit.Assert.assertNotNull(Assert.java:712)
13:21:59 	at org.eclipse.papyrus.uml.modelexplorer.tests.paste.TableCopyPasteModelExplorerTest.copyPasteTableTest(TableCopyPasteModelExplorerTest.java:119)
13:21:59 
13:21:59 copyPasteofClass1Test(org.eclipse.papyrus.uml.modelexplorer.tests.paste.StereotypeCopyPasteModelExplorerTest)  Time elapsed: 0.972 sec
13:21:59 advancedModeDoesNotCollapseItself(org.eclipse.papyrus.uml.modelexplorer.tests.AdvancedModeTest)  Time elapsed: 1.686 sec
13:21:59 dropInterface(org.eclipse.papyrus.uml.diagram.dnd.tests.tests.InstanceSpecificationTest)  Time elapsed: 0.094 sec
13:21:59 dropClass(org.eclipse.papyrus.uml.diagram.dnd.tests.tests.InstanceSpecificationTest)  Time elapsed: 0.019 sec
13:21:59 testPropertyContentProvider(org.eclipse.papyrus.uml.diagram.dnd.tests.tests.InstanceSpecificationTest)  Time elapsed: 0.003 sec
13:21:59 dropClassAndInterface(org.eclipse.papyrus.uml.diagram.dnd.tests.tests.InstanceSpecificationTest)  Time elapsed: 0.029 sec
13:21:59 dropClassAndSuperclass(org.eclipse.papyrus.uml.diagram.dnd.tests.tests.InstanceSpecificationTest)  Time elapsed: 0.029 sec
13:21:59 singleValuePropertyGraphicalTest(org.eclipse.papyrus.uml.tools.tests.tests.ContentProviderTest)  Time elapsed: 0.063 sec
13:21:59 singleValuePropertyTest(org.eclipse.papyrus.uml.tools.tests.tests.ContentProviderTest)  Time elapsed: 0.014 sec
13:21:59 multipleValuePropertyTest(org.eclipse.papyrus.uml.tools.tests.tests.ContentProviderTest) skipped
13:21:59 enumPropertyTest(org.eclipse.papyrus.uml.tools.tests.tests.ContentProviderTest)  Time elapsed: 0.007 sec
13:21:59 testProfileContentWithBaseClassPropertyWithoutInheritedProperties(org.eclipse.papyrus.uml.tools.tests.tests.UMLStereotypePropertyContentProviderTest)  Time elapsed: 0.194 sec
13:21:59 testProfileContentWithoutBaseClassPropertyWithoutInheritedProperties(org.eclipse.papyrus.uml.tools.tests.tests.UMLStereotypePropertyContentProviderTest)  Time elapsed: 0.142 sec
13:21:59 testProfileContentWithBaseClassPropertyWithInheritedProperties(org.eclipse.papyrus.uml.tools.tests.tests.UMLStereotypePropertyContentProviderTest)  Time elapsed: 0.138 sec
13:21:59 testProfileContentWithoutBaseClassPropertyWithInheritedProperties(org.eclipse.papyrus.uml.tools.tests.tests.UMLStereotypePropertyContentProviderTest)  Time elapsed: 0.221 sec
13:21:59 testSwitchToProxy(org.eclipse.papyrus.uml.tools.tests.tests.DependencyManagementTest) skipped
13:21:59 testSwitchProfilesWithStereotypes(org.eclipse.papyrus.uml.tools.tests.tests.DependencyManagementTest)  Time elapsed: 1.393 sec
13:21:59 testSwitchFromRegistererdToLocal(org.eclipse.papyrus.uml.tools.tests.tests.DependencyManagementTest)  Time elapsed: 1.328 sec
13:21:59 testSwitchProfilesWithStereotypeProperties(org.eclipse.papyrus.uml.tools.tests.tests.DependencyManagementTest)  Time elapsed: 1.268 sec
13:21:59 testSwitchProfilesWithMissingDefinitions(org.eclipse.papyrus.uml.tools.tests.tests.DependencyManagementTest)  Time elapsed: 1.113 sec
13:21:59 testSwitchFromLocalToRegistered(org.eclipse.papyrus.uml.tools.tests.tests.DependencyManagementTest)  Time elapsed: 1.321 sec
13:21:59 testSwitchToDifferentVersion(org.eclipse.papyrus.uml.tools.tests.tests.DependencyManagementTest) skipped
13:21:59 testSimpleSwitch(org.eclipse.papyrus.uml.tools.tests.tests.DependencyManagementTest)  Time elapsed: 1.17 sec
13:21:59 testSwitchFromProxy(org.eclipse.papyrus.uml.tools.tests.tests.DependencyManagementTest) skipped
13:21:59 testSwitchProfilesStereotypeIdentities(org.eclipse.papyrus.uml.tools.tests.tests.DependencyManagementTest)  Time elapsed: 1.484 sec
13:21:59 testSwitchProfilesWithRequiredStereotypes(org.eclipse.papyrus.uml.tools.tests.tests.DependencyManagementTest)  Time elapsed: 1.306 sec
13:21:59 testOverloadDoesNotClash(org.eclipse.papyrus.uml.tools.tests.tests.NamedElementValidatorTest)  Time elapsed: 0.035 sec
13:21:59 testNameClash(org.eclipse.papyrus.uml.tools.tests.tests.NamedElementValidatorTest)  Time elapsed: 0.029 sec
13:21:59 testElementOfDifferentKindDoesNotClash(org.eclipse.papyrus.uml.tools.tests.tests.NamedElementValidatorTest)  Time elapsed: 0.032 sec
13:21:59 testModifiedSysMLStereotype(org.eclipse.papyrus.uml.tools.tests.tests.StereotypeElementListenerTest) skipped
13:21:59 testUndoUnapplyProfile(org.eclipse.papyrus.uml.tools.tests.tests.StereotypeElementListenerTest)  Time elapsed: 0.296 sec
13:21:59 testAddStereotype(org.eclipse.papyrus.uml.tools.tests.tests.StereotypeElementListenerTest)  Time elapsed: 0.265 sec
13:21:59 testStereotypeUnsetAttributeChange(org.eclipse.papyrus.uml.tools.tests.tests.StereotypeElementListenerTest)  Time elapsed: 0.298 sec
13:21:59 testUndoAddStereotype(org.eclipse.papyrus.uml.tools.tests.tests.StereotypeElementListenerTest)  Time elapsed: 0.375 sec
13:21:59 testAddStereotypes(org.eclipse.papyrus.uml.tools.tests.tests.StereotypeElementListenerTest)  Time elapsed: 0.427 sec
13:21:59 testUndoRemoveStereotype(org.eclipse.papyrus.uml.tools.tests.tests.StereotypeElementListenerTest)  Time elapsed: 0.451 sec
13:21:59 testAddSysMLStereotype(org.eclipse.papyrus.uml.tools.tests.tests.StereotypeElementListenerTest)  Time elapsed: 0.366 sec
13:21:59 testModifiedStereotype(org.eclipse.papyrus.uml.tools.tests.tests.StereotypeElementListenerTest)  Time elapsed: 0.426 sec
13:21:59 testAddStereotypeOnSeveralElements(org.eclipse.papyrus.uml.tools.tests.tests.StereotypeElementListenerTest)  Time elapsed: 0.482 sec
13:21:59 testUndoAddStereotypes(org.eclipse.papyrus.uml.tools.tests.tests.StereotypeElementListenerTest)  Time elapsed: 0.275 sec
13:21:59 testFakeBasedProperty(org.eclipse.papyrus.uml.tools.tests.tests.StereotypeElementListenerTest)  Time elapsed: 0.277 sec
13:21:59 testRemoveStereotype(org.eclipse.papyrus.uml.tools.tests.tests.StereotypeElementListenerTest)  Time elapsed: 0.388 sec
13:21:59 testRemoveSysMLStereotype(org.eclipse.papyrus.uml.tools.tests.tests.StereotypeElementListenerTest)  Time elapsed: 0.257 sec
13:21:59 testUndoAddSysMLStereotype(org.eclipse.papyrus.uml.tools.tests.tests.StereotypeElementListenerTest)  Time elapsed: 0.269 sec
13:21:59 testUndoModifiedStereotype(org.eclipse.papyrus.uml.tools.tests.tests.StereotypeElementListenerTest)  Time elapsed: 0.347 sec
13:21:59 testUndoAddStereotypeOnSeveralElements(org.eclipse.papyrus.uml.tools.tests.tests.StereotypeElementListenerTest)  Time elapsed: 0.293 sec
13:21:59 testUndoRedoAddStereotypeTiming(org.eclipse.papyrus.uml.tools.tests.tests.StereotypeElementListenerTest)  Time elapsed: 0.408 sec
13:21:59 testUnapplyProfile(org.eclipse.papyrus.uml.tools.tests.tests.StereotypeElementListenerTest)  Time elapsed: 0.363 sec
13:21:59 testUndoRemoveSysMLStereotype(org.eclipse.papyrus.uml.tools.tests.tests.StereotypeElementListenerTest)  Time elapsed: 0.389 sec
13:21:59 testUndoModifiedSysMLStereotype(org.eclipse.papyrus.uml.tools.tests.tests.StereotypeElementListenerTest) skipped
13:21:59 testStereotypeListAttributeChange(org.eclipse.papyrus.uml.tools.tests.tests.StereotypeElementListenerTest)  Time elapsed: 0.303 sec
13:21:59 twoProfilesUnapplied(org.eclipse.papyrus.uml.tools.tests.tests.ProfileApplicationListenerTest)  Time elapsed: 0.088 sec
13:21:59 moveProfileApplication(org.eclipse.papyrus.uml.tools.tests.tests.ProfileApplicationListenerTest)  Time elapsed: 0.098 sec
13:21:59 applyProfileThenMoveApplication(org.eclipse.papyrus.uml.tools.tests.tests.ProfileApplicationListenerTest)  Time elapsed: 0.1 sec
13:21:59 twoProfilesApplied(org.eclipse.papyrus.uml.tools.tests.tests.ProfileApplicationListenerTest)  Time elapsed: 0.1 sec
13:21:59 profileReplacedInAnApplication(org.eclipse.papyrus.uml.tools.tests.tests.ProfileApplicationListenerTest)  Time elapsed: 0.158 sec
13:21:59 simpleNewProfileApplication(org.eclipse.papyrus.uml.tools.tests.tests.ProfileApplicationListenerTest)  Time elapsed: 0.116 sec
13:21:59 simpleProfileUnapplication(org.eclipse.papyrus.uml.tools.tests.tests.ProfileApplicationListenerTest)  Time elapsed: 0.142 sec
13:21:59 profileAppliedThenReplacedInSameApplication(org.eclipse.papyrus.uml.tools.tests.tests.ProfileApplicationListenerTest)  Time elapsed: 0.107 sec
13:21:59 testEditToDisplaySingleString_1(org.eclipse.papyrus.uml.tools.tests.tests.UMLReferenceConverterTest)  Time elapsed: 0.043 sec
13:21:59 testList(org.eclipse.papyrus.uml.tools.tests.tests.UMLReferenceConverterTest)  Time elapsed: 0.049 sec
13:21:59 testNull(org.eclipse.papyrus.uml.tools.tests.tests.UMLReferenceConverterTest)  Time elapsed: 0.042 sec
13:21:59 testDisplayToEditString_1(org.eclipse.papyrus.uml.tools.tests.tests.UMLReferenceConverterTest)  Time elapsed: 0.048 sec
13:21:59 testEmptyString(org.eclipse.papyrus.uml.tools.tests.tests.UMLReferenceConverterTest)  Time elapsed: 0.047 sec
13:21:59 testClass2(org.eclipse.papyrus.uml.tools.tests.tests.UMLReferenceConverterTest)  Time elapsed: 0.03 sec
13:21:59 testClass3(org.eclipse.papyrus.uml.tools.tests.tests.UMLReferenceConverterTest)  Time elapsed: 0.02 sec
13:21:59 testMatchingElementstSingleValue1(org.eclipse.papyrus.uml.tools.tests.tests.UMLReferenceConverterTest)  Time elapsed: 0.024 sec
13:21:59 testMatchingElementstSingleValue2(org.eclipse.papyrus.uml.tools.tests.tests.UMLReferenceConverterTest)  Time elapsed: 0.025 sec
13:21:59 testCompletionToFindClass_1(org.eclipse.papyrus.uml.tools.tests.tests.UMLReferenceConverterCompletionTest)  Time elapsed: 0.118 sec
13:21:59 testCompletionToFindClass_3(org.eclipse.papyrus.uml.tools.tests.tests.UMLReferenceConverterCompletionTest)  Time elapsed: 0.039 sec
13:21:59 testCompletionToFindClass_4(org.eclipse.papyrus.uml.tools.tests.tests.UMLReferenceConverterCompletionTest)  Time elapsed: 0.023 sec
13:21:59 testCompletionToFindClass_5(org.eclipse.papyrus.uml.tools.tests.tests.UMLReferenceConverterCompletionTest)  Time elapsed: 0.025 sec
13:21:59 testCompletionToFindClass_6(org.eclipse.papyrus.uml.tools.tests.tests.UMLReferenceConverterCompletionTest)  Time elapsed: 0.027 sec
13:21:59 testCompletionToFindClass_7(org.eclipse.papyrus.uml.tools.tests.tests.UMLReferenceConverterCompletionTest)  Time elapsed: 0.028 sec
13:21:59 testCompletionToFindClass_8(org.eclipse.papyrus.uml.tools.tests.tests.UMLReferenceConverterCompletionTest)  Time elapsed: 0.028 sec
13:21:59 testSplitString_1(org.eclipse.papyrus.uml.tools.tests.tests.UMLReferenceConverterCompletionTest)  Time elapsed: 0.027 sec
13:21:59 testSplitString_2(org.eclipse.papyrus.uml.tools.tests.tests.UMLReferenceConverterCompletionTest)  Time elapsed: 0.029 sec
13:21:59 testCompletionToFindConstraint_1(org.eclipse.papyrus.uml.tools.tests.tests.UMLReferenceConverterCompletionTest)  Time elapsed: 0.031 sec
13:21:59 testCompletionToFindConstraint_2(org.eclipse.papyrus.uml.tools.tests.tests.UMLReferenceConverterCompletionTest)  Time elapsed: 0.025 sec
13:21:59 testCompletionMultiValueConverterEmptyString(org.eclipse.papyrus.uml.tools.tests.tests.UMLReferenceConverterCompletionTest)  Time elapsed: 0.029 sec
13:21:59 testCompletionToFindPackage_1(org.eclipse.papyrus.uml.tools.tests.tests.UMLReferenceConverterCompletionTest)  Time elapsed: 0.026 sec
13:21:59 testCompletionToFindPackage_2(org.eclipse.papyrus.uml.tools.tests.tests.UMLReferenceConverterCompletionTest)  Time elapsed: 0.033 sec
13:21:59 testCompletionSingleValueConverterEmptyString(org.eclipse.papyrus.uml.tools.tests.tests.UMLReferenceConverterCompletionTest)  Time elapsed: 0.029 sec
13:21:59 profileLanguage(org.eclipse.papyrus.uml.tools.tests.tests.UMLLanguageProvidersTest)  Time elapsed: 0.003 sec
13:21:59 umlLanguage(org.eclipse.papyrus.uml.tools.tests.tests.UMLLanguageProvidersTest)  Time elapsed: 0.001 sec
13:21:59 ValidationStereotypesListClass1Test(org.eclipse.papyrus.uml.tools.tests.tests.IconsStereotypesTest)  Time elapsed: 1.021 sec
13:21:59 ValidationStereotypesListClass2Test(org.eclipse.papyrus.uml.tools.tests.tests.IconsStereotypesTest)  Time elapsed: 0.978 sec
13:21:59 ValidationStereotypesListClass3Test(org.eclipse.papyrus.uml.tools.tests.tests.IconsStereotypesTest)  Time elapsed: 0.998 sec
13:21:59 ValidationStereotypesListClass4Test(org.eclipse.papyrus.uml.tools.tests.tests.IconsStereotypesTest)  Time elapsed: 1.282 sec
13:21:59 ValidationImageClass1Test(org.eclipse.papyrus.uml.tools.tests.tests.IconsStereotypesTest)  Time elapsed: 1.088 sec
13:21:59 ValidationImageClass2Test(org.eclipse.papyrus.uml.tools.tests.tests.IconsStereotypesTest)  Time elapsed: 1.061 sec
13:21:59 ValidationImageClass3Test(org.eclipse.papyrus.uml.tools.tests.tests.IconsStereotypesTest)  Time elapsed: 1.244 sec
13:21:59 ValidationImageClass4Test(org.eclipse.papyrus.uml.tools.tests.tests.IconsStereotypesTest)  Time elapsed: 1.174 sec
13:21:59 returnedTextTest(org.eclipse.papyrus.uml.tools.tests.tests.CustomizableDelegatingItemLabelProviderTest)  Time elapsed: 1.059 sec
13:21:59 returnedStyledTextTest(org.eclipse.papyrus.uml.tools.tests.tests.CustomizableDelegatingItemLabelProviderTest)  Time elapsed: 1.001 sec
13:21:59 notifyChange(org.eclipse.papyrus.uml.tools.tests.tests.DelegatingItemLabelProviderTest)  Time elapsed: 0.142 sec
13:21:59 copyingInterfaceRealizationDoesNotCorruptTheModel(org.eclipse.papyrus.uml.tools.tests.tests.UMLCopyTest)  Time elapsed: 0.006 sec
13:21:59 recursiveImportPackage(org.eclipse.papyrus.uml.tools.utils.tests.tests.NameResolutionHelperTest)  Time elapsed: 0.048 sec
13:21:59 testIsAutoNamed(org.eclipse.papyrus.uml.tools.utils.tests.tests.NamedElementUtilTest)  Time elapsed: 0.022 sec
13:21:59 testGetDefaultNameWithIncrement(org.eclipse.papyrus.uml.tools.utils.tests.tests.NamedElementUtilTest)  Time elapsed: 0.002 sec
13:21:59 testAutoNameIncrement(org.eclipse.papyrus.uml.tools.utils.tests.tests.NamedElementUtilTest)  Time elapsed: 0.001 sec
13:21:59 testExistingElementHavingNameNotRenamed(org.eclipse.papyrus.uml.tools.utils.tests.tests.NamedElementUtilTest)  Time elapsed: 0 sec
13:21:59 testGetAppliedSuperstereotype(org.eclipse.papyrus.uml.tools.utils.tests.tests.UMLUtilTest)  Time elapsed: 0.089 sec
13:21:59 testGetApplicableStereotype_notStrict_notApplicable(org.eclipse.papyrus.uml.tools.utils.tests.tests.UMLUtilTest)  Time elapsed: 0.226 sec
13:21:59 testGetApplicableStereotype_notStrict_applicable(org.eclipse.papyrus.uml.tools.utils.tests.tests.UMLUtilTest)  Time elapsed: 0.251 sec
13:21:59 testGetApplicableStereotype_strict_applicable(org.eclipse.papyrus.uml.tools.utils.tests.tests.UMLUtilTest)  Time elapsed: 0.315 sec
13:21:59 testGetAppliedSubstereotype_notApplied(org.eclipse.papyrus.uml.tools.utils.tests.tests.UMLUtilTest)  Time elapsed: 0.066 sec
13:21:59 testGetApplicableStereotype_strict_notApplicable(org.eclipse.papyrus.uml.tools.utils.tests.tests.UMLUtilTest)  Time elapsed: 0.208 sec
13:21:59 testGetAppliedSubstereotype_applied(org.eclipse.papyrus.uml.tools.utils.tests.tests.UMLUtilTest)  Time elapsed: 0.067 sec
13:21:59 testUnApplyStereotypeApplication(org.eclipse.papyrus.uml.diagram.stereotypeproperty.TestBadUnapplyProfile2ClosedDiagComment)  Time elapsed: 1.541 sec
13:21:59 testStereotypeApplicationOnClass(org.eclipse.papyrus.uml.diagram.stereotypeproperty.TestDropStereotypedClass)  Time elapsed: 0.677 sec
13:21:59 testProfileApplicationOnModel(org.eclipse.papyrus.uml.diagram.stereotypeproperty.TestProfileApplication)  Time elapsed: 0.45 sec
13:21:59 testBrace(org.eclipse.papyrus.uml.diagram.stereotypeproperty.tests.asbrace.TestDisplayAsBrace)  Time elapsed: 0.972 sec
13:21:59 testReopenStereotypeAsComment(org.eclipse.papyrus.uml.diagram.stereotypeproperty.tests.asbrace.TestReopenAsBrace)  Time elapsed: 1.828 sec
13:21:59 testStereotypeApplicationOnClass(org.eclipse.papyrus.uml.diagram.stereotypeproperty.tests.ascomment.TestDisplayAsComment)  Time elapsed: 0.604 sec
13:21:59 testReopenStereotypeAsComment(org.eclipse.papyrus.uml.diagram.stereotypeproperty.tests.ascomment.TestReopenAsComment)  Time elapsed: 1.97 sec
13:21:59 testStereotypeApplicationOnClass(org.eclipse.papyrus.uml.diagram.stereotypeproperty.tests.ascompartment.TestDisplayAsCompartment)  Time elapsed: 1.018 sec
13:21:59 testReopenStereotypeAsComment(org.eclipse.papyrus.uml.diagram.stereotypeproperty.tests.ascompartment.TestReopenAsCompartment)  Time elapsed: 1.978 sec
13:21:59 test2StereotypeApplicationsOnClass(org.eclipse.papyrus.uml.diagram.stereotypeproperty.tests.displayname.Test2StereotypeApplications)  Time elapsed: 0.539 sec
13:21:59 testStereotypeApplicationOnPackage(org.eclipse.papyrus.uml.diagram.stereotypeproperty.tests.displayname.TestStereotypeApplication)  Time elapsed: 0.749 sec
13:21:59 testStereotypeApplicationOnClass(org.eclipse.papyrus.uml.diagram.stereotypeproperty.tests.displayname.TestStereotypeApplication)  Time elapsed: 0.067 sec
13:21:59 testQNStereotypeApplicationOnClass(org.eclipse.papyrus.uml.diagram.stereotypeproperty.tests.displayname.TestStereotypeApplicationQualifiedName)  Time elapsed: 0.633 sec
13:21:59 testLayoutStereotypeApplicationOnClass(org.eclipse.papyrus.uml.diagram.stereotypeproperty.tests.layout.TestLayoutWithStereotype) skipped
13:21:59 testLayoutOnClass(org.eclipse.papyrus.uml.diagram.stereotypeproperty.tests.layout.TestLayoutWithStereotype) skipped
13:21:59 testLayoutStereotypeApplicationOnClass(org.eclipse.papyrus.uml.diagram.stereotypeproperty.tests.layout.TestLayoutWithStereotypeOnEclipseHIPPInstance) skipped
13:21:59 testLayoutOnClass(org.eclipse.papyrus.uml.diagram.stereotypeproperty.tests.layout.TestLayoutWithStereotypeOnEclipseHIPPInstance) skipped
13:21:59 testDiagramFileExtentionLabel(org.eclipse.papyrus.uml.diagram.wizards.TestCreateModelWizard)  Time elapsed: 0.356 sec
13:21:59 testDiagramFileExtenstionForUML(org.eclipse.papyrus.uml.diagram.wizards.TestCreateModelWizard)  Time elapsed: 0.099 sec
13:21:59 testOrderOfPages(org.eclipse.papyrus.uml.diagram.wizards.TestCreateModelWizard)  Time elapsed: 0.083 sec
13:21:59 testDiagramFileExtentionLabel(org.eclipse.papyrus.uml.diagram.wizards.TestInitModelWizard)  Time elapsed: 0.082 sec
13:21:59 testDiagramFileExtenstionForUML(org.eclipse.papyrus.uml.diagram.wizards.TestInitModelWizard)  Time elapsed: 0.08 sec
13:21:59 testOrderOfPages(org.eclipse.papyrus.uml.diagram.wizards.TestInitModelWizard)  Time elapsed: 0.08 sec
13:21:59 testOrderOfPages(org.eclipse.papyrus.uml.diagram.wizards.TestNewProjectWizard)  Time elapsed: 0.09 sec
13:21:59 testForSimpleModel(org.eclipse.papyrus.uml.diagram.wizards.TestCreateModelFromExistingModelWizard)  Time elapsed: 0.085 sec
13:21:59 testOrderOfPages(org.eclipse.papyrus.uml.diagram.wizards.TestCreateModelFromExistingModelWizard)  Time elapsed: 0.085 sec
13:21:59 testForModelWithDot(org.eclipse.papyrus.uml.diagram.wizards.TestCreateModelFromExistingModelWizard)  Time elapsed: 0.09 sec
13:21:59 missingSchema(org.eclipse.papyrus.uml.modelrepair.internal.stereotypes.StereotypeApplicationRepairSnippetTest)  Time elapsed: 0.313 sec
13:21:59 noCorruptionControlCase(org.eclipse.papyrus.uml.modelrepair.internal.stereotypes.StereotypeApplicationRepairSnippetTest)  Time elapsed: 0.085 sec
13:21:59 wrongProfileVersion(org.eclipse.papyrus.uml.modelrepair.internal.stereotypes.StereotypeApplicationRepairSnippetTest)  Time elapsed: 0.225 sec
13:21:59 missingProfileApplication(org.eclipse.papyrus.uml.modelrepair.internal.stereotypes.StereotypeApplicationRepairSnippetTest)  Time elapsed: 0.225 sec
13:21:59 deleteStereotypes(org.eclipse.papyrus.uml.modelrepair.internal.stereotypes.StereotypeApplicationRepairSnippetTest)  Time elapsed: 0.081 sec
13:21:59 nestedProfileApplicationsMissingNamespace_bug434302(org.eclipse.papyrus.uml.modelrepair.internal.stereotypes.StereotypeRepairRegressionTest)  Time elapsed: 0.392 sec
13:21:59 orphansOfWrongProfileVersion_bug436666(org.eclipse.papyrus.uml.modelrepair.internal.stereotypes.StereotypeRepairRegressionTest)  Time elapsed: 0.058 sec
13:21:59 badSchemaLocationInNonPackageFragment_bug459488(org.eclipse.papyrus.uml.modelrepair.internal.stereotypes.StereotypeRepairRegressionTest)  Time elapsed: 0.673 sec
13:21:59 nestedProfilesAndNestedApplicationsWellFormed_bug434302(org.eclipse.papyrus.uml.modelrepair.internal.stereotypes.StereotypeRepairRegressionTest)  Time elapsed: 0.258 sec
13:21:59 registeredDynamicProfie_bug455329(org.eclipse.papyrus.uml.modelrepair.internal.stereotypes.StereotypeRepairRegressionTest)  Time elapsed: 0.157 sec
13:21:59 nestedPackageSchemaMissing_bug436666(org.eclipse.papyrus.uml.modelrepair.internal.stereotypes.StereotypeRepairRegressionTest)  Time elapsed: 0.399 sec
13:21:59 incorrectZombieGroupingWithoutProfileNamespaceURIPattern_bug496307(org.eclipse.papyrus.uml.modelrepair.internal.stereotypes.StereotypeRepairRegressionTest)  Time elapsed: 0.068 sec
13:21:59 nonStereotypeApplicationsAreOK_bug436666(org.eclipse.papyrus.uml.modelrepair.internal.stereotypes.StereotypeRepairRegressionTest)  Time elapsed: 0.141 sec
13:21:59 nestedProfileApplications2Pkgs1Profile_bug434302(org.eclipse.papyrus.uml.modelrepair.internal.stereotypes.StereotypeRepairRegressionTest)  Time elapsed: 0.25 sec
13:21:59 crossReferencedPackageUnitWithoutOwnProfileApplication_bug458736(org.eclipse.papyrus.uml.modelrepair.internal.stereotypes.StereotypeRepairRegressionTest)  Time elapsed: 0.388 sec
13:21:59 correctZombieGroupingWithProfileNamespaceURIPattern_bug496307(org.eclipse.papyrus.uml.modelrepair.internal.stereotypes.StereotypeRepairRegressionTest)  Time elapsed: 0.033 sec
13:21:59 orphansOfValidSchema_bug436666(org.eclipse.papyrus.uml.modelrepair.internal.stereotypes.StereotypeRepairRegressionTest)  Time elapsed: 0.043 sec
13:21:59 packageUnitWithoutOwnProfileApplication_bug455248(org.eclipse.papyrus.uml.modelrepair.internal.stereotypes.StereotypeRepairRegressionTest)  Time elapsed: 0.142 sec
13:21:59 nestedPackageInProfileIsOK_bug436666(org.eclipse.papyrus.uml.modelrepair.internal.stereotypes.StereotypeRepairRegressionTest)  Time elapsed: 0.36 sec
13:21:59 compareMultiVersionSameURISameVersion(org.eclipse.papyrus.uml.modelrepair.internal.uripattern.ProfileNamespaceURIPatternTest)  Time elapsed: 0 sec
13:21:59 compareMultiVersionDifferentURIDifferentVersion(org.eclipse.papyrus.uml.modelrepair.internal.uripattern.ProfileNamespaceURIPatternTest)  Time elapsed: 0.001 sec
13:21:59 compareSingleVersionDifferentURISameVersion(org.eclipse.papyrus.uml.modelrepair.internal.uripattern.ProfileNamespaceURIPatternTest)  Time elapsed: 0 sec
13:21:59 compareMultiVersionDifferentURISameVersion(org.eclipse.papyrus.uml.modelrepair.internal.uripattern.ProfileNamespaceURIPatternTest)  Time elapsed: 0 sec
13:21:59 compareCorrectInvalidComparisonConstantBehavior(org.eclipse.papyrus.uml.modelrepair.internal.uripattern.ProfileNamespaceURIPatternTest)  Time elapsed: 0 sec
13:21:59 compareNoVersionSameURI(org.eclipse.papyrus.uml.modelrepair.internal.uripattern.ProfileNamespaceURIPatternTest)  Time elapsed: 0 sec
13:21:59 compareSingleVersionDifferentURIDifferentVersion(org.eclipse.papyrus.uml.modelrepair.internal.uripattern.ProfileNamespaceURIPatternTest)  Time elapsed: 0 sec
13:21:59 matchCorrectNoMatchConstantBehavior(org.eclipse.papyrus.uml.modelrepair.internal.uripattern.ProfileNamespaceURIPatternTest)  Time elapsed: 0.001 sec
13:21:59 matchSingleVersionCorrectURIGivenVersion(org.eclipse.papyrus.uml.modelrepair.internal.uripattern.ProfileNamespaceURIPatternTest)  Time elapsed: 0 sec
13:21:59 matchNoVersionCorrectURIDefaultVersion(org.eclipse.papyrus.uml.modelrepair.internal.uripattern.ProfileNamespaceURIPatternTest)  Time elapsed: 0 sec
13:21:59 matchMultipleVersionCorrectURIGivenVersion(org.eclipse.papyrus.uml.modelrepair.internal.uripattern.ProfileNamespaceURIPatternTest)  Time elapsed: 0 sec
13:21:59 matchMultipleVersionCorrectURIDefaultVersion(org.eclipse.papyrus.uml.modelrepair.internal.uripattern.ProfileNamespaceURIPatternTest)  Time elapsed: 0 sec
13:21:59 compareCorrectInvalidComparisonBehaviorWrongLHS(org.eclipse.papyrus.uml.modelrepair.internal.uripattern.ProfileNamespaceURIPatternTest)  Time elapsed: 0 sec
13:21:59 compareCorrectInvalidComparisonBehaviorWrongRHS(org.eclipse.papyrus.uml.modelrepair.internal.uripattern.ProfileNamespaceURIPatternTest)  Time elapsed: 0 sec
13:21:59 registryExtensionPointCorrectMatch(org.eclipse.papyrus.uml.modelrepair.internal.uripattern.ProfileNamespaceURIPatternTest)  Time elapsed: 0.001 sec
13:21:59 compareSingleVersionSameURIDifferentVersion(org.eclipse.papyrus.uml.modelrepair.internal.uripattern.ProfileNamespaceURIPatternTest)  Time elapsed: 0 sec
13:21:59 compareSingleVersionSameURISameVersion(org.eclipse.papyrus.uml.modelrepair.internal.uripattern.ProfileNamespaceURIPatternTest)  Time elapsed: 0 sec
13:21:59 compareMultiVersionSameURIDifferentVersion(org.eclipse.papyrus.uml.modelrepair.internal.uripattern.ProfileNamespaceURIPatternTest)  Time elapsed: 0 sec
13:21:59 registryCorrectUnregisterAndRegister(org.eclipse.papyrus.uml.modelrepair.internal.uripattern.ProfileNamespaceURIPatternTest)  Time elapsed: 0 sec
13:21:59 registryExtensionPointRegistered(org.eclipse.papyrus.uml.modelrepair.internal.uripattern.ProfileNamespaceURIPatternTest)  Time elapsed: 0 sec
13:21:59 compareCorrectInvalidComparisonBehaviorWrongPattern(org.eclipse.papyrus.uml.modelrepair.internal.uripattern.ProfileNamespaceURIPatternTest)  Time elapsed: 0 sec
13:21:59 matchNoVersionCorrectURIGivenVersion(org.eclipse.papyrus.uml.modelrepair.internal.uripattern.ProfileNamespaceURIPatternTest)  Time elapsed: 0 sec
13:21:59 compareNoVersionDifferentURI(org.eclipse.papyrus.uml.modelrepair.internal.uripattern.ProfileNamespaceURIPatternTest)  Time elapsed: 0 sec
13:21:59 matchSingleVersionCorrectURIDefaultVersion(org.eclipse.papyrus.uml.modelrepair.internal.uripattern.ProfileNamespaceURIPatternTest)  Time elapsed: 0 sec
13:21:59 matchCorrectNoMatchBehavior(org.eclipse.papyrus.uml.modelrepair.internal.uripattern.ProfileNamespaceURIPatternTest)  Time elapsed: 0 sec
13:21:59 outOfDateModelSkipMigration_papyrus(org.eclipse.papyrus.uml.profile.service.ReapplyProfilesServiceTest)  Time elapsed: 1.344 sec
13:21:59 upToDateModelDoesNotPromptForMigration_papyrus(org.eclipse.papyrus.uml.profile.service.ReapplyProfilesServiceTest)  Time elapsed: 1.228 sec
13:21:59 outOfDateModelDoMigration_dynamic(org.eclipse.papyrus.uml.profile.service.ReapplyProfilesServiceTest)  Time elapsed: 1.154 sec
13:21:59 outOfDateModelSkipMigration_uml2(org.eclipse.papyrus.uml.profile.service.ReapplyProfilesServiceTest)  Time elapsed: 1.378 sec
13:21:59 outOfDateModelDoMigration_papyrus(org.eclipse.papyrus.uml.profile.service.ReapplyProfilesServiceTest)  Time elapsed: 1.145 sec
13:21:59 outOfDateModelSkipMigration_dynamic(org.eclipse.papyrus.uml.profile.service.ReapplyProfilesServiceTest)  Time elapsed: 1.179 sec
13:21:59 outOfDateModelDoMigration_uml2(org.eclipse.papyrus.uml.profile.service.ReapplyProfilesServiceTest)  Time elapsed: 1.337 sec
13:21:59 upToDateModelDoesNotPromptForMigration_uml2(org.eclipse.papyrus.uml.profile.service.ReapplyProfilesServiceTest)  Time elapsed: 1.25 sec
13:21:59 upToDateModelDoesNotPromptForMigration_dynamic(org.eclipse.papyrus.uml.profile.service.ReapplyProfilesServiceTest)  Time elapsed: 0.887 sec
13:21:59 loadDecoratorAsMainModel(org.eclipse.papyrus.uml.decoratormodel.tests.ExternalizeProfileApplicationTest)  Time elapsed: 0.452 sec
13:21:59 externalizeApplication(org.eclipse.papyrus.uml.decoratormodel.tests.ExternalizeProfileApplicationTest)  Time elapsed: 0.471 sec
13:21:59 unloadApplication(org.eclipse.papyrus.uml.decoratormodel.tests.ExternalizeProfileApplicationTest)  Time elapsed: 0.505 sec
13:21:59 externalizeApplication_undo(org.eclipse.papyrus.uml.decoratormodel.tests.ExternalizeProfileApplicationTest)  Time elapsed: 0.389 sec
13:21:59 unloadedApplicationNotAvailable(org.eclipse.papyrus.uml.decoratormodel.tests.ExternalizeProfileApplicationTest)  Time elapsed: 0.451 sec
13:21:59 loadApplication(org.eclipse.papyrus.uml.decoratormodel.tests.ExternalizeProfileApplicationTest)  Time elapsed: 0.457 sec
13:21:59 externalizeApplication_undo_redo(org.eclipse.papyrus.uml.decoratormodel.tests.ExternalizeProfileApplicationTest)  Time elapsed: 0.543 sec
13:21:59 nestedPackageApplicationOfSameProfile_bug459613(org.eclipse.papyrus.uml.decoratormodel.tests.ExternalizeProfileApplicationTest)  Time elapsed: 0.474 sec
13:21:59 externalizeApplication_forNestedPackage(org.eclipse.papyrus.uml.decoratormodel.tests.ExternalizeProfileApplicationTest)  Time elapsed: 0.474 sec
13:21:59 internalizeApplication_undo(org.eclipse.papyrus.uml.decoratormodel.tests.InternalizeProfileApplicationTest)  Time elapsed: 0.43 sec
13:21:59 internalizeApplication_undo_redo(org.eclipse.papyrus.uml.decoratormodel.tests.InternalizeProfileApplicationTest)  Time elapsed: 0.592 sec
13:21:59 internalizeApplication(org.eclipse.papyrus.uml.decoratormodel.tests.InternalizeProfileApplicationTest)  Time elapsed: 0.466 sec
13:21:59 migrateProfile(org.eclipse.papyrus.uml.decoratormodel.tests.ProfileMigrationTest)  Time elapsed: 0.521 sec
13:21:59 missingSchema(org.eclipse.papyrus.uml.decoratormodel.tests.StereotypeApplicationRepairTest)  Time elapsed: 0.46 sec
13:21:59 wrongProfileVersion(org.eclipse.papyrus.uml.decoratormodel.tests.StereotypeApplicationRepairTest)  Time elapsed: 0.431 sec
13:21:59 missingProfileApplication(org.eclipse.papyrus.uml.decoratormodel.tests.StereotypeApplicationRepairTest)  Time elapsed: 0.353 sec
13:21:59 decoratorModelsForPackageAsync(org.eclipse.papyrus.uml.decoratormodel.internal.resource.tests.DecoratorModelIndexTest)  Time elapsed: 0.498 sec
13:21:59 decoratorModelsForPackage_none(org.eclipse.papyrus.uml.decoratormodel.internal.resource.tests.DecoratorModelIndexTest)  Time elapsed: 0.492 sec
13:21:59 removeResource(org.eclipse.papyrus.uml.decoratormodel.internal.resource.tests.DecoratorModelIndexTest)  Time elapsed: 0.658 sec
13:21:59 decoratorModelsAsync_uri(org.eclipse.papyrus.uml.decoratormodel.internal.resource.tests.DecoratorModelIndexTest)  Time elapsed: 0.517 sec
13:21:59 decoratorModelName(org.eclipse.papyrus.uml.decoratormodel.internal.resource.tests.DecoratorModelIndexTest)  Time elapsed: 0.573 sec
13:21:59 baseline(org.eclipse.papyrus.uml.decoratormodel.internal.resource.tests.DecoratorModelIndexTest)  Time elapsed: 0.623 sec
13:21:59 decoratorModelsForPackage(org.eclipse.papyrus.uml.decoratormodel.internal.resource.tests.DecoratorModelIndexTest)  Time elapsed: 0.541 sec
13:21:59 decoratorModelNameAsync(org.eclipse.papyrus.uml.decoratormodel.internal.resource.tests.DecoratorModelIndexTest)  Time elapsed: 0.483 sec
13:21:59 appliedProfilesByResourceIndex(org.eclipse.papyrus.uml.decoratormodel.internal.resource.tests.DecoratorModelIndexTest)  Time elapsed: 0.736 sec
13:21:59 decoratorModels(org.eclipse.papyrus.uml.decoratormodel.internal.resource.tests.DecoratorModelIndexTest)  Time elapsed: 0.481 sec
13:21:59 decoratorModelsAsync(org.eclipse.papyrus.uml.decoratormodel.internal.resource.tests.DecoratorModelIndexTest)  Time elapsed: 0.516 sec
13:21:59 allAppliedProfiles(org.eclipse.papyrus.uml.decoratormodel.internal.resource.tests.DecoratorModelIndexTest)  Time elapsed: 0.61 sec
13:21:59 decoratorModelNames(org.eclipse.papyrus.uml.decoratormodel.internal.resource.tests.DecoratorModelIndexTest)  Time elapsed: 0.895 sec
13:21:59 decoratorModels_uri(org.eclipse.papyrus.uml.decoratormodel.internal.resource.tests.DecoratorModelIndexTest)  Time elapsed: 0.522 sec
13:21:59 decoratorModelNamesAsync(org.eclipse.papyrus.uml.decoratormodel.internal.resource.tests.DecoratorModelIndexTest)  Time elapsed: 0.477 sec
13:21:59 listener(org.eclipse.papyrus.uml.decoratormodel.internal.resource.tests.DecoratorModelIndexTest)  Time elapsed: 0.801 sec
13:21:59 allAppliedProfilesAsync(org.eclipse.papyrus.uml.decoratormodel.internal.resource.tests.DecoratorModelIndexTest)  Time elapsed: 0.543 sec
13:21:59 addNewResource(org.eclipse.papyrus.uml.decoratormodel.internal.resource.tests.DecoratorModelIndexTest)  Time elapsed: 0.901 sec
13:21:59 decoratorModelsForPackageAsync_none(org.eclipse.papyrus.uml.decoratormodel.internal.resource.tests.DecoratorModelIndexTest)  Time elapsed: 0.448 sec
13:21:59 copy_subsetOfProfiles(org.eclipse.papyrus.uml.decoratormodel.internal.resource.tests.DecoratorModelCopierTest)  Time elapsed: 1.201 sec
13:21:59 copy_allProfiles(org.eclipse.papyrus.uml.decoratormodel.internal.resource.tests.DecoratorModelCopierTest)  Time elapsed: 0.959 sec
13:21:59 testHasUnloadedDecoratorModelsAsync_recursive(org.eclipse.papyrus.uml.decoratormodel.helper.tests.DecoratorModelUtilsTest)  Time elapsed: 0.602 sec
13:21:59 testIsDecoratorModelFor(org.eclipse.papyrus.uml.decoratormodel.helper.tests.DecoratorModelUtilsTest)  Time elapsed: 0.369 sec
13:21:59 testIsDecoratorModelURI(org.eclipse.papyrus.uml.decoratormodel.helper.tests.DecoratorModelUtilsTest)  Time elapsed: 0.483 sec
13:21:59 testInternalizeProfileApplications(org.eclipse.papyrus.uml.decoratormodel.helper.tests.DecoratorModelUtilsTest)  Time elapsed: 0.567 sec
13:21:59 testHasUnloadedDecoratorModelsAsync(org.eclipse.papyrus.uml.decoratormodel.helper.tests.DecoratorModelUtilsTest)  Time elapsed: 0.53 sec
13:21:59 testExternalizeProfileApplication(org.eclipse.papyrus.uml.decoratormodel.helper.tests.DecoratorModelUtilsTest)  Time elapsed: 2.067 sec
13:21:59 testGetDecoratorPackages(org.eclipse.papyrus.uml.decoratormodel.helper.tests.DecoratorModelUtilsTest)  Time elapsed: 0.455 sec
13:21:59 testGetDecoratorModelAppliedProfiles(org.eclipse.papyrus.uml.decoratormodel.helper.tests.DecoratorModelUtilsTest)  Time elapsed: 0.566 sec
13:21:59 testGetUnloadedDecoratorModelsAsyncResource(org.eclipse.papyrus.uml.decoratormodel.helper.tests.DecoratorModelUtilsTest)  Time elapsed: 0.455 sec
13:21:59 testGetExternalizationProfile(org.eclipse.papyrus.uml.decoratormodel.helper.tests.DecoratorModelUtilsTest)  Time elapsed: 0.365 sec
13:21:59 testIsDecoratorModelResource(org.eclipse.papyrus.uml.decoratormodel.helper.tests.DecoratorModelUtilsTest)  Time elapsed: 0.399 sec
13:21:59 testGetDecoratorModelProfileApplications(org.eclipse.papyrus.uml.decoratormodel.helper.tests.DecoratorModelUtilsTest)  Time elapsed: 0.431 sec
13:21:59 testGetUnloadedDecoratorModelsAsyncPackage(org.eclipse.papyrus.uml.decoratormodel.helper.tests.DecoratorModelUtilsTest)  Time elapsed: 0.567 sec
13:21:59 testGetLoadedDecoratorModels(org.eclipse.papyrus.uml.decoratormodel.helper.tests.DecoratorModelUtilsTest)  Time elapsed: 0.473 sec
13:21:59 testGetLoadedSubUnitPackages(org.eclipse.papyrus.uml.decoratormodel.helper.tests.DecoratorModelUtilsTest)  Time elapsed: 0.362 sec
13:21:59 testGetUnloadedDecoratorModels(org.eclipse.papyrus.uml.decoratormodel.helper.tests.DecoratorModelUtilsTest)  Time elapsed: 0.515 sec
13:21:59 testHasExternalizationProfile(org.eclipse.papyrus.uml.decoratormodel.helper.tests.DecoratorModelUtilsTest)  Time elapsed: 0.432 sec
13:21:59 testGetUnloadedDecoratorModelsAsyncIterableOfResource(org.eclipse.papyrus.uml.decoratormodel.helper.tests.DecoratorModelUtilsTest)  Time elapsed: 0.89 sec
13:21:59 testGetUserModelResources(org.eclipse.papyrus.uml.decoratormodel.helper.tests.DecoratorModelUtilsTest)  Time elapsed: 0.438 sec
13:21:59 testGetDecoratorProfileApplications(org.eclipse.papyrus.uml.decoratormodel.helper.tests.DecoratorModelUtilsTest)  Time elapsed: 0.43 sec
13:21:59 stereotypeApplication_inNestedPackage(org.eclipse.papyrus.uml.decoratormodel.helper.tests.PapyrusStereotypeApplicationHelperTest)  Time elapsed: 0.154 sec
13:21:59 stereotypeApplication_inNonPackageSubmodelUnit_bug459613(org.eclipse.papyrus.uml.decoratormodel.helper.tests.PapyrusStereotypeApplicationHelperTest)  Time elapsed: 0.147 sec
13:21:59 applyStereotype_resourceSet(org.eclipse.papyrus.uml.decoratormodel.helper.tests.PapyrusStereotypeApplicationHelperTest)  Time elapsed: 0.183 sec
13:21:59 applyStereotype_freeFloating(org.eclipse.papyrus.uml.decoratormodel.helper.tests.PapyrusStereotypeApplicationHelperTest)  Time elapsed: 0.152 sec
13:21:59 isDecoratorModel_decoratorModelUML(org.eclipse.papyrus.uml.decoratormodel.internal.expressions.tests.FilePropertyTesterTest)  Time elapsed: 0.364 sec
13:21:59 isDecoratorModel_decoratorModelNotation(org.eclipse.papyrus.uml.decoratormodel.internal.expressions.tests.FilePropertyTesterTest)  Time elapsed: 0.352 sec
13:21:59 isDecoratorModel_userModelUML(org.eclipse.papyrus.uml.decoratormodel.internal.expressions.tests.FilePropertyTesterTest)  Time elapsed: 0.442 sec
13:21:59 decoratorIndexing(org.eclipse.papyrus.uml.decoratormodel.internal.resource.index.tests.ProfileIndexTest)  Time elapsed: 0.401 sec
13:21:59 userModelIndexing(org.eclipse.papyrus.uml.decoratormodel.internal.resource.index.tests.ProfileIndexTest)  Time elapsed: 0 sec
13:21:59 decoratorAsUserModelIndexing(org.eclipse.papyrus.uml.decoratormodel.internal.resource.index.tests.ProfileIndexTest)  Time elapsed: 0 sec
13:21:59 migrateProfileExtendingDynamic_bug481302(org.eclipse.papyrus.uml.decoratormodel.tests.RegressionTest)  Time elapsed: 0.428 sec
13:21:59 basicUMLMigrateProfileExtendingStatic_bug481302(org.eclipse.papyrus.uml.decoratormodel.tests.RegressionTest) skipped
13:21:59 migrateProfileExtendingStatic_bug481302(org.eclipse.papyrus.uml.decoratormodel.tests.RegressionTest)  Time elapsed: 0.301 sec
13:21:59 control_undo_redo_allDecoratorsLoaded(org.eclipse.papyrus.uml.decoratormodel.controlmode.tests.ControlModeWithDecoratorModelsTest)  Time elapsed: 0.703 sec
13:21:59 uncontrol_undo_redo_allDecoratorsUnloaded(org.eclipse.papyrus.uml.decoratormodel.controlmode.tests.ControlModeWithDecoratorModelsTest)  Time elapsed: 3.04 sec
13:21:59 control_someDecoratorsLoaded(org.eclipse.papyrus.uml.decoratormodel.controlmode.tests.ControlModeWithDecoratorModelsTest)  Time elapsed: 2.133 sec
13:21:59 uncontrol_someDecoratorsLoaded(org.eclipse.papyrus.uml.decoratormodel.controlmode.tests.ControlModeWithDecoratorModelsTest)  Time elapsed: 1.759 sec
13:21:59 uncontrol_allDecoratorsUnloaded(org.eclipse.papyrus.uml.decoratormodel.controlmode.tests.ControlModeWithDecoratorModelsTest)  Time elapsed: 1.887 sec
13:21:59 control_undo_redo_someDecoratorsLoaded(org.eclipse.papyrus.uml.decoratormodel.controlmode.tests.ControlModeWithDecoratorModelsTest)  Time elapsed: 1.983 sec
13:21:59 control_allDecoratorsLoaded(org.eclipse.papyrus.uml.decoratormodel.controlmode.tests.ControlModeWithDecoratorModelsTest)  Time elapsed: 0.767 sec
13:21:59 control_undo_redo_allDecoratorsUnloaded(org.eclipse.papyrus.uml.decoratormodel.controlmode.tests.ControlModeWithDecoratorModelsTest)  Time elapsed: 2.192 sec
13:21:59 control_allDecoratorsUnloaded(org.eclipse.papyrus.uml.decoratormodel.controlmode.tests.ControlModeWithDecoratorModelsTest)  Time elapsed: 1.238 sec
13:21:59 uncontrol_undo_redo_someDecoratorsLoaded(org.eclipse.papyrus.uml.decoratormodel.controlmode.tests.ControlModeWithDecoratorModelsTest)  Time elapsed: 2.303 sec
13:21:59 uncontrol_undo_redo_allDecoratorsLoaded(org.eclipse.papyrus.uml.decoratormodel.controlmode.tests.ControlModeWithDecoratorModelsTest)  Time elapsed: 2.603 sec
13:21:59 uncontrol_allDecoratorsLoaded(org.eclipse.papyrus.uml.decoratormodel.controlmode.tests.ControlModeWithDecoratorModelsTest)  Time elapsed: 1.369 sec
13:21:59 nonBaseElementStereotypeCrossReferences(org.eclipse.papyrus.uml.decoratormodel.controlmode.tests.AdditionalModelStructuresTest)  Time elapsed: 0.943 sec
13:21:59 classUnitExternalizeParentUnitProfileApplication_bug459613(org.eclipse.papyrus.uml.decoratormodel.controlmode.tests.AdditionalModelStructuresTest)  Time elapsed: 0.617 sec
13:21:59 nestedPackagesInheritingExternalProfileApplications(org.eclipse.papyrus.uml.decoratormodel.controlmode.tests.AdditionalModelStructuresTest)  Time elapsed: 1.548 sec
13:21:59 validateOCLOnInstanceSpec(org.eclipse.papyrus.uml.validation.tests.rules.TestOCLConstraintOnInstanceSpec)  Time elapsed: 4.296 sec
13:21:59 validateCamelCaseRule(org.eclipse.papyrus.uml.validation.tests.rules.TestOCLValidationRuleFromFile)  Time elapsed: 2.967 sec
13:21:59 validateIsActiveOCLRule_inactiveClass(org.eclipse.papyrus.uml.validation.tests.rules.TestValidationRulesInPluginXML)  Time elapsed: 1.84 sec
13:21:59 validateIsPassiveJavaRule_inactiveClass(org.eclipse.papyrus.uml.validation.tests.rules.TestValidationRulesInPluginXML)  Time elapsed: 1.633 sec
13:21:59 validateIsPassiveJavaRule_activeClass(org.eclipse.papyrus.uml.validation.tests.rules.TestValidationRulesInPluginXML)  Time elapsed: 1.799 sec
13:21:59 validateMalformedActiveRule_notActiveCapsule(org.eclipse.papyrus.uml.validation.tests.rules.TestValidationRulesInProfile)  Time elapsed: 1.667 sec
13:21:59 validateIsActiveRule_notActiveCapsule(org.eclipse.papyrus.uml.validation.tests.rules.TestValidationRulesInProfile)  Time elapsed: 1.849 sec
13:21:59 validateIsActiveRule_ActiveCapsule(org.eclipse.papyrus.uml.validation.tests.rules.TestValidationRulesInProfile)  Time elapsed: 1.641 sec
13:21:59 validateNameClashDetection(org.eclipse.papyrus.uml.validation.tests.rules.TestUMLValidationRules)  Time elapsed: 0.702 sec
13:21:59 validateNonStandardMultiplicity(org.eclipse.papyrus.uml.validation.tests.rules.TestUMLValidationRules)  Time elapsed: 0.852 sec
13:21:59 validateUnsetStereotypeAttribute(org.eclipse.papyrus.uml.validation.tests.rules.TestStereotypeValidation)  Time elapsed: 1.068 sec
13:21:59 testResolveProfile__Object(org.eclipse.papyrus.uml.filters.tests.ProfileAppliedTest)  Time elapsed: 0.027 sec
13:21:59 testMatches__Object(org.eclipse.papyrus.uml.filters.tests.ProfileAppliedTest)  Time elapsed: 0.015 sec
13:21:59 profileAppliedFilterResourceURI_bug480221(org.eclipse.papyrus.uml.filters.tests.ProfileAppliedRegressionTest)  Time elapsed: 0.034 sec
13:21:59 profileAppliedFilterDoesNotLoadProfiles_miss_bug480221(org.eclipse.papyrus.uml.filters.tests.ProfileAppliedRegressionTest)  Time elapsed: 0.036 sec
13:21:59 profileAppliedFilterDoesNotLoadProfiles_hit_bug480221(org.eclipse.papyrus.uml.filters.tests.ProfileAppliedRegressionTest)  Time elapsed: 0.035 sec
13:21:59 popupsGenerated(org.eclipse.papyrus.uml.profile.assistants.generator.tests.BasicAssistantsGenerationTest)  Time elapsed: 0.012 sec
13:21:59 connectionTargetFilters(org.eclipse.papyrus.uml.profile.assistants.generator.tests.BasicAssistantsGenerationTest)  Time elapsed: 0.003 sec
13:21:59 popupFilters(org.eclipse.papyrus.uml.profile.assistants.generator.tests.BasicAssistantsGenerationTest)  Time elapsed: 0 sec
13:21:59 connectionSourceFilters(org.eclipse.papyrus.uml.profile.assistants.generator.tests.BasicAssistantsGenerationTest)  Time elapsed: 0.001 sec
13:21:59 connectionsGenerated(org.eclipse.papyrus.uml.profile.assistants.generator.tests.BasicAssistantsGenerationTest)  Time elapsed: 0 sec
13:21:59 popupsGenerated(org.eclipse.papyrus.uml.profile.assistants.generator.tests.DiagramSpecificAssistantsGenerationTest)  Time elapsed: 0.021 sec
13:21:59 connectionTargetFilters(org.eclipse.papyrus.uml.profile.assistants.generator.tests.DiagramSpecificAssistantsGenerationTest)  Time elapsed: 0.002 sec
13:21:59 distinctConnectionHintsGenerated(org.eclipse.papyrus.uml.profile.assistants.generator.tests.DiagramSpecificAssistantsGenerationTest)  Time elapsed: 0.003 sec
13:21:59 popupFilters(org.eclipse.papyrus.uml.profile.assistants.generator.tests.DiagramSpecificAssistantsGenerationTest)  Time elapsed: 0.001 sec
13:21:59 connectionSourceFilters(org.eclipse.papyrus.uml.profile.assistants.generator.tests.DiagramSpecificAssistantsGenerationTest)  Time elapsed: 0 sec
13:21:59 distinctPopupHintsGenerated(org.eclipse.papyrus.uml.profile.assistants.generator.tests.DiagramSpecificAssistantsGenerationTest)  Time elapsed: 0 sec
13:21:59 connectionsGenerated(org.eclipse.papyrus.uml.profile.assistants.generator.tests.DiagramSpecificAssistantsGenerationTest)  Time elapsed: 0 sec
13:21:59 popupsGenerated(org.eclipse.papyrus.uml.profile.assistants.generator.tests.ProfilesWithPackageNestingTest)  Time elapsed: 0.003 sec
13:21:59 connectionTargetFilters(org.eclipse.papyrus.uml.profile.assistants.generator.tests.ProfilesWithPackageNestingTest)  Time elapsed: 0.002 sec
13:21:59 popupFilters(org.eclipse.papyrus.uml.profile.assistants.generator.tests.ProfilesWithPackageNestingTest)  Time elapsed: 0 sec
13:21:59 connectionSourceFilters(org.eclipse.papyrus.uml.profile.assistants.generator.tests.ProfilesWithPackageNestingTest)  Time elapsed: 0 sec
13:21:59 connectionsGenerated(org.eclipse.papyrus.uml.profile.assistants.generator.tests.ProfilesWithPackageNestingTest)  Time elapsed: 0 sec
13:21:59 connectionsGenerated[<<Indirect>> Generalization](org.eclipse.papyrus.uml.profile.assistants.generator.tests.ConnectionTypesTest)  Time elapsed: 0.002 sec
13:21:59 connectionsGenerated[<<Indirect>> GeneralizationSet](org.eclipse.papyrus.uml.profile.assistants.generator.tests.ConnectionTypesTest)  Time elapsed: 0.001 sec
13:21:59 connectionsGenerated[<<Virtual>> ControlFlow](org.eclipse.papyrus.uml.profile.assistants.generator.tests.ConnectionTypesTest)  Time elapsed: 0 sec
13:21:59 connectionsGenerated[<<Virtual>> ObjectFlow](org.eclipse.papyrus.uml.profile.assistants.generator.tests.ConnectionTypesTest)  Time elapsed: 0 sec
13:21:59 connectionsGenerated[<<Virtual>> Transition](org.eclipse.papyrus.uml.profile.assistants.generator.tests.ConnectionTypesTest)  Time elapsed: 0 sec
13:21:59 connectionsGenerated[<<Virtual>> Message](org.eclipse.papyrus.uml.profile.assistants.generator.tests.ConnectionTypesTest)  Time elapsed: 0.001 sec
13:21:59 connectionsGenerated[<<Indirect>> Connector](org.eclipse.papyrus.uml.profile.assistants.generator.tests.ConnectionTypesTest)  Time elapsed: 0 sec
13:21:59 iconGenerated(org.eclipse.papyrus.uml.profile.types.generator.tests.BasicElementTypesGenerationTest)  Time elapsed: 0.005 sec
13:21:59 elementTypeSpecializedTypes_bug461717(org.eclipse.papyrus.uml.profile.types.generator.tests.BasicElementTypesGenerationTest)  Time elapsed: 0.01 sec
13:21:59 multipleElementTypesForOneStereotypeGenerated(org.eclipse.papyrus.uml.profile.types.generator.tests.BasicElementTypesGenerationTest)  Time elapsed: 0 sec
13:21:59 stereotypeAdviceGenerated(org.eclipse.papyrus.uml.profile.types.generator.tests.BasicElementTypesGenerationTest)  Time elapsed: 0.001 sec
13:21:59 elementTypesGenerated(org.eclipse.papyrus.uml.profile.types.generator.tests.BasicElementTypesGenerationTest)  Time elapsed: 0 sec
13:21:59 stereotypeMatcherGenerated(org.eclipse.papyrus.uml.profile.types.generator.tests.BasicElementTypesGenerationTest)  Time elapsed: 0.001 sec
13:21:59 stereotypeAdviceNotGenerated(org.eclipse.papyrus.uml.profile.types.generator.tests.DiagramSpecificElementTypesGenerationTest)  Time elapsed: 0.003 sec
13:21:59 distinctHintsGenerated(org.eclipse.papyrus.uml.profile.types.generator.tests.DiagramSpecificElementTypesGenerationTest)  Time elapsed: 0.003 sec
13:21:59 stereotypeMatcherNotGenerated(org.eclipse.papyrus.uml.profile.types.generator.tests.DiagramSpecificElementTypesGenerationTest)  Time elapsed: 0 sec
13:21:59 iconGenerated(org.eclipse.papyrus.uml.profile.types.generator.tests.DiagramSpecificElementTypesGenerationTest)  Time elapsed: 0 sec
13:21:59 elementTypeSpecializedTypes_bug461717(org.eclipse.papyrus.uml.profile.types.generator.tests.DiagramSpecificElementTypesGenerationTest)  Time elapsed: 0.019 sec
13:21:59 elementTypesGenerated(org.eclipse.papyrus.uml.profile.types.generator.tests.DiagramSpecificElementTypesGenerationTest)  Time elapsed: 0.001 sec
13:21:59 iconGenerated(org.eclipse.papyrus.uml.profile.types.generator.tests.ProfilesWithPackageNestingTest)  Time elapsed: 0.002 sec
13:21:59 stereotypeAdviceGenerated(org.eclipse.papyrus.uml.profile.types.generator.tests.ProfilesWithPackageNestingTest)  Time elapsed: 0.001 sec
13:21:59 elementTypesGenerated(org.eclipse.papyrus.uml.profile.types.generator.tests.ProfilesWithPackageNestingTest)  Time elapsed: 0 sec
13:21:59 stereotypeMatcherGenerated(org.eclipse.papyrus.uml.profile.types.generator.tests.ProfilesWithPackageNestingTest)  Time elapsed: 0 sec
13:21:59 elementTypeSpecializedTypes(org.eclipse.papyrus.uml.profile.types.generator.tests.DiagramSpecificElementTypesGenerationBug461717Test)  Time elapsed: 0.022 sec
13:21:59 stereotypeAdviceGenerated(org.eclipse.papyrus.uml.profile.types.generator.tests.DiagramSpecificElementTypesGenerationBug461717Test)  Time elapsed: 0.001 sec
13:21:59 stereotypeMatcherGenerated(org.eclipse.papyrus.uml.profile.types.generator.tests.DiagramSpecificElementTypesGenerationBug461717Test)  Time elapsed: 0 sec
13:21:59 testGetStereotypeNames(org.eclipse.papyrus.uml.profile.drafter.tests.ProfileCatalogTest)  Time elapsed: 0.038 sec
13:21:59 testGetStereotypes(org.eclipse.papyrus.uml.profile.drafter.tests.ProfileCatalogTest)  Time elapsed: 0.079 sec
13:21:59 testGetAllStereotypeNames(org.eclipse.papyrus.uml.profile.drafter.tests.ProfileCatalogTest) skipped
13:21:59 testGetProfileNames(org.eclipse.papyrus.uml.profile.drafter.tests.ProfileCatalogTest)  Time elapsed: 0.143 sec
13:21:59 testProfileCatalog(org.eclipse.papyrus.uml.profile.drafter.tests.ProfileCatalogTest)  Time elapsed: 0.039 sec
13:21:59 testLookupStereotype(org.eclipse.papyrus.uml.profile.drafter.tests.ProfileCatalogTest)  Time elapsed: 0.072 sec
13:21:59 testLookupStereotypeInAppliedProfile(org.eclipse.papyrus.uml.profile.drafter.tests.ProfileCatalogTest)  Time elapsed: 0.094 sec
13:21:59 testProfileCopy(org.eclipse.papyrus.uml.profile.drafter.tests.ProfileCatalogTest)  Time elapsed: 0.075 sec
13:21:59 testGetProfiles(org.eclipse.papyrus.uml.profile.drafter.tests.ProfileCatalogTest)  Time elapsed: 0.074 sec
13:21:59 testGetNamedElement(org.eclipse.papyrus.uml.profile.drafter.tests.ProfileCatalogTest)  Time elapsed: 0.063 sec
13:21:59 testIsModelsExist(org.eclipse.papyrus.uml.profile.drafter.tests.ProfileCatalogTest)  Time elapsed: 0.068 sec
13:21:59 testGetStereotypeQualifiedNames(org.eclipse.papyrus.uml.profile.drafter.tests.ProfileCatalogTest)  Time elapsed: 0.147 sec
13:21:59 testGetProfileQualifiedNames(org.eclipse.papyrus.uml.profile.drafter.tests.ProfileCatalogTest)  Time elapsed: 0.067 sec
13:21:59 testCopyResources(org.eclipse.papyrus.uml.profile.drafter.tests.EclipseProjectTest)  Time elapsed: 0.007 sec
13:21:59 testCopyResource(org.eclipse.papyrus.uml.profile.drafter.tests.EclipseProjectTest)  Time elapsed: 0.003 sec
13:21:59 testGetProject(org.eclipse.papyrus.uml.profile.drafter.tests.EclipseProjectTest)  Time elapsed: 0 sec
13:21:59 testEclipseProject(org.eclipse.papyrus.uml.profile.drafter.tests.EclipseProjectTest)  Time elapsed: 0 sec
13:21:59 testGetUmlModelWithIFile(org.eclipse.papyrus.uml.profile.drafter.tests.ModelSetManagerTest)  Time elapsed: 0.123 sec
13:21:59 testModelSetManagerString(org.eclipse.papyrus.uml.profile.drafter.tests.ModelSetManagerTest)  Time elapsed: 0.003 sec
13:21:59 testModelSetManagerURI(org.eclipse.papyrus.uml.profile.drafter.tests.ModelSetManagerTest)  Time elapsed: 0.003 sec
13:21:59 testGetNamedElementByNameString(org.eclipse.papyrus.uml.profile.drafter.tests.ModelSetManagerTest)  Time elapsed: 0.004 sec
13:21:59 testGetUmlModel(org.eclipse.papyrus.uml.profile.drafter.tests.ModelSetManagerTest)  Time elapsed: 0.012 sec
13:21:59 testModelSetManagerStringModels(org.eclipse.papyrus.uml.profile.drafter.tests.ModelSetManagerTest)  Time elapsed: 0.002 sec
13:21:59 testGetNamedElementByNameWithSterotype(org.eclipse.papyrus.uml.profile.drafter.tests.ModelSetManagerTest)  Time elapsed: 0.063 sec
13:21:59 testCreation(org.eclipse.papyrus.uml.profile.drafter.tests.utils.UMLModelCreatorTest)  Time elapsed: 0.002 sec
13:21:59 testCreateClass(org.eclipse.papyrus.uml.profile.drafter.tests.utils.UMLModelCreatorTest)  Time elapsed: 0 sec
13:21:59 testCreateModel(org.eclipse.papyrus.uml.profile.drafter.tests.utils.UMLModelCreatorTest)  Time elapsed: 0 sec
13:21:59 testCreatePackage(org.eclipse.papyrus.uml.profile.drafter.tests.utils.UMLModelCreatorTest)  Time elapsed: 0 sec
13:21:59 testCd(org.eclipse.papyrus.uml.profile.drafter.tests.utils.UMLModelCreatorTest)  Time elapsed: 0.001 sec
13:21:59 testUMLModelCreatorResourceFailing(org.eclipse.papyrus.uml.profile.drafter.tests.utils.UMLModelCreatorTest)  Time elapsed: 0 sec
13:21:59 testUMLModelCreatorStringString(org.eclipse.papyrus.uml.profile.drafter.tests.utils.UMLModelCreatorTest)  Time elapsed: 0 sec
13:21:59 testUMLModelCreatorResource(org.eclipse.papyrus.uml.profile.drafter.tests.utils.UMLModelCreatorTest)  Time elapsed: 0 sec
13:21:59 testCreateDatatype(org.eclipse.papyrus.uml.profile.drafter.tests.utils.UMLModelCreatorTest)  Time elapsed: 0 sec
13:21:59 testCompoundTypeProvider(org.eclipse.papyrus.uml.profile.drafter.ui.model.CompoundTypeProviderTest)  Time elapsed: 0.001 sec
13:21:59 testGetTypes(org.eclipse.papyrus.uml.profile.drafter.ui.model.CompoundTypeProviderTest)  Time elapsed: 0 sec
13:21:59 testAddITypeProvider(org.eclipse.papyrus.uml.profile.drafter.ui.model.CompoundTypeProviderTest)  Time elapsed: 0 sec
13:21:59 testIterator(org.eclipse.papyrus.uml.profile.drafter.ui.model.CompoundTypeProviderTest)  Time elapsed: 0.001 sec
13:21:59 testVisitMetaclassesModel(org.eclipse.papyrus.uml.profile.drafter.ui.model.SimpleModelVisitorTest) skipped
13:21:59 testVisitPropertyModel(org.eclipse.papyrus.uml.profile.drafter.ui.model.SimpleModelVisitorTest) skipped
13:21:59 testSimpleModelVisitor(org.eclipse.papyrus.uml.profile.drafter.ui.model.SimpleModelVisitorTest)  Time elapsed: 0.001 sec
13:21:59 testDoVisitStereoptypeModel(org.eclipse.papyrus.uml.profile.drafter.ui.model.SimpleModelVisitorTest) skipped
13:21:59 testDoVisitPropertyModel(org.eclipse.papyrus.uml.profile.drafter.ui.model.SimpleModelVisitorTest) skipped
13:21:59 testVisitStereoptypeModel(org.eclipse.papyrus.uml.profile.drafter.ui.model.SimpleModelVisitorTest) skipped
13:21:59 testDoVisitMetaclassesModel(org.eclipse.papyrus.uml.profile.drafter.ui.model.SimpleModelVisitorTest) skipped
13:21:59 testSetStereotypeName(org.eclipse.papyrus.uml.profile.drafter.ui.model.StereotypeURLTest)  Time elapsed: 0.017 sec
13:21:59 testGetProfileName(org.eclipse.papyrus.uml.profile.drafter.ui.model.StereotypeURLTest)  Time elapsed: 0 sec
13:21:59 testAddPropertyChangeListenerPropertyChangeListener(org.eclipse.papyrus.uml.profile.drafter.ui.model.StereotypeURLTest)  Time elapsed: 0.001 sec
13:21:59 testSetQualifiedNameComplex(org.eclipse.papyrus.uml.profile.drafter.ui.model.StereotypeURLTest)  Time elapsed: 0 sec
13:21:59 testClear(org.eclipse.papyrus.uml.profile.drafter.ui.model.StereotypeURLTest)  Time elapsed: 0 sec
13:21:59 testStereotypeURLString(org.eclipse.papyrus.uml.profile.drafter.ui.model.StereotypeURLTest)  Time elapsed: 0 sec
13:21:59 testToString(org.eclipse.papyrus.uml.profile.drafter.ui.model.StereotypeURLTest)  Time elapsed: 0 sec
13:21:59 testGetStereotypeName(org.eclipse.papyrus.uml.profile.drafter.ui.model.StereotypeURLTest)  Time elapsed: 0 sec
13:21:59 testAddPropertyChangeListenerStringPropertyChangeListener(org.eclipse.papyrus.uml.profile.drafter.ui.model.StereotypeURLTest)  Time elapsed: 0 sec
13:21:59 testStereotypeURL(org.eclipse.papyrus.uml.profile.drafter.ui.model.StereotypeURLTest)  Time elapsed: 0 sec
13:21:59 testRemovePropertyChangeListenerPropertyChangeListener(org.eclipse.papyrus.uml.profile.drafter.ui.model.StereotypeURLTest)  Time elapsed: 0 sec
13:21:59 testSetQualifiedNameSimple(org.eclipse.papyrus.uml.profile.drafter.ui.model.StereotypeURLTest)  Time elapsed: 0 sec
13:21:59 testSetProfileName(org.eclipse.papyrus.uml.profile.drafter.ui.model.StereotypeURLTest)  Time elapsed: 0 sec
13:21:59 testRemovePropertyChangeListenerStringPropertyChangeListener(org.eclipse.papyrus.uml.profile.drafter.ui.model.StereotypeURLTest)  Time elapsed: 0 sec
13:21:59 testComputeQualifiedName(org.eclipse.papyrus.uml.profile.drafter.ui.model.StereotypeURLTest)  Time elapsed: 0 sec
13:21:59 testGetQualifiedName(org.eclipse.papyrus.uml.profile.drafter.ui.model.StereotypeURLTest)  Time elapsed: 0.001 sec
13:21:59 testStereotypeURLStringString(org.eclipse.papyrus.uml.profile.drafter.ui.model.StereotypeURLTest)  Time elapsed: 0 sec
13:21:59 testGetTypes(org.eclipse.papyrus.uml.profile.drafter.ui.model.TypeProviderTest)  Time elapsed: 0.002 sec
13:21:59 testTypeProvider(org.eclipse.papyrus.uml.profile.drafter.ui.model.TypeProviderTest)  Time elapsed: 0 sec
13:21:59 testIterator(org.eclipse.papyrus.uml.profile.drafter.ui.model.TypeProviderTest)  Time elapsed: 0 sec
13:21:59 testGetTypes(org.eclipse.papyrus.uml.profile.drafter.ui.model.TypeProviderTest2)  Time elapsed: 0.001 sec
13:21:59 testAddType(org.eclipse.papyrus.uml.profile.drafter.ui.model.TypeProviderTest2)  Time elapsed: 0 sec
13:21:59 testAddTypeFromConstructor(org.eclipse.papyrus.uml.profile.drafter.ui.model.TypeProviderTest2)  Time elapsed: 0 sec
13:21:59 testTypeProvider(org.eclipse.papyrus.uml.profile.drafter.ui.model.TypeProviderTest2)  Time elapsed: 0 sec
13:21:59 testTypeProviderTypeArray(org.eclipse.papyrus.uml.profile.drafter.ui.model.TypeProviderTest2)  Time elapsed: 0 sec
13:21:59 testIterator(org.eclipse.papyrus.uml.profile.drafter.ui.model.TypeProviderTest2)  Time elapsed: 0 sec
13:21:59 testUMLPrimitiveTypesModel(org.eclipse.papyrus.uml.profile.drafter.utils.UMLPrimitiveTypesModelTest)  Time elapsed: 0.024 sec
13:21:59 testGetLibraryPackage(org.eclipse.papyrus.uml.profile.drafter.utils.UMLPrimitiveTypesModelTest)  Time elapsed: 0.016 sec
13:21:59 testUseInternationalizationModification(org.eclipse.papyrus.uml.internationalization.tests.tests.UMLInternationalizationChangePreferencesTest)  Time elapsed: 0.692 sec
13:21:59 testLanguageModification(org.eclipse.papyrus.uml.internationalization.tests.tests.UMLInternationalizationChangeLanguageTest)  Time elapsed: 0.621 sec
13:21:59 rebuildAdapters(org.eclipse.papyrus.uml.internationalization.tests.tests.InternationalizationUMLItemProviderAdapterFactoryTest)  Time elapsed: 0.891 sec
13:21:59 normalAdapters(org.eclipse.papyrus.uml.internationalization.tests.tests.InternationalizationUMLItemProviderAdapterFactoryTest)  Time elapsed: 0.857 sec
13:21:59 testMapping(org.eclipse.papyrus.uml.alf.tests.mapper.MappingTest) skipped
13:21:59 org.eclipse.papyrus.uml.alf.tests.mapper.MappingTest skipped
13:21:59 testMerging(org.eclipse.papyrus.uml.alf.tests.mapper.MergeTest) skipped
13:21:59 org.eclipse.papyrus.uml.alf.tests.mapper.MergeTest skipped
13:21:59 testStaticSemantics(org.eclipse.papyrus.uml.alf.tests.SemanticTest) skipped
13:21:59 org.eclipse.papyrus.uml.alf.tests.SemanticTest skipped
13:21:59 testOneFile(org.eclipse.papyrus.uml.alf.tests.SingleTest) skipped
13:21:59 org.eclipse.papyrus.uml.alf.tests.SingleTest skipped
13:21:59 testSyntax(org.eclipse.papyrus.uml.alf.tests.SyntacticTest) skipped
13:21:59 org.eclipse.papyrus.uml.alf.tests.SyntacticTest skipped
13:21:59 testGeneration(org.eclipse.papyrus.uml.alf.tests.generator.GenerationTest) skipped
13:21:59 org.eclipse.papyrus.uml.alf.tests.generator.GenerationTest skipped
13:21:59 org.eclipse.papyrus.uml.alf.tests.AllTests skipped
13:21:59 IsStereotypedWithExpression_Test10(org.eclipse.papyrus.uml.expressions.tests.IsStereotypedWithExpressionTests)  Time elapsed: 1.512 sec
13:21:59 IsStereotypedWithExpression_Test11(org.eclipse.papyrus.uml.expressions.tests.IsStereotypedWithExpressionTests)  Time elapsed: 1.477 sec
13:21:59 IsStereotypedWithExpression_Test12(org.eclipse.papyrus.uml.expressions.tests.IsStereotypedWithExpressionTests)  Time elapsed: 1.387 sec
13:21:59 IsStereotypedWithExpression_Test13(org.eclipse.papyrus.uml.expressions.tests.IsStereotypedWithExpressionTests)  Time elapsed: 1.431 sec
13:21:59 IsStereotypedWithExpression_Test1(org.eclipse.papyrus.uml.expressions.tests.IsStereotypedWithExpressionTests)  Time elapsed: 1.61 sec
13:21:59 IsStereotypedWithExpression_Test2(org.eclipse.papyrus.uml.expressions.tests.IsStereotypedWithExpressionTests)  Time elapsed: 1.384 sec
13:21:59 IsStereotypedWithExpression_Test3(org.eclipse.papyrus.uml.expressions.tests.IsStereotypedWithExpressionTests)  Time elapsed: 1.35 sec
13:21:59 IsStereotypedWithExpression_Test4(org.eclipse.papyrus.uml.expressions.tests.IsStereotypedWithExpressionTests)  Time elapsed: 1.302 sec
13:21:59 IsStereotypedWithExpression_Test5(org.eclipse.papyrus.uml.expressions.tests.IsStereotypedWithExpressionTests)  Time elapsed: 1.522 sec
13:21:59 IsStereotypedWithExpression_Test6(org.eclipse.papyrus.uml.expressions.tests.IsStereotypedWithExpressionTests)  Time elapsed: 1.228 sec
13:21:59 IsStereotypedWithExpression_Test7(org.eclipse.papyrus.uml.expressions.tests.IsStereotypedWithExpressionTests)  Time elapsed: 1.537 sec
13:21:59 IsStereotypedWithExpression_Test8(org.eclipse.papyrus.uml.expressions.tests.IsStereotypedWithExpressionTests)  Time elapsed: 1.606 sec
13:21:59 IsStereotypedWithExpression_Test9(org.eclipse.papyrus.uml.expressions.tests.IsStereotypedWithExpressionTests)  Time elapsed: 1.61 sec
13:21:59 HasStereotypeExpressionTests_Test1(org.eclipse.papyrus.uml.expressions.tests.HasAppliedStereotypeExpressionTests)  Time elapsed: 1.497 sec
13:21:59 HasStereotypeExpressionTests_Test2(org.eclipse.papyrus.uml.expressions.tests.HasAppliedStereotypeExpressionTests)  Time elapsed: 3.569 sec
13:21:59 HasStereotypeExpressionTests_Test3(org.eclipse.papyrus.uml.expressions.tests.HasAppliedStereotypeExpressionTests)  Time elapsed: 1.581 sec
13:21:59 HasStereotypeExpressionTests_Test4(org.eclipse.papyrus.uml.expressions.tests.HasAppliedStereotypeExpressionTests)  Time elapsed: 1.792 sec
13:21:59 metaclassAndNoContext(org.eclipse.papyrus.uml.expressions.tests.IsKindOfExpressionTest)  Time elapsed: 0.004 sec
13:21:59 noMetaclassAndNoContextTest(org.eclipse.papyrus.uml.expressions.tests.IsKindOfExpressionTest)  Time elapsed: 0 sec
13:21:59 metaclassAndValidContext_1(org.eclipse.papyrus.uml.expressions.tests.IsKindOfExpressionTest)  Time elapsed: 0 sec
13:21:59 metaclassAndValidContext_2(org.eclipse.papyrus.uml.expressions.tests.IsKindOfExpressionTest)  Time elapsed: 0 sec
13:21:59 metaclassAndInvalidContext(org.eclipse.papyrus.uml.expressions.tests.IsKindOfExpressionTest)  Time elapsed: 0 sec
13:21:59 metaclassAndNoContext(org.eclipse.papyrus.uml.expressions.tests.IsTypeOfExpressionTests)  Time elapsed: 0.001 sec
13:21:59 noMetaclassAndNoContextTest(org.eclipse.papyrus.uml.expressions.tests.IsTypeOfExpressionTests)  Time elapsed: 0 sec
13:21:59 metaclassAndValidContext_2(org.eclipse.papyrus.uml.expressions.tests.IsTypeOfExpressionTests)  Time elapsed: 0 sec
13:21:59 metaclassAndInValidContext_1(org.eclipse.papyrus.uml.expressions.tests.IsTypeOfExpressionTests)  Time elapsed: 0 sec
13:21:59 
13:21:59 Results :
13:21:59 
13:21:59 Failed tests: 
13:21:59   TableCopyPasteModelExplorerTest.copyPasteTableTest:119 TableOfViews0 TreeElement is null
13:21:59 
13:21:59 Tests run: 576, Failures: 1, Errors: 0, Skipped: 38
13:21:59 
13:22:01 [ERROR] There are test failures.
13:22:01 
13:22:01 Please refer to /jobs/genie.papyrus/Papyrus-Oxygen-Tests/workspace/source/tests/junit/plugins/uml/org.eclipse.papyrus.uml.suite.tests/target/surefire-reports for the individual test results.
13:22:01 [INFO] 
13:22:01 [INFO] --- jacoco-maven-plugin:0.7.9:report (default-report) @ org.eclipse.papyrus.uml.suite.tests ---
13:22:01 [INFO] Loading execution data file /jobs/genie.papyrus/Papyrus-Oxygen-Tests/workspace/source/tests/junit/plugins/uml/org.eclipse.papyrus.uml.suite.tests/target/jacoco.exec
13:22:01 [INFO] Analyzed bundle 'org.eclipse.papyrus.uml.suite.tests' with 0 classes
13:22:01 [INFO] 
13:22:01 [INFO] --< org.eclipse.papyrus.tests:org.eclipse.papyrus.uml.alf.tests.releng >--
13:22:01 [INFO] Building org.eclipse.papyrus.uml.alf.tests.releng 0.0.1-SNAPSHOT [148/155]
13:22:01 [INFO] --------------------------------[ pom ]---------------------------------
13:22:01 [INFO] 
13:22:01 [INFO] --- maven-clean-plugin:2.6:clean (default-clean) @ org.eclipse.papyrus.uml.alf.tests.releng ---
13:22:01 [INFO] 
13:22:01 [INFO] --- jacoco-maven-plugin:0.7.9:prepare-agent (default-prepare-agent) @ org.eclipse.papyrus.uml.alf.tests.releng ---
13:22:01 [INFO] argLine set to -javaagent:/home/hudson/genie.papyrus/.jenkins/jobs/Papyrus-Oxygen-Tests/workspace/.repository/org/jacoco/org.jacoco.agent/0.7.9/org.jacoco.agent-0.7.9-runtime.jar=destfile=/jobs/genie.papyrus/Papyrus-Oxygen-Tests/workspace/source/tests/junit/plugins/uml/alf/target/jacoco.exec,includes=org.eclipse.papyrus.*,excludes=org.eclipse.uml2
13:22:01 [INFO] 
13:22:01 [INFO] --- jacoco-maven-plugin:0.7.9:report (default-report) @ org.eclipse.papyrus.uml.alf.tests.releng ---
13:22:01 [INFO] Skipping JaCoCo execution due to missing execution data file.
13:22:01 [INFO] 
13:22:01 [INFO] --< org.eclipse.papyrus.tests:org.eclipse.papyrus.uml.alf.backend.tests >--
13:22:01 [INFO] Building org.eclipse.papyrus.uml.alf.backend.tests 1.1.0-SNAPSHOT [149/155]
13:22:01 [INFO] ------------------------[ eclipse-test-plugin ]-------------------------
13:22:01 [INFO] 
13:22:01 [INFO] --- maven-clean-plugin:2.6:clean (default-clean) @ org.eclipse.papyrus.uml.alf.backend.tests ---
13:22:01 [INFO] 
13:22:01 [INFO] --- tycho-packaging-plugin:1.0.0:build-qualifier (default-build-qualifier) @ org.eclipse.papyrus.uml.alf.backend.tests ---
13:22:01 [INFO] The project's OSGi version is 1.1.0.201911111728
13:22:01 [INFO] 
13:22:01 [INFO] --- tycho-packaging-plugin:1.0.0:validate-id (default-validate-id) @ org.eclipse.papyrus.uml.alf.backend.tests ---
13:22:01 [INFO] 
13:22:01 [INFO] --- tycho-packaging-plugin:1.0.0:validate-version (default-validate-version) @ org.eclipse.papyrus.uml.alf.backend.tests ---
13:22:01 [INFO] 
13:22:01 [INFO] --- jacoco-maven-plugin:0.7.9:prepare-agent (default-prepare-agent) @ org.eclipse.papyrus.uml.alf.backend.tests ---
13:22:01 [INFO] tycho.testArgLine set to -javaagent:/home/hudson/genie.papyrus/.jenkins/jobs/Papyrus-Oxygen-Tests/workspace/.repository/org/jacoco/org.jacoco.agent/0.7.9/org.jacoco.agent-0.7.9-runtime.jar=destfile=/jobs/genie.papyrus/Papyrus-Oxygen-Tests/workspace/source/tests/junit/plugins/uml/alf/org.eclipse.papyrus.uml.alf.backend.tests/target/jacoco.exec,includes=org.eclipse.papyrus.*,excludes=org.eclipse.uml2
13:22:01 [INFO] 
13:22:01 [INFO] --- xtend-maven-plugin:2.11.0:compile (default) @ org.eclipse.papyrus.uml.alf.backend.tests ---
13:22:02 [INFO] 
13:22:02 [INFO] --- maven-resources-plugin:2.6:resources (default-resources) @ org.eclipse.papyrus.uml.alf.backend.tests ---
13:22:02 [INFO] Using 'UTF-8' encoding to copy filtered resources.
13:22:02 [INFO] skip non existing resourceDirectory /jobs/genie.papyrus/Papyrus-Oxygen-Tests/workspace/source/tests/junit/plugins/uml/alf/org.eclipse.papyrus.uml.alf.backend.tests/src/main/resources
13:22:02 [INFO] 
13:22:02 [INFO] --- tycho-compiler-plugin:1.0.0:compile (default-compile) @ org.eclipse.papyrus.uml.alf.backend.tests ---
13:22:02 [INFO] Compiling 4 source files to /jobs/genie.papyrus/Papyrus-Oxygen-Tests/workspace/source/tests/junit/plugins/uml/alf/org.eclipse.papyrus.uml.alf.backend.tests/target/classes
13:22:02 [INFO] 
13:22:02 [INFO] --- maven-resources-plugin:2.6:testResources (default-testResources) @ org.eclipse.papyrus.uml.alf.backend.tests ---
13:22:02 [INFO] Using 'UTF-8' encoding to copy filtered resources.
13:22:02 [INFO] skip non existing resourceDirectory /jobs/genie.papyrus/Papyrus-Oxygen-Tests/workspace/source/tests/junit/plugins/uml/alf/org.eclipse.papyrus.uml.alf.backend.tests/src/test/resources
13:22:02 [INFO] 
13:22:02 [INFO] --- target-platform-configuration:1.0.0:target-platform (default-target-platform) @ org.eclipse.papyrus.uml.alf.backend.tests ---
13:22:02 [INFO] 
13:22:02 [INFO] --- tycho-packaging-plugin:1.0.0:package-plugin (default-package-plugin) @ org.eclipse.papyrus.uml.alf.backend.tests ---
13:22:02 [INFO] Building jar: /jobs/genie.papyrus/Papyrus-Oxygen-Tests/workspace/source/tests/junit/plugins/uml/alf/org.eclipse.papyrus.uml.alf.backend.tests/target/org.eclipse.papyrus.uml.alf.backend.tests-1.1.0-SNAPSHOT.jar
13:22:02 [INFO] 
13:22:02 [INFO] --- tycho-p2-plugin:1.0.0:p2-metadata-default (default-p2-metadata-default) @ org.eclipse.papyrus.uml.alf.backend.tests ---
13:22:02 [INFO] 
13:22:02 [INFO] --- tycho-surefire-plugin:1.0.0:test (default-test) @ org.eclipse.papyrus.uml.alf.backend.tests ---
13:22:02 [INFO] Skipping tests
13:22:02 [INFO] 
13:22:02 [INFO] --- jacoco-maven-plugin:0.7.9:report (default-report) @ org.eclipse.papyrus.uml.alf.backend.tests ---
13:22:02 [INFO] Skipping JaCoCo execution due to missing execution data file.
13:22:02 [INFO] 
13:22:02 [INFO] --< org.eclipse.papyrus.tests:org.eclipse.papyrus.uml.internationalization.controlmode.tests >--
13:22:02 [INFO] Building org.eclipse.papyrus.uml.internationalization.controlmode.tests 1.0.0-SNAPSHOT [150/155]
13:22:02 [INFO] ------------------------[ eclipse-test-plugin ]-------------------------
13:22:02 [INFO] 
13:22:02 [INFO] --- maven-clean-plugin:2.6:clean (default-clean) @ org.eclipse.papyrus.uml.internationalization.controlmode.tests ---
13:22:02 [INFO] 
13:22:02 [INFO] --- tycho-packaging-plugin:1.0.0:build-qualifier (default-build-qualifier) @ org.eclipse.papyrus.uml.internationalization.controlmode.tests ---
13:22:02 [INFO] The project's OSGi version is 1.0.0.201911111728
13:22:02 [INFO] 
13:22:02 [INFO] --- tycho-packaging-plugin:1.0.0:validate-id (default-validate-id) @ org.eclipse.papyrus.uml.internationalization.controlmode.tests ---
13:22:02 [INFO] 
13:22:02 [INFO] --- tycho-packaging-plugin:1.0.0:validate-version (default-validate-version) @ org.eclipse.papyrus.uml.internationalization.controlmode.tests ---
13:22:02 [INFO] 
13:22:02 [INFO] --- jacoco-maven-plugin:0.7.9:prepare-agent (default-prepare-agent) @ org.eclipse.papyrus.uml.internationalization.controlmode.tests ---
13:22:02 [INFO] tycho.testArgLine set to -javaagent:/home/hudson/genie.papyrus/.jenkins/jobs/Papyrus-Oxygen-Tests/workspace/.repository/org/jacoco/org.jacoco.agent/0.7.9/org.jacoco.agent-0.7.9-runtime.jar=destfile=/jobs/genie.papyrus/Papyrus-Oxygen-Tests/workspace/source/tests/junit/plugins/uml/internationalization/org.eclipse.papyrus.uml.internationalization.controlmode.tests/target/jacoco.exec,includes=org.eclipse.papyrus.*,excludes=org.eclipse.uml2
13:22:02 [INFO] 
13:22:02 [INFO] --- maven-resources-plugin:2.6:resources (default-resources) @ org.eclipse.papyrus.uml.internationalization.controlmode.tests ---
13:22:02 [INFO] Using 'UTF-8' encoding to copy filtered resources.
13:22:02 [INFO] skip non existing resourceDirectory /jobs/genie.papyrus/Papyrus-Oxygen-Tests/workspace/source/tests/junit/plugins/uml/internationalization/org.eclipse.papyrus.uml.internationalization.controlmode.tests/src/main/resources
13:22:02 [INFO] 
13:22:02 [INFO] --- tycho-compiler-plugin:1.0.0:compile (default-compile) @ org.eclipse.papyrus.uml.internationalization.controlmode.tests ---
13:22:02 [INFO] Compiling 5 source files to /jobs/genie.papyrus/Papyrus-Oxygen-Tests/workspace/source/tests/junit/plugins/uml/internationalization/org.eclipse.papyrus.uml.internationalization.controlmode.tests/target/classes
13:22:03 [INFO] 
13:22:03 [INFO] --- maven-resources-plugin:2.6:testResources (default-testResources) @ org.eclipse.papyrus.uml.internationalization.controlmode.tests ---
13:22:03 [INFO] Using 'UTF-8' encoding to copy filtered resources.
13:22:03 [INFO] skip non existing resourceDirectory /jobs/genie.papyrus/Papyrus-Oxygen-Tests/workspace/source/tests/junit/plugins/uml/internationalization/org.eclipse.papyrus.uml.internationalization.controlmode.tests/src/test/resources
13:22:03 [INFO] 
13:22:03 [INFO] --- target-platform-configuration:1.0.0:target-platform (default-target-platform) @ org.eclipse.papyrus.uml.internationalization.controlmode.tests ---
13:22:03 [INFO] 
13:22:03 [INFO] --- tycho-packaging-plugin:1.0.0:package-plugin (default-package-plugin) @ org.eclipse.papyrus.uml.internationalization.controlmode.tests ---
13:22:03 [INFO] Building jar: /jobs/genie.papyrus/Papyrus-Oxygen-Tests/workspace/source/tests/junit/plugins/uml/internationalization/org.eclipse.papyrus.uml.internationalization.controlmode.tests/target/org.eclipse.papyrus.uml.internationalization.controlmode.tests-1.0.0-SNAPSHOT.jar
13:22:03 [INFO] 
13:22:03 [INFO] --- tycho-p2-plugin:1.0.0:p2-metadata-default (default-p2-metadata-default) @ org.eclipse.papyrus.uml.internationalization.controlmode.tests ---
13:22:03 [INFO] 
13:22:03 [INFO] --- tycho-surefire-plugin:1.0.0:test (default-test) @ org.eclipse.papyrus.uml.internationalization.controlmode.tests ---
13:22:03 [INFO] Skipping tests
13:22:03 [INFO] 
13:22:03 [INFO] --- jacoco-maven-plugin:0.7.9:report (default-report) @ org.eclipse.papyrus.uml.internationalization.controlmode.tests ---
13:22:03 [INFO] Skipping JaCoCo execution due to missing execution data file.
13:22:03 [INFO] 
13:22:03 [INFO] --< org.eclipse.papyrus.tests:org.eclipse.papyrus.views.properties.toolsmiths.tests >--
13:22:03 [INFO] Building org.eclipse.papyrus.views.properties.toolsmiths.tests 1.2.0-SNAPSHOT [151/155]
13:22:03 [INFO] ------------------------[ eclipse-test-plugin ]-------------------------
13:22:03 [INFO] 
13:22:03 [INFO] --- maven-clean-plugin:2.6:clean (default-clean) @ org.eclipse.papyrus.views.properties.toolsmiths.tests ---
13:22:03 [INFO] 
13:22:03 [INFO] --- tycho-packaging-plugin:1.0.0:build-qualifier (default-build-qualifier) @ org.eclipse.papyrus.views.properties.toolsmiths.tests ---
13:22:03 [INFO] The project's OSGi version is 1.2.0.201911111728
13:22:03 [INFO] 
13:22:03 [INFO] --- tycho-packaging-plugin:1.0.0:validate-id (default-validate-id) @ org.eclipse.papyrus.views.properties.toolsmiths.tests ---
13:22:03 [INFO] 
13:22:03 [INFO] --- tycho-packaging-plugin:1.0.0:validate-version (default-validate-version) @ org.eclipse.papyrus.views.properties.toolsmiths.tests ---
13:22:03 [INFO] 
13:22:03 [INFO] --- jacoco-maven-plugin:0.7.9:prepare-agent (default-prepare-agent) @ org.eclipse.papyrus.views.properties.toolsmiths.tests ---
13:22:03 [INFO] tycho.testArgLine set to -javaagent:/home/hudson/genie.papyrus/.jenkins/jobs/Papyrus-Oxygen-Tests/workspace/.repository/org/jacoco/org.jacoco.agent/0.7.9/org.jacoco.agent-0.7.9-runtime.jar=destfile=/jobs/genie.papyrus/Papyrus-Oxygen-Tests/workspace/source/tests/junit/plugins/views/org.eclipse.papyrus.views.properties.toolsmiths.tests/target/jacoco.exec,includes=org.eclipse.papyrus.*,excludes=org.eclipse.uml2
13:22:03 [INFO] 
13:22:03 [INFO] --- maven-resources-plugin:2.6:resources (default-resources) @ org.eclipse.papyrus.views.properties.toolsmiths.tests ---
13:22:03 [INFO] Using 'UTF-8' encoding to copy filtered resources.
13:22:03 [INFO] skip non existing resourceDirectory /jobs/genie.papyrus/Papyrus-Oxygen-Tests/workspace/source/tests/junit/plugins/views/org.eclipse.papyrus.views.properties.toolsmiths.tests/src/main/resources
13:22:03 [INFO] 
13:22:03 [INFO] --- tycho-compiler-plugin:1.0.0:compile (default-compile) @ org.eclipse.papyrus.views.properties.toolsmiths.tests ---
13:22:03 [INFO] Compiling 3 source files to /jobs/genie.papyrus/Papyrus-Oxygen-Tests/workspace/source/tests/junit/plugins/views/org.eclipse.papyrus.views.properties.toolsmiths.tests/target/classes
13:22:03 [WARNING] /jobs/genie.papyrus/Papyrus-Oxygen-Tests/workspace/source/tests/junit/plugins/views/org.eclipse.papyrus.views.properties.toolsmiths.tests/src/org/eclipse/papyrus/views/properties/toolsmiths/tests/qvt/TransformationsTests.java:[164] 
13:22:03 	ModelExtent temp = new BasicModelExtent();
13:22:03 	            ^^^^
13:22:03 The value of the local variable temp is not used
13:22:03 [WARNING] /jobs/genie.papyrus/Papyrus-Oxygen-Tests/workspace/source/tests/junit/plugins/views/org.eclipse.papyrus.views.properties.toolsmiths.tests/src/org/eclipse/papyrus/views/properties/toolsmiths/tests/qvt/TransformationsTests.java:[275] 
13:22:03 	DataContextElement st3Element = findContextElement(context, "Stereotype3");
13:22:03 	                   ^^^^^^^^^^
13:22:03 The value of the local variable st3Element is not used
13:22:03 2 problems (2 warnings)
13:22:03 [INFO] 
13:22:03 [INFO] --- maven-resources-plugin:2.6:testResources (default-testResources) @ org.eclipse.papyrus.views.properties.toolsmiths.tests ---
13:22:03 [INFO] Using 'UTF-8' encoding to copy filtered resources.
13:22:03 [INFO] skip non existing resourceDirectory /jobs/genie.papyrus/Papyrus-Oxygen-Tests/workspace/source/tests/junit/plugins/views/org.eclipse.papyrus.views.properties.toolsmiths.tests/src/test/resources
13:22:03 [INFO] 
13:22:03 [INFO] --- target-platform-configuration:1.0.0:target-platform (default-target-platform) @ org.eclipse.papyrus.views.properties.toolsmiths.tests ---
13:22:03 [INFO] 
13:22:03 [INFO] --- tycho-packaging-plugin:1.0.0:package-plugin (default-package-plugin) @ org.eclipse.papyrus.views.properties.toolsmiths.tests ---
13:22:03 [INFO] Building jar: /jobs/genie.papyrus/Papyrus-Oxygen-Tests/workspace/source/tests/junit/plugins/views/org.eclipse.papyrus.views.properties.toolsmiths.tests/target/org.eclipse.papyrus.views.properties.toolsmiths.tests-1.2.0-SNAPSHOT.jar
13:22:03 [INFO] 
13:22:03 [INFO] --- tycho-p2-plugin:1.0.0:p2-metadata-default (default-p2-metadata-default) @ org.eclipse.papyrus.views.properties.toolsmiths.tests ---
13:22:03 [INFO] 
13:22:03 [INFO] --- tycho-surefire-plugin:1.0.0:test (default-test) @ org.eclipse.papyrus.views.properties.toolsmiths.tests ---
13:22:03 [INFO] Skipping tests
13:22:03 [INFO] 
13:22:03 [INFO] --- jacoco-maven-plugin:0.7.9:report (default-report) @ org.eclipse.papyrus.views.properties.toolsmiths.tests ---
13:22:03 [INFO] Skipping JaCoCo execution due to missing execution data file.
13:22:03 [INFO] 
13:22:03 [INFO] --< org.eclipse.papyrus.tests:org.eclipse.papyrus.views.suite.tests >---
13:22:03 [INFO] Building org.eclipse.papyrus.views.suite.tests 0.0.1-SNAPSHOT  [152/155]
13:22:03 [INFO] ------------------------[ eclipse-test-plugin ]-------------------------
13:22:03 [INFO] 
13:22:03 [INFO] --- maven-clean-plugin:2.6:clean (default-clean) @ org.eclipse.papyrus.views.suite.tests ---
13:22:03 [INFO] 
13:22:03 [INFO] --- tycho-packaging-plugin:1.0.0:build-qualifier (default-build-qualifier) @ org.eclipse.papyrus.views.suite.tests ---
13:22:03 [INFO] The project's OSGi version is 0.0.1.201911111728
13:22:03 [INFO] 
13:22:03 [INFO] --- tycho-packaging-plugin:1.0.0:validate-id (default-validate-id) @ org.eclipse.papyrus.views.suite.tests ---
13:22:03 [INFO] 
13:22:03 [INFO] --- tycho-packaging-plugin:1.0.0:validate-version (default-validate-version) @ org.eclipse.papyrus.views.suite.tests ---
13:22:03 [INFO] 
13:22:03 [INFO] --- jacoco-maven-plugin:0.7.9:prepare-agent (default-prepare-agent) @ org.eclipse.papyrus.views.suite.tests ---
13:22:03 [INFO] tycho.testArgLine set to -javaagent:/home/hudson/genie.papyrus/.jenkins/jobs/Papyrus-Oxygen-Tests/workspace/.repository/org/jacoco/org.jacoco.agent/0.7.9/org.jacoco.agent-0.7.9-runtime.jar=destfile=/jobs/genie.papyrus/Papyrus-Oxygen-Tests/workspace/source/tests/junit/plugins/views/org.eclipse.papyrus.views.suite.tests/target/jacoco.exec,includes=org.eclipse.papyrus.*,excludes=org.eclipse.uml2
13:22:03 [INFO] 
13:22:03 [INFO] --- maven-resources-plugin:2.6:resources (default-resources) @ org.eclipse.papyrus.views.suite.tests ---
13:22:03 [INFO] Using 'UTF-8' encoding to copy filtered resources.
13:22:03 [INFO] skip non existing resourceDirectory /jobs/genie.papyrus/Papyrus-Oxygen-Tests/workspace/source/tests/junit/plugins/views/org.eclipse.papyrus.views.suite.tests/src/main/resources
13:22:03 [INFO] 
13:22:03 [INFO] --- tycho-compiler-plugin:1.0.0:compile (default-compile) @ org.eclipse.papyrus.views.suite.tests ---
13:22:03 [INFO] Compiling 2 source files to /jobs/genie.papyrus/Papyrus-Oxygen-Tests/workspace/source/tests/junit/plugins/views/org.eclipse.papyrus.views.suite.tests/target/classes
13:22:04 [INFO] 
13:22:04 [INFO] --- maven-resources-plugin:2.6:testResources (default-testResources) @ org.eclipse.papyrus.views.suite.tests ---
13:22:04 [INFO] Using 'UTF-8' encoding to copy filtered resources.
13:22:04 [INFO] skip non existing resourceDirectory /jobs/genie.papyrus/Papyrus-Oxygen-Tests/workspace/source/tests/junit/plugins/views/org.eclipse.papyrus.views.suite.tests/src/test/resources
13:22:04 [INFO] 
13:22:04 [INFO] --- target-platform-configuration:1.0.0:target-platform (default-target-platform) @ org.eclipse.papyrus.views.suite.tests ---
13:22:04 [INFO] 
13:22:04 [INFO] --- tycho-packaging-plugin:1.0.0:package-plugin (default-package-plugin) @ org.eclipse.papyrus.views.suite.tests ---
13:22:04 [INFO] Building jar: /jobs/genie.papyrus/Papyrus-Oxygen-Tests/workspace/source/tests/junit/plugins/views/org.eclipse.papyrus.views.suite.tests/target/org.eclipse.papyrus.views.suite.tests-0.0.1-SNAPSHOT.jar
13:22:04 [INFO] 
13:22:04 [INFO] --- tycho-p2-plugin:1.0.0:p2-metadata-default (default-p2-metadata-default) @ org.eclipse.papyrus.views.suite.tests ---
13:22:04 [INFO] 
13:22:04 [INFO] --- tycho-surefire-plugin:1.0.0:test (default-test) @ org.eclipse.papyrus.views.suite.tests ---
13:22:05 [INFO] Expected eclipse log file: /jobs/genie.papyrus/Papyrus-Oxygen-Tests/workspace/source/tests/junit/plugins/views/org.eclipse.papyrus.views.suite.tests/target/work/data/.metadata/.log
13:22:05 [INFO] Command line:
13:22:05 	[/opt/public/common/java/oracle/jdk1.8.0_192_x64/jre/bin/java, -Dosgi.noShutdown=false, -Dosgi.os=linux, -Dosgi.ws=gtk, -Dosgi.arch=x86_64, -javaagent:/home/hudson/genie.papyrus/.jenkins/jobs/Papyrus-Oxygen-Tests/workspace/.repository/org/jacoco/org.jacoco.agent/0.7.9/org.jacoco.agent-0.7.9-runtime.jar=destfile=/jobs/genie.papyrus/Papyrus-Oxygen-Tests/workspace/source/tests/junit/plugins/views/org.eclipse.papyrus.views.suite.tests/target/jacoco.exec,includes=org.eclipse.papyrus.*,excludes=org.eclipse.uml2, -Xms512m, -Xmx2048m, -XX:SoftRefLRUPolicyMSPerMB=100, -Dosgi.clean=true, -jar, /jobs/genie.papyrus/Papyrus-Oxygen-Tests/workspace/.repository/p2/osgi/bundle/org.eclipse.equinox.launcher/1.4.0.v20161219-1356/org.eclipse.equinox.launcher-1.4.0.v20161219-1356.jar, -data, /jobs/genie.papyrus/Papyrus-Oxygen-Tests/workspace/source/tests/junit/plugins/views/org.eclipse.papyrus.views.suite.tests/target/work/data, -install, /jobs/genie.papyrus/Papyrus-Oxygen-Tests/workspace/source/tests/junit/plugins/views/org.eclipse.papyrus.views.suite.tests/target/work, -configuration, /jobs/genie.papyrus/Papyrus-Oxygen-Tests/workspace/source/tests/junit/plugins/views/org.eclipse.papyrus.views.suite.tests/target/work/configuration, -application, org.eclipse.tycho.surefire.osgibooter.uitest, -testproperties, /jobs/genie.papyrus/Papyrus-Oxygen-Tests/workspace/source/tests/junit/plugins/views/org.eclipse.papyrus.views.suite.tests/target/surefire.properties, -product, org.eclipse.sdk.ide, -testConfig=CI_TESTS_CONFIG]
13:22:05 Picked up JAVA_TOOL_OPTIONS: -Xmx2G -Djava.io.tmpdir=/tmp/genie.papyrus -DforkCount=1
13:22:13 
13:22:13 -------------------------------------------------------
13:22:13  T E S T S
13:22:13 -------------------------------------------------------
13:22:13 Running org.eclipse.papyrus.views.suite.tests.AllTests
13:22:31 Tests run: 10, Failures: 0, Errors: 0, Skipped: 0, Time elapsed: 17.519 sec - in org.eclipse.papyrus.views.suite.tests.AllTests
13:22:31 revealSemanticElement_rootTest(org.eclipse.papyrus.views.modelexplorer.tests.ModelExplorerViewTests)  Time elapsed: 8.487 sec
13:22:31 deleteDiagramTest(org.eclipse.papyrus.views.modelexplorer.tests.DeleteHandlerTest)  Time elapsed: 3.158 sec
13:22:31 deleteTableTest(org.eclipse.papyrus.views.modelexplorer.tests.DeleteHandlerTest)  Time elapsed: 1.28 sec
13:22:31 deleteLinkItemTest(org.eclipse.papyrus.views.modelexplorer.tests.DeleteHandlerTest)  Time elapsed: 1.128 sec
13:22:31 deleteRootOfTheModel(org.eclipse.papyrus.views.modelexplorer.tests.DeleteHandlerTest)  Time elapsed: 1.164 sec
13:22:31 testOpendiagramTest(org.eclipse.papyrus.views.modelexplorer.tests.OpendiagramTest)  Time elapsed: 0.487 sec
13:22:31 handleXWTFileFromResourceSet(org.eclipse.papyrus.views.properties.toolsmiths.tests.qvt.TransformationsTests)  Time elapsed: 0.753 sec
13:22:31 handleXWTFileFromResource(org.eclipse.papyrus.views.properties.toolsmiths.tests.qvt.TransformationsTests)  Time elapsed: 0.153 sec
13:22:31 generateEcoreContext(org.eclipse.papyrus.views.properties.toolsmiths.tests.qvt.TransformationsTests)  Time elapsed: 0.068 sec
13:22:31 generateProfileContext(org.eclipse.papyrus.views.properties.toolsmiths.tests.qvt.TransformationsTests)  Time elapsed: 0.373 sec
13:22:31 
13:22:31 Results :
13:22:31 
13:22:31 Tests run: 10, Failures: 0, Errors: 0, Skipped: 0
13:22:31 
13:22:33 [INFO] All tests passed!
13:22:33 [INFO] 
13:22:33 [INFO] --- jacoco-maven-plugin:0.7.9:report (default-report) @ org.eclipse.papyrus.views.suite.tests ---
13:22:33 [INFO] Loading execution data file /jobs/genie.papyrus/Papyrus-Oxygen-Tests/workspace/source/tests/junit/plugins/views/org.eclipse.papyrus.views.suite.tests/target/jacoco.exec
13:22:33 [INFO] Analyzed bundle 'org.eclipse.papyrus.views.suite.tests' with 0 classes
13:22:33 [INFO] 
13:22:33 [INFO] --< org.eclipse.papyrus.tests:org.eclipse.papyrus.toolsmiths.suite.tests >--
13:22:33 [INFO] Building org.eclipse.papyrus.toolsmiths.suite.tests 0.0.1-SNAPSHOT [153/155]
13:22:33 [INFO] ------------------------[ eclipse-test-plugin ]-------------------------
13:22:33 [INFO] 
13:22:33 [INFO] --- maven-clean-plugin:2.6:clean (default-clean) @ org.eclipse.papyrus.toolsmiths.suite.tests ---
13:22:33 [INFO] 
13:22:33 [INFO] --- tycho-packaging-plugin:1.0.0:build-qualifier (default-build-qualifier) @ org.eclipse.papyrus.toolsmiths.suite.tests ---
13:22:33 [INFO] The project's OSGi version is 0.0.1.201911111728
13:22:33 [INFO] 
13:22:33 [INFO] --- tycho-packaging-plugin:1.0.0:validate-id (default-validate-id) @ org.eclipse.papyrus.toolsmiths.suite.tests ---
13:22:33 [INFO] 
13:22:33 [INFO] --- tycho-packaging-plugin:1.0.0:validate-version (default-validate-version) @ org.eclipse.papyrus.toolsmiths.suite.tests ---
13:22:33 [INFO] 
13:22:33 [INFO] --- jacoco-maven-plugin:0.7.9:prepare-agent (default-prepare-agent) @ org.eclipse.papyrus.toolsmiths.suite.tests ---
13:22:33 [INFO] tycho.testArgLine set to -javaagent:/home/hudson/genie.papyrus/.jenkins/jobs/Papyrus-Oxygen-Tests/workspace/.repository/org/jacoco/org.jacoco.agent/0.7.9/org.jacoco.agent-0.7.9-runtime.jar=destfile=/jobs/genie.papyrus/Papyrus-Oxygen-Tests/workspace/source/tests/junit/plugins/toolsmiths/org.eclipse.papyrus.toolsmiths.suite.tests/target/jacoco.exec,includes=org.eclipse.papyrus.*,excludes=org.eclipse.uml2
13:22:33 [INFO] 
13:22:33 [INFO] --- maven-resources-plugin:2.6:resources (default-resources) @ org.eclipse.papyrus.toolsmiths.suite.tests ---
13:22:33 [INFO] Using 'UTF-8' encoding to copy filtered resources.
13:22:33 [INFO] skip non existing resourceDirectory /jobs/genie.papyrus/Papyrus-Oxygen-Tests/workspace/source/tests/junit/plugins/toolsmiths/org.eclipse.papyrus.toolsmiths.suite.tests/src/main/resources
13:22:33 [INFO] 
13:22:33 [INFO] --- tycho-compiler-plugin:1.0.0:compile (default-compile) @ org.eclipse.papyrus.toolsmiths.suite.tests ---
13:22:33 [INFO] Compiling 2 source files to /jobs/genie.papyrus/Papyrus-Oxygen-Tests/workspace/source/tests/junit/plugins/toolsmiths/org.eclipse.papyrus.toolsmiths.suite.tests/target/classes
13:22:34 [INFO] 
13:22:34 [INFO] --- maven-resources-plugin:2.6:testResources (default-testResources) @ org.eclipse.papyrus.toolsmiths.suite.tests ---
13:22:34 [INFO] Using 'UTF-8' encoding to copy filtered resources.
13:22:34 [INFO] skip non existing resourceDirectory /jobs/genie.papyrus/Papyrus-Oxygen-Tests/workspace/source/tests/junit/plugins/toolsmiths/org.eclipse.papyrus.toolsmiths.suite.tests/src/test/resources
13:22:34 [INFO] 
13:22:34 [INFO] --- target-platform-configuration:1.0.0:target-platform (default-target-platform) @ org.eclipse.papyrus.toolsmiths.suite.tests ---
13:22:34 [INFO] 
13:22:34 [INFO] --- tycho-packaging-plugin:1.0.0:package-plugin (default-package-plugin) @ org.eclipse.papyrus.toolsmiths.suite.tests ---
13:22:34 [INFO] Building jar: /jobs/genie.papyrus/Papyrus-Oxygen-Tests/workspace/source/tests/junit/plugins/toolsmiths/org.eclipse.papyrus.toolsmiths.suite.tests/target/org.eclipse.papyrus.toolsmiths.suite.tests-0.0.1-SNAPSHOT.jar
13:22:34 [INFO] 
13:22:34 [INFO] --- tycho-p2-plugin:1.0.0:p2-metadata-default (default-p2-metadata-default) @ org.eclipse.papyrus.toolsmiths.suite.tests ---
13:22:34 [INFO] 
13:22:34 [INFO] --- tycho-surefire-plugin:1.0.0:test (default-test) @ org.eclipse.papyrus.toolsmiths.suite.tests ---
13:22:35 [INFO] Expected eclipse log file: /jobs/genie.papyrus/Papyrus-Oxygen-Tests/workspace/source/tests/junit/plugins/toolsmiths/org.eclipse.papyrus.toolsmiths.suite.tests/target/work/data/.metadata/.log
13:22:35 [INFO] Command line:
13:22:35 	[/opt/public/common/java/oracle/jdk1.8.0_192_x64/jre/bin/java, -Dosgi.noShutdown=false, -Dosgi.os=linux, -Dosgi.ws=gtk, -Dosgi.arch=x86_64, -javaagent:/home/hudson/genie.papyrus/.jenkins/jobs/Papyrus-Oxygen-Tests/workspace/.repository/org/jacoco/org.jacoco.agent/0.7.9/org.jacoco.agent-0.7.9-runtime.jar=destfile=/jobs/genie.papyrus/Papyrus-Oxygen-Tests/workspace/source/tests/junit/plugins/toolsmiths/org.eclipse.papyrus.toolsmiths.suite.tests/target/jacoco.exec,includes=org.eclipse.papyrus.*,excludes=org.eclipse.uml2, -Xms512m, -Xmx2048m, -XX:SoftRefLRUPolicyMSPerMB=100, -Dosgi.clean=true, -jar, /jobs/genie.papyrus/Papyrus-Oxygen-Tests/workspace/.repository/p2/osgi/bundle/org.eclipse.equinox.launcher/1.4.0.v20161219-1356/org.eclipse.equinox.launcher-1.4.0.v20161219-1356.jar, -data, /jobs/genie.papyrus/Papyrus-Oxygen-Tests/workspace/source/tests/junit/plugins/toolsmiths/org.eclipse.papyrus.toolsmiths.suite.tests/target/work/data, -install, /jobs/genie.papyrus/Papyrus-Oxygen-Tests/workspace/source/tests/junit/plugins/toolsmiths/org.eclipse.papyrus.toolsmiths.suite.tests/target/work, -configuration, /jobs/genie.papyrus/Papyrus-Oxygen-Tests/workspace/source/tests/junit/plugins/toolsmiths/org.eclipse.papyrus.toolsmiths.suite.tests/target/work/configuration, -application, org.eclipse.tycho.surefire.osgibooter.uitest, -testproperties, /jobs/genie.papyrus/Papyrus-Oxygen-Tests/workspace/source/tests/junit/plugins/toolsmiths/org.eclipse.papyrus.toolsmiths.suite.tests/target/surefire.properties, -product, org.eclipse.sdk.ide, -testConfig=CI_TESTS_CONFIG]
13:22:35 Picked up JAVA_TOOL_OPTIONS: -Xmx2G -Djava.io.tmpdir=/tmp/genie.papyrus -DforkCount=1
13:22:43 
13:22:43 -------------------------------------------------------
13:22:43  T E S T S
13:22:43 -------------------------------------------------------
13:22:43 Running org.eclipse.papyrus.toolsmiths.suite.tests.AllTests
13:22:44 log4j:WARN No appenders could be found for logger (org.eclipse.emf.compare.EMFCompare).
13:22:44 log4j:WARN Please initialize the log4j system properly.
13:22:46 Tests run: 21, Failures: 0, Errors: 0, Skipped: 0, Time elapsed: 2.556 sec - in org.eclipse.papyrus.toolsmiths.suite.tests.AllTests
13:22:46 ProfileAutomaticMigrationTest(org.eclipse.papyrus.toolsmiths.profilemigration.tests.automatic.AutomaticMigrationTest)  Time elapsed: 0.004 sec
13:22:46 PackageAutomaticMigrationTest(org.eclipse.papyrus.toolsmiths.profilemigration.tests.automatic.AutomaticMigrationTest)  Time elapsed: 0.01 sec
13:22:46 StereotypeAutomaticMigrationTest_Stereotype_delete_Property(org.eclipse.papyrus.toolsmiths.profilemigration.tests.automatic.AutomaticMigrationTest)  Time elapsed: 0 sec
13:22:46 PropertyAutomaticMigrationTest(org.eclipse.papyrus.toolsmiths.profilemigration.tests.automatic.AutomaticMigrationTest)  Time elapsed: 0.001 sec
13:22:46 StereotypeAutomaticMigrationTest(org.eclipse.papyrus.toolsmiths.profilemigration.tests.automatic.AutomaticMigrationTest)  Time elapsed: 0.001 sec
13:22:46 GeneralizationAutomaticMigrationTest(org.eclipse.papyrus.toolsmiths.profilemigration.tests.automatic.AutomaticMigrationTest)  Time elapsed: 0.001 sec
13:22:46 atomicListTest(org.eclipse.papyrus.toolsmiths.profilemigration.tests.migrators.ChangeIsAbstractFromStereotypeTest)  Time elapsed: 0.001 sec
13:22:46 atomicListMoveProfileIntoNonApplyProfileTest(org.eclipse.papyrus.toolsmiths.profilemigration.tests.migrators.MoveMigratorTest)  Time elapsed: 0.042 sec
13:22:46 atomicListMoveStereotypeIntoNonApplyProfileTest(org.eclipse.papyrus.toolsmiths.profilemigration.tests.migrators.MoveMigratorTest)  Time elapsed: 0.04 sec
13:22:46 atomicListMovePackageIntoAlreadyApplyProfileTest(org.eclipse.papyrus.toolsmiths.profilemigration.tests.migrators.MoveMigratorTest)  Time elapsed: 0.035 sec
13:22:46 atomicListMoveStereotypeIntoAlreadyApplyProfileTest(org.eclipse.papyrus.toolsmiths.profilemigration.tests.migrators.MoveMigratorTest)  Time elapsed: 0.028 sec
13:22:46 atomicListMovePackageIntoNonApplyProfileTest(org.eclipse.papyrus.toolsmiths.profilemigration.tests.migrators.MoveMigratorTest)  Time elapsed: 0.028 sec
13:22:46 atomicListMoveProfileIntoAlreadyApplyProfileTest(org.eclipse.papyrus.toolsmiths.profilemigration.tests.migrators.MoveMigratorTest)  Time elapsed: 0.03 sec
13:22:46 UpperMultiplicityTest(org.eclipse.papyrus.toolsmiths.profilemigration.tests.migrators.ChangeMultiplicityFromPropertyMigratorTest)  Time elapsed: 0.001 sec
13:22:46 atomicListTest(org.eclipse.papyrus.toolsmiths.profilemigration.tests.migrators.ChangeMultiplicityFromPropertyMigratorTest)  Time elapsed: 0 sec
13:22:46 LowerMultiplicityTest(org.eclipse.papyrus.toolsmiths.profilemigration.tests.migrators.ChangeMultiplicityFromPropertyMigratorTest)  Time elapsed: 0 sec
13:22:46 DeleteEnumerationLiteralTest(org.eclipse.papyrus.toolsmiths.profilemigration.tests.migrators.DeleteEnumLiteralFromEnumerationTest)  Time elapsed: 0.002 sec
13:22:46 MoveEnumerationLiteralTest(org.eclipse.papyrus.toolsmiths.profilemigration.tests.migrators.DeleteEnumLiteralFromEnumerationTest)  Time elapsed: 0.001 sec
13:22:46 atomicListTest(org.eclipse.papyrus.toolsmiths.profilemigration.tests.migrators.DeleteEnumLiteralFromEnumerationTest)  Time elapsed: 0 sec
13:22:46 atomicListTest(org.eclipse.papyrus.toolsmiths.profilemigration.tests.migrators.ChangeIsStaticFromPropertyTest)  Time elapsed: 0.002 sec
13:22:46 atomicListTest(org.eclipse.papyrus.toolsmiths.profilemigration.tests.migrators.AddPropertyToStereotypeTest)  Time elapsed: 0.001 sec
13:22:46 
13:22:46 Results :
13:22:46 
13:22:46 Tests run: 21, Failures: 0, Errors: 0, Skipped: 0
13:22:46 
13:22:48 [INFO] All tests passed!
13:22:48 [INFO] 
13:22:48 [INFO] --- jacoco-maven-plugin:0.7.9:report (default-report) @ org.eclipse.papyrus.toolsmiths.suite.tests ---
13:22:48 [INFO] Loading execution data file /jobs/genie.papyrus/Papyrus-Oxygen-Tests/workspace/source/tests/junit/plugins/toolsmiths/org.eclipse.papyrus.toolsmiths.suite.tests/target/jacoco.exec
13:22:48 [INFO] Analyzed bundle 'org.eclipse.papyrus.toolsmiths.suite.tests' with 0 classes
13:22:48 [INFO] 
13:22:48 [INFO] --< org.eclipse.papyrus:org.eclipse.papyrus.main.tests.target.parent >--
13:22:48 [INFO] Building org.eclipse.papyrus.main.tests.target.parent 0.0.1-SNAPSHOT [154/155]
13:22:48 [INFO] --------------------------------[ pom ]---------------------------------
13:22:48 [INFO] 
13:22:48 [INFO] --- maven-clean-plugin:2.6:clean (default-clean) @ org.eclipse.papyrus.main.tests.target.parent ---
13:22:48 [INFO] 
13:22:48 [INFO] --- jacoco-maven-plugin:0.7.9:prepare-agent (default-prepare-agent) @ org.eclipse.papyrus.main.tests.target.parent ---
13:22:48 [INFO] argLine set to -javaagent:/home/hudson/genie.papyrus/.jenkins/jobs/Papyrus-Oxygen-Tests/workspace/.repository/org/jacoco/org.jacoco.agent/0.7.9/org.jacoco.agent-0.7.9-runtime.jar=destfile=/jobs/genie.papyrus/Papyrus-Oxygen-Tests/workspace/source/releng/main-tests/targetPlatform/target/jacoco.exec,includes=org.eclipse.papyrus.*,excludes=org.eclipse.uml2
13:22:48 [INFO] 
13:22:48 [INFO] --- jacoco-maven-plugin:0.7.9:report (default-report) @ org.eclipse.papyrus.main.tests.target.parent ---
13:22:48 [INFO] Skipping JaCoCo execution due to missing execution data file.
13:22:48 [INFO] 
13:22:48 [INFO] --< org.eclipse.papyrus:org.eclipse.papyrus.main.tests.portable.target >--
13:22:48 [INFO] Building org.eclipse.papyrus.main.tests.portable.target 0.0.1-SNAPSHOT [155/155]
13:22:48 [INFO] ---------------------[ eclipse-target-definition ]----------------------
13:22:48 [INFO] 
13:22:48 [INFO] --- maven-clean-plugin:2.6:clean (default-clean) @ org.eclipse.papyrus.main.tests.portable.target ---
13:22:48 [INFO] 
13:22:48 [INFO] --- jacoco-maven-plugin:0.7.9:prepare-agent (default-prepare-agent) @ org.eclipse.papyrus.main.tests.portable.target ---
13:22:48 [INFO] argLine set to -javaagent:/home/hudson/genie.papyrus/.jenkins/jobs/Papyrus-Oxygen-Tests/workspace/.repository/org/jacoco/org.jacoco.agent/0.7.9/org.jacoco.agent-0.7.9-runtime.jar=destfile=/jobs/genie.papyrus/Papyrus-Oxygen-Tests/workspace/source/releng/main-tests/targetPlatform/portable/target/jacoco.exec,includes=org.eclipse.papyrus.*,excludes=org.eclipse.uml2
13:22:48 [INFO] 
13:22:48 [INFO] --- tycho-packaging-plugin:1.0.0:package-target-definition (default-package-target-definition) @ org.eclipse.papyrus.main.tests.portable.target ---
13:22:48 [INFO] 
13:22:48 [INFO] --- jacoco-maven-plugin:0.7.9:report (default-report) @ org.eclipse.papyrus.main.tests.portable.target ---
13:22:48 [INFO] Skipping JaCoCo execution due to missing execution data file.
13:22:48 [INFO] ------------------------------------------------------------------------
13:22:48 [INFO] Reactor Summary:
13:22:48 [INFO] 
13:22:48 [INFO] org.eclipse.papyrus.tests.releng 1.2.0-SNAPSHOT .... SUCCESS [01:21 min]
13:22:48 [INFO] org.eclipse.papyrus.plugins.tests.releng 0.0.1-SNAPSHOT SUCCESS [  0.006 s]
13:22:48 [INFO] org.eclipse.papyrus.editor.tests.releng 0.0.1-SNAPSHOT SUCCESS [  0.008 s]
13:22:48 [INFO] org.eclipse.papyrus.editor.integration.tests 1.3.100-SNAPSHOT SUCCESS [ 32.156 s]
13:22:48 [INFO] org.eclipse.papyrus.infra.tests.releng 0.0.1-SNAPSHOT SUCCESS [  0.008 s]
13:22:48 [INFO] org.eclipse.papyrus.infra.core.tests.releng 0.0.1-SNAPSHOT SUCCESS [  0.006 s]
13:22:48 [INFO] org.eclipse.papyrus.infra.core.clipboard.tests 1.3.0-SNAPSHOT SUCCESS [  0.661 s]
13:22:48 [INFO] org.eclipse.papyrus.infra.core.sasheditor.tests 1.2.0-SNAPSHOT SUCCESS [  1.518 s]
13:22:48 [INFO] org.eclipse.papyrus.infra.core.sasheditor.di.tests 1.2.0-SNAPSHOT SUCCESS [  0.376 s]
13:22:48 [INFO] org.eclipse.papyrus.infra.core.tests 3.0.1-SNAPSHOT  SUCCESS [  0.937 s]
13:22:48 [INFO] org.eclipse.papyrus.infra.editor.tests.releng 0.0.1-SNAPSHOT SUCCESS [  0.004 s]
13:22:48 [INFO] org.eclipse.papyrus.infra.editor.welcome.tests 1.2.0-SNAPSHOT SUCCESS [  0.566 s]
13:22:48 [INFO] org.eclipse.papyrus.infra.emf.tests.releng 0.0.1-SNAPSHOT SUCCESS [  0.005 s]
13:22:48 [INFO] org.eclipse.papyrus.infra.emf.gmf.tests 1.2.100-SNAPSHOT SUCCESS [  0.388 s]
13:22:48 [INFO] org.eclipse.papyrus.infra.emf.readonly.tests 1.2.0-SNAPSHOT SUCCESS [  0.429 s]
13:22:48 [INFO] org.eclipse.papyrus.infra.emf.tests 1.4.0-SNAPSHOT . SUCCESS [  0.694 s]
13:22:48 [INFO] org.eclipse.papyrus.infra.filters.tests 1.2.0-SNAPSHOT SUCCESS [  0.316 s]
13:22:48 [INFO] org.eclipse.papyrus.infra.gmfdiag.tests.releng 0.0.1-SNAPSHOT SUCCESS [  0.005 s]
13:22:48 [INFO] org.eclipse.papyrus.infra.gmfdiag.assistant.tests.releng 0.0.1-SNAPSHOT SUCCESS [  0.006 s]
13:22:48 [INFO] org.eclipse.papyrus.infra.gmfdiag.assistant.tests 1.2.0-SNAPSHOT SUCCESS [  0.636 s]
13:22:48 [INFO] org.eclipse.papyrus.infra.gmfdiag.canonical.tests 1.2.0-SNAPSHOT SUCCESS [  0.771 s]
13:22:48 [INFO] org.eclipse.papyrus.infra.gmfdiag.commands.tests 1.2.0-SNAPSHOT SUCCESS [  0.588 s]
13:22:48 [INFO] org.eclipse.papyrus.infra.gmfdiag.common.tests 3.0.0-SNAPSHOT SUCCESS [  0.620 s]
13:22:48 [INFO] org.eclipse.papyrus.infra.gmfdiag.css.tests 1.2.0-SNAPSHOT SUCCESS [  0.618 s]
13:22:48 [INFO] org.eclipse.papyrus.infra.gmfdiag.menu.tests 1.2.0-SNAPSHOT SUCCESS [  0.534 s]
13:22:48 [INFO] org.eclipse.papyrus.infra.gmfdiag.paletteconfiguration.tests 1.2.0-SNAPSHOT SUCCESS [  0.368 s]
13:22:48 [INFO] org.eclipse.papyrus.infra.gmfdiag.welcome.tests 1.2.0-SNAPSHOT SUCCESS [  0.574 s]
13:22:48 [INFO] org.eclipse.papyrus.infra.nattable.main.test 1.2.0-SNAPSHOT SUCCESS [  0.005 s]
13:22:48 [INFO] org.eclipse.papyrus.infra.nattable.common.tests 1.2.100-SNAPSHOT SUCCESS [  0.590 s]
13:22:48 [INFO] org.eclipse.papyrus.infra.nattable.model.editor.tests 1.2.100-SNAPSHOT SUCCESS [  0.509 s]
13:22:48 [INFO] org.eclipse.papyrus.infra.nattable.model.tests 1.2.100-SNAPSHOT SUCCESS [  0.379 s]
13:22:48 [INFO] org.eclipse.papyrus.infra.nattable.tests 1.2.100-SNAPSHOT SUCCESS [  0.565 s]
13:22:48 [INFO] org.eclipse.papyrus.infra.nattable.views.tests 1.2.100-SNAPSHOT SUCCESS [  0.684 s]
13:22:48 [INFO] org.eclipse.papyrus.infra.properties.tests.releng 0.0.1-SNAPSHOT SUCCESS [  0.006 s]
13:22:48 [INFO] org.eclipse.papyrus.infra.properties.ui.tests 2.0.0-SNAPSHOT SUCCESS [  0.439 s]
13:22:48 [INFO] org.eclipse.papyrus.infra.services.tests.releng 0.0.1-SNAPSHOT SUCCESS [  0.004 s]
13:22:48 [INFO] org.eclipse.papyrus.infra.services.controlmode.tests 1.4.0-SNAPSHOT SUCCESS [  0.505 s]
13:22:48 [INFO] org.eclipse.papyrus.infra.services.edit.tests 1.2.0-SNAPSHOT SUCCESS [  0.393 s]
13:22:48 [INFO] org.eclipse.papyrus.infra.services.edit.ui.tests 1.2.0-SNAPSHOT SUCCESS [  0.257 s]
13:22:48 [INFO] org.eclipse.papyrus.infra.services.resourceloading.tests 1.2.0-SNAPSHOT SUCCESS [  0.281 s]
13:22:48 [INFO] org.eclipse.papyrus.infra.services.semantic.tests 1.2.100-SNAPSHOT SUCCESS [  0.345 s]
13:22:48 [INFO] org.eclipse.papyrus.infra.tools.tests 1.2.0-SNAPSHOT SUCCESS [  0.541 s]
13:22:48 [INFO] org.eclipse.papyrus.infra.types.tests.releng 0.0.1-SNAPSHOT SUCCESS [  0.003 s]
13:22:48 [INFO] org.eclipse.papyrus.infra.types.tests 3.0.0-SNAPSHOT SUCCESS [  0.352 s]
13:22:48 [INFO] org.eclipse.papyrus.infra.types.ui.tests 3.0.0-SNAPSHOT SUCCESS [  0.357 s]
13:22:48 [INFO] org.eclipse.papyrus.infra.ui.emf.tests 1.2.0-SNAPSHOT SUCCESS [  0.526 s]
13:22:48 [INFO] org.eclipse.papyrus.infra.ui.tests 1.2.0-SNAPSHOT .. SUCCESS [  0.410 s]
13:22:48 [INFO] org.eclipse.papyrus.infra.viewpoints.tests.releng 1.2.0-SNAPSHOT SUCCESS [  0.004 s]
13:22:48 [INFO] org.eclipse.papyrus.infra.viewpoints.policy.tests 1.2.0-SNAPSHOT SUCCESS [  0.381 s]
13:22:48 [INFO] org.eclipse.papyrus.uml.tests.releng 0.0.1-SNAPSHOT  SUCCESS [  0.004 s]
13:22:48 [INFO] org.eclipse.papyrus.uml.diagram.tests.releng 1.2.0-SNAPSHOT SUCCESS [  0.004 s]
13:22:48 [INFO] org.eclipse.papyrus.uml.diagram.tests 1.3.0-SNAPSHOT SUCCESS [  0.874 s]
13:22:48 [INFO] org.eclipse.papyrus.uml.diagram.clazz.tests 1.3.0-SNAPSHOT SUCCESS [  0.600 s]
13:22:48 [INFO] org.eclipse.papyrus.uml.diagram.activity.tests 1.2.0-SNAPSHOT SUCCESS [  0.798 s]
13:22:48 [INFO] org.eclipse.papyrus.uml.diagram.usecase.tests 1.2.0-SNAPSHOT SUCCESS [  0.478 s]
13:22:48 [INFO] org.eclipse.papyrus.uml.diagram.deployment.tests 1.2.0-SNAPSHOT SUCCESS [  0.493 s]
13:22:48 [INFO] org.eclipse.papyrus.uml.diagram.component.tests 1.2.0-SNAPSHOT SUCCESS [  0.473 s]
13:22:48 [INFO] org.eclipse.papyrus.uml.diagram.timing.tests 1.2.0-SNAPSHOT SUCCESS [  0.515 s]
13:22:48 [INFO] org.eclipse.papyrus.uml.diagram.stereotypeproperty.tests 1.2.0-SNAPSHOT SUCCESS [  0.567 s]
13:22:48 [INFO] org.eclipse.papyrus.uml.diagram.sequence.tests 1.3.100-SNAPSHOT SUCCESS [  0.733 s]
13:22:48 [INFO] org.eclipse.papyrus.uml.diagram.composite.tests 1.2.0-SNAPSHOT SUCCESS [  0.505 s]
13:22:48 [INFO] org.eclipse.papyrus.uml.diagram.wizards.tests 1.2.0-SNAPSHOT SUCCESS [  0.395 s]
13:22:48 [INFO] org.eclipse.papyrus.uml.diagram.profile.tests 1.2.0-SNAPSHOT SUCCESS [  0.428 s]
13:22:48 [INFO] org.eclipse.papyrus.uml.dynamic.profile.tests 1.2.0-SNAPSHOT SUCCESS [  0.040 s]
13:22:48 [INFO] org.eclipse.papyrus.uml.diagram.common.tests 1.3.0-SNAPSHOT SUCCESS [  0.557 s]
13:22:48 [INFO] org.eclipse.papyrus.tests.uml.diagram.feature 1.2.0-SNAPSHOT SUCCESS [  0.225 s]
13:22:48 [INFO] org.eclipse.papyrus.tests.infra.services.feature 1.2.0-SNAPSHOT SUCCESS [  0.067 s]
13:22:48 [INFO] org.eclipse.papyrus.views.tests.releng 0.0.1-SNAPSHOT SUCCESS [  0.003 s]
13:22:48 [INFO] org.eclipse.papyrus.views.modelexplorer.tests 1.2.100-SNAPSHOT SUCCESS [  0.245 s]
13:22:48 [INFO] org.eclipse.papyrus.uml.modelexplorer.tests.releng 0.0.1-SNAPSHOT SUCCESS [  0.002 s]
13:22:48 [INFO] org.eclipse.papyrus.uml.modelexplorer.tests 1.3.100-SNAPSHOT SUCCESS [  0.331 s]
13:22:48 [INFO] org.eclipse.papyrus.uml.modelrepair.tests 1.2.100-SNAPSHOT SUCCESS [  0.603 s]
13:22:48 [INFO] org.eclipse.papyrus.uml.service.types.tests 1.2.0-SNAPSHOT SUCCESS [  0.522 s]
13:22:48 [INFO] org.eclipse.papyrus.uml.service.types.ui.tests 1.2.0-SNAPSHOT SUCCESS [  0.448 s]
13:22:48 [INFO] org.eclipse.papyrus.uml.profile.tests.releng 0.0.1-SNAPSHOT SUCCESS [  0.003 s]
13:22:48 [INFO] org.eclipse.papyrus.uml.profile.drafter.tests 1.2.0-SNAPSHOT SUCCESS [  0.579 s]
13:22:48 [INFO] org.eclipse.papyrus.uml.filters.tests 1.2.0-SNAPSHOT SUCCESS [  0.347 s]
13:22:48 [INFO] org.eclipse.papyrus.uml.profile.tests 1.2.0-SNAPSHOT SUCCESS [  0.350 s]
13:22:48 [INFO] org.eclipse.papyrus.tests.uml.feature 1.2.0-SNAPSHOT SUCCESS [  0.093 s]
13:22:48 [INFO] org.eclipse.papyrus.tests.views.feature 1.2.0-SNAPSHOT SUCCESS [  0.031 s]
13:22:48 [INFO] org.eclipse.papyrus.tests.infra.nattable.feature 1.3.0-SNAPSHOT SUCCESS [  0.077 s]
13:22:48 [INFO] org.eclipse.papyrus.uml.nattable.main.test 1.2.0-SNAPSHOT SUCCESS [  0.005 s]
13:22:48 [INFO] org.eclipse.papyrus.uml.nattable.tests 1.2.100-SNAPSHOT SUCCESS [  0.307 s]
13:22:48 [INFO] org.eclipse.papyrus.uml.nattable.generic.tests 1.2.100-SNAPSHOT SUCCESS [  0.581 s]
13:22:48 [INFO] org.eclipse.papyrus.uml.nattable.clazz.config.tests 1.2.100-SNAPSHOT SUCCESS [  0.979 s]
13:22:48 [INFO] org.eclipse.papyrus.uml.nattable.stereotyped.elements.tests 1.0.100-SNAPSHOT SUCCESS [  0.693 s]
13:22:48 [INFO] org.eclipse.papyrus.uml.nattable.matrix.tests 1.0.0-SNAPSHOT SUCCESS [  0.511 s]
13:22:48 [INFO] org.eclipse.papyrus.tests.uml.nattable.feature 1.3.0-SNAPSHOT SUCCESS [  1.242 s]
13:22:48 [INFO] org.eclipse.papyrus.tests.infra.feature 1.2.0-SNAPSHOT SUCCESS [  3.753 s]
13:22:48 [INFO] org.eclipse.papyrus.tests.infra.core.feature 1.2.0-SNAPSHOT SUCCESS [  0.050 s]
13:22:48 [INFO] org.eclipse.papyrus.uml.tools.tests.releng 0.0.1-SNAPSHOT SUCCESS [  0.002 s]
13:22:48 [INFO] org.eclipse.papyrus.uml.tools.tests 3.0.0-SNAPSHOT . SUCCESS [  0.754 s]
13:22:48 [INFO] org.eclipse.papyrus.uml.tools.utils.tests 1.3.0-SNAPSHOT SUCCESS [  0.513 s]
13:22:48 [INFO] org.eclipse.papyrus.tests.uml.tools.feature 1.2.0-SNAPSHOT SUCCESS [  0.080 s]
13:22:48 [INFO] org.eclipse.papyrus.uml.decoratormodel.tests.releng 0.0.1-SNAPSHOT SUCCESS [  0.003 s]
13:22:48 [INFO] org.eclipse.papyrus.uml.decoratormodel.tests 1.2.0-SNAPSHOT SUCCESS [  0.642 s]
13:22:48 [INFO] org.eclipse.papyrus.uml.decoratormodel.controlmode.tests 1.2.0-SNAPSHOT SUCCESS [  0.384 s]
13:22:48 [INFO] org.eclipse.papyrus.tests.uml.decoratormodel.feature 1.2.0-SNAPSHOT SUCCESS [  0.041 s]
13:22:48 [INFO] org.eclipse.papyrus.uml.textedit.tests.releng 0.0.1-SNAPSHOT SUCCESS [  0.002 s]
13:22:48 [INFO] org.eclipse.papyrus.uml.textedit.tests 1.2.0-SNAPSHOT SUCCESS [  0.395 s]
13:22:48 [INFO] org.eclipse.papyrus.uml.textedit.parameter.tests 1.2.0-SNAPSHOT SUCCESS [  0.535 s]
13:22:48 [INFO] org.eclipse.papyrus.uml.textedit.port.tests 1.2.0-SNAPSHOT SUCCESS [  0.477 s]
13:22:48 [INFO] org.eclipse.papyrus.uml.textedit.property.tests 1.2.0-SNAPSHOT SUCCESS [  0.539 s]
13:22:48 [INFO] org.eclipse.papyrus.uml.textedit.tests.feature 1.2.0-SNAPSHOT SUCCESS [  0.103 s]
13:22:48 [INFO] org.eclipse.papyrus.uml.assistants.tests.releng 0.0.1-SNAPSHOT SUCCESS [  0.007 s]
13:22:48 [INFO] org.eclipse.papyrus.uml.profile.types.generator.tests 1.2.0-SNAPSHOT SUCCESS [  0.605 s]
13:22:48 [INFO] org.eclipse.papyrus.uml.profile.assistants.generator.tests 1.2.0-SNAPSHOT SUCCESS [  0.458 s]
13:22:48 [INFO] org.eclipse.papyrus.tests.uml.assistants.feature 1.2.0-SNAPSHOT SUCCESS [  0.043 s]
13:22:48 [INFO] org.eclipse.papyrus.toolsmiths.tests.releng 0.0.1-SNAPSHOT SUCCESS [  0.003 s]
13:22:48 [INFO] org.eclipse.papyrus.toolsmiths.profilemigration.tests 0.7.0-SNAPSHOT SUCCESS [  0.358 s]
13:22:48 [INFO] org.eclipse.papyrus.tests.toolsmiths.feature 1.0.0-SNAPSHOT SUCCESS [  0.074 s]
13:22:48 [INFO] org.eclipse.papyrus.tests.feature 1.3.0-SNAPSHOT ... SUCCESS [  0.711 s]
13:22:48 [INFO] org.eclipse.papyrus.infra.emf.expressions.main.tests 0.0.1-SNAPSHOT SUCCESS [  0.002 s]
13:22:48 [INFO] org.eclipse.papyrus.infra.emf.expressions.tests 1.0.0-SNAPSHOT SUCCESS [  0.119 s]
13:22:48 [INFO] org.eclipse.papyrus.tests.infra.emf.expressions.feature 1.0.0-SNAPSHOT SUCCESS [  0.019 s]
13:22:48 [INFO] org.eclipse.papyrus.uml.expressions.tests.releng 0.0.1-SNAPSHOT SUCCESS [  0.003 s]
13:22:48 [INFO] org.eclipse.papyrus.uml.expressions.tests 1.0.0-SNAPSHOT SUCCESS [  0.407 s]
13:22:48 [INFO] org.eclipse.papyrus.tests.uml.expressions.feature 1.0.0-SNAPSHOT SUCCESS [  0.054 s]
13:22:48 [INFO] org.eclipse.papyrus.uml.alf.tests 1.2.0-SNAPSHOT ... SUCCESS [03:24 min]
13:22:48 [INFO] org.eclipse.papyrus.uml.alf.tests.feature 1.2.0-SNAPSHOT SUCCESS [  0.134 s]
13:22:48 [INFO] org.eclipse.papyrus.developer.suite.tests 0.0.1-SNAPSHOT SUCCESS [ 14.862 s]
13:22:48 [INFO] org.eclipse.papyrus.developer.tests.releng 0.0.1-SNAPSHOT SUCCESS [  0.005 s]
13:22:48 [INFO] org.eclipse.papyrus.eclipse.project.editors.tests 2.0.0-SNAPSHOT SUCCESS [  0.544 s]
13:22:48 [INFO] org.eclipse.papyrus.editors.suite.tests 0.0.1-SNAPSHOT SUCCESS [04:13 min]
13:22:48 [INFO] org.eclipse.papyrus.infra.core.suite.tests 0.0.1-SNAPSHOT SUCCESS [ 43.151 s]
13:22:48 [INFO] org.eclipse.papyrus.infra.nattable.suite.tests 0.0.1-SNAPSHOT SUCCESS [ 41.226 s]
13:22:48 [INFO] org.eclipse.papyrus.infra.internationalization.main.test 1.0.0-SNAPSHOT SUCCESS [  0.004 s]
13:22:48 [INFO] org.eclipse.papyrus.infra.internationalization.tests 1.1.0-SNAPSHOT SUCCESS [  0.436 s]
13:22:48 [INFO] org.eclipse.papyrus.infra.services.labelprovider.tests 1.2.1-SNAPSHOT SUCCESS [  0.277 s]
13:22:48 [INFO] org.eclipse.papyrus.infra.suite.tests 0.0.1-SNAPSHOT SUCCESS [07:33 min]
13:22:48 [INFO] org.eclipse.papyrus.infra.newchild.tests 1.2.0-SNAPSHOT SUCCESS [  0.344 s]
13:22:48 [INFO] org.eclipse.papyrus.uml.diagram.communication.tests 1.2.0-SNAPSHOT SUCCESS [  0.503 s]
13:22:48 [INFO] org.eclipse.papyrus.uml.diagram.interactionoverview.tests 1.2.0-SNAPSHOT SUCCESS [  0.332 s]
13:22:48 [INFO] org.eclipse.papyrus.uml.diagram.statemachine.tests 1.2.0-SNAPSHOT SUCCESS [  0.456 s]
13:22:48 [INFO] org.eclipse.papyrus.uml.diagram.suite.tests 0.0.1-SNAPSHOT SUCCESS [07:41 min]
13:22:48 [INFO] org.eclipse.papyrus.uml.diagram.dnd.tests 1.2.0-SNAPSHOT SUCCESS [  0.331 s]
13:22:48 [INFO] org.eclipse.papyrus.uml.nattable.stereotype.display.tests 1.2.100-SNAPSHOT SUCCESS [  0.625 s]
13:22:48 [INFO] org.eclipse.papyrus.uml.nattable.suite.tests 0.0.1-SNAPSHOT SUCCESS [13:53 min]
13:22:48 [INFO] org.eclipse.papyrus.uml.textedit.valuespecification.tests 1.2.0-SNAPSHOT SUCCESS [  0.506 s]
13:22:48 [INFO] org.eclipse.papyrus.uml.textedit.suite.tests 0.0.1-SNAPSHOT SUCCESS [ 26.949 s]
13:22:48 [INFO] org.eclipse.papyrus.uml.internationalization.main.test 1.0.0-SNAPSHOT SUCCESS [  0.004 s]
13:22:48 [INFO] org.eclipse.papyrus.uml.internationalization.tests 1.1.0-SNAPSHOT SUCCESS [  0.391 s]
13:22:48 [INFO] org.eclipse.papyrus.uml.validation.tests.releng 0.0.1-SNAPSHOT SUCCESS [  0.002 s]
13:22:48 [INFO] org.eclipse.papyrus.uml.validation.tests.staticprofile 1.2.0-SNAPSHOT SUCCESS [  0.198 s]
13:22:48 [INFO] org.eclipse.papyrus.uml.validation.tests.genvalidation 1.2.0-SNAPSHOT SUCCESS [  0.351 s]
13:22:48 [INFO] org.eclipse.papyrus.uml.validation.tests 1.2.0-SNAPSHOT SUCCESS [  0.332 s]
13:22:48 [INFO] org.eclipse.papyrus.uml.suite.tests 0.0.1-SNAPSHOT . SUCCESS [04:13 min]
13:22:48 [INFO] org.eclipse.papyrus.uml.alf.tests.releng 0.0.1-SNAPSHOT SUCCESS [  0.004 s]
13:22:48 [INFO] org.eclipse.papyrus.uml.alf.backend.tests 1.1.0-SNAPSHOT SUCCESS [  0.969 s]
13:22:48 [INFO] org.eclipse.papyrus.uml.internationalization.controlmode.tests 1.0.0-SNAPSHOT SUCCESS [  0.454 s]
13:22:48 [INFO] org.eclipse.papyrus.views.properties.toolsmiths.tests 1.2.0-SNAPSHOT SUCCESS [  0.408 s]
13:22:48 [INFO] org.eclipse.papyrus.views.suite.tests 0.0.1-SNAPSHOT SUCCESS [ 29.969 s]
13:22:48 [INFO] org.eclipse.papyrus.toolsmiths.suite.tests 0.0.1-SNAPSHOT SUCCESS [ 14.956 s]
13:22:48 [INFO] org.eclipse.papyrus.main.tests.target.parent 0.0.1-SNAPSHOT SUCCESS [  0.005 s]
13:22:48 [INFO] org.eclipse.papyrus.main.tests.portable.target 0.0.1-SNAPSHOT SUCCESS [  0.005 s]
13:22:48 [INFO] ------------------------------------------------------------------------
13:22:48 [INFO] BUILD SUCCESS
13:22:48 [INFO] ------------------------------------------------------------------------
13:22:48 [INFO] Total time:  54:46 min
13:22:48 [INFO] Finished at: 2019-11-11T13:22:48-05:00
13:22:48 [INFO] ------------------------------------------------------------------------
13:22:50 Taking screenshot.
13:22:50 [workspace] $ echo $XAUTHORITY
13:22:50 /home/hudson/genie.papyrus/.jenkins/jobs/Papyrus-Oxygen-Tests/workspace/.Xauthority-6634995465041340036
13:22:50 [workspace] $ ls -l $XAUTHORITY
13:22:50 -rw-rw-r-- 1 genie.papyrus modeling.mdt.papyrus 0 Nov 11 12:27 /home/hudson/genie.papyrus/.jenkins/jobs/Papyrus-Oxygen-Tests/workspace/.Xauthority-6634995465041340036
13:22:50 [workspace] $ import -window root -display :723 screenshot.jpg
13:22:50 Terminating xvnc.
13:23:02 Sending e-mails to: patrick.tessier@cea.fr vincent.lorenzo@cea.fr quentin.lemenez@cea.fr
13:23:02 Recording test results
13:23:03 Build step 'Publish JUnit test result report' changed build result to UNSTABLE
13:23:03 Started calculate disk usage of build
13:23:03 Finished Calculation of disk usage of build in 0 seconds
13:23:03 Started calculate disk usage of workspace
13:23:04 Finished Calculation of disk usage of workspace in  1 second
13:23:04 [WS-CLEANUP] Deleting project workspace...
13:23:04 [WS-CLEANUP] Deferred wipeout is used...
13:23:04 [WS-CLEANUP] done
13:23:04 Finished: UNSTABLE