UnstableConsole Output

Skipping 3,234 KB.. Full Log
Running org.eclipse.papyrus.uml.suite.tests.AllTests
01:02:27 No JFaces support for org.eclipse.jface.viewers.TableTreeViewer
01:02:49 Warning: NLS unused message: "Select in: messages
01:02:54 org.eclipse.core.internal.resources.ResourceException(/copyingInterfaceRealizationDoesNotCorruptTheModel)[368]: java.lang.Exception: Resource '/copyingInterfaceRealizationDoesNotCorruptTheModel' does not exist.
01:04:48 	at org.eclipse.core.internal.resources.ResourceException.provideStackTrace(ResourceException.java:42)
01:04:48 	at org.eclipse.core.internal.resources.ResourceException.<init>(ResourceException.java:38)
01:04:48 	at org.eclipse.core.internal.resources.Resource.checkExists(Resource.java:330)
01:04:48 	at org.eclipse.core.internal.resources.Resource.checkAccessible(Resource.java:204)
01:04:48 	at org.eclipse.core.internal.resources.Project.checkAccessible(Project.java:145)
01:04:48 	at org.eclipse.core.internal.resources.Resource.accept(Resource.java:63)
01:04:48 	at org.eclipse.core.internal.resources.Resource.accept(Resource.java:55)
01:04:48 	at org.eclipse.core.internal.resources.Resource.accept(Resource.java:117)
01:04:48 	at org.eclipse.core.internal.resources.Resource.accept(Resource.java:105)
01:04:48 	at org.eclipse.papyrus.junit.utils.rules.ProjectFixture.deleteProject(ProjectFixture.java:307)
01:04:48 	at org.eclipse.papyrus.junit.utils.rules.ProjectFixture$1.evaluate(ProjectFixture.java:277)
01:04:48 	at org.junit.runners.ParentRunner$3.evaluate(ParentRunner.java:306)
01:04:48 	at org.junit.runners.BlockJUnit4ClassRunner$1.evaluate(BlockJUnit4ClassRunner.java:100)
01:04:48 	at org.junit.runners.ParentRunner.runLeaf(ParentRunner.java:366)
01:04:48 	at org.junit.runners.BlockJUnit4ClassRunner.runChild(BlockJUnit4ClassRunner.java:103)
01:04:48 	at org.eclipse.papyrus.junit.framework.classification.ClassificationRunner.access$0(ClassificationRunner.java:1)
01:04:48 	at org.eclipse.papyrus.junit.framework.classification.ClassificationRunner$1.runChild(ClassificationRunner.java:58)
01:04:48 	at org.eclipse.papyrus.junit.framework.classification.ClassificationRunnerImpl.runChild(ClassificationRunnerImpl.java:87)
01:04:48 	at org.eclipse.papyrus.junit.framework.classification.ClassificationRunner.runChild(ClassificationRunner.java:86)
01:04:48 	at org.junit.runners.BlockJUnit4ClassRunner.runChild(BlockJUnit4ClassRunner.java:63)
01:04:48 	at org.junit.runners.ParentRunner$4.run(ParentRunner.java:331)
01:04:48 	at org.junit.runners.ParentRunner$1.schedule(ParentRunner.java:79)
01:04:48 	at org.junit.runners.ParentRunner.runChildren(ParentRunner.java:329)
01:04:48 	at org.junit.runners.ParentRunner.access$100(ParentRunner.java:66)
01:04:48 	at org.junit.runners.ParentRunner$2.evaluate(ParentRunner.java:293)
01:04:48 	at org.junit.runners.ParentRunner$3.evaluate(ParentRunner.java:306)
01:04:48 	at org.junit.rules.TestWatcher$1.evaluate(TestWatcher.java:61)
01:04:48 	at org.junit.runners.ParentRunner.run(ParentRunner.java:413)
01:04:48 	at org.junit.runners.Suite.runChild(Suite.java:128)
01:04:48 	at org.junit.runners.Suite.runChild(Suite.java:27)
01:04:48 	at org.junit.runners.ParentRunner$4.run(ParentRunner.java:331)
01:04:48 	at org.junit.runners.ParentRunner$1.schedule(ParentRunner.java:79)
01:04:48 	at org.junit.runners.ParentRunner.runChildren(ParentRunner.java:329)
01:04:48 	at org.junit.runners.ParentRunner.access$100(ParentRunner.java:66)
01:04:48 	at org.junit.runners.ParentRunner$2.evaluate(ParentRunner.java:293)
01:04:48 	at org.junit.runners.ParentRunner$3.evaluate(ParentRunner.java:306)
01:04:48 	at org.junit.runners.ParentRunner.run(ParentRunner.java:413)
01:04:48 	at org.eclipse.papyrus.junit.framework.classification.ClassificationSuite.run(ClassificationSuite.java:130)
01:04:48 	at org.junit.runners.Suite.runChild(Suite.java:128)
01:04:48 	at org.junit.runners.Suite.runChild(Suite.java:27)
01:04:48 	at org.junit.runners.ParentRunner$4.run(ParentRunner.java:331)
01:04:48 	at org.junit.runners.ParentRunner$1.schedule(ParentRunner.java:79)
01:04:48 	at org.junit.runners.ParentRunner.runChildren(ParentRunner.java:329)
01:04:48 	at org.junit.runners.ParentRunner.access$100(ParentRunner.java:66)
01:04:48 	at org.junit.runners.ParentRunner$2.evaluate(ParentRunner.java:293)
01:04:48 	at org.junit.runners.ParentRunner$3.evaluate(ParentRunner.java:306)
01:04:48 	at org.junit.runners.ParentRunner.run(ParentRunner.java:413)
01:04:48 	at org.apache.maven.surefire.junit4.JUnit4Provider.execute(JUnit4Provider.java:365)
01:04:48 	at org.apache.maven.surefire.junit4.JUnit4Provider.executeWithRerun(JUnit4Provider.java:273)
01:04:48 	at org.apache.maven.surefire.junit4.JUnit4Provider.executeTestSet(JUnit4Provider.java:238)
01:04:48 	at org.apache.maven.surefire.junit4.JUnit4Provider.invoke(JUnit4Provider.java:159)
01:04:48 	at java.base/jdk.internal.reflect.NativeMethodAccessorImpl.invoke0(Native Method)
01:04:48 	at java.base/jdk.internal.reflect.NativeMethodAccessorImpl.invoke(NativeMethodAccessorImpl.java:62)
01:04:48 	at java.base/jdk.internal.reflect.DelegatingMethodAccessorImpl.invoke(DelegatingMethodAccessorImpl.java:43)
01:04:48 	at java.base/java.lang.reflect.Method.invoke(Method.java:566)
01:04:48 	at org.apache.maven.surefire.util.ReflectionUtils.invokeMethodWithArray2(ReflectionUtils.java:206)
01:04:48 	at org.apache.maven.surefire.booter.ProviderFactory$ProviderProxy.invoke(ProviderFactory.java:161)
01:04:48 	at org.apache.maven.surefire.booter.ProviderFactory.invokeProvider(ProviderFactory.java:84)
01:04:48 	at org.eclipse.tycho.surefire.osgibooter.OsgiSurefireBooter.run(OsgiSurefireBooter.java:116)
01:04:48 	at org.eclipse.tycho.surefire.osgibooter.AbstractUITestApplication$1.run(AbstractUITestApplication.java:37)
01:04:48 	at org.eclipse.swt.widgets.RunnableLock.run(RunnableLock.java:40)
01:04:48 	at org.eclipse.swt.widgets.Synchronizer.runAsyncMessages(Synchronizer.java:185)
01:04:48 	at org.eclipse.swt.widgets.Display.runAsyncMessages(Display.java:5067)
01:04:48 	at org.eclipse.swt.widgets.Display.readAndDispatch(Display.java:4573)
01:04:48 	at org.eclipse.e4.ui.internal.workbench.swt.PartRenderingEngine$5.run(PartRenderingEngine.java:1157)
01:04:48 	at org.eclipse.core.databinding.observable.Realm.runWithDefault(Realm.java:338)
01:04:48 	at org.eclipse.e4.ui.internal.workbench.swt.PartRenderingEngine.run(PartRenderingEngine.java:1046)
01:04:48 	at org.eclipse.e4.ui.internal.workbench.E4Workbench.createAndRunUI(E4Workbench.java:155)
01:04:48 	at org.eclipse.ui.internal.Workbench.lambda$3(Workbench.java:644)
01:04:48 	at org.eclipse.core.databinding.observable.Realm.runWithDefault(Realm.java:338)
01:04:48 	at org.eclipse.ui.internal.Workbench.createAndRunWorkbench(Workbench.java:551)
01:04:48 	at org.eclipse.ui.PlatformUI.createAndRunWorkbench(PlatformUI.java:156)
01:04:48 	at org.eclipse.ui.internal.ide.application.IDEApplication.start(IDEApplication.java:152)
01:04:48 	at org.eclipse.tycho.surefire.osgibooter.UITestApplication.runApplication(UITestApplication.java:29)
01:04:48 	at org.eclipse.tycho.surefire.osgibooter.AbstractUITestApplication.run(AbstractUITestApplication.java:122)
01:04:48 	at org.eclipse.tycho.surefire.osgibooter.UITestApplication.start(UITestApplication.java:35)
01:04:48 	at org.eclipse.equinox.internal.app.EclipseAppHandle.run(EclipseAppHandle.java:203)
01:04:48 	at org.eclipse.core.runtime.internal.adaptor.EclipseAppLauncher.runApplication(EclipseAppLauncher.java:134)
01:04:48 	at org.eclipse.core.runtime.internal.adaptor.EclipseAppLauncher.start(EclipseAppLauncher.java:104)
01:04:48 	at org.eclipse.core.runtime.adaptor.EclipseStarter.run(EclipseStarter.java:401)
01:04:48 	at org.eclipse.core.runtime.adaptor.EclipseStarter.run(EclipseStarter.java:255)
01:04:48 	at java.base/jdk.internal.reflect.NativeMethodAccessorImpl.invoke0(Native Method)
01:04:48 	at java.base/jdk.internal.reflect.NativeMethodAccessorImpl.invoke(NativeMethodAccessorImpl.java:62)
01:04:48 	at java.base/jdk.internal.reflect.DelegatingMethodAccessorImpl.invoke(DelegatingMethodAccessorImpl.java:43)
01:04:48 	at java.base/java.lang.reflect.Method.invoke(Method.java:566)
01:04:48 	at org.eclipse.equinox.launcher.Main.invokeFramework(Main.java:653)
01:04:48 	at org.eclipse.equinox.launcher.Main.basicRun(Main.java:590)
01:04:48 	at org.eclipse.equinox.launcher.Main.run(Main.java:1461)
01:04:48 	at org.eclipse.equinox.launcher.Main.main(Main.java:1434)
01:04:48 
01:05:21 (Eclipse:4263): Gtk-CRITICAL **: 05:05:21.297: gtk_box_gadget_distribute: assertion 'size >= 0' failed in GtkScrollbar
01:05:21 
01:05:21 (Eclipse:4263): Gtk-CRITICAL **: 05:05:21.310: gtk_box_gadget_distribute: assertion 'size >= 0' failed in GtkScrollbar
01:05:21 
01:05:21 (Eclipse:4263): Gtk-CRITICAL **: 05:05:21.322: gtk_box_gadget_distribute: assertion 'size >= 0' failed in GtkScrollbar
01:05:21 
01:05:21 (Eclipse:4263): Gtk-CRITICAL **: 05:05:21.711: gtk_box_gadget_distribute: assertion 'size >= 0' failed in GtkScrollbar
01:05:21 
01:05:21 (Eclipse:4263): Gtk-CRITICAL **: 05:05:21.723: gtk_box_gadget_distribute: assertion 'size >= 0' failed in GtkScrollbar
01:05:21 
01:05:21 (Eclipse:4263): Gtk-CRITICAL **: 05:05:21.735: gtk_box_gadget_distribute: assertion 'size >= 0' failed in GtkScrollbar
01:05:21 
01:05:21 (Eclipse:4263): Gtk-CRITICAL **: 05:05:21.896: gtk_box_gadget_distribute: assertion 'size >= 0' failed in GtkScrollbar
01:05:21 
01:05:22 (Eclipse:4263): Gtk-CRITICAL **: 05:05:22.262: gtk_box_gadget_distribute: assertion 'size >= 0' failed in GtkScrollbar
01:05:22 
01:05:22 (Eclipse:4263): Gtk-CRITICAL **: 05:05:22.275: gtk_box_gadget_distribute: assertion 'size >= 0' failed in GtkScrollbar
01:05:22 
01:05:22 (Eclipse:4263): Gtk-CRITICAL **: 05:05:22.301: gtk_box_gadget_distribute: assertion 'size >= 0' failed in GtkScrollbar
01:05:22 
01:06:09 (Eclipse:4263): Gtk-CRITICAL **: 05:06:09.253: gtk_box_gadget_distribute: assertion 'size >= 0' failed in GtkScrollbar
01:06:09 
01:06:09 (Eclipse:4263): Gtk-CRITICAL **: 05:06:09.271: gtk_box_gadget_distribute: assertion 'size >= 0' failed in GtkScrollbar
01:06:09 
01:06:09 (Eclipse:4263): Gtk-CRITICAL **: 05:06:09.280: gtk_box_gadget_distribute: assertion 'size >= 0' failed in GtkScrollbar
01:06:09 
01:06:09 (Eclipse:4263): Gtk-CRITICAL **: 05:06:09.299: gtk_box_gadget_distribute: assertion 'size >= 0' failed in GtkScrollbar
01:06:09 
01:06:11 (Eclipse:4263): Gtk-CRITICAL **: 05:06:11.283: gtk_box_gadget_distribute: assertion 'size >= 0' failed in GtkScrollbar
01:06:11 
01:06:11 (Eclipse:4263): Gtk-CRITICAL **: 05:06:11.300: gtk_box_gadget_distribute: assertion 'size >= 0' failed in GtkScrollbar
01:06:11 
01:06:13 (Eclipse:4263): Gtk-CRITICAL **: 05:06:13.082: gtk_box_gadget_distribute: assertion 'size >= 0' failed in GtkScrollbar
01:06:13 
01:06:13 (Eclipse:4263): Gtk-CRITICAL **: 05:06:13.099: gtk_box_gadget_distribute: assertion 'size >= 0' failed in GtkScrollbar
01:06:13 
01:06:13 (Eclipse:4263): Gtk-CRITICAL **: 05:06:13.110: gtk_box_gadget_distribute: assertion 'size >= 0' failed in GtkScrollbar
01:06:13 
01:06:13 (Eclipse:4263): Gtk-CRITICAL **: 05:06:13.128: gtk_box_gadget_distribute: assertion 'size >= 0' failed in GtkScrollbar
01:06:13 
01:06:14 (Eclipse:4263): Gtk-CRITICAL **: 05:06:14.411: gtk_box_gadget_distribute: assertion 'size >= 0' failed in GtkScrollbar
01:06:14 
01:06:14 (Eclipse:4263): Gtk-CRITICAL **: 05:06:14.428: gtk_box_gadget_distribute: assertion 'size >= 0' failed in GtkScrollbar
01:06:14 
01:06:14 (Eclipse:4263): Gtk-CRITICAL **: 05:06:14.438: gtk_box_gadget_distribute: assertion 'size >= 0' failed in GtkScrollbar
01:06:14 
01:06:14 (Eclipse:4263): Gtk-CRITICAL **: 05:06:14.457: gtk_box_gadget_distribute: assertion 'size >= 0' failed in GtkScrollbar
01:06:14 
01:06:15 (Eclipse:4263): Gtk-CRITICAL **: 05:06:15.800: gtk_box_gadget_distribute: assertion 'size >= 0' failed in GtkScrollbar
01:06:15 
01:06:15 (Eclipse:4263): Gtk-CRITICAL **: 05:06:15.818: gtk_box_gadget_distribute: assertion 'size >= 0' failed in GtkScrollbar
01:06:15 
01:06:15 (Eclipse:4263): Gtk-CRITICAL **: 05:06:15.827: gtk_box_gadget_distribute: assertion 'size >= 0' failed in GtkScrollbar
01:06:15 
01:06:16 (Eclipse:4263): Gtk-CRITICAL **: 05:06:16.976: gtk_box_gadget_distribute: assertion 'size >= 0' failed in GtkScrollbar
01:06:16 
01:06:16 (Eclipse:4263): Gtk-CRITICAL **: 05:06:16.993: gtk_box_gadget_distribute: assertion 'size >= 0' failed in GtkScrollbar
01:06:16 
01:06:17 (Eclipse:4263): Gtk-CRITICAL **: 05:06:17.005: gtk_box_gadget_distribute: assertion 'size >= 0' failed in GtkScrollbar
01:06:17 log4j:WARN No appenders could be found for logger (org.eclipse.ocl.pivot.internal.resource.StandaloneProjectMap).
01:07:51 log4j:WARN Please initialize the log4j system properly.
01:07:51 
01:08:05 (Eclipse:4263): Gtk-CRITICAL **: 05:08:05.124: gtk_box_gadget_distribute: assertion 'size >= 0' failed in GtkScrollbar
01:08:05 
01:08:05 (Eclipse:4263): Gtk-CRITICAL **: 05:08:05.129: gtk_box_gadget_distribute: assertion 'size >= 0' failed in GtkScrollbar
01:08:05 
01:08:05 (Eclipse:4263): Gtk-CRITICAL **: 05:08:05.133: gtk_box_gadget_distribute: assertion 'size >= 0' failed in GtkScrollbar
01:08:05 
01:08:05 (Eclipse:4263): Gtk-CRITICAL **: 05:08:05.137: gtk_box_gadget_distribute: assertion 'size >= 0' failed in GtkScrollbar
01:08:05 
01:08:05 (Eclipse:4263): Gtk-CRITICAL **: 05:08:05.142: gtk_box_gadget_distribute: assertion 'size >= 0' failed in GtkScrollbar
01:08:05 
01:08:05 (Eclipse:4263): Gtk-CRITICAL **: 05:08:05.147: gtk_box_gadget_distribute: assertion 'size >= 0' failed in GtkScrollbar
01:08:05 
01:08:05 (Eclipse:4263): Gtk-CRITICAL **: 05:08:05.151: gtk_box_gadget_distribute: assertion 'size >= 0' failed in GtkScrollbar
01:08:05 
01:08:05 (Eclipse:4263): Gtk-CRITICAL **: 05:08:05.156: gtk_box_gadget_distribute: assertion 'size >= 0' failed in GtkScrollbar
01:08:05 
01:08:05 (Eclipse:4263): Gtk-CRITICAL **: 05:08:05.200: gtk_box_gadget_distribute: assertion 'size >= 0' failed in GtkScrollbar
01:08:05 
01:08:05 (Eclipse:4263): Gtk-CRITICAL **: 05:08:05.204: gtk_box_gadget_distribute: assertion 'size >= 0' failed in GtkScrollbar
01:08:05 
01:08:05 (Eclipse:4263): Gtk-CRITICAL **: 05:08:05.209: gtk_box_gadget_distribute: assertion 'size >= 0' failed in GtkScrollbar
01:08:05 
01:08:05 (Eclipse:4263): Gtk-CRITICAL **: 05:08:05.213: gtk_box_gadget_distribute: assertion 'size >= 0' failed in GtkScrollbar
01:08:05 
01:08:05 (Eclipse:4263): Gtk-CRITICAL **: 05:08:05.218: gtk_box_gadget_distribute: assertion 'size >= 0' failed in GtkScrollbar
01:08:05 
01:08:05 (Eclipse:4263): Gtk-CRITICAL **: 05:08:05.221: gtk_box_gadget_distribute: assertion 'size >= 0' failed in GtkScrollbar
01:08:05 
01:08:05 (Eclipse:4263): Gtk-CRITICAL **: 05:08:05.225: gtk_box_gadget_distribute: assertion 'size >= 0' failed in GtkScrollbar
01:08:05 
01:08:05 (Eclipse:4263): Gtk-CRITICAL **: 05:08:05.229: gtk_box_gadget_distribute: assertion 'size >= 0' failed in GtkScrollbar
01:08:05 
01:08:05 (Eclipse:4263): Gtk-CRITICAL **: 05:08:05.234: gtk_box_gadget_distribute: assertion 'size >= 0' failed in GtkScrollbar
01:08:05 
01:08:05 (Eclipse:4263): Gtk-CRITICAL **: 05:08:05.238: gtk_box_gadget_distribute: assertion 'size >= 0' failed in GtkScrollbar
01:08:05 
01:08:05 (Eclipse:4263): Gtk-CRITICAL **: 05:08:05.242: gtk_box_gadget_distribute: assertion 'size >= 0' failed in GtkScrollbar
01:08:05 
01:08:05 (Eclipse:4263): Gtk-CRITICAL **: 05:08:05.246: gtk_box_gadget_distribute: assertion 'size >= 0' failed in GtkScrollbar
01:08:05 Tests run: 678, Failures: 1, Errors: 0, Skipped: 39, Time elapsed: 441.336 s <<< FAILURE! - in org.eclipse.papyrus.uml.suite.tests.AllTests
01:09:48 testUML(org.eclipse.papyrus.uml.service.types.tests.creation.CreatePureUMLElementTest)  Time elapsed: 0.138 s
01:09:48 test(org.eclipse.papyrus.uml.service.types.tests.creation.CreatePureUMLElementTest)  Time elapsed: 0.372 s
01:09:48 testDeleteOneAddVariableValueAction(org.eclipse.papyrus.uml.service.types.tests.deletion.DeletePureUMLElementTest)  Time elapsed: 0.14 s
01:09:48 testDeleteOneCentralBufferNode(org.eclipse.papyrus.uml.service.types.tests.deletion.DeletePureUMLElementTest)  Time elapsed: 0.055 s
01:09:48 stereotypeApplicationsDeleted:command(org.eclipse.papyrus.uml.service.types.tests.deletion.DeleteDependentWithStereotypeApplications458685)  Time elapsed: 3.292 s
01:09:48 stereotypeApplicationsDeleted:elements(org.eclipse.papyrus.uml.service.types.tests.deletion.DeleteDependentWithStereotypeApplications458685)  Time elapsed: 0 s
01:09:48 stereotypeApplicationsDeleted:stereotypes(org.eclipse.papyrus.uml.service.types.tests.deletion.DeleteDependentWithStereotypeApplications458685)  Time elapsed: 0 s
01:09:48 stereotypeApplicationsDeleted:undo(org.eclipse.papyrus.uml.service.types.tests.deletion.DeleteDependentWithStereotypeApplications458685)  Time elapsed: 0 s
01:09:48 stereotypeApplicationsDeleted:redo(org.eclipse.papyrus.uml.service.types.tests.deletion.DeleteDependentWithStereotypeApplications458685)  Time elapsed: 0 s
01:09:48 deleteInitialState(org.eclipse.papyrus.uml.service.types.tests.deletion.DeleteTransitionsWithVertexTest)  Time elapsed: 0.543 s
01:09:48 deleteS1(org.eclipse.papyrus.uml.service.types.tests.deletion.DeleteTransitionsWithVertexTest)  Time elapsed: 0.259 s
01:09:48 deleteS2(org.eclipse.papyrus.uml.service.types.tests.deletion.DeleteTransitionsWithVertexTest)  Time elapsed: 0.202 s
01:09:48 deleteFinalState(org.eclipse.papyrus.uml.service.types.tests.deletion.DeleteTransitionsWithVertexTest)  Time elapsed: 0.253 s
01:09:48 deleteFromContainmentSubset(org.eclipse.papyrus.uml.service.types.tests.deletion.DeleteContainmentSubsetTest)  Time elapsed: 0.198 s
01:09:48 deleteFromTwoContainmentSupersetsAtOnce(org.eclipse.papyrus.uml.service.types.tests.deletion.DeleteContainmentSubsetTest)  Time elapsed: 0.153 s
01:09:48 createAssociationWritable(org.eclipse.papyrus.uml.service.types.tests.creation.ConnectorReadOnlyTestBug465899)  Time elapsed: 0.101 s
01:09:48 createAssociationReadOnly_usecase(org.eclipse.papyrus.uml.service.types.tests.creation.ConnectorReadOnlyTestBug465899)  Time elapsed: 0.081 s
01:09:48 createAssociationReadOnly(org.eclipse.papyrus.uml.service.types.tests.creation.ConnectorReadOnlyTestBug465899)  Time elapsed: 0.046 s
01:09:48 createConnectorTargetReadOnly(org.eclipse.papyrus.uml.service.types.tests.creation.ConnectorReadOnlyTestBug465899)  Time elapsed: 0.077 s
01:09:48 createConnectorSourceReadOnly(org.eclipse.papyrus.uml.service.types.tests.creation.ConnectorReadOnlyTestBug465899)  Time elapsed: 0.078 s
01:09:48 testDeletion(org.eclipse.papyrus.uml.service.types.tests.deletion.DeleteAssociationPropertyTypeTest)  Time elapsed: 0.065 s
01:09:48 testDeletionInCompositeDiagram(org.eclipse.papyrus.uml.service.types.tests.deletion.DeleteCommentLinkTest)  Time elapsed: 9.214 s
01:09:48 testDeletionWithSetRequest(org.eclipse.papyrus.uml.service.types.tests.deletion.DeleteCommentLinkTest) skipped
01:09:48 testDeletionInClassDiagram(org.eclipse.papyrus.uml.service.types.tests.deletion.DeleteCommentLinkTest)  Time elapsed: 3.207 s
01:09:48 testDeletionInComponentDiagram(org.eclipse.papyrus.uml.service.types.tests.deletion.DeleteCommentLinkTest)  Time elapsed: 2.502 s
01:09:48 testCreation(org.eclipse.papyrus.uml.service.types.tests.creation.CreateAssociationTest)  Time elapsed: 0.017 s
01:09:48 testCreation(org.eclipse.papyrus.uml.service.types.tests.creation.CreateAssociationDirectedTest)  Time elapsed: 0.012 s
01:09:48 testCreation(org.eclipse.papyrus.uml.service.types.tests.creation.CreateAssociationCompositeTest)  Time elapsed: 0.014 s
01:09:48 testCreation(org.eclipse.papyrus.uml.service.types.tests.creation.CreateAssociationCompositeDirectedTest)  Time elapsed: 0.008 s
01:09:48 testCreation(org.eclipse.papyrus.uml.service.types.tests.creation.CreateAssociationSharedTest)  Time elapsed: 0.018 s
01:09:48 testCreation(org.eclipse.papyrus.uml.service.types.tests.creation.CreateAssociationSharedDirectedTest)  Time elapsed: 0.025 s
01:09:48 deleteInteractionFragmentInOperand(org.eclipse.papyrus.uml.service.types.tests.deletion.InteractionDeletionTest)  Time elapsed: 1.578 s
01:09:48 deleteAllOperandsOfCombinedFragment(org.eclipse.papyrus.uml.service.types.tests.deletion.InteractionDeletionTest)  Time elapsed: 1.482 s
01:09:48 deleteCombinedFragment(org.eclipse.papyrus.uml.service.types.tests.deletion.InteractionDeletionTest)  Time elapsed: 1.76 s
01:09:48 deleteCombinedFragmentNested(org.eclipse.papyrus.uml.service.types.tests.deletion.InteractionDeletionTest)  Time elapsed: 1.497 s
01:09:48 deleteOperandsOfCombinedFragment(org.eclipse.papyrus.uml.service.types.tests.deletion.InteractionDeletionTest)  Time elapsed: 1.232 s
01:09:48 deleteCombinedFragmentDeeplyNested(org.eclipse.papyrus.uml.service.types.tests.deletion.InteractionDeletionTest)  Time elapsed: 1.301 s
01:09:48 deleteInteractionWithNesting(org.eclipse.papyrus.uml.service.types.tests.deletion.InteractionDeletionTest)  Time elapsed: 1.15 s
01:09:48 deleteInteraction(org.eclipse.papyrus.uml.service.types.tests.deletion.InteractionDeletionTest)  Time elapsed: 1.121 s
01:09:48 stereotypeNotApplicableByProfileURI(org.eclipse.papyrus.uml.service.types.tests.registry.StereotypeMatcherAdviceTest)  Time elapsed: 2.521 s
01:09:48 matchExistingElement(org.eclipse.papyrus.uml.service.types.tests.registry.StereotypeMatcherAdviceTest)  Time elapsed: 0.255 s
01:09:48 stereotypeNotApplicableByQualifiedName(org.eclipse.papyrus.uml.service.types.tests.registry.StereotypeMatcherAdviceTest)  Time elapsed: 1.777 s
01:09:48 createNewElement(org.eclipse.papyrus.uml.service.types.tests.registry.StereotypeMatcherAdviceTest)  Time elapsed: 0.941 s
01:09:48 testCreateClassInModel(org.eclipse.papyrus.uml.service.types.ui.tests.creation.CreateElementTest)  Time elapsed: 0.01 s
01:09:48 testCreateCentralBufferNodeInActivity(org.eclipse.papyrus.uml.service.types.ui.tests.creation.CreateElementTest)  Time elapsed: 0.013 s
01:09:48 testCreateCentralBufferNodeInActivityWithNode(org.eclipse.papyrus.uml.service.types.ui.tests.creation.CreateElementTest)  Time elapsed: 0.006 s
01:09:48 testCannotCreateOperationRedefinableTemplateSignature_bug468071(org.eclipse.papyrus.uml.service.types.ui.tests.creation.CreateElementTest)  Time elapsed: 0.001 s
01:09:48 testCreateOperationTemplateSignature_bug468071(org.eclipse.papyrus.uml.service.types.ui.tests.creation.CreateElementTest)  Time elapsed: 0.007 s
01:09:48 testCreateModelInClass(org.eclipse.papyrus.uml.service.types.ui.tests.creation.CreateElementTest)  Time elapsed: 0.001 s
01:09:48 testCreateDeploymentBetweenNodeAndArtifactInNode(org.eclipse.papyrus.uml.service.types.ui.tests.creation.CreateRelationshipTest)  Time elapsed: 0.008 s
01:09:48 testCreatePackageMergeBetweenPackageAndPackageInPackage2(org.eclipse.papyrus.uml.service.types.ui.tests.creation.CreateRelationshipTest)  Time elapsed: 0.012 s
01:09:48 testCreateTraceBetweenClassAndNullInPackage(org.eclipse.papyrus.uml.service.types.ui.tests.creation.CreateRelationshipTest)  Time elapsed: 0.005 s
01:09:48 testCreateDependencyBetweenClassesInPackage(org.eclipse.papyrus.uml.service.types.ui.tests.creation.CreateRelationshipTest)  Time elapsed: 0.006 s
01:09:48 testCreateProtocolConformanceBetweenPackageAndPackageInPackage(org.eclipse.papyrus.uml.service.types.ui.tests.creation.CreateRelationshipTest)  Time elapsed: 0.02 s
01:09:48 testCreateInformationfloweBetweenClasses2InPackage(org.eclipse.papyrus.uml.service.types.ui.tests.creation.CreateRelationshipTest)  Time elapsed: 0.008 s
01:09:48 testCreateUsageBetweenClassAndNullInPackage(org.eclipse.papyrus.uml.service.types.ui.tests.creation.CreateRelationshipTest)  Time elapsed: 0.003 s
01:09:48 testCreateAbstractionBetweenPackageAndClassesInModel(org.eclipse.papyrus.uml.service.types.ui.tests.creation.CreateRelationshipTest)  Time elapsed: 0.022 s
01:09:48 testCreateComponentRealizationBetweenClassAndComponentInComponent(org.eclipse.papyrus.uml.service.types.ui.tests.creation.CreateRelationshipTest)  Time elapsed: 0.016 s
01:09:48 testCreateAbstractionBetweenClassesInPackage(org.eclipse.papyrus.uml.service.types.ui.tests.creation.CreateRelationshipTest)  Time elapsed: 0.005 s
01:09:48 testCreateUsageBetweenClassesInPackage(org.eclipse.papyrus.uml.service.types.ui.tests.creation.CreateRelationshipTest)  Time elapsed: 0.005 s
01:09:48 testCreatePackageImportBetweenPackageAndPackageInPackage(org.eclipse.papyrus.uml.service.types.ui.tests.creation.CreateRelationshipTest)  Time elapsed: 0.007 s
01:09:48 testCreateComponentRealizationBetweenComponentAndClassInComponent(org.eclipse.papyrus.uml.service.types.ui.tests.creation.CreateRelationshipTest)  Time elapsed: 0.029 s
01:09:48 testCreateElementImportBetweenPackageAndPackageInPackage(org.eclipse.papyrus.uml.service.types.ui.tests.creation.CreateRelationshipTest)  Time elapsed: 0.006 s
01:09:48 testCreateDeploymentBetweenNodeAndArtifactInArtifact(org.eclipse.papyrus.uml.service.types.ui.tests.creation.CreateRelationshipTest)  Time elapsed: 0.001 s
01:09:48 testCreateGeneralizationBetweenClassesInPackage(org.eclipse.papyrus.uml.service.types.ui.tests.creation.CreateRelationshipTest)  Time elapsed: 0.006 s
01:09:48 testCreateGeneralizationBetweenClassAndNullInClass(org.eclipse.papyrus.uml.service.types.ui.tests.creation.CreateRelationshipTest)  Time elapsed: 0.002 s
01:09:48 testCreateDeploymentBetweenArtifactAndNodeInArtifact(org.eclipse.papyrus.uml.service.types.ui.tests.creation.CreateRelationshipTest)  Time elapsed: 0.01 s
01:09:48 testCreateExtendBetweenClasses2InPackage(org.eclipse.papyrus.uml.service.types.ui.tests.creation.CreateRelationshipTest)  Time elapsed: 0.001 s
01:09:48 testCreateProtocolConformanceBetweenPackageAndPackageInPackage2(org.eclipse.papyrus.uml.service.types.ui.tests.creation.CreateRelationshipTest)  Time elapsed: 0.001 s
01:09:48 testCreateTransitionBetweenInitialAndState(org.eclipse.papyrus.uml.service.types.ui.tests.creation.CreateRelationshipTest) skipped
01:09:48 testCreateInformationfloweBetweenUseCases2InUseCase(org.eclipse.papyrus.uml.service.types.ui.tests.creation.CreateRelationshipTest)  Time elapsed: 0.008 s
01:09:48 testCreateRefineBetweenClassesInPackage(org.eclipse.papyrus.uml.service.types.ui.tests.creation.CreateRelationshipTest)  Time elapsed: 0.425 s
01:09:48 testCreateComponentRealizationBetweenClassAndComponentInClass(org.eclipse.papyrus.uml.service.types.ui.tests.creation.CreateRelationshipTest)  Time elapsed: 0.009 s
01:09:48 testCreateRealizationBetweenClassAndNullInPackage(org.eclipse.papyrus.uml.service.types.ui.tests.creation.CreateRelationshipTest)  Time elapsed: 0.004 s
01:09:48 testCreateExtensionBetweenClassAndNullInNull(org.eclipse.papyrus.uml.service.types.ui.tests.creation.CreateRelationshipTest)  Time elapsed: 0.001 s
01:09:48 testCreateExtendBetweenUseCases2InUseCase(org.eclipse.papyrus.uml.service.types.ui.tests.creation.CreateRelationshipTest)  Time elapsed: 0.029 s
01:09:48 testCreateElementImportBetweenPackageAndPackageInPackage2(org.eclipse.papyrus.uml.service.types.ui.tests.creation.CreateRelationshipTest)  Time elapsed: 0.005 s
01:09:48 testCreateAssociationBetweenClassesInPackage(org.eclipse.papyrus.uml.service.types.ui.tests.creation.CreateRelationshipTest)  Time elapsed: 0.004 s
01:09:48 testCreateTraceBetweenClassesInClass(org.eclipse.papyrus.uml.service.types.ui.tests.creation.CreateRelationshipTest)  Time elapsed: 0.015 s
01:09:48 testCreateManifestationBetweenArtifactAndPackage2InArtifact(org.eclipse.papyrus.uml.service.types.ui.tests.creation.CreateRelationshipTest)  Time elapsed: 0.007 s
01:09:48 testCreateSubstitutionBetweenClassesInPackage(org.eclipse.papyrus.uml.service.types.ui.tests.creation.CreateRelationshipTest)  Time elapsed: 0.007 s
01:09:48 testCreateAbstractionBetweenClassAndNullInPackage(org.eclipse.papyrus.uml.service.types.ui.tests.creation.CreateRelationshipTest)  Time elapsed: 0.002 s
01:09:48 testCreateAbstractionBetweenClassAndClassInClass(org.eclipse.papyrus.uml.service.types.ui.tests.creation.CreateRelationshipTest)  Time elapsed: 0.005 s
01:09:48 testCreatePackageMergeBetweenPackageAndPackageInPackage(org.eclipse.papyrus.uml.service.types.ui.tests.creation.CreateRelationshipTest)  Time elapsed: 0.004 s
01:09:48 testCreateRealizationBetweenClassesInPackage(org.eclipse.papyrus.uml.service.types.ui.tests.creation.CreateRelationshipTest)  Time elapsed: 0.004 s
01:09:48 testCreateTransitionBetweenStateAndInitial(org.eclipse.papyrus.uml.service.types.ui.tests.creation.CreateRelationshipTest) skipped
01:09:48 testCreateAssociationBetweenClassAndNullInPackage(org.eclipse.papyrus.uml.service.types.ui.tests.creation.CreateRelationshipTest)  Time elapsed: 0.002 s
01:09:48 testCreateRefineBetweenClassAndNullInPackage(org.eclipse.papyrus.uml.service.types.ui.tests.creation.CreateRelationshipTest)  Time elapsed: 0.002 s
01:09:48 testCreateDeploymentBetweenArtifactAndNodeInNode(org.eclipse.papyrus.uml.service.types.ui.tests.creation.CreateRelationshipTest)  Time elapsed: 0.006 s
01:09:48 testCreateIncludeBetweenUseCases2InUseCase(org.eclipse.papyrus.uml.service.types.ui.tests.creation.CreateRelationshipTest)  Time elapsed: 0.03 s
01:09:48 testCreateGeneralizationBetweenClassesInClass(org.eclipse.papyrus.uml.service.types.ui.tests.creation.CreateRelationshipTest)  Time elapsed: 0.005 s
01:09:48 testCreateExtensionBetweenClassAndNullInClass(org.eclipse.papyrus.uml.service.types.ui.tests.creation.CreateRelationshipTest)  Time elapsed: 0 s
01:09:48 testCreateDependencyBetweenClassAndNullInPackage(org.eclipse.papyrus.uml.service.types.ui.tests.creation.CreateRelationshipTest)  Time elapsed: 0.001 s
01:09:48 testCreatePackageImportBetweenPackageAndPackageInPackage2(org.eclipse.papyrus.uml.service.types.ui.tests.creation.CreateRelationshipTest)  Time elapsed: 0.004 s
01:09:48 testCreateComponentRealizationBetweenComponentAndClass(org.eclipse.papyrus.uml.service.types.ui.tests.creation.CreateRelationshipTest)  Time elapsed: 0.002 s
01:09:48 testCreateSubstitutionBetweenClassAndNullInPackage(org.eclipse.papyrus.uml.service.types.ui.tests.creation.CreateRelationshipTest)  Time elapsed: 0.002 s
01:09:48 testCreateInterfaceRealizationBetweenClassAndInterfaceInClass(org.eclipse.papyrus.uml.service.types.ui.tests.creation.CreateRelationshipTest)  Time elapsed: 0.007 s
01:09:48 testCreateTraceBetweenClassesInPackage(org.eclipse.papyrus.uml.service.types.ui.tests.creation.CreateRelationshipTest)  Time elapsed: 0.012 s
01:09:48 testCreateTransitionBetweenStateAndFinal(org.eclipse.papyrus.uml.service.types.ui.tests.creation.CreateRelationshipTest) skipped
01:09:48 testCreateAbstractionBetweenClassAndPackageInModel(org.eclipse.papyrus.uml.service.types.ui.tests.creation.CreateRelationshipTest)  Time elapsed: 0.004 s
01:09:48 testCreateRefineBetweenClassesInClass(org.eclipse.papyrus.uml.service.types.ui.tests.creation.CreateRelationshipTest)  Time elapsed: 0.012 s
01:09:48 testCreateTransitionBetweenFinalAndState(org.eclipse.papyrus.uml.service.types.ui.tests.creation.CreateRelationshipTest) skipped
01:09:48 testCreateManifestationBetweenClassAndPackage2InArtifact(org.eclipse.papyrus.uml.service.types.ui.tests.creation.CreateRelationshipTest)  Time elapsed: 0.005 s
01:09:48 testCreateInterfaceRealizationBetweenUseCases2InUseCase(org.eclipse.papyrus.uml.service.types.ui.tests.creation.CreateRelationshipTest)  Time elapsed: 0.001 s
01:09:48 testCreateIncludeBetweenClasses2InPackage(org.eclipse.papyrus.uml.service.types.ui.tests.creation.CreateRelationshipTest)  Time elapsed: 0.001 s
01:09:48 testCreateExtensionBetweenStereotypeAndMetaClassInPackage(org.eclipse.papyrus.uml.service.types.ui.tests.creation.CreateProfileRelationshipTest)  Time elapsed: 0.024 s
01:09:48 testMoveTemplateSignatureToOperation_bug468071(org.eclipse.papyrus.uml.service.types.ui.tests.creation.MoveElementTest)  Time elapsed: 0.849 s
01:09:48 testMoveRedefinableTemplateSignatureToClass_bug468071(org.eclipse.papyrus.uml.service.types.ui.tests.creation.MoveElementTest)  Time elapsed: 0.004 s
01:09:48 testCannotMoveRedefinableTemplateSignatureToOperation_bug468071(org.eclipse.papyrus.uml.service.types.ui.tests.creation.MoveElementTest)  Time elapsed: 0.001 s
01:09:48 testSetTemplateSignatureOfOperation_bug468071(org.eclipse.papyrus.uml.service.types.ui.tests.creation.SetFeatureTest)  Time elapsed: 0.005 s
01:09:48 testSetRedefinableTemplateSignatureOfClass_bug468071(org.eclipse.papyrus.uml.service.types.ui.tests.creation.SetFeatureTest)  Time elapsed: 0.004 s
01:09:48 testCannotSetRedefinableTemplateSignatureOfOperation_bug468071(org.eclipse.papyrus.uml.service.types.ui.tests.creation.SetFeatureTest)  Time elapsed: 0 s
01:09:48 deleteAssociation(org.eclipse.papyrus.uml.service.types.ui.tests.deletion.DeleteAssociationTest)  Time elapsed: 0.356 s
01:09:48 deleteAssociationTarget(org.eclipse.papyrus.uml.service.types.ui.tests.deletion.DeleteAssociationTest)  Time elapsed: 0.322 s
01:09:48 deleteReadOnlyElement(org.eclipse.papyrus.uml.modelexplorer.tests.DeleteModelExplorerTest)  Time elapsed: 1.44 s
01:09:48 deleteClassInTheModel(org.eclipse.papyrus.uml.modelexplorer.tests.DeleteModelExplorerTest)  Time elapsed: 1.81 s
01:09:48 deleteRootOfTheModel(org.eclipse.papyrus.uml.modelexplorer.tests.DeleteModelExplorerTest)  Time elapsed: 0.398 s
01:09:48 renameUMLUnnamedElementTest(org.eclipse.papyrus.uml.modelexplorer.tests.RenameHandlerTest) skipped
01:09:48 renameUMLNamedElementTest(org.eclipse.papyrus.uml.modelexplorer.tests.RenameHandlerTest) skipped
01:09:48 revealSemanticElement_selectRootTest(org.eclipse.papyrus.uml.modelexplorer.tests.ModelExplorerViewTests)  Time elapsed: 1.286 s
01:09:48 revealSemanticElement_selectChildrenTest(org.eclipse.papyrus.uml.modelexplorer.tests.ModelExplorerViewTests)  Time elapsed: 1.119 s
01:09:48 revealSemanticElement_selectImportedPackage(org.eclipse.papyrus.uml.modelexplorer.tests.ModelExplorerViewTests)  Time elapsed: 1.19 s
01:09:48 revealSemanticElement_selectImportedPackageList(org.eclipse.papyrus.uml.modelexplorer.tests.ModelExplorerViewTests)  Time elapsed: 1.224 s
01:09:48 revealSemanticElement_selectChildrenTestList(org.eclipse.papyrus.uml.modelexplorer.tests.ModelExplorerViewTests)  Time elapsed: 1.057 s
01:09:48 cutReadOnlyElement(org.eclipse.papyrus.uml.modelexplorer.tests.paste.CutPasteModelExplorerTest)  Time elapsed: 0.549 s
01:09:48 cutClassTest(org.eclipse.papyrus.uml.modelexplorer.tests.paste.CutPasteModelExplorerTest)  Time elapsed: 1.758 s
01:09:48 cutRootOfTheModel(org.eclipse.papyrus.uml.modelexplorer.tests.paste.CutPasteModelExplorerTest)  Time elapsed: 0.387 s
01:09:48 copyPasteofClass1Test(org.eclipse.papyrus.uml.modelexplorer.tests.paste.CopyPasteModelExplorerTest)  Time elapsed: 0.542 s
01:09:48 pasteOnReadOnlyElement(org.eclipse.papyrus.uml.modelexplorer.tests.paste.CopyPasteModelExplorerTest)  Time elapsed: 0.564 s
01:09:48 copyPasteofClass1And2Test(org.eclipse.papyrus.uml.modelexplorer.tests.paste.CopyPasteModelExplorerTest)  Time elapsed: 0.511 s
01:09:48 copyPasteDiagramTest(org.eclipse.papyrus.uml.modelexplorer.tests.paste.DiagramCopyPasteModelExplorerTest)  Time elapsed: 0.535 s
01:09:48 copyPasteTableTest(org.eclipse.papyrus.uml.modelexplorer.tests.paste.TableCopyPasteModelExplorerTest)  Time elapsed: 0.536 s
01:09:48 copyPasteofClass1Test(org.eclipse.papyrus.uml.modelexplorer.tests.paste.StereotypeCopyPasteModelExplorerTest)  Time elapsed: 1.748 s
01:09:48 advancedModeDoesNotCollapseItself(org.eclipse.papyrus.uml.modelexplorer.tests.AdvancedModeTest)  Time elapsed: 2.073 s
01:09:48 validateModel[0](org.eclipse.papyrus.uml.modelexplorer.tests.resources.ModelValidationTest)  Time elapsed: 0.052 s
01:09:48 validateModel[1](org.eclipse.papyrus.uml.modelexplorer.tests.resources.ModelValidationTest)  Time elapsed: 0.02 s
01:09:48 dropInterface(org.eclipse.papyrus.uml.diagram.dnd.tests.tests.InstanceSpecificationTest)  Time elapsed: 0.145 s
01:09:48 dropClass(org.eclipse.papyrus.uml.diagram.dnd.tests.tests.InstanceSpecificationTest)  Time elapsed: 0.053 s
01:09:48 testPropertyContentProvider(org.eclipse.papyrus.uml.diagram.dnd.tests.tests.InstanceSpecificationTest)  Time elapsed: 0.006 s
01:09:48 dropClassAndInterface(org.eclipse.papyrus.uml.diagram.dnd.tests.tests.InstanceSpecificationTest)  Time elapsed: 0.05 s
01:09:48 dropClassAndSuperclass(org.eclipse.papyrus.uml.diagram.dnd.tests.tests.InstanceSpecificationTest)  Time elapsed: 0.075 s
01:09:48 singleValuePropertyGraphicalTest(org.eclipse.papyrus.uml.tools.tests.tests.ContentProviderTest)  Time elapsed: 0.13 s
01:09:48 singleValuePropertyTest(org.eclipse.papyrus.uml.tools.tests.tests.ContentProviderTest)  Time elapsed: 0.058 s
01:09:48 multipleValuePropertyTest(org.eclipse.papyrus.uml.tools.tests.tests.ContentProviderTest) skipped
01:09:48 enumPropertyTest(org.eclipse.papyrus.uml.tools.tests.tests.ContentProviderTest)  Time elapsed: 0.013 s
01:09:48 testProfileContentWithBaseClassPropertyWithoutInheritedProperties(org.eclipse.papyrus.uml.tools.tests.tests.UMLStereotypePropertyContentProviderTest)  Time elapsed: 0.586 s
01:09:48 testProfileContentWithoutBaseClassPropertyWithoutInheritedProperties(org.eclipse.papyrus.uml.tools.tests.tests.UMLStereotypePropertyContentProviderTest)  Time elapsed: 0.45 s
01:09:48 testProfileContentWithBaseClassPropertyWithInheritedProperties(org.eclipse.papyrus.uml.tools.tests.tests.UMLStereotypePropertyContentProviderTest)  Time elapsed: 0.476 s
01:09:48 testProfileContentWithoutBaseClassPropertyWithInheritedProperties(org.eclipse.papyrus.uml.tools.tests.tests.UMLStereotypePropertyContentProviderTest)  Time elapsed: 0.468 s
01:09:48 testSwitchToProxy(org.eclipse.papyrus.uml.tools.tests.tests.DependencyManagementTest) skipped
01:09:48 testSwitchProfilesWithStereotypes(org.eclipse.papyrus.uml.tools.tests.tests.DependencyManagementTest)  Time elapsed: 3.482 s
01:09:48 testSwitchFromRegistererdToLocal(org.eclipse.papyrus.uml.tools.tests.tests.DependencyManagementTest)  Time elapsed: 3.797 s
01:09:48 testSwitchProfilesWithStereotypeProperties(org.eclipse.papyrus.uml.tools.tests.tests.DependencyManagementTest)  Time elapsed: 4.018 s
01:09:48 testSwitchProfilesWithMissingDefinitions(org.eclipse.papyrus.uml.tools.tests.tests.DependencyManagementTest)  Time elapsed: 2.897 s
01:09:48 testSwitchFromLocalToRegistered(org.eclipse.papyrus.uml.tools.tests.tests.DependencyManagementTest)  Time elapsed: 3.098 s
01:09:48 testSwitchToDifferentVersion(org.eclipse.papyrus.uml.tools.tests.tests.DependencyManagementTest) skipped
01:09:48 testSimpleSwitch(org.eclipse.papyrus.uml.tools.tests.tests.DependencyManagementTest)  Time elapsed: 2.837 s
01:09:48 testSwitchFromProxy(org.eclipse.papyrus.uml.tools.tests.tests.DependencyManagementTest) skipped
01:09:48 testSwitchProfilesStereotypeIdentities(org.eclipse.papyrus.uml.tools.tests.tests.DependencyManagementTest)  Time elapsed: 2.546 s
01:09:48 testSwitchProfilesWithRequiredStereotypes(org.eclipse.papyrus.uml.tools.tests.tests.DependencyManagementTest)  Time elapsed: 2.472 s
01:09:48 testOverloadDoesNotClash(org.eclipse.papyrus.uml.tools.tests.tests.NamedElementValidatorTest)  Time elapsed: 0.08 s
01:09:48 testNameClash(org.eclipse.papyrus.uml.tools.tests.tests.NamedElementValidatorTest)  Time elapsed: 0.059 s
01:09:48 testElementOfDifferentKindDoesNotClash(org.eclipse.papyrus.uml.tools.tests.tests.NamedElementValidatorTest)  Time elapsed: 0.056 s
01:09:48 testModifiedSysMLStereotype(org.eclipse.papyrus.uml.tools.tests.tests.StereotypeElementListenerTest) skipped
01:09:48 testUndoUnapplyProfile(org.eclipse.papyrus.uml.tools.tests.tests.StereotypeElementListenerTest)  Time elapsed: 0.669 s
01:09:48 testAddStereotype(org.eclipse.papyrus.uml.tools.tests.tests.StereotypeElementListenerTest)  Time elapsed: 0.803 s
01:09:48 testStereotypeUnsetAttributeChange(org.eclipse.papyrus.uml.tools.tests.tests.StereotypeElementListenerTest)  Time elapsed: 0.692 s
01:09:48 testUndoAddStereotype(org.eclipse.papyrus.uml.tools.tests.tests.StereotypeElementListenerTest)  Time elapsed: 0.649 s
01:09:48 testAddStereotypes(org.eclipse.papyrus.uml.tools.tests.tests.StereotypeElementListenerTest)  Time elapsed: 0.634 s
01:09:48 testUndoRemoveStereotype(org.eclipse.papyrus.uml.tools.tests.tests.StereotypeElementListenerTest)  Time elapsed: 0.608 s
01:09:48 testAddSysMLStereotype(org.eclipse.papyrus.uml.tools.tests.tests.StereotypeElementListenerTest)  Time elapsed: 0.631 s
01:09:48 testModifiedStereotype(org.eclipse.papyrus.uml.tools.tests.tests.StereotypeElementListenerTest)  Time elapsed: 0.694 s
01:09:48 testAddStereotypeOnSeveralElements(org.eclipse.papyrus.uml.tools.tests.tests.StereotypeElementListenerTest)  Time elapsed: 0.612 s
01:09:48 testUndoAddStereotypes(org.eclipse.papyrus.uml.tools.tests.tests.StereotypeElementListenerTest)  Time elapsed: 0.601 s
01:09:48 testFakeBasedProperty(org.eclipse.papyrus.uml.tools.tests.tests.StereotypeElementListenerTest)  Time elapsed: 0.609 s
01:09:48 testRemoveStereotype(org.eclipse.papyrus.uml.tools.tests.tests.StereotypeElementListenerTest)  Time elapsed: 0.588 s
01:09:48 testRemoveSysMLStereotype(org.eclipse.papyrus.uml.tools.tests.tests.StereotypeElementListenerTest)  Time elapsed: 0.604 s
01:09:48 testUndoAddSysMLStereotype(org.eclipse.papyrus.uml.tools.tests.tests.StereotypeElementListenerTest)  Time elapsed: 0.684 s
01:09:48 testUndoModifiedStereotype(org.eclipse.papyrus.uml.tools.tests.tests.StereotypeElementListenerTest)  Time elapsed: 0.594 s
01:09:48 testUndoAddStereotypeOnSeveralElements(org.eclipse.papyrus.uml.tools.tests.tests.StereotypeElementListenerTest)  Time elapsed: 0.576 s
01:09:48 testUndoRedoAddStereotypeTiming(org.eclipse.papyrus.uml.tools.tests.tests.StereotypeElementListenerTest)  Time elapsed: 0.658 s
01:09:48 testUnapplyProfile(org.eclipse.papyrus.uml.tools.tests.tests.StereotypeElementListenerTest)  Time elapsed: 0.817 s
01:09:48 testUndoRemoveSysMLStereotype(org.eclipse.papyrus.uml.tools.tests.tests.StereotypeElementListenerTest)  Time elapsed: 1.007 s
01:09:48 testUndoModifiedSysMLStereotype(org.eclipse.papyrus.uml.tools.tests.tests.StereotypeElementListenerTest) skipped
01:09:48 testStereotypeListAttributeChange(org.eclipse.papyrus.uml.tools.tests.tests.StereotypeElementListenerTest)  Time elapsed: 0.708 s
01:09:48 twoProfilesUnapplied(org.eclipse.papyrus.uml.tools.tests.tests.ProfileApplicationListenerTest)  Time elapsed: 0.172 s
01:09:48 moveProfileApplication(org.eclipse.papyrus.uml.tools.tests.tests.ProfileApplicationListenerTest)  Time elapsed: 0.167 s
01:09:48 applyProfileThenMoveApplication(org.eclipse.papyrus.uml.tools.tests.tests.ProfileApplicationListenerTest)  Time elapsed: 0.158 s
01:09:48 twoProfilesApplied(org.eclipse.papyrus.uml.tools.tests.tests.ProfileApplicationListenerTest)  Time elapsed: 0.17 s
01:09:48 profileReplacedInAnApplication(org.eclipse.papyrus.uml.tools.tests.tests.ProfileApplicationListenerTest)  Time elapsed: 0.173 s
01:09:48 simpleNewProfileApplication(org.eclipse.papyrus.uml.tools.tests.tests.ProfileApplicationListenerTest)  Time elapsed: 0.176 s
01:09:48 simpleProfileUnapplication(org.eclipse.papyrus.uml.tools.tests.tests.ProfileApplicationListenerTest)  Time elapsed: 0.175 s
01:09:48 profileAppliedThenReplacedInSameApplication(org.eclipse.papyrus.uml.tools.tests.tests.ProfileApplicationListenerTest)  Time elapsed: 0.232 s
01:09:48 testEditToDisplaySingleString_1(org.eclipse.papyrus.uml.tools.tests.tests.UMLReferenceConverterTest)  Time elapsed: 0.041 s
01:09:48 testList(org.eclipse.papyrus.uml.tools.tests.tests.UMLReferenceConverterTest)  Time elapsed: 0.043 s
01:09:48 testNull(org.eclipse.papyrus.uml.tools.tests.tests.UMLReferenceConverterTest)  Time elapsed: 0.054 s
01:09:48 testDisplayToEditString_1(org.eclipse.papyrus.uml.tools.tests.tests.UMLReferenceConverterTest)  Time elapsed: 0.038 s
01:09:48 testEmptyString(org.eclipse.papyrus.uml.tools.tests.tests.UMLReferenceConverterTest)  Time elapsed: 0.059 s
01:09:48 testClass2(org.eclipse.papyrus.uml.tools.tests.tests.UMLReferenceConverterTest)  Time elapsed: 0.08 s
01:09:48 testClass3(org.eclipse.papyrus.uml.tools.tests.tests.UMLReferenceConverterTest)  Time elapsed: 0.04 s
01:09:48 testMatchingElementstSingleValue1(org.eclipse.papyrus.uml.tools.tests.tests.UMLReferenceConverterTest)  Time elapsed: 0.052 s
01:09:48 testMatchingElementstSingleValue2(org.eclipse.papyrus.uml.tools.tests.tests.UMLReferenceConverterTest)  Time elapsed: 0.043 s
01:09:48 testCompletionToFindClass_1(org.eclipse.papyrus.uml.tools.tests.tests.UMLReferenceConverterCompletionTest)  Time elapsed: 0.077 s
01:09:48 testCompletionToFindClass_3(org.eclipse.papyrus.uml.tools.tests.tests.UMLReferenceConverterCompletionTest)  Time elapsed: 0.048 s
01:09:48 testCompletionToFindClass_4(org.eclipse.papyrus.uml.tools.tests.tests.UMLReferenceConverterCompletionTest)  Time elapsed: 0.059 s
01:09:48 testCompletionToFindClass_5(org.eclipse.papyrus.uml.tools.tests.tests.UMLReferenceConverterCompletionTest)  Time elapsed: 0.1 s
01:09:48 testCompletionToFindClass_6(org.eclipse.papyrus.uml.tools.tests.tests.UMLReferenceConverterCompletionTest)  Time elapsed: 0.048 s
01:09:48 testCompletionToFindClass_7(org.eclipse.papyrus.uml.tools.tests.tests.UMLReferenceConverterCompletionTest)  Time elapsed: 0.061 s
01:09:48 testCompletionToFindClass_8(org.eclipse.papyrus.uml.tools.tests.tests.UMLReferenceConverterCompletionTest)  Time elapsed: 0.129 s
01:09:48 testSplitString_1(org.eclipse.papyrus.uml.tools.tests.tests.UMLReferenceConverterCompletionTest)  Time elapsed: 0.058 s
01:09:48 testSplitString_2(org.eclipse.papyrus.uml.tools.tests.tests.UMLReferenceConverterCompletionTest)  Time elapsed: 0.047 s
01:09:48 testCompletionToFindConstraint_1(org.eclipse.papyrus.uml.tools.tests.tests.UMLReferenceConverterCompletionTest)  Time elapsed: 0.06 s
01:09:48 testCompletionToFindConstraint_2(org.eclipse.papyrus.uml.tools.tests.tests.UMLReferenceConverterCompletionTest)  Time elapsed: 0.047 s
01:09:48 testCompletionMultiValueConverterEmptyString(org.eclipse.papyrus.uml.tools.tests.tests.UMLReferenceConverterCompletionTest)  Time elapsed: 0.058 s
01:09:48 testCompletionToFindPackage_1(org.eclipse.papyrus.uml.tools.tests.tests.UMLReferenceConverterCompletionTest)  Time elapsed: 0.062 s
01:09:48 testCompletionToFindPackage_2(org.eclipse.papyrus.uml.tools.tests.tests.UMLReferenceConverterCompletionTest)  Time elapsed: 0.047 s
01:09:48 testCompletionSingleValueConverterEmptyString(org.eclipse.papyrus.uml.tools.tests.tests.UMLReferenceConverterCompletionTest)  Time elapsed: 0.049 s
01:09:48 profileLanguage(org.eclipse.papyrus.uml.tools.tests.tests.UMLLanguageProvidersTest)  Time elapsed: 0.002 s
01:09:48 umlLanguage(org.eclipse.papyrus.uml.tools.tests.tests.UMLLanguageProvidersTest)  Time elapsed: 0.001 s
01:09:48 ValidationStereotypesListClass1Test(org.eclipse.papyrus.uml.tools.tests.tests.IconsStereotypesTest)  Time elapsed: 1.288 s
01:09:48 ValidationStereotypesListClass2Test(org.eclipse.papyrus.uml.tools.tests.tests.IconsStereotypesTest)  Time elapsed: 1.192 s
01:09:48 ValidationStereotypesListClass3Test(org.eclipse.papyrus.uml.tools.tests.tests.IconsStereotypesTest)  Time elapsed: 1.152 s
01:09:48 ValidationStereotypesListClass4Test(org.eclipse.papyrus.uml.tools.tests.tests.IconsStereotypesTest)  Time elapsed: 1.191 s
01:09:48 ValidationImageClass1Test(org.eclipse.papyrus.uml.tools.tests.tests.IconsStereotypesTest)  Time elapsed: 1.193 s
01:09:48 ValidationImageClass2Test(org.eclipse.papyrus.uml.tools.tests.tests.IconsStereotypesTest)  Time elapsed: 1.161 s
01:09:48 ValidationImageClass3Test(org.eclipse.papyrus.uml.tools.tests.tests.IconsStereotypesTest)  Time elapsed: 1.136 s
01:09:48 ValidationImageClass4Test(org.eclipse.papyrus.uml.tools.tests.tests.IconsStereotypesTest)  Time elapsed: 1.107 s
01:09:48 returnedTextTest(org.eclipse.papyrus.uml.tools.tests.tests.CustomizableDelegatingItemLabelProviderTest)  Time elapsed: 1.168 s
01:09:48 returnedStyledTextTest(org.eclipse.papyrus.uml.tools.tests.tests.CustomizableDelegatingItemLabelProviderTest)  Time elapsed: 1.148 s
01:09:48 notifyChange(org.eclipse.papyrus.uml.tools.tests.tests.DelegatingItemLabelProviderTest)  Time elapsed: 0.078 s
01:09:48 copyingInterfaceRealizationDoesNotCorruptTheModel(org.eclipse.papyrus.uml.tools.tests.tests.UMLCopyTest)  Time elapsed: 0.005 s
01:09:48 copyingInterfaceRealizationDoesNotCorruptTheModel(org.eclipse.papyrus.uml.tools.tests.tests.UMLCopyTestME)  Time elapsed: 0.845 s
01:09:48 duplicateStereotypeWithMultivaluedDataTypeContainmentFeatureTest(org.eclipse.papyrus.uml.tools.tests.tests.DuplicateStereotypeCommandTest)  Time elapsed: 1.994 s
01:09:48 duplicateStereotypeWithMultivaluedContainmentFeatureTest(org.eclipse.papyrus.uml.tools.tests.tests.DuplicateStereotypeCommandTest)  Time elapsed: 1.716 s
01:09:48 duplicateStereotypeWithSingleContainmentFeatureTest(org.eclipse.papyrus.uml.tools.tests.tests.DuplicateStereotypeCommandTest)  Time elapsed: 1.737 s
01:09:48 recursiveImportPackage(org.eclipse.papyrus.uml.tools.utils.tests.tests.NameResolutionHelperTest)  Time elapsed: 0.062 s
01:09:48 testIsAutoNamed(org.eclipse.papyrus.uml.tools.utils.tests.tests.NamedElementUtilTest)  Time elapsed: 0.02 s
01:09:48 testGetDefaultNameWithIncrement(org.eclipse.papyrus.uml.tools.utils.tests.tests.NamedElementUtilTest)  Time elapsed: 0.001 s
01:09:48 testAutoNameIncrement(org.eclipse.papyrus.uml.tools.utils.tests.tests.NamedElementUtilTest)  Time elapsed: 0.001 s
01:09:48 testExistingElementHavingNameNotRenamed(org.eclipse.papyrus.uml.tools.utils.tests.tests.NamedElementUtilTest)  Time elapsed: 0.001 s
01:09:48 testGetAppliedSuperstereotype(org.eclipse.papyrus.uml.tools.utils.tests.tests.UMLUtilTest)  Time elapsed: 0.085 s
01:09:48 testGetApplicableStereotype_notStrict_notApplicable(org.eclipse.papyrus.uml.tools.utils.tests.tests.UMLUtilTest)  Time elapsed: 0.415 s
01:09:48 testGetApplicableStereotype_notStrict_applicable(org.eclipse.papyrus.uml.tools.utils.tests.tests.UMLUtilTest)  Time elapsed: 0.394 s
01:09:48 testGetApplicableStereotype_strict_applicable(org.eclipse.papyrus.uml.tools.utils.tests.tests.UMLUtilTest)  Time elapsed: 0.444 s
01:09:48 testGetAppliedSubstereotype_notApplied(org.eclipse.papyrus.uml.tools.utils.tests.tests.UMLUtilTest)  Time elapsed: 0.079 s
01:09:48 testGetApplicableStereotype_strict_notApplicable(org.eclipse.papyrus.uml.tools.utils.tests.tests.UMLUtilTest)  Time elapsed: 0.421 s
01:09:48 testGetAppliedSubstereotype_applied(org.eclipse.papyrus.uml.tools.utils.tests.tests.UMLUtilTest)  Time elapsed: 0.081 s
01:09:48 testUnApplyStereotypeApplication(org.eclipse.papyrus.uml.diagram.stereotypeproperty.TestBadUnapplyProfile2ClosedDiagComment)  Time elapsed: 2.391 s
01:09:48 testStereotypeApplicationOnClass(org.eclipse.papyrus.uml.diagram.stereotypeproperty.TestDropStereotypedClass)  Time elapsed: 1.563 s
01:09:48 testProfileApplicationOnModel(org.eclipse.papyrus.uml.diagram.stereotypeproperty.TestProfileApplication)  Time elapsed: 0.857 s
01:09:48 testBrace(org.eclipse.papyrus.uml.diagram.stereotypeproperty.tests.asbrace.TestDisplayAsBrace)  Time elapsed: 1.442 s
01:09:48 testReopenStereotypeAsComment(org.eclipse.papyrus.uml.diagram.stereotypeproperty.tests.asbrace.TestReopenAsBrace)  Time elapsed: 3.532 s
01:09:48 testStereotypeApplicationOnClass(org.eclipse.papyrus.uml.diagram.stereotypeproperty.tests.ascomment.TestDisplayAsComment)  Time elapsed: 1.032 s
01:09:48 testReopenStereotypeAsComment(org.eclipse.papyrus.uml.diagram.stereotypeproperty.tests.ascomment.TestReopenAsComment)  Time elapsed: 3.192 s
01:09:48 testStereotypeApplicationOnClass(org.eclipse.papyrus.uml.diagram.stereotypeproperty.tests.ascompartment.TestDisplayAsCompartment)  Time elapsed: 1.832 s
01:09:48 testReopenStereotypeAsComment(org.eclipse.papyrus.uml.diagram.stereotypeproperty.tests.ascompartment.TestReopenAsCompartment)  Time elapsed: 3.173 s
01:09:48 test2StereotypeApplicationsOnClass(org.eclipse.papyrus.uml.diagram.stereotypeproperty.tests.displayname.Test2StereotypeApplications)  Time elapsed: 0.867 s
01:09:48 testStereotypeApplicationOnPackage(org.eclipse.papyrus.uml.diagram.stereotypeproperty.tests.displayname.TestStereotypeApplication)  Time elapsed: 1.282 s
01:09:48 testStereotypeApplicationOnClass(org.eclipse.papyrus.uml.diagram.stereotypeproperty.tests.displayname.TestStereotypeApplication)  Time elapsed: 0.143 s
01:09:48 testQNStereotypeApplicationOnClass(org.eclipse.papyrus.uml.diagram.stereotypeproperty.tests.displayname.TestStereotypeApplicationQualifiedName)  Time elapsed: 0.871 s
01:09:48 testLayoutStereotypeApplicationOnClass(org.eclipse.papyrus.uml.diagram.stereotypeproperty.tests.layout.TestLayoutWithStereotype) skipped
01:09:48 testLayoutOnClass(org.eclipse.papyrus.uml.diagram.stereotypeproperty.tests.layout.TestLayoutWithStereotype) skipped
01:09:48 testLayoutStereotypeApplicationOnClass(org.eclipse.papyrus.uml.diagram.stereotypeproperty.tests.layout.TestLayoutWithStereotypeOnEclipseHIPPInstance) skipped
01:09:48 testLayoutOnClass(org.eclipse.papyrus.uml.diagram.stereotypeproperty.tests.layout.TestLayoutWithStereotypeOnEclipseHIPPInstance) skipped
01:09:48 testDiagramFileExtentionLabel(org.eclipse.papyrus.uml.diagram.wizards.TestCreateModelWizard)  Time elapsed: 0.342 s
01:09:48 testDiagramFileExtenstionForUML(org.eclipse.papyrus.uml.diagram.wizards.TestCreateModelWizard)  Time elapsed: 0.106 s
01:09:48 testOrderOfPages(org.eclipse.papyrus.uml.diagram.wizards.TestCreateModelWizard)  Time elapsed: 0.106 s
01:09:48 testDiagramFileExtentionLabel(org.eclipse.papyrus.uml.diagram.wizards.TestInitModelWizard)  Time elapsed: 0.124 s
01:09:48 testDiagramFileExtenstionForUML(org.eclipse.papyrus.uml.diagram.wizards.TestInitModelWizard)  Time elapsed: 0.111 s
01:09:48 testOrderOfPages(org.eclipse.papyrus.uml.diagram.wizards.TestInitModelWizard)  Time elapsed: 0.115 s
01:09:48 testOrderOfPages(org.eclipse.papyrus.uml.diagram.wizards.TestNewProjectWizard)  Time elapsed: 0.139 s
01:09:48 testForSimpleModel(org.eclipse.papyrus.uml.diagram.wizards.TestCreateModelFromExistingModelWizard)  Time elapsed: 0.107 s
01:09:48 testOrderOfPages(org.eclipse.papyrus.uml.diagram.wizards.TestCreateModelFromExistingModelWizard)  Time elapsed: 0.106 s
01:09:48 testForModelWithDot(org.eclipse.papyrus.uml.diagram.wizards.TestCreateModelFromExistingModelWizard)  Time elapsed: 0.118 s
01:09:48 missingSchema(org.eclipse.papyrus.uml.modelrepair.internal.stereotypes.StereotypeApplicationRepairSnippetTest)  Time elapsed: 0.481 s
01:09:48 noCorruptionControlCase(org.eclipse.papyrus.uml.modelrepair.internal.stereotypes.StereotypeApplicationRepairSnippetTest)  Time elapsed: 0.07 s
01:09:48 wrongProfileVersion(org.eclipse.papyrus.uml.modelrepair.internal.stereotypes.StereotypeApplicationRepairSnippetTest)  Time elapsed: 0.493 s
01:09:48 missingProfileApplication(org.eclipse.papyrus.uml.modelrepair.internal.stereotypes.StereotypeApplicationRepairSnippetTest)  Time elapsed: 0.439 s
01:09:48 deleteStereotypes(org.eclipse.papyrus.uml.modelrepair.internal.stereotypes.StereotypeApplicationRepairSnippetTest)  Time elapsed: 0.071 s
01:09:48 nestedProfileApplicationsMissingNamespace_bug434302(org.eclipse.papyrus.uml.modelrepair.internal.stereotypes.StereotypeRepairRegressionTest)  Time elapsed: 0.615 s
01:09:48 orphansOfWrongProfileVersion_bug436666(org.eclipse.papyrus.uml.modelrepair.internal.stereotypes.StereotypeRepairRegressionTest)  Time elapsed: 0.075 s
01:09:48 badSchemaLocationInNonPackageFragment_bug459488(org.eclipse.papyrus.uml.modelrepair.internal.stereotypes.StereotypeRepairRegressionTest)  Time elapsed: 1.354 s
01:09:48 nestedProfilesAndNestedApplicationsWellFormed_bug434302(org.eclipse.papyrus.uml.modelrepair.internal.stereotypes.StereotypeRepairRegressionTest)  Time elapsed: 0.784 s
01:09:48 registeredDynamicProfie_bug455329(org.eclipse.papyrus.uml.modelrepair.internal.stereotypes.StereotypeRepairRegressionTest)  Time elapsed: 0.106 s
01:09:48 nestedPackageSchemaMissing_bug436666(org.eclipse.papyrus.uml.modelrepair.internal.stereotypes.StereotypeRepairRegressionTest)  Time elapsed: 0.678 s
01:09:48 incorrectZombieGroupingWithoutProfileNamespaceURIPattern_bug496307(org.eclipse.papyrus.uml.modelrepair.internal.stereotypes.StereotypeRepairRegressionTest)  Time elapsed: 0.092 s
01:09:48 nonStereotypeApplicationsAreOK_bug436666(org.eclipse.papyrus.uml.modelrepair.internal.stereotypes.StereotypeRepairRegressionTest)  Time elapsed: 0.021 s
01:09:48 nestedProfileApplications2Pkgs1Profile_bug434302(org.eclipse.papyrus.uml.modelrepair.internal.stereotypes.StereotypeRepairRegressionTest)  Time elapsed: 0.591 s
01:09:48 crossReferencedPackageUnitWithoutOwnProfileApplication_bug458736(org.eclipse.papyrus.uml.modelrepair.internal.stereotypes.StereotypeRepairRegressionTest)  Time elapsed: 1.322 s
01:09:48 correctZombieGroupingWithProfileNamespaceURIPattern_bug496307(org.eclipse.papyrus.uml.modelrepair.internal.stereotypes.StereotypeRepairRegressionTest)  Time elapsed: 0.126 s
01:09:48 orphansOfValidSchema_bug436666(org.eclipse.papyrus.uml.modelrepair.internal.stereotypes.StereotypeRepairRegressionTest)  Time elapsed: 0.244 s
01:09:48 packageUnitWithoutOwnProfileApplication_bug455248(org.eclipse.papyrus.uml.modelrepair.internal.stereotypes.StereotypeRepairRegressionTest)  Time elapsed: 1.071 s
01:09:48 nestedPackageInProfileIsOK_bug436666(org.eclipse.papyrus.uml.modelrepair.internal.stereotypes.StereotypeRepairRegressionTest)  Time elapsed: 0.55 s
01:09:48 compareMultiVersionSameURISameVersion(org.eclipse.papyrus.uml.modelrepair.internal.uripattern.ProfileNamespaceURIPatternTest)  Time elapsed: 0.001 s
01:09:48 compareMultiVersionDifferentURIDifferentVersion(org.eclipse.papyrus.uml.modelrepair.internal.uripattern.ProfileNamespaceURIPatternTest)  Time elapsed: 0 s
01:09:48 compareSingleVersionDifferentURISameVersion(org.eclipse.papyrus.uml.modelrepair.internal.uripattern.ProfileNamespaceURIPatternTest)  Time elapsed: 0 s
01:09:48 compareMultiVersionDifferentURISameVersion(org.eclipse.papyrus.uml.modelrepair.internal.uripattern.ProfileNamespaceURIPatternTest)  Time elapsed: 0.001 s
01:09:48 compareCorrectInvalidComparisonConstantBehavior(org.eclipse.papyrus.uml.modelrepair.internal.uripattern.ProfileNamespaceURIPatternTest)  Time elapsed: 0 s
01:09:48 compareNoVersionSameURI(org.eclipse.papyrus.uml.modelrepair.internal.uripattern.ProfileNamespaceURIPatternTest)  Time elapsed: 0 s
01:09:48 compareSingleVersionDifferentURIDifferentVersion(org.eclipse.papyrus.uml.modelrepair.internal.uripattern.ProfileNamespaceURIPatternTest)  Time elapsed: 0 s
01:09:48 matchCorrectNoMatchConstantBehavior(org.eclipse.papyrus.uml.modelrepair.internal.uripattern.ProfileNamespaceURIPatternTest)  Time elapsed: 0 s
01:09:48 matchSingleVersionCorrectURIGivenVersion(org.eclipse.papyrus.uml.modelrepair.internal.uripattern.ProfileNamespaceURIPatternTest)  Time elapsed: 0.001 s
01:09:48 matchNoVersionCorrectURIDefaultVersion(org.eclipse.papyrus.uml.modelrepair.internal.uripattern.ProfileNamespaceURIPatternTest)  Time elapsed: 0 s
01:09:48 matchMultipleVersionCorrectURIGivenVersion(org.eclipse.papyrus.uml.modelrepair.internal.uripattern.ProfileNamespaceURIPatternTest)  Time elapsed: 0 s
01:09:48 matchMultipleVersionCorrectURIDefaultVersion(org.eclipse.papyrus.uml.modelrepair.internal.uripattern.ProfileNamespaceURIPatternTest)  Time elapsed: 0 s
01:09:48 compareCorrectInvalidComparisonBehaviorWrongLHS(org.eclipse.papyrus.uml.modelrepair.internal.uripattern.ProfileNamespaceURIPatternTest)  Time elapsed: 0 s
01:09:48 compareCorrectInvalidComparisonBehaviorWrongRHS(org.eclipse.papyrus.uml.modelrepair.internal.uripattern.ProfileNamespaceURIPatternTest)  Time elapsed: 0 s
01:09:48 registryExtensionPointCorrectMatch(org.eclipse.papyrus.uml.modelrepair.internal.uripattern.ProfileNamespaceURIPatternTest)  Time elapsed: 0.002 s
01:09:48 compareSingleVersionSameURIDifferentVersion(org.eclipse.papyrus.uml.modelrepair.internal.uripattern.ProfileNamespaceURIPatternTest)  Time elapsed: 0 s
01:09:48 compareSingleVersionSameURISameVersion(org.eclipse.papyrus.uml.modelrepair.internal.uripattern.ProfileNamespaceURIPatternTest)  Time elapsed: 0 s
01:09:48 compareMultiVersionSameURIDifferentVersion(org.eclipse.papyrus.uml.modelrepair.internal.uripattern.ProfileNamespaceURIPatternTest)  Time elapsed: 0.001 s
01:09:48 registryCorrectUnregisterAndRegister(org.eclipse.papyrus.uml.modelrepair.internal.uripattern.ProfileNamespaceURIPatternTest)  Time elapsed: 0 s
01:09:48 registryExtensionPointRegistered(org.eclipse.papyrus.uml.modelrepair.internal.uripattern.ProfileNamespaceURIPatternTest)  Time elapsed: 0 s
01:09:48 compareCorrectInvalidComparisonBehaviorWrongPattern(org.eclipse.papyrus.uml.modelrepair.internal.uripattern.ProfileNamespaceURIPatternTest)  Time elapsed: 0 s
01:09:48 matchNoVersionCorrectURIGivenVersion(org.eclipse.papyrus.uml.modelrepair.internal.uripattern.ProfileNamespaceURIPatternTest)  Time elapsed: 0 s
01:09:48 compareNoVersionDifferentURI(org.eclipse.papyrus.uml.modelrepair.internal.uripattern.ProfileNamespaceURIPatternTest)  Time elapsed: 0 s
01:09:48 matchSingleVersionCorrectURIDefaultVersion(org.eclipse.papyrus.uml.modelrepair.internal.uripattern.ProfileNamespaceURIPatternTest)  Time elapsed: 0 s
01:09:48 matchCorrectNoMatchBehavior(org.eclipse.papyrus.uml.modelrepair.internal.uripattern.ProfileNamespaceURIPatternTest)  Time elapsed: 0.001 s
01:09:48 interactionOperand_contentProvider(org.eclipse.papyrus.uml.properties.modelelement.tests.UMLModelElementTest)  Time elapsed: 0.096 s
01:09:48 combinedFragment_contentProvider(org.eclipse.papyrus.uml.properties.modelelement.tests.UMLModelElementTest)  Time elapsed: 0.047 s
01:09:48 testObservableValue(org.eclipse.papyrus.uml.properties.databinding.tests.MultiplicityObservableValueTest)  Time elapsed: 0.996 s
01:09:48 testObservableValue(org.eclipse.papyrus.uml.properties.databinding.tests.ExtensionEndMultiplicityObservableValueTest)  Time elapsed: 0.727 s
01:09:48 testObservableValue(org.eclipse.papyrus.uml.properties.databinding.tests.NavigationObservableValueTest)  Time elapsed: 0.8 s
01:09:48 testObservableValue(org.eclipse.papyrus.uml.properties.databinding.tests.OwnerObservableValueTest)  Time elapsed: 0.82 s
01:09:48 testObservableValue(org.eclipse.papyrus.uml.properties.databinding.tests.KeywordObservableValueTest)  Time elapsed: 0.826 s
01:09:48 testObservableValue(org.eclipse.papyrus.uml.properties.databinding.tests.UMLLabelObservableValueTest)  Time elapsed: 0.777 s
01:09:48 testObservableValue(org.eclipse.papyrus.uml.properties.databinding.tests.ImageExpressionObservableValueTest)  Time elapsed: 0.771 s
01:09:48 testObservableValue(org.eclipse.papyrus.uml.properties.databinding.tests.ImageKindObservableValueTest)  Time elapsed: 0.749 s
01:09:48 testObservableValue(org.eclipse.papyrus.uml.properties.databinding.tests.ImageNameObservableValueTest)  Time elapsed: 0.828 s
01:09:48 testObservableValue(org.eclipse.papyrus.uml.properties.databinding.tests.ElementCustomizationElementIconObservableValueTest)  Time elapsed: 1.265 s
01:09:48 testObservableValue(org.eclipse.papyrus.uml.properties.databinding.tests.ElementCustomizationQualifiedNameObservableValueTest)  Time elapsed: 1.241 s
01:09:48 testObservableValue(org.eclipse.papyrus.uml.properties.databinding.tests.ElementCustomizationShadowObservableValueTest)  Time elapsed: 1.323 s
01:09:48 testObservableValue(org.eclipse.papyrus.uml.properties.databinding.tests.ExtensionRequiredObservableValueTest)  Time elapsed: 1.467 s
01:09:48 testObservableValue(org.eclipse.papyrus.uml.properties.databinding.tests.ImportedPackageLocationObservableValueTest)  Time elapsed: 0.837 s
01:09:48 testObservableValue(org.eclipse.papyrus.uml.properties.databinding.tests.UnsettableStringObservableValueTest)  Time elapsed: 0.813 s
01:09:48 testObservableValue(org.eclipse.papyrus.uml.properties.databinding.tests.BasicObservableValueTest)  Time elapsed: 0.733 s
01:09:48 testObservableValue(org.eclipse.papyrus.uml.properties.databinding.tests.AnnotationObservableValueTest)  Time elapsed: 0.83 s
01:09:48 testObservableList(org.eclipse.papyrus.uml.properties.databinding.tests.MaskValueObservableListTest)  Time elapsed: 1.358 s
01:09:48 testObservableList(org.eclipse.papyrus.uml.properties.databinding.tests.AppliedCommentsObservableListTest)  Time elapsed: 1.564 s
01:09:48 testObservableList(org.eclipse.papyrus.uml.properties.databinding.tests.OwnedCommentsObservableListTest)  Time elapsed: 1.637 s
01:09:48 testObservableList(org.eclipse.papyrus.uml.properties.databinding.tests.ProvidedInterfaceObservableListTest)  Time elapsed: 0.806 s
01:09:48 testObservableList(org.eclipse.papyrus.uml.properties.databinding.tests.RequiredInterfaceObservableListTest)  Time elapsed: 0.826 s
01:09:48 testObservableList(org.eclipse.papyrus.uml.properties.databinding.tests.ProfileApplicationObservableListTest)  Time elapsed: 0.869 s
01:09:48 testObservableList(org.eclipse.papyrus.uml.properties.databinding.tests.StereotypeApplicationObservableListTest)  Time elapsed: 0.745 s
01:09:48 testObservableList(org.eclipse.papyrus.uml.properties.databinding.tests.BasicObservableListTest)  Time elapsed: 0.742 s
01:09:48 testObservableValue(org.eclipse.papyrus.uml.diagram.properties.databinding.tests.CanonicalObservableValueTest)  Time elapsed: 1.221 s
01:09:48 testObservableValue(org.eclipse.papyrus.uml.diagram.properties.databinding.tests.ConnectionDecorationStyleObservableValueTest)  Time elapsed: 1.813 s
01:09:48 testObservableValue(org.eclipse.papyrus.uml.diagram.properties.databinding.tests.CustomStringStyleCompartmentObservableValueTest)  Time elapsed: 1.762 s
01:09:48 testObservableValue(org.eclipse.papyrus.uml.diagram.properties.databinding.tests.CustomIntStyleCompartmentObservableValueTest)  Time elapsed: 1.335 s
01:09:48 testObservableValue(org.eclipse.papyrus.uml.diagram.properties.databinding.tests.DiagramLabelObservableValueTest)  Time elapsed: 0.743 s
01:09:48 testObservableValue(org.eclipse.papyrus.uml.diagram.properties.databinding.tests.CustomBooleanStyleWithStoreObservableValueTest)  Time elapsed: 0.767 s
01:09:48 testObservableValue(org.eclipse.papyrus.uml.diagram.properties.databinding.tests.CustomDoubleStyleWithStoreObservableValueTest)  Time elapsed: 0.736 s
01:09:48 testObservableValue(org.eclipse.papyrus.uml.diagram.properties.databinding.tests.CustomIntStyleWithStoreObservableValueTest)  Time elapsed: 0.701 s
01:09:48 testObservableValue(org.eclipse.papyrus.uml.diagram.properties.databinding.tests.RulersUnitStyleObservableValueTest)  Time elapsed: 0.858 s
01:09:48 testObservableValue(org.eclipse.papyrus.uml.diagram.properties.databinding.tests.SwitchOrientationObservableValueTest)  Time elapsed: 1.932 s
01:09:48 outOfDateModelSkipMigration_papyrus(org.eclipse.papyrus.uml.profile.service.ReapplyProfilesServiceTest)  Time elapsed: 1.339 s
01:09:48 upToDateModelDoesNotPromptForMigration_papyrus(org.eclipse.papyrus.uml.profile.service.ReapplyProfilesServiceTest)  Time elapsed: 1.086 s
01:09:48 outOfDateModelDoMigration_dynamic(org.eclipse.papyrus.uml.profile.service.ReapplyProfilesServiceTest)  Time elapsed: 1.439 s
01:09:48 outOfDateModelSkipMigration_uml2(org.eclipse.papyrus.uml.profile.service.ReapplyProfilesServiceTest)  Time elapsed: 1.278 s
01:09:48 outOfDateModelDoMigration_papyrus(org.eclipse.papyrus.uml.profile.service.ReapplyProfilesServiceTest)  Time elapsed: 1.765 s
01:09:48 outOfDateModelSkipMigration_dynamic(org.eclipse.papyrus.uml.profile.service.ReapplyProfilesServiceTest)  Time elapsed: 0.932 s
01:09:48 outOfDateModelDoMigration_uml2(org.eclipse.papyrus.uml.profile.service.ReapplyProfilesServiceTest)  Time elapsed: 1.578 s
01:09:48 upToDateModelDoesNotPromptForMigration_uml2(org.eclipse.papyrus.uml.profile.service.ReapplyProfilesServiceTest)  Time elapsed: 1.033 s
01:09:48 upToDateModelDoesNotPromptForMigration_dynamic(org.eclipse.papyrus.uml.profile.service.ReapplyProfilesServiceTest)  Time elapsed: 0.686 s
01:09:48 loadDecoratorAsMainModel(org.eclipse.papyrus.uml.decoratormodel.tests.ExternalizeProfileApplicationTest)  Time elapsed: 0.899 s
01:09:48 externalizeApplication(org.eclipse.papyrus.uml.decoratormodel.tests.ExternalizeProfileApplicationTest)  Time elapsed: 0.81 s
01:09:48 unloadApplication(org.eclipse.papyrus.uml.decoratormodel.tests.ExternalizeProfileApplicationTest)  Time elapsed: 0.784 s
01:09:48 externalizeApplication_undo(org.eclipse.papyrus.uml.decoratormodel.tests.ExternalizeProfileApplicationTest)  Time elapsed: 0.742 s
01:09:48 unloadedApplicationNotAvailable(org.eclipse.papyrus.uml.decoratormodel.tests.ExternalizeProfileApplicationTest)  Time elapsed: 0.837 s
01:09:48 loadApplication(org.eclipse.papyrus.uml.decoratormodel.tests.ExternalizeProfileApplicationTest)  Time elapsed: 0.794 s
01:09:48 externalizeApplication_undo_redo(org.eclipse.papyrus.uml.decoratormodel.tests.ExternalizeProfileApplicationTest)  Time elapsed: 0.818 s
01:09:48 nestedPackageApplicationOfSameProfile_bug459613(org.eclipse.papyrus.uml.decoratormodel.tests.ExternalizeProfileApplicationTest)  Time elapsed: 0.799 s
01:09:48 externalizeApplication_forNestedPackage(org.eclipse.papyrus.uml.decoratormodel.tests.ExternalizeProfileApplicationTest)  Time elapsed: 0.734 s
01:09:48 internalizeApplication_undo(org.eclipse.papyrus.uml.decoratormodel.tests.InternalizeProfileApplicationTest)  Time elapsed: 0.813 s
01:09:48 internalizeApplication_undo_redo(org.eclipse.papyrus.uml.decoratormodel.tests.InternalizeProfileApplicationTest)  Time elapsed: 0.816 s
01:09:48 internalizeApplication(org.eclipse.papyrus.uml.decoratormodel.tests.InternalizeProfileApplicationTest)  Time elapsed: 1.374 s
01:09:48 migrateProfile(org.eclipse.papyrus.uml.decoratormodel.tests.ProfileMigrationTest)  Time elapsed: 1.708 s
01:09:48 missingSchema(org.eclipse.papyrus.uml.decoratormodel.tests.StereotypeApplicationRepairTest)  Time elapsed: 0.879 s
01:09:48 wrongProfileVersion(org.eclipse.papyrus.uml.decoratormodel.tests.StereotypeApplicationRepairTest)  Time elapsed: 0.881 s
01:09:48 missingProfileApplication(org.eclipse.papyrus.uml.decoratormodel.tests.StereotypeApplicationRepairTest)  Time elapsed: 0.894 s
01:09:48 decoratorModelsForPackageAsync(org.eclipse.papyrus.uml.decoratormodel.internal.resource.tests.DecoratorModelIndexTest)  Time elapsed: 0.987 s
01:09:48 decoratorModelsForPackage_none(org.eclipse.papyrus.uml.decoratormodel.internal.resource.tests.DecoratorModelIndexTest) skipped
01:09:48 removeResource(org.eclipse.papyrus.uml.decoratormodel.internal.resource.tests.DecoratorModelIndexTest)  Time elapsed: 1.125 s
01:09:48 decoratorModelsAsync_uri(org.eclipse.papyrus.uml.decoratormodel.internal.resource.tests.DecoratorModelIndexTest)  Time elapsed: 0.993 s
01:09:48 decoratorModelName(org.eclipse.papyrus.uml.decoratormodel.internal.resource.tests.DecoratorModelIndexTest)  Time elapsed: 0.916 s
01:09:48 baseline(org.eclipse.papyrus.uml.decoratormodel.internal.resource.tests.DecoratorModelIndexTest)  Time elapsed: 1.033 s
01:09:48 decoratorModelsForPackage(org.eclipse.papyrus.uml.decoratormodel.internal.resource.tests.DecoratorModelIndexTest)  Time elapsed: 0.966 s
01:09:48 decoratorModelNameAsync(org.eclipse.papyrus.uml.decoratormodel.internal.resource.tests.DecoratorModelIndexTest)  Time elapsed: 1.092 s
01:09:48 appliedProfilesByResourceIndex(org.eclipse.papyrus.uml.decoratormodel.internal.resource.tests.DecoratorModelIndexTest)  Time elapsed: 0.946 s
01:09:48 decoratorModels(org.eclipse.papyrus.uml.decoratormodel.internal.resource.tests.DecoratorModelIndexTest)  Time elapsed: 0.95 s
01:09:48 decoratorModelsAsync(org.eclipse.papyrus.uml.decoratormodel.internal.resource.tests.DecoratorModelIndexTest)  Time elapsed: 1.037 s
01:09:48 allAppliedProfiles(org.eclipse.papyrus.uml.decoratormodel.internal.resource.tests.DecoratorModelIndexTest)  Time elapsed: 1.078 s
01:09:48 decoratorModelNames(org.eclipse.papyrus.uml.decoratormodel.internal.resource.tests.DecoratorModelIndexTest)  Time elapsed: 1.066 s
01:09:48 decoratorModels_uri(org.eclipse.papyrus.uml.decoratormodel.internal.resource.tests.DecoratorModelIndexTest)  Time elapsed: 0.966 s
01:09:48 decoratorModelNamesAsync(org.eclipse.papyrus.uml.decoratormodel.internal.resource.tests.DecoratorModelIndexTest)  Time elapsed: 1 s
01:09:48 listener(org.eclipse.papyrus.uml.decoratormodel.internal.resource.tests.DecoratorModelIndexTest)  Time elapsed: 1.167 s
01:09:48 allAppliedProfilesAsync(org.eclipse.papyrus.uml.decoratormodel.internal.resource.tests.DecoratorModelIndexTest)  Time elapsed: 0.974 s
01:09:48 addNewResource(org.eclipse.papyrus.uml.decoratormodel.internal.resource.tests.DecoratorModelIndexTest)  Time elapsed: 1.256 s
01:09:48 decoratorModelsForPackageAsync_none(org.eclipse.papyrus.uml.decoratormodel.internal.resource.tests.DecoratorModelIndexTest)  Time elapsed: 1.013 s
01:09:48 copy_subsetOfProfiles(org.eclipse.papyrus.uml.decoratormodel.internal.resource.tests.DecoratorModelCopierTest)  Time elapsed: 1.022 s
01:09:48 copy_allProfiles(org.eclipse.papyrus.uml.decoratormodel.internal.resource.tests.DecoratorModelCopierTest)  Time elapsed: 0.993 s
01:09:48 testHasUnloadedDecoratorModelsAsync_recursive(org.eclipse.papyrus.uml.decoratormodel.helper.tests.DecoratorModelUtilsTest)  Time elapsed: 1.241 s
01:09:48 testIsDecoratorModelFor(org.eclipse.papyrus.uml.decoratormodel.helper.tests.DecoratorModelUtilsTest)  Time elapsed: 0.968 s
01:09:48 testIsDecoratorModelURI(org.eclipse.papyrus.uml.decoratormodel.helper.tests.DecoratorModelUtilsTest)  Time elapsed: 0.838 s
01:09:48 testInternalizeProfileApplications(org.eclipse.papyrus.uml.decoratormodel.helper.tests.DecoratorModelUtilsTest)  Time elapsed: 0.79 s
01:09:48 testHasUnloadedDecoratorModelsAsync(org.eclipse.papyrus.uml.decoratormodel.helper.tests.DecoratorModelUtilsTest)  Time elapsed: 1.262 s
01:09:48 testExternalizeProfileApplication(org.eclipse.papyrus.uml.decoratormodel.helper.tests.DecoratorModelUtilsTest)  Time elapsed: 1.567 s
01:09:48 testGetDecoratorPackages(org.eclipse.papyrus.uml.decoratormodel.helper.tests.DecoratorModelUtilsTest)  Time elapsed: 1.251 s
01:09:48 testGetDecoratorModelAppliedProfiles(org.eclipse.papyrus.uml.decoratormodel.helper.tests.DecoratorModelUtilsTest)  Time elapsed: 0.832 s
01:09:48 testGetUnloadedDecoratorModelsAsyncResource(org.eclipse.papyrus.uml.decoratormodel.helper.tests.DecoratorModelUtilsTest)  Time elapsed: 1.137 s
01:09:48 testGetExternalizationProfile(org.eclipse.papyrus.uml.decoratormodel.helper.tests.DecoratorModelUtilsTest)  Time elapsed: 0.785 s
01:09:48 testIsDecoratorModelResource(org.eclipse.papyrus.uml.decoratormodel.helper.tests.DecoratorModelUtilsTest)  Time elapsed: 0.82 s
01:09:48 testGetDecoratorModelProfileApplications(org.eclipse.papyrus.uml.decoratormodel.helper.tests.DecoratorModelUtilsTest)  Time elapsed: 0.802 s
01:09:48 testGetUnloadedDecoratorModelsAsyncPackage(org.eclipse.papyrus.uml.decoratormodel.helper.tests.DecoratorModelUtilsTest)  Time elapsed: 1.132 s
01:09:48 testGetLoadedDecoratorModels(org.eclipse.papyrus.uml.decoratormodel.helper.tests.DecoratorModelUtilsTest)  Time elapsed: 0.781 s
01:09:48 testGetLoadedSubUnitPackages(org.eclipse.papyrus.uml.decoratormodel.helper.tests.DecoratorModelUtilsTest)  Time elapsed: 0.737 s
01:09:48 testGetUnloadedDecoratorModels(org.eclipse.papyrus.uml.decoratormodel.helper.tests.DecoratorModelUtilsTest)  Time elapsed: 1.046 s
01:09:48 testHasExternalizationProfile(org.eclipse.papyrus.uml.decoratormodel.helper.tests.DecoratorModelUtilsTest)  Time elapsed: 0.832 s
01:09:48 testGetUnloadedDecoratorModelsAsyncIterableOfResource(org.eclipse.papyrus.uml.decoratormodel.helper.tests.DecoratorModelUtilsTest)  Time elapsed: 1.423 s
01:09:48 testGetUserModelResources(org.eclipse.papyrus.uml.decoratormodel.helper.tests.DecoratorModelUtilsTest)  Time elapsed: 0.776 s
01:09:48 testGetDecoratorProfileApplications(org.eclipse.papyrus.uml.decoratormodel.helper.tests.DecoratorModelUtilsTest)  Time elapsed: 0.821 s
01:09:48 stereotypeApplication_inNestedPackage(org.eclipse.papyrus.uml.decoratormodel.helper.tests.PapyrusStereotypeApplicationHelperTest)  Time elapsed: 0.317 s
01:09:48 stereotypeApplication_inNonPackageSubmodelUnit_bug459613(org.eclipse.papyrus.uml.decoratormodel.helper.tests.PapyrusStereotypeApplicationHelperTest)  Time elapsed: 0.306 s
01:09:48 applyStereotype_resourceSet(org.eclipse.papyrus.uml.decoratormodel.helper.tests.PapyrusStereotypeApplicationHelperTest)  Time elapsed: 0.347 s
01:09:48 applyStereotype_freeFloating(org.eclipse.papyrus.uml.decoratormodel.helper.tests.PapyrusStereotypeApplicationHelperTest)  Time elapsed: 0.338 s
01:09:48 isDecoratorModel_decoratorModelUML(org.eclipse.papyrus.uml.decoratormodel.internal.expressions.tests.FilePropertyTesterTest)  Time elapsed: 0.603 s
01:09:48 isDecoratorModel_decoratorModelNotation(org.eclipse.papyrus.uml.decoratormodel.internal.expressions.tests.FilePropertyTesterTest)  Time elapsed: 0.575 s
01:09:48 isDecoratorModel_userModelUML(org.eclipse.papyrus.uml.decoratormodel.internal.expressions.tests.FilePropertyTesterTest)  Time elapsed: 0.681 s
01:09:48 decoratorIndexing(org.eclipse.papyrus.uml.decoratormodel.internal.resource.index.tests.ProfileIndexTest)  Time elapsed: 0.402 s
01:09:48 userModelIndexing(org.eclipse.papyrus.uml.decoratormodel.internal.resource.index.tests.ProfileIndexTest)  Time elapsed: 0.001 s
01:09:48 decoratorAsUserModelIndexing(org.eclipse.papyrus.uml.decoratormodel.internal.resource.index.tests.ProfileIndexTest)  Time elapsed: 0 s
01:09:48 migrateProfileExtendingDynamic_bug481302(org.eclipse.papyrus.uml.decoratormodel.tests.RegressionTest)  Time elapsed: 0.652 s
01:09:48 basicUMLMigrateProfileExtendingStatic_bug481302(org.eclipse.papyrus.uml.decoratormodel.tests.RegressionTest) skipped
01:09:48 migrateProfileExtendingStatic_bug481302(org.eclipse.papyrus.uml.decoratormodel.tests.RegressionTest)  Time elapsed: 0.539 s
01:09:48 control_undo_redo_allDecoratorsLoaded(org.eclipse.papyrus.uml.decoratormodel.controlmode.tests.ControlModeWithDecoratorModelsTest)  Time elapsed: 1.047 s
01:09:48 uncontrol_undo_redo_allDecoratorsUnloaded(org.eclipse.papyrus.uml.decoratormodel.controlmode.tests.ControlModeWithDecoratorModelsTest)  Time elapsed: 4.008 s
01:09:48 control_someDecoratorsLoaded(org.eclipse.papyrus.uml.decoratormodel.controlmode.tests.ControlModeWithDecoratorModelsTest)  Time elapsed: 1.575 s
01:09:48 uncontrol_someDecoratorsLoaded(org.eclipse.papyrus.uml.decoratormodel.controlmode.tests.ControlModeWithDecoratorModelsTest)  Time elapsed: 2.148 s
01:09:48 uncontrol_allDecoratorsUnloaded(org.eclipse.papyrus.uml.decoratormodel.controlmode.tests.ControlModeWithDecoratorModelsTest)  Time elapsed: 3.085 s
01:09:48 control_undo_redo_someDecoratorsLoaded(org.eclipse.papyrus.uml.decoratormodel.controlmode.tests.ControlModeWithDecoratorModelsTest)  Time elapsed: 2.917 s
01:09:48 control_allDecoratorsLoaded(org.eclipse.papyrus.uml.decoratormodel.controlmode.tests.ControlModeWithDecoratorModelsTest)  Time elapsed: 0.981 s
01:09:48 control_undo_redo_allDecoratorsUnloaded(org.eclipse.papyrus.uml.decoratormodel.controlmode.tests.ControlModeWithDecoratorModelsTest)  Time elapsed: 3.816 s
01:09:48 control_allDecoratorsUnloaded(org.eclipse.papyrus.uml.decoratormodel.controlmode.tests.ControlModeWithDecoratorModelsTest)  Time elapsed: 1.975 s
01:09:48 uncontrol_undo_redo_someDecoratorsLoaded(org.eclipse.papyrus.uml.decoratormodel.controlmode.tests.ControlModeWithDecoratorModelsTest)  Time elapsed: 3.449 s
01:09:48 uncontrol_undo_redo_allDecoratorsLoaded(org.eclipse.papyrus.uml.decoratormodel.controlmode.tests.ControlModeWithDecoratorModelsTest)  Time elapsed: 1.07 s
01:09:48 uncontrol_allDecoratorsLoaded(org.eclipse.papyrus.uml.decoratormodel.controlmode.tests.ControlModeWithDecoratorModelsTest)  Time elapsed: 1.186 s
01:09:48 nonBaseElementStereotypeCrossReferences(org.eclipse.papyrus.uml.decoratormodel.controlmode.tests.AdditionalModelStructuresTest)  Time elapsed: 2.045 s
01:09:48 classUnitExternalizeParentUnitProfileApplication_bug459613(org.eclipse.papyrus.uml.decoratormodel.controlmode.tests.AdditionalModelStructuresTest)  Time elapsed: 0.677 s
01:09:48 nestedPackagesInheritingExternalProfileApplications(org.eclipse.papyrus.uml.decoratormodel.controlmode.tests.AdditionalModelStructuresTest)  Time elapsed: 2.087 s
01:09:48 validateOCLOnInstanceSpec(org.eclipse.papyrus.uml.validation.tests.rules.TestOCLConstraintOnInstanceSpec)  Time elapsed: 5.665 s
01:09:48 validateCamelCaseRule(org.eclipse.papyrus.uml.validation.tests.rules.TestOCLValidationRuleFromFile)  Time elapsed: 1.563 s  <<< FAILURE!
01:09:48 java.lang.AssertionError: The rule CamelCaseName in ExtraUMLValidation.ocl should trigger an issue for this class expected:<1> but was:<0>
01:09:48 	at org.eclipse.papyrus.uml.validation.tests.rules.TestOCLValidationRuleFromFile.validateCamelCaseRule(TestOCLValidationRuleFromFile.java:114)
01:09:48 
01:09:48 validateIsActiveOCLRule_inactiveClass(org.eclipse.papyrus.uml.validation.tests.rules.TestValidationRulesInPluginXML)  Time elapsed: 4.594 s
01:09:48 validateIsPassiveJavaRule_inactiveClass(org.eclipse.papyrus.uml.validation.tests.rules.TestValidationRulesInPluginXML)  Time elapsed: 2.363 s
01:09:48 validateIsPassiveJavaRule_activeClass(org.eclipse.papyrus.uml.validation.tests.rules.TestValidationRulesInPluginXML)  Time elapsed: 5.009 s
01:09:48 validateMalformedActiveRule_notActiveCapsule(org.eclipse.papyrus.uml.validation.tests.rules.TestValidationRulesInProfile)  Time elapsed: 2.553 s
01:09:48 validateIsActiveRule_notActiveCapsule(org.eclipse.papyrus.uml.validation.tests.rules.TestValidationRulesInProfile)  Time elapsed: 3.197 s
01:09:48 validateIsActiveRule_ActiveCapsule(org.eclipse.papyrus.uml.validation.tests.rules.TestValidationRulesInProfile)  Time elapsed: 4.71 s
01:09:48 validateNameClashDetection(org.eclipse.papyrus.uml.validation.tests.rules.TestUMLValidationRules)  Time elapsed: 1.09 s
01:09:48 validateNonStandardMultiplicity(org.eclipse.papyrus.uml.validation.tests.rules.TestUMLValidationRules)  Time elapsed: 1.044 s
01:09:48 validateUnsetStereotypeAttribute(org.eclipse.papyrus.uml.validation.tests.rules.TestStereotypeValidation)  Time elapsed: 5.134 s
01:09:48 testResolveProfile__Object(org.eclipse.papyrus.uml.filters.tests.ProfileAppliedTest)  Time elapsed: 0.056 s
01:09:48 testMatches__Object(org.eclipse.papyrus.uml.filters.tests.ProfileAppliedTest)  Time elapsed: 0.023 s
01:09:48 profileAppliedFilterResourceURI_bug480221(org.eclipse.papyrus.uml.filters.tests.ProfileAppliedRegressionTest)  Time elapsed: 0.068 s
01:09:48 profileAppliedFilterDoesNotLoadProfiles_miss_bug480221(org.eclipse.papyrus.uml.filters.tests.ProfileAppliedRegressionTest)  Time elapsed: 0.05 s
01:09:48 profileAppliedFilterDoesNotLoadProfiles_hit_bug480221(org.eclipse.papyrus.uml.filters.tests.ProfileAppliedRegressionTest)  Time elapsed: 0.059 s
01:09:48 popupsGenerated(org.eclipse.papyrus.uml.profile.assistants.generator.tests.BasicAssistantsGenerationTest)  Time elapsed: 0.013 s
01:09:48 connectionTargetFilters(org.eclipse.papyrus.uml.profile.assistants.generator.tests.BasicAssistantsGenerationTest)  Time elapsed: 0.004 s
01:09:48 popupFilters(org.eclipse.papyrus.uml.profile.assistants.generator.tests.BasicAssistantsGenerationTest)  Time elapsed: 0.001 s
01:09:48 connectionSourceFilters(org.eclipse.papyrus.uml.profile.assistants.generator.tests.BasicAssistantsGenerationTest)  Time elapsed: 0.001 s
01:09:48 connectionsGenerated(org.eclipse.papyrus.uml.profile.assistants.generator.tests.BasicAssistantsGenerationTest)  Time elapsed: 0 s
01:09:48 popupsGenerated(org.eclipse.papyrus.uml.profile.assistants.generator.tests.DiagramSpecificAssistantsGenerationTest)  Time elapsed: 0.041 s
01:09:48 connectionTargetFilters(org.eclipse.papyrus.uml.profile.assistants.generator.tests.DiagramSpecificAssistantsGenerationTest)  Time elapsed: 0.004 s
01:09:48 distinctConnectionHintsGenerated(org.eclipse.papyrus.uml.profile.assistants.generator.tests.DiagramSpecificAssistantsGenerationTest)  Time elapsed: 0.017 s
01:09:48 popupFilters(org.eclipse.papyrus.uml.profile.assistants.generator.tests.DiagramSpecificAssistantsGenerationTest)  Time elapsed: 0.001 s
01:09:48 connectionSourceFilters(org.eclipse.papyrus.uml.profile.assistants.generator.tests.DiagramSpecificAssistantsGenerationTest)  Time elapsed: 0.002 s
01:09:48 distinctPopupHintsGenerated(org.eclipse.papyrus.uml.profile.assistants.generator.tests.DiagramSpecificAssistantsGenerationTest)  Time elapsed: 0 s
01:09:48 connectionsGenerated(org.eclipse.papyrus.uml.profile.assistants.generator.tests.DiagramSpecificAssistantsGenerationTest)  Time elapsed: 0.001 s
01:09:48 popupsGenerated(org.eclipse.papyrus.uml.profile.assistants.generator.tests.ProfilesWithPackageNestingTest)  Time elapsed: 0.005 s
01:09:48 connectionTargetFilters(org.eclipse.papyrus.uml.profile.assistants.generator.tests.ProfilesWithPackageNestingTest)  Time elapsed: 0.003 s
01:09:48 popupFilters(org.eclipse.papyrus.uml.profile.assistants.generator.tests.ProfilesWithPackageNestingTest)  Time elapsed: 0.001 s
01:09:48 connectionSourceFilters(org.eclipse.papyrus.uml.profile.assistants.generator.tests.ProfilesWithPackageNestingTest)  Time elapsed: 0 s
01:09:48 connectionsGenerated(org.eclipse.papyrus.uml.profile.assistants.generator.tests.ProfilesWithPackageNestingTest)  Time elapsed: 0.001 s
01:09:48 connectionsGenerated[<<Indirect>> Generalization](org.eclipse.papyrus.uml.profile.assistants.generator.tests.ConnectionTypesTest)  Time elapsed: 0.005 s
01:09:48 connectionsGenerated[<<Indirect>> GeneralizationSet](org.eclipse.papyrus.uml.profile.assistants.generator.tests.ConnectionTypesTest)  Time elapsed: 0.001 s
01:09:48 connectionsGenerated[<<Virtual>> ControlFlow](org.eclipse.papyrus.uml.profile.assistants.generator.tests.ConnectionTypesTest)  Time elapsed: 0.001 s
01:09:48 connectionsGenerated[<<Virtual>> ObjectFlow](org.eclipse.papyrus.uml.profile.assistants.generator.tests.ConnectionTypesTest)  Time elapsed: 0.001 s
01:09:48 connectionsGenerated[<<Virtual>> Transition](org.eclipse.papyrus.uml.profile.assistants.generator.tests.ConnectionTypesTest)  Time elapsed: 0 s
01:09:48 connectionsGenerated[<<Virtual>> Message](org.eclipse.papyrus.uml.profile.assistants.generator.tests.ConnectionTypesTest)  Time elapsed: 0 s
01:09:48 connectionsGenerated[<<Indirect>> Connector](org.eclipse.papyrus.uml.profile.assistants.generator.tests.ConnectionTypesTest)  Time elapsed: 0 s
01:09:48 iconGenerated(org.eclipse.papyrus.uml.profile.types.generator.tests.BasicElementTypesGenerationTest)  Time elapsed: 0.006 s
01:09:48 typeSetAttributes(org.eclipse.papyrus.uml.profile.types.generator.tests.BasicElementTypesGenerationTest)  Time elapsed: 0 s
01:09:48 elementTypeSpecializedTypes_bug461717(org.eclipse.papyrus.uml.profile.types.generator.tests.BasicElementTypesGenerationTest)  Time elapsed: 0.041 s
01:09:48 multipleElementTypesForOneStereotypeGenerated(org.eclipse.papyrus.uml.profile.types.generator.tests.BasicElementTypesGenerationTest)  Time elapsed: 0 s
01:09:48 stereotypeAdviceGenerated(org.eclipse.papyrus.uml.profile.types.generator.tests.BasicElementTypesGenerationTest)  Time elapsed: 0.001 s
01:09:48 elementTypesGenerated(org.eclipse.papyrus.uml.profile.types.generator.tests.BasicElementTypesGenerationTest)  Time elapsed: 0 s
01:09:48 stereotypeMatcherGenerated(org.eclipse.papyrus.uml.profile.types.generator.tests.BasicElementTypesGenerationTest)  Time elapsed: 0.001 s
01:09:48 stereotypeAdviceNotGenerated(org.eclipse.papyrus.uml.profile.types.generator.tests.DiagramSpecificElementTypesGenerationTest)  Time elapsed: 0.008 s
01:09:48 distinctHintsGenerated(org.eclipse.papyrus.uml.profile.types.generator.tests.DiagramSpecificElementTypesGenerationTest)  Time elapsed: 0.002 s
01:09:48 stereotypeMatcherNotGenerated(org.eclipse.papyrus.uml.profile.types.generator.tests.DiagramSpecificElementTypesGenerationTest)  Time elapsed: 0 s
01:09:48 iconGenerated(org.eclipse.papyrus.uml.profile.types.generator.tests.DiagramSpecificElementTypesGenerationTest)  Time elapsed: 0 s
01:09:48 elementTypeSpecializedTypes_bug461717(org.eclipse.papyrus.uml.profile.types.generator.tests.DiagramSpecificElementTypesGenerationTest)  Time elapsed: 0.047 s
01:09:48 elementTypesGenerated(org.eclipse.papyrus.uml.profile.types.generator.tests.DiagramSpecificElementTypesGenerationTest)  Time elapsed: 0.001 s
01:09:48 iconGenerated(org.eclipse.papyrus.uml.profile.types.generator.tests.ProfilesWithPackageNestingTest)  Time elapsed: 0.003 s
01:09:48 stereotypeAdviceGenerated(org.eclipse.papyrus.uml.profile.types.generator.tests.ProfilesWithPackageNestingTest)  Time elapsed: 0.001 s
01:09:48 elementTypesGenerated(org.eclipse.papyrus.uml.profile.types.generator.tests.ProfilesWithPackageNestingTest)  Time elapsed: 0.001 s
01:09:48 stereotypeMatcherGenerated(org.eclipse.papyrus.uml.profile.types.generator.tests.ProfilesWithPackageNestingTest)  Time elapsed: 0 s
01:09:48 elementTypeSpecializedTypes(org.eclipse.papyrus.uml.profile.types.generator.tests.DiagramSpecificElementTypesGenerationBug461717Test)  Time elapsed: 0.047 s
01:09:48 stereotypeAdviceGenerated(org.eclipse.papyrus.uml.profile.types.generator.tests.DiagramSpecificElementTypesGenerationBug461717Test)  Time elapsed: 0.001 s
01:09:48 stereotypeMatcherGenerated(org.eclipse.papyrus.uml.profile.types.generator.tests.DiagramSpecificElementTypesGenerationBug461717Test)  Time elapsed: 0 s
01:09:48 iconGenerated(org.eclipse.papyrus.uml.profile.types.generator.incremental.tests.BasicElementTypesRegenerationTest)  Time elapsed: 0.001 s
01:09:48 typeSetAttributes(org.eclipse.papyrus.uml.profile.types.generator.incremental.tests.BasicElementTypesRegenerationTest)  Time elapsed: 0 s
01:09:48 elementTypeSpecializedTypes_bug461717(org.eclipse.papyrus.uml.profile.types.generator.incremental.tests.BasicElementTypesRegenerationTest)  Time elapsed: 0 s
01:09:48 multipleElementTypesForOneStereotypeGenerated(org.eclipse.papyrus.uml.profile.types.generator.incremental.tests.BasicElementTypesRegenerationTest)  Time elapsed: 0.001 s
01:09:48 stereotypeAdviceGenerated(org.eclipse.papyrus.uml.profile.types.generator.incremental.tests.BasicElementTypesRegenerationTest)  Time elapsed: 0 s
01:09:48 elementTypesGenerated(org.eclipse.papyrus.uml.profile.types.generator.incremental.tests.BasicElementTypesRegenerationTest)  Time elapsed: 0 s
01:09:48 stereotypeMatcherGenerated(org.eclipse.papyrus.uml.profile.types.generator.incremental.tests.BasicElementTypesRegenerationTest)  Time elapsed: 0.001 s
01:09:48 testRemovedStereotypes(org.eclipse.papyrus.uml.profile.types.generator.incremental.tests.SimpleDeltaStrategyTest)  Time elapsed: 0 s
01:09:48 testRenamedStereotypes(org.eclipse.papyrus.uml.profile.types.generator.incremental.tests.SimpleDeltaStrategyTest)  Time elapsed: 0.001 s
01:09:48 testAddedExtensions(org.eclipse.papyrus.uml.profile.types.generator.incremental.tests.SimpleDeltaStrategyTest)  Time elapsed: 0 s
01:09:48 testAddedStereotypes(org.eclipse.papyrus.uml.profile.types.generator.incremental.tests.SimpleDeltaStrategyTest)  Time elapsed: 0 s
01:09:48 testRemovedExtension(org.eclipse.papyrus.uml.profile.types.generator.incremental.tests.SimpleDeltaStrategyTest)  Time elapsed: 0 s
01:09:48 testGetStereotypeNames(org.eclipse.papyrus.uml.profile.drafter.tests.ProfileCatalogTest)  Time elapsed: 0.061 s
01:09:48 testGetStereotypes(org.eclipse.papyrus.uml.profile.drafter.tests.ProfileCatalogTest)  Time elapsed: 0.04 s
01:09:48 testGetAllStereotypeNames(org.eclipse.papyrus.uml.profile.drafter.tests.ProfileCatalogTest) skipped
01:09:48 testGetProfileNames(org.eclipse.papyrus.uml.profile.drafter.tests.ProfileCatalogTest)  Time elapsed: 0.034 s
01:09:48 testProfileCatalog(org.eclipse.papyrus.uml.profile.drafter.tests.ProfileCatalogTest)  Time elapsed: 0.029 s
01:09:48 testLookupStereotype(org.eclipse.papyrus.uml.profile.drafter.tests.ProfileCatalogTest)  Time elapsed: 0.031 s
01:09:48 testLookupStereotypeInAppliedProfile(org.eclipse.papyrus.uml.profile.drafter.tests.ProfileCatalogTest)  Time elapsed: 0.077 s
01:09:48 testProfileCopy(org.eclipse.papyrus.uml.profile.drafter.tests.ProfileCatalogTest)  Time elapsed: 0.059 s
01:09:48 testGetProfiles(org.eclipse.papyrus.uml.profile.drafter.tests.ProfileCatalogTest)  Time elapsed: 0.04 s
01:09:48 testGetNamedElement(org.eclipse.papyrus.uml.profile.drafter.tests.ProfileCatalogTest)  Time elapsed: 0.04 s
01:09:48 testIsModelsExist(org.eclipse.papyrus.uml.profile.drafter.tests.ProfileCatalogTest)  Time elapsed: 0.031 s
01:09:48 testGetStereotypeQualifiedNames(org.eclipse.papyrus.uml.profile.drafter.tests.ProfileCatalogTest)  Time elapsed: 0.045 s
01:09:48 testGetProfileQualifiedNames(org.eclipse.papyrus.uml.profile.drafter.tests.ProfileCatalogTest)  Time elapsed: 0.051 s
01:09:48 testCopyResources(org.eclipse.papyrus.uml.profile.drafter.tests.EclipseProjectTest)  Time elapsed: 0.938 s
01:09:48 testCopyResource(org.eclipse.papyrus.uml.profile.drafter.tests.EclipseProjectTest)  Time elapsed: 0.002 s
01:09:48 testGetProject(org.eclipse.papyrus.uml.profile.drafter.tests.EclipseProjectTest)  Time elapsed: 0 s
01:09:48 testEclipseProject(org.eclipse.papyrus.uml.profile.drafter.tests.EclipseProjectTest)  Time elapsed: 0 s
01:09:48 testGetUmlModelWithIFile(org.eclipse.papyrus.uml.profile.drafter.tests.ModelSetManagerTest)  Time elapsed: 0.125 s
01:09:48 testModelSetManagerString(org.eclipse.papyrus.uml.profile.drafter.tests.ModelSetManagerTest)  Time elapsed: 0.006 s
01:09:48 testModelSetManagerURI(org.eclipse.papyrus.uml.profile.drafter.tests.ModelSetManagerTest)  Time elapsed: 0.006 s
01:09:48 testGetNamedElementByNameString(org.eclipse.papyrus.uml.profile.drafter.tests.ModelSetManagerTest)  Time elapsed: 0.006 s
01:09:48 testGetUmlModel(org.eclipse.papyrus.uml.profile.drafter.tests.ModelSetManagerTest)  Time elapsed: 0.022 s
01:09:48 testModelSetManagerStringModels(org.eclipse.papyrus.uml.profile.drafter.tests.ModelSetManagerTest)  Time elapsed: 0.003 s
01:09:48 testGetNamedElementByNameWithSterotype(org.eclipse.papyrus.uml.profile.drafter.tests.ModelSetManagerTest)  Time elapsed: 0.036 s
01:09:48 testCreation(org.eclipse.papyrus.uml.profile.drafter.tests.utils.UMLModelCreatorTest)  Time elapsed: 0.007 s
01:09:48 testCreateClass(org.eclipse.papyrus.uml.profile.drafter.tests.utils.UMLModelCreatorTest)  Time elapsed: 0 s
01:09:48 testCreateModel(org.eclipse.papyrus.uml.profile.drafter.tests.utils.UMLModelCreatorTest)  Time elapsed: 0 s
01:09:48 testCreatePackage(org.eclipse.papyrus.uml.profile.drafter.tests.utils.UMLModelCreatorTest)  Time elapsed: 0 s
01:09:48 testCd(org.eclipse.papyrus.uml.profile.drafter.tests.utils.UMLModelCreatorTest)  Time elapsed: 0.001 s
01:09:48 testUMLModelCreatorResourceFailing(org.eclipse.papyrus.uml.profile.drafter.tests.utils.UMLModelCreatorTest)  Time elapsed: 0 s
01:09:48 testUMLModelCreatorStringString(org.eclipse.papyrus.uml.profile.drafter.tests.utils.UMLModelCreatorTest)  Time elapsed: 0 s
01:09:48 testUMLModelCreatorResource(org.eclipse.papyrus.uml.profile.drafter.tests.utils.UMLModelCreatorTest)  Time elapsed: 0 s
01:09:48 testCreateDatatype(org.eclipse.papyrus.uml.profile.drafter.tests.utils.UMLModelCreatorTest)  Time elapsed: 0 s
01:09:48 testCompoundTypeProvider(org.eclipse.papyrus.uml.profile.drafter.ui.model.CompoundTypeProviderTest)  Time elapsed: 0.003 s
01:09:48 testGetTypes(org.eclipse.papyrus.uml.profile.drafter.ui.model.CompoundTypeProviderTest)  Time elapsed: 0 s
01:09:48 testAddITypeProvider(org.eclipse.papyrus.uml.profile.drafter.ui.model.CompoundTypeProviderTest)  Time elapsed: 0 s
01:09:48 testIterator(org.eclipse.papyrus.uml.profile.drafter.ui.model.CompoundTypeProviderTest)  Time elapsed: 0 s
01:09:48 testVisitMetaclassesModel(org.eclipse.papyrus.uml.profile.drafter.ui.model.SimpleModelVisitorTest) skipped
01:09:48 testVisitPropertyModel(org.eclipse.papyrus.uml.profile.drafter.ui.model.SimpleModelVisitorTest) skipped
01:09:48 testSimpleModelVisitor(org.eclipse.papyrus.uml.profile.drafter.ui.model.SimpleModelVisitorTest)  Time elapsed: 0.003 s
01:09:48 testDoVisitStereoptypeModel(org.eclipse.papyrus.uml.profile.drafter.ui.model.SimpleModelVisitorTest) skipped
01:09:48 testDoVisitPropertyModel(org.eclipse.papyrus.uml.profile.drafter.ui.model.SimpleModelVisitorTest) skipped
01:09:48 testVisitStereoptypeModel(org.eclipse.papyrus.uml.profile.drafter.ui.model.SimpleModelVisitorTest) skipped
01:09:48 testDoVisitMetaclassesModel(org.eclipse.papyrus.uml.profile.drafter.ui.model.SimpleModelVisitorTest) skipped
01:09:48 testSetStereotypeName(org.eclipse.papyrus.uml.profile.drafter.ui.model.StereotypeURLTest)  Time elapsed: 0.008 s
01:09:48 testGetProfileName(org.eclipse.papyrus.uml.profile.drafter.ui.model.StereotypeURLTest)  Time elapsed: 0 s
01:09:48 testAddPropertyChangeListenerPropertyChangeListener(org.eclipse.papyrus.uml.profile.drafter.ui.model.StereotypeURLTest)  Time elapsed: 0.001 s
01:09:48 testSetQualifiedNameComplex(org.eclipse.papyrus.uml.profile.drafter.ui.model.StereotypeURLTest)  Time elapsed: 0 s
01:09:48 testClear(org.eclipse.papyrus.uml.profile.drafter.ui.model.StereotypeURLTest)  Time elapsed: 0 s
01:09:48 testStereotypeURLString(org.eclipse.papyrus.uml.profile.drafter.ui.model.StereotypeURLTest)  Time elapsed: 0 s
01:09:48 testToString(org.eclipse.papyrus.uml.profile.drafter.ui.model.StereotypeURLTest)  Time elapsed: 0 s
01:09:48 testGetStereotypeName(org.eclipse.papyrus.uml.profile.drafter.ui.model.StereotypeURLTest)  Time elapsed: 0 s
01:09:48 testAddPropertyChangeListenerStringPropertyChangeListener(org.eclipse.papyrus.uml.profile.drafter.ui.model.StereotypeURLTest)  Time elapsed: 0.001 s
01:09:48 testStereotypeURL(org.eclipse.papyrus.uml.profile.drafter.ui.model.StereotypeURLTest)  Time elapsed: 0 s
01:09:48 testRemovePropertyChangeListenerPropertyChangeListener(org.eclipse.papyrus.uml.profile.drafter.ui.model.StereotypeURLTest)  Time elapsed: 0 s
01:09:48 testSetQualifiedNameSimple(org.eclipse.papyrus.uml.profile.drafter.ui.model.StereotypeURLTest)  Time elapsed: 0 s
01:09:48 testSetProfileName(org.eclipse.papyrus.uml.profile.drafter.ui.model.StereotypeURLTest)  Time elapsed: 0 s
01:09:48 testRemovePropertyChangeListenerStringPropertyChangeListener(org.eclipse.papyrus.uml.profile.drafter.ui.model.StereotypeURLTest)  Time elapsed: 0 s
01:09:48 testComputeQualifiedName(org.eclipse.papyrus.uml.profile.drafter.ui.model.StereotypeURLTest)  Time elapsed: 0 s
01:09:48 testGetQualifiedName(org.eclipse.papyrus.uml.profile.drafter.ui.model.StereotypeURLTest)  Time elapsed: 0.001 s
01:09:48 testStereotypeURLStringString(org.eclipse.papyrus.uml.profile.drafter.ui.model.StereotypeURLTest)  Time elapsed: 0 s
01:09:48 testGetTypes(org.eclipse.papyrus.uml.profile.drafter.ui.model.TypeProviderTest)  Time elapsed: 0.003 s
01:09:48 testTypeProvider(org.eclipse.papyrus.uml.profile.drafter.ui.model.TypeProviderTest)  Time elapsed: 0 s
01:09:48 testIterator(org.eclipse.papyrus.uml.profile.drafter.ui.model.TypeProviderTest)  Time elapsed: 0.001 s
01:09:48 testGetTypes(org.eclipse.papyrus.uml.profile.drafter.ui.model.TypeProviderTest2)  Time elapsed: 0 s
01:09:48 testAddType(org.eclipse.papyrus.uml.profile.drafter.ui.model.TypeProviderTest2)  Time elapsed: 0 s
01:09:48 testAddTypeFromConstructor(org.eclipse.papyrus.uml.profile.drafter.ui.model.TypeProviderTest2)  Time elapsed: 0 s
01:09:48 testTypeProvider(org.eclipse.papyrus.uml.profile.drafter.ui.model.TypeProviderTest2)  Time elapsed: 0 s
01:09:48 testTypeProviderTypeArray(org.eclipse.papyrus.uml.profile.drafter.ui.model.TypeProviderTest2)  Time elapsed: 0 s
01:09:48 testIterator(org.eclipse.papyrus.uml.profile.drafter.ui.model.TypeProviderTest2)  Time elapsed: 0.001 s
01:09:48 testUMLPrimitiveTypesModel(org.eclipse.papyrus.uml.profile.drafter.utils.UMLPrimitiveTypesModelTest)  Time elapsed: 0.03 s
01:09:48 testGetLibraryPackage(org.eclipse.papyrus.uml.profile.drafter.utils.UMLPrimitiveTypesModelTest)  Time elapsed: 0.026 s
01:09:48 testUseInternationalizationModification(org.eclipse.papyrus.uml.internationalization.tests.tests.UMLInternationalizationChangePreferencesTest)  Time elapsed: 0.957 s
01:09:48 testLanguageModification(org.eclipse.papyrus.uml.internationalization.tests.tests.UMLInternationalizationChangeLanguageTest)  Time elapsed: 0.8 s
01:09:48 rebuildAdapters(org.eclipse.papyrus.uml.internationalization.tests.tests.InternationalizationUMLItemProviderAdapterFactoryTest)  Time elapsed: 0.835 s
01:09:48 normalAdapters(org.eclipse.papyrus.uml.internationalization.tests.tests.InternationalizationUMLItemProviderAdapterFactoryTest)  Time elapsed: 0.758 s
01:09:48 testLabelProviderAdapter(org.eclipse.papyrus.uml.internationalization.tests.tests.InternationalizationAdapterTest)  Time elapsed: 0.002 s
01:09:48 testMapping(org.eclipse.papyrus.uml.alf.tests.mapper.MappingTest) skipped
01:09:48 org.eclipse.papyrus.uml.alf.tests.mapper.MappingTest skipped
01:09:48 testMerging(org.eclipse.papyrus.uml.alf.tests.mapper.MergeTest) skipped
01:09:48 org.eclipse.papyrus.uml.alf.tests.mapper.MergeTest skipped
01:09:48 testStaticSemantics(org.eclipse.papyrus.uml.alf.tests.SemanticTest) skipped
01:09:48 org.eclipse.papyrus.uml.alf.tests.SemanticTest skipped
01:09:48 testOneFile(org.eclipse.papyrus.uml.alf.tests.SingleTest) skipped
01:09:48 org.eclipse.papyrus.uml.alf.tests.SingleTest skipped
01:09:48 testSyntax(org.eclipse.papyrus.uml.alf.tests.SyntacticTest) skipped
01:09:48 org.eclipse.papyrus.uml.alf.tests.SyntacticTest skipped
01:09:48 testGeneration(org.eclipse.papyrus.uml.alf.tests.generator.GenerationTest) skipped
01:09:48 org.eclipse.papyrus.uml.alf.tests.generator.GenerationTest skipped
01:09:48 org.eclipse.papyrus.uml.alf.tests.AllTests skipped
01:09:48 IsStereotypedWithExpression_Test10(org.eclipse.papyrus.uml.expressions.tests.IsStereotypedWithExpressionTests)  Time elapsed: 1.194 s
01:09:48 IsStereotypedWithExpression_Test11(org.eclipse.papyrus.uml.expressions.tests.IsStereotypedWithExpressionTests)  Time elapsed: 1.093 s
01:09:48 IsStereotypedWithExpression_Test12(org.eclipse.papyrus.uml.expressions.tests.IsStereotypedWithExpressionTests)  Time elapsed: 1.115 s
01:09:48 IsStereotypedWithExpression_Test13(org.eclipse.papyrus.uml.expressions.tests.IsStereotypedWithExpressionTests)  Time elapsed: 1.174 s
01:09:48 IsStereotypedWithExpression_Test1(org.eclipse.papyrus.uml.expressions.tests.IsStereotypedWithExpressionTests)  Time elapsed: 1.136 s
01:09:48 IsStereotypedWithExpression_Test2(org.eclipse.papyrus.uml.expressions.tests.IsStereotypedWithExpressionTests)  Time elapsed: 1.11 s
01:09:48 IsStereotypedWithExpression_Test3(org.eclipse.papyrus.uml.expressions.tests.IsStereotypedWithExpressionTests)  Time elapsed: 1.113 s
01:09:48 IsStereotypedWithExpression_Test4(org.eclipse.papyrus.uml.expressions.tests.IsStereotypedWithExpressionTests)  Time elapsed: 1.078 s
01:09:48 IsStereotypedWithExpression_Test5(org.eclipse.papyrus.uml.expressions.tests.IsStereotypedWithExpressionTests)  Time elapsed: 1.118 s
01:09:48 IsStereotypedWithExpression_Test6(org.eclipse.papyrus.uml.expressions.tests.IsStereotypedWithExpressionTests)  Time elapsed: 1.08 s
01:09:48 IsStereotypedWithExpression_Test7(org.eclipse.papyrus.uml.expressions.tests.IsStereotypedWithExpressionTests)  Time elapsed: 1.073 s
01:09:48 IsStereotypedWithExpression_Test8(org.eclipse.papyrus.uml.expressions.tests.IsStereotypedWithExpressionTests)  Time elapsed: 1.14 s
01:09:48 IsStereotypedWithExpression_Test9(org.eclipse.papyrus.uml.expressions.tests.IsStereotypedWithExpressionTests)  Time elapsed: 1.227 s
01:09:48 HasStereotypeExpressionTests_Test1(org.eclipse.papyrus.uml.expressions.tests.HasAppliedStereotypeExpressionTests)  Time elapsed: 1.26 s
01:09:48 HasStereotypeExpressionTests_Test2(org.eclipse.papyrus.uml.expressions.tests.HasAppliedStereotypeExpressionTests)  Time elapsed: 1.593 s
01:09:48 HasStereotypeExpressionTests_Test3(org.eclipse.papyrus.uml.expressions.tests.HasAppliedStereotypeExpressionTests)  Time elapsed: 1.093 s
01:09:48 HasStereotypeExpressionTests_Test4(org.eclipse.papyrus.uml.expressions.tests.HasAppliedStereotypeExpressionTests)  Time elapsed: 1.112 s
01:09:48 metaclassAndNoContext(org.eclipse.papyrus.uml.expressions.tests.IsKindOfExpressionTest)  Time elapsed: 0.004 s
01:09:48 noMetaclassAndNoContextTest(org.eclipse.papyrus.uml.expressions.tests.IsKindOfExpressionTest)  Time elapsed: 0 s
01:09:48 metaclassAndValidContext_1(org.eclipse.papyrus.uml.expressions.tests.IsKindOfExpressionTest)  Time elapsed: 0.001 s
01:09:48 metaclassAndValidContext_2(org.eclipse.papyrus.uml.expressions.tests.IsKindOfExpressionTest)  Time elapsed: 0 s
01:09:48 metaclassAndInvalidContext(org.eclipse.papyrus.uml.expressions.tests.IsKindOfExpressionTest)  Time elapsed: 0 s
01:09:48 metaclassAndNoContext(org.eclipse.papyrus.uml.expressions.tests.IsTypeOfExpressionTests)  Time elapsed: 0.001 s
01:09:48 noMetaclassAndNoContextTest(org.eclipse.papyrus.uml.expressions.tests.IsTypeOfExpressionTests)  Time elapsed: 0 s
01:09:48 metaclassAndValidContext_2(org.eclipse.papyrus.uml.expressions.tests.IsTypeOfExpressionTests)  Time elapsed: 0.001 s
01:09:48 metaclassAndInValidContext_1(org.eclipse.papyrus.uml.expressions.tests.IsTypeOfExpressionTests)  Time elapsed: 0 s
01:09:48 IsKindOfStereotypeExpression_Test10(org.eclipse.papyrus.uml.expressions.tests.IsKindOfStereotypeExpressionTests)  Time elapsed: 1.168 s
01:09:48 IsKindOfStereotypeExpression_Test11(org.eclipse.papyrus.uml.expressions.tests.IsKindOfStereotypeExpressionTests)  Time elapsed: 1.08 s
01:09:48 IsKindOfStereotypeExpression_Test12(org.eclipse.papyrus.uml.expressions.tests.IsKindOfStereotypeExpressionTests)  Time elapsed: 1.118 s
01:09:48 IsKindOfStereotypeExpression_Test13(org.eclipse.papyrus.uml.expressions.tests.IsKindOfStereotypeExpressionTests)  Time elapsed: 1.149 s
01:09:48 IsKindOfStereotypeExpression_Test14(org.eclipse.papyrus.uml.expressions.tests.IsKindOfStereotypeExpressionTests)  Time elapsed: 1.199 s
01:09:48 IsKindOfStereotypeExpression_Test1(org.eclipse.papyrus.uml.expressions.tests.IsKindOfStereotypeExpressionTests)  Time elapsed: 1.085 s
01:09:48 IsKindOfStereotypeExpression_Test2(org.eclipse.papyrus.uml.expressions.tests.IsKindOfStereotypeExpressionTests)  Time elapsed: 1.147 s
01:09:48 IsKindOfStereotypeExpression_Test3(org.eclipse.papyrus.uml.expressions.tests.IsKindOfStereotypeExpressionTests)  Time elapsed: 1.098 s
01:09:48 IsKindOfStereotypeExpression_Test4(org.eclipse.papyrus.uml.expressions.tests.IsKindOfStereotypeExpressionTests)  Time elapsed: 1.124 s
01:09:48 IsKindOfStereotypeExpression_Test5(org.eclipse.papyrus.uml.expressions.tests.IsKindOfStereotypeExpressionTests)  Time elapsed: 1.117 s
01:09:48 IsKindOfStereotypeExpression_Test6(org.eclipse.papyrus.uml.expressions.tests.IsKindOfStereotypeExpressionTests)  Time elapsed: 1.056 s
01:09:48 IsKindOfStereotypeExpression_Test7(org.eclipse.papyrus.uml.expressions.tests.IsKindOfStereotypeExpressionTests)  Time elapsed: 1.072 s
01:09:48 IsKindOfStereotypeExpression_Test8(org.eclipse.papyrus.uml.expressions.tests.IsKindOfStereotypeExpressionTests)  Time elapsed: 1.09 s
01:09:48 IsKindOfStereotypeExpression_Test9(org.eclipse.papyrus.uml.expressions.tests.IsKindOfStereotypeExpressionTests)  Time elapsed: 1.056 s
01:09:48 IsTypeOfStereotypeExpression_Test1(org.eclipse.papyrus.uml.expressions.tests.IsTypeOfStereotypeExpressionTests)  Time elapsed: 1.082 s
01:09:48 IsTypeOfStereotypeExpression_Test2(org.eclipse.papyrus.uml.expressions.tests.IsTypeOfStereotypeExpressionTests)  Time elapsed: 1.067 s
01:09:48 IsTypeOfStereotypeExpression_Test3(org.eclipse.papyrus.uml.expressions.tests.IsTypeOfStereotypeExpressionTests)  Time elapsed: 1.035 s
01:09:48 IsTypeOfStereotypeExpression_Test4(org.eclipse.papyrus.uml.expressions.tests.IsTypeOfStereotypeExpressionTests)  Time elapsed: 1.07 s
01:09:48 IsTypeOfStereotypeExpression_Test5(org.eclipse.papyrus.uml.expressions.tests.IsTypeOfStereotypeExpressionTests)  Time elapsed: 1.004 s
01:09:48 IsTypeOfStereotypeExpression_Test6(org.eclipse.papyrus.uml.expressions.tests.IsTypeOfStereotypeExpressionTests)  Time elapsed: 1.017 s
01:09:48 IsTypeOfStereotypeExpression_Test7(org.eclipse.papyrus.uml.expressions.tests.IsTypeOfStereotypeExpressionTests)  Time elapsed: 1.06 s
01:09:48 IsTypeOfStereotypeExpression_Test8(org.eclipse.papyrus.uml.expressions.tests.IsTypeOfStereotypeExpressionTests)  Time elapsed: 1.096 s
01:09:48 IsTypeOfStereotypeExpression_Test9(org.eclipse.papyrus.uml.expressions.tests.IsTypeOfStereotypeExpressionTests)  Time elapsed: 1.035 s
01:09:48 IsTypeOfStereotypeExpression_Test10(org.eclipse.papyrus.uml.expressions.tests.IsTypeOfStereotypeExpressionTests)  Time elapsed: 1.191 s
01:09:48 IsTypeOfStereotypeExpression_Test11(org.eclipse.papyrus.uml.expressions.tests.IsTypeOfStereotypeExpressionTests)  Time elapsed: 2.23 s
01:09:48 IsTypeOfStereotypeExpression_Test12(org.eclipse.papyrus.uml.expressions.tests.IsTypeOfStereotypeExpressionTests)  Time elapsed: 1.077 s
01:09:48 IsTypeOfStereotypeExpression_Test13(org.eclipse.papyrus.uml.expressions.tests.IsTypeOfStereotypeExpressionTests)  Time elapsed: 1.129 s
01:09:48 SingleStereotypeAttributeEqualityExpressionTests_Test10(org.eclipse.papyrus.uml.expressions.tests.SingleStereotypeAttributeEqualityExpressionTests)  Time elapsed: 1.075 s
01:09:48 SingleStereotypeAttributeEqualityExpressionTests_Test11(org.eclipse.papyrus.uml.expressions.tests.SingleStereotypeAttributeEqualityExpressionTests)  Time elapsed: 1.119 s
01:09:48 SingleStereotypeAttributeEqualityExpressionTests_Test12(org.eclipse.papyrus.uml.expressions.tests.SingleStereotypeAttributeEqualityExpressionTests)  Time elapsed: 1.05 s
01:09:48 SingleStereotypeAttributeEqualityExpressionTests_Test13(org.eclipse.papyrus.uml.expressions.tests.SingleStereotypeAttributeEqualityExpressionTests)  Time elapsed: 1.093 s
01:09:48 SingleStereotypeAttributeEqualityExpressionTests_Test1(org.eclipse.papyrus.uml.expressions.tests.SingleStereotypeAttributeEqualityExpressionTests)  Time elapsed: 1.049 s
01:09:48 SingleStereotypeAttributeEqualityExpressionTests_Test2(org.eclipse.papyrus.uml.expressions.tests.SingleStereotypeAttributeEqualityExpressionTests)  Time elapsed: 1.052 s
01:09:48 SingleStereotypeAttributeEqualityExpressionTests_Test3(org.eclipse.papyrus.uml.expressions.tests.SingleStereotypeAttributeEqualityExpressionTests)  Time elapsed: 1.029 s
01:09:48 SingleStereotypeAttributeEqualityExpressionTests_Test4(org.eclipse.papyrus.uml.expressions.tests.SingleStereotypeAttributeEqualityExpressionTests)  Time elapsed: 1.127 s
01:09:48 SingleStereotypeAttributeEqualityExpressionTests_Test5(org.eclipse.papyrus.uml.expressions.tests.SingleStereotypeAttributeEqualityExpressionTests)  Time elapsed: 1.072 s
01:09:48 SingleStereotypeAttributeEqualityExpressionTests_Test6(org.eclipse.papyrus.uml.expressions.tests.SingleStereotypeAttributeEqualityExpressionTests)  Time elapsed: 1.066 s
01:09:48 SingleStereotypeAttributeEqualityExpressionTests_Test7(org.eclipse.papyrus.uml.expressions.tests.SingleStereotypeAttributeEqualityExpressionTests)  Time elapsed: 1.043 s
01:09:48 SingleStereotypeAttributeEqualityExpressionTests_Test8(org.eclipse.papyrus.uml.expressions.tests.SingleStereotypeAttributeEqualityExpressionTests)  Time elapsed: 1.029 s
01:09:48 SingleStereotypeAttributeEqualityExpressionTests_Test9(org.eclipse.papyrus.uml.expressions.tests.SingleStereotypeAttributeEqualityExpressionTests)  Time elapsed: 1.081 s
01:09:48 validateModel[0](org.eclipse.papyrus.uml.architecture.tests.resources.ModelValidationTest)  Time elapsed: 0.253 s
01:09:48 
01:09:48 Results:
01:09:48 
01:09:48 Failures: 
01:09:48   TestOCLValidationRuleFromFile.validateCamelCaseRule:114 The rule CamelCaseName in ExtraUMLValidation.ocl should trigger an issue for this class expected:<1> but was:<0>
01:09:48 
01:09:48 Tests run: 678, Failures: 1, Errors: 0, Skipped: 39
01:09:48 
01:09:48 [ERROR] There are test failures.
01:09:51 
01:09:51 Please refer to /home/jenkins/agent/workspace/Papyrus-Master-Tests-Releng/source/tests/junit/plugins/uml/org.eclipse.papyrus.uml.suite.tests/target/surefire-reports for the individual test results.
01:09:51 [INFO] 
01:09:51 [INFO] --- jacoco-maven-plugin:0.8.6:report (default-report) @ org.eclipse.papyrus.uml.suite.tests ---
01:09:51 [INFO] Loading execution data file /home/jenkins/agent/workspace/Papyrus-Master-Tests-Releng/source/tests/junit/plugins/uml/org.eclipse.papyrus.uml.suite.tests/target/jacoco.exec
01:09:51 [INFO] Analyzed bundle 'org.eclipse.papyrus.uml.suite.tests' with 0 classes
01:09:51 [INFO] 
01:09:51 [INFO] --< org.eclipse.papyrus.tests:org.eclipse.papyrus.uml.alf.tests.releng >--
01:09:51 [INFO] Building org.eclipse.papyrus.uml.alf.tests.releng 0.0.1-SNAPSHOT [165/172]
01:09:51 [INFO] --------------------------------[ pom ]---------------------------------
01:09:51 [INFO] 
01:09:51 [INFO] --- maven-clean-plugin:3.1.0:clean (default-clean) @ org.eclipse.papyrus.uml.alf.tests.releng ---
01:09:51 [INFO] 
01:09:51 [INFO] --- jacoco-maven-plugin:0.8.6:prepare-agent (default-prepare-agent) @ org.eclipse.papyrus.uml.alf.tests.releng ---
01:09:51 [INFO] argLine set to -javaagent:/home/jenkins/agent/workspace/Papyrus-Master-Tests-Releng/.repository/org/jacoco/org.jacoco.agent/0.8.6/org.jacoco.agent-0.8.6-runtime.jar=destfile=/home/jenkins/agent/workspace/Papyrus-Master-Tests-Releng/source/tests/junit/plugins/uml/alf/target/jacoco.exec,includes=org.eclipse.papyrus.*,excludes=org.eclipse.uml2
01:09:51 [INFO] 
01:09:51 [INFO] --- jacoco-maven-plugin:0.8.6:report (default-report) @ org.eclipse.papyrus.uml.alf.tests.releng ---
01:09:51 [INFO] Skipping JaCoCo execution due to missing execution data file.
01:09:51 [INFO] 
01:09:51 [INFO] --< org.eclipse.papyrus.tests:org.eclipse.papyrus.uml.alf.backend.tests >--
01:09:51 [INFO] Building org.eclipse.papyrus.uml.alf.backend.tests 2.0.0-SNAPSHOT [166/172]
01:09:51 [INFO] ------------------------[ eclipse-test-plugin ]-------------------------
01:09:51 [INFO] 
01:09:51 [INFO] --- maven-clean-plugin:3.1.0:clean (default-clean) @ org.eclipse.papyrus.uml.alf.backend.tests ---
01:09:51 [INFO] 
01:09:51 [INFO] --- tycho-packaging-plugin:2.2.0:build-qualifier (default-build-qualifier) @ org.eclipse.papyrus.uml.alf.backend.tests ---
01:09:51 [INFO] The project's OSGi version is 2.0.0.202103250402
01:09:51 [INFO] 
01:09:51 [INFO] --- tycho-packaging-plugin:2.2.0:validate-id (default-validate-id) @ org.eclipse.papyrus.uml.alf.backend.tests ---
01:09:51 [INFO] 
01:09:51 [INFO] --- tycho-packaging-plugin:2.2.0:validate-version (default-validate-version) @ org.eclipse.papyrus.uml.alf.backend.tests ---
01:09:51 [INFO] 
01:09:51 [INFO] --- jacoco-maven-plugin:0.8.6:prepare-agent (default-prepare-agent) @ org.eclipse.papyrus.uml.alf.backend.tests ---
01:09:51 [INFO] tycho.testArgLine set to -javaagent:/home/jenkins/agent/workspace/Papyrus-Master-Tests-Releng/.repository/org/jacoco/org.jacoco.agent/0.8.6/org.jacoco.agent-0.8.6-runtime.jar=destfile=/home/jenkins/agent/workspace/Papyrus-Master-Tests-Releng/source/tests/junit/plugins/uml/alf/org.eclipse.papyrus.uml.alf.backend.tests/target/jacoco.exec,includes=org.eclipse.papyrus.*,excludes=org.eclipse.uml2
01:09:51 [INFO] 
01:09:51 [INFO] --- xtend-maven-plugin:2.25.0.M1:compile (default) @ org.eclipse.papyrus.uml.alf.backend.tests ---
01:09:51 [INFO] 
01:09:52 [INFO] --- maven-resources-plugin:3.2.0:resources (default-resources) @ org.eclipse.papyrus.uml.alf.backend.tests ---
01:09:52 [INFO] Using 'UTF-8' encoding to copy filtered resources.
01:09:52 [INFO] Using 'UTF-8' encoding to copy filtered properties files.
01:09:52 [INFO] skip non existing resourceDirectory /home/jenkins/agent/workspace/Papyrus-Master-Tests-Releng/source/tests/junit/plugins/uml/alf/org.eclipse.papyrus.uml.alf.backend.tests/src/main/resources
01:09:52 [INFO] 
01:09:52 [INFO] --- tycho-compiler-plugin:2.2.0:compile (default-compile) @ org.eclipse.papyrus.uml.alf.backend.tests ---
01:09:52 [INFO] Compiling 4 source files to /home/jenkins/agent/workspace/Papyrus-Master-Tests-Releng/source/tests/junit/plugins/uml/alf/org.eclipse.papyrus.uml.alf.backend.tests/bin
01:09:52 [INFO] 
01:09:53 [INFO] --- maven-resources-plugin:3.2.0:testResources (default-testResources) @ org.eclipse.papyrus.uml.alf.backend.tests ---
01:09:53 [INFO] Using 'UTF-8' encoding to copy filtered resources.
01:09:53 [INFO] Using 'UTF-8' encoding to copy filtered properties files.
01:09:53 [INFO] skip non existing resourceDirectory /home/jenkins/agent/workspace/Papyrus-Master-Tests-Releng/source/tests/junit/plugins/uml/alf/org.eclipse.papyrus.uml.alf.backend.tests/src/test/resources
01:09:53 [INFO] 
01:09:53 [INFO] --- target-platform-configuration:2.2.0:target-platform (default-target-platform) @ org.eclipse.papyrus.uml.alf.backend.tests ---
01:09:53 [INFO] 
01:09:53 [INFO] --- tycho-packaging-plugin:2.2.0:package-plugin (default-package-plugin) @ org.eclipse.papyrus.uml.alf.backend.tests ---
01:09:53 [INFO] Building jar: /home/jenkins/agent/workspace/Papyrus-Master-Tests-Releng/source/tests/junit/plugins/uml/alf/org.eclipse.papyrus.uml.alf.backend.tests/target/org.eclipse.papyrus.uml.alf.backend.tests-2.0.0-SNAPSHOT.jar
01:09:53 [INFO] 
01:09:53 [INFO] --- tycho-p2-plugin:2.2.0:p2-metadata-default (default-p2-metadata-default) @ org.eclipse.papyrus.uml.alf.backend.tests ---
01:09:53 [INFO] 
01:09:53 [INFO] --- tycho-surefire-plugin:2.2.0:test (default-test) @ org.eclipse.papyrus.uml.alf.backend.tests ---
01:09:53 [INFO] Skipping tests
01:09:53 [INFO] 
01:09:53 [INFO] --- jacoco-maven-plugin:0.8.6:report (default-report) @ org.eclipse.papyrus.uml.alf.backend.tests ---
01:09:53 [INFO] Skipping JaCoCo execution due to missing execution data file.
01:09:53 [INFO] 
01:09:53 [INFO] --< org.eclipse.papyrus.tests:org.eclipse.papyrus.views.properties.toolsmiths.tests >--
01:09:53 [INFO] Building org.eclipse.papyrus.views.properties.toolsmiths.tests 2.0.0-SNAPSHOT [167/172]
01:09:53 [INFO] ------------------------[ eclipse-test-plugin ]-------------------------
01:09:53 [INFO] 
01:09:53 [INFO] --- maven-clean-plugin:3.1.0:clean (default-clean) @ org.eclipse.papyrus.views.properties.toolsmiths.tests ---
01:09:53 [INFO] 
01:09:53 [INFO] --- tycho-packaging-plugin:2.2.0:build-qualifier (default-build-qualifier) @ org.eclipse.papyrus.views.properties.toolsmiths.tests ---
01:09:53 [INFO] The project's OSGi version is 2.0.0.202103250402
01:09:53 [INFO] 
01:09:53 [INFO] --- tycho-packaging-plugin:2.2.0:validate-id (default-validate-id) @ org.eclipse.papyrus.views.properties.toolsmiths.tests ---
01:09:53 [INFO] 
01:09:53 [INFO] --- tycho-packaging-plugin:2.2.0:validate-version (default-validate-version) @ org.eclipse.papyrus.views.properties.toolsmiths.tests ---
01:09:53 [INFO] 
01:09:53 [INFO] --- jacoco-maven-plugin:0.8.6:prepare-agent (default-prepare-agent) @ org.eclipse.papyrus.views.properties.toolsmiths.tests ---
01:09:53 [INFO] tycho.testArgLine set to -javaagent:/home/jenkins/agent/workspace/Papyrus-Master-Tests-Releng/.repository/org/jacoco/org.jacoco.agent/0.8.6/org.jacoco.agent-0.8.6-runtime.jar=destfile=/home/jenkins/agent/workspace/Papyrus-Master-Tests-Releng/source/tests/junit/plugins/views/org.eclipse.papyrus.views.properties.toolsmiths.tests/target/jacoco.exec,includes=org.eclipse.papyrus.*,excludes=org.eclipse.uml2
01:09:53 [INFO] 
01:09:53 [INFO] --- maven-resources-plugin:3.2.0:resources (default-resources) @ org.eclipse.papyrus.views.properties.toolsmiths.tests ---
01:09:53 [INFO] Using 'UTF-8' encoding to copy filtered resources.
01:09:53 [INFO] Using 'UTF-8' encoding to copy filtered properties files.
01:09:53 [INFO] skip non existing resourceDirectory /home/jenkins/agent/workspace/Papyrus-Master-Tests-Releng/source/tests/junit/plugins/views/org.eclipse.papyrus.views.properties.toolsmiths.tests/src/main/resources
01:09:53 [INFO] 
01:09:53 [INFO] --- tycho-compiler-plugin:2.2.0:compile (default-compile) @ org.eclipse.papyrus.views.properties.toolsmiths.tests ---
01:09:53 [INFO] Compiling 3 source files to /home/jenkins/agent/workspace/Papyrus-Master-Tests-Releng/source/tests/junit/plugins/views/org.eclipse.papyrus.views.properties.toolsmiths.tests/bin
01:09:53 [WARNING] /home/jenkins/agent/workspace/Papyrus-Master-Tests-Releng/source/tests/junit/plugins/views/org.eclipse.papyrus.views.properties.toolsmiths.tests/src/org/eclipse/papyrus/views/properties/toolsmiths/tests/qvt/TransformationsTests.java:[274] 
01:09:53 	DataContextElement st3Element = findContextElement(context, "Stereotype3");
01:09:53 	                   ^^^^^^^^^^
01:09:53 The value of the local variable st3Element is not used
01:09:53 1 problem (1 warning)
01:09:53 [INFO] 
01:09:53 [INFO] --- maven-resources-plugin:3.2.0:testResources (default-testResources) @ org.eclipse.papyrus.views.properties.toolsmiths.tests ---
01:09:53 [INFO] Using 'UTF-8' encoding to copy filtered resources.
01:09:53 [INFO] Using 'UTF-8' encoding to copy filtered properties files.
01:09:53 [INFO] skip non existing resourceDirectory /home/jenkins/agent/workspace/Papyrus-Master-Tests-Releng/source/tests/junit/plugins/views/org.eclipse.papyrus.views.properties.toolsmiths.tests/src/test/resources
01:09:53 [INFO] 
01:09:53 [INFO] --- target-platform-configuration:2.2.0:target-platform (default-target-platform) @ org.eclipse.papyrus.views.properties.toolsmiths.tests ---
01:09:53 [INFO] 
01:09:53 [INFO] --- tycho-packaging-plugin:2.2.0:package-plugin (default-package-plugin) @ org.eclipse.papyrus.views.properties.toolsmiths.tests ---
01:09:53 [INFO] Building jar: /home/jenkins/agent/workspace/Papyrus-Master-Tests-Releng/source/tests/junit/plugins/views/org.eclipse.papyrus.views.properties.toolsmiths.tests/target/org.eclipse.papyrus.views.properties.toolsmiths.tests-2.0.0-SNAPSHOT.jar
01:09:53 [INFO] 
01:09:53 [INFO] --- tycho-p2-plugin:2.2.0:p2-metadata-default (default-p2-metadata-default) @ org.eclipse.papyrus.views.properties.toolsmiths.tests ---
01:09:53 [INFO] 
01:09:53 [INFO] --- tycho-surefire-plugin:2.2.0:test (default-test) @ org.eclipse.papyrus.views.properties.toolsmiths.tests ---
01:09:53 [INFO] Skipping tests
01:09:53 [INFO] 
01:09:53 [INFO] --- jacoco-maven-plugin:0.8.6:report (default-report) @ org.eclipse.papyrus.views.properties.toolsmiths.tests ---
01:09:53 [INFO] Skipping JaCoCo execution due to missing execution data file.
01:09:53 [INFO] 
01:09:53 [INFO] --< org.eclipse.papyrus.tests:org.eclipse.papyrus.views.suite.tests >---
01:09:53 [INFO] Building org.eclipse.papyrus.views.suite.tests 1.1.0-SNAPSHOT  [168/172]
01:09:53 [INFO] ------------------------[ eclipse-test-plugin ]-------------------------
01:09:53 [INFO] 
01:09:54 [INFO] --- maven-clean-plugin:3.1.0:clean (default-clean) @ org.eclipse.papyrus.views.suite.tests ---
01:09:54 [INFO] 
01:09:54 [INFO] --- tycho-packaging-plugin:2.2.0:build-qualifier (default-build-qualifier) @ org.eclipse.papyrus.views.suite.tests ---
01:09:54 [INFO] The project's OSGi version is 1.1.0.202103250402
01:09:54 [INFO] 
01:09:54 [INFO] --- tycho-packaging-plugin:2.2.0:validate-id (default-validate-id) @ org.eclipse.papyrus.views.suite.tests ---
01:09:54 [INFO] 
01:09:54 [INFO] --- tycho-packaging-plugin:2.2.0:validate-version (default-validate-version) @ org.eclipse.papyrus.views.suite.tests ---
01:09:54 [INFO] 
01:09:54 [INFO] --- jacoco-maven-plugin:0.8.6:prepare-agent (default-prepare-agent) @ org.eclipse.papyrus.views.suite.tests ---
01:09:54 [INFO] tycho.testArgLine set to -javaagent:/home/jenkins/agent/workspace/Papyrus-Master-Tests-Releng/.repository/org/jacoco/org.jacoco.agent/0.8.6/org.jacoco.agent-0.8.6-runtime.jar=destfile=/home/jenkins/agent/workspace/Papyrus-Master-Tests-Releng/source/tests/junit/plugins/views/org.eclipse.papyrus.views.suite.tests/target/jacoco.exec,includes=org.eclipse.papyrus.*,excludes=org.eclipse.uml2
01:09:54 [INFO] 
01:09:54 [INFO] --- maven-resources-plugin:3.2.0:resources (default-resources) @ org.eclipse.papyrus.views.suite.tests ---
01:09:54 [INFO] Using 'UTF-8' encoding to copy filtered resources.
01:09:54 [INFO] Using 'UTF-8' encoding to copy filtered properties files.
01:09:54 [INFO] skip non existing resourceDirectory /home/jenkins/agent/workspace/Papyrus-Master-Tests-Releng/source/tests/junit/plugins/views/org.eclipse.papyrus.views.suite.tests/src/main/resources
01:09:54 [INFO] 
01:09:54 [INFO] --- tycho-compiler-plugin:2.2.0:compile (default-compile) @ org.eclipse.papyrus.views.suite.tests ---
01:09:54 [INFO] Compiling 2 source files to /home/jenkins/agent/workspace/Papyrus-Master-Tests-Releng/source/tests/junit/plugins/views/org.eclipse.papyrus.views.suite.tests/bin
01:09:54 [INFO] 
01:09:54 [INFO] --- maven-resources-plugin:3.2.0:testResources (default-testResources) @ org.eclipse.papyrus.views.suite.tests ---
01:09:54 [INFO] Using 'UTF-8' encoding to copy filtered resources.
01:09:54 [INFO] Using 'UTF-8' encoding to copy filtered properties files.
01:09:54 [INFO] skip non existing resourceDirectory /home/jenkins/agent/workspace/Papyrus-Master-Tests-Releng/source/tests/junit/plugins/views/org.eclipse.papyrus.views.suite.tests/src/test/resources
01:09:54 [INFO] 
01:09:54 [INFO] --- target-platform-configuration:2.2.0:target-platform (default-target-platform) @ org.eclipse.papyrus.views.suite.tests ---
01:09:54 [INFO] 
01:09:54 [INFO] --- tycho-packaging-plugin:2.2.0:package-plugin (default-package-plugin) @ org.eclipse.papyrus.views.suite.tests ---
01:09:54 [INFO] Building jar: /home/jenkins/agent/workspace/Papyrus-Master-Tests-Releng/source/tests/junit/plugins/views/org.eclipse.papyrus.views.suite.tests/target/org.eclipse.papyrus.views.suite.tests-1.1.0-SNAPSHOT.jar
01:09:54 [INFO] 
01:09:54 [INFO] --- tycho-p2-plugin:2.2.0:p2-metadata-default (default-p2-metadata-default) @ org.eclipse.papyrus.views.suite.tests ---
01:09:54 [INFO] 
01:09:54 [INFO] --- tycho-surefire-plugin:2.2.0:test (default-test) @ org.eclipse.papyrus.views.suite.tests ---
01:09:54 [INFO] Executing Test Runtime with timeout 0, logs (if any) will be placed at: /home/jenkins/agent/workspace/Papyrus-Master-Tests-Releng/source/tests/junit/plugins/views/org.eclipse.papyrus.views.suite.tests/target/work/data/.metadata/.log
01:09:56 [INFO] Command line:
01:09:56 	[/opt/tools/java/openjdk/jdk-11/11.0.2+9/bin/java, -Dosgi.noShutdown=false, -Dosgi.os=linux, -Dosgi.ws=gtk, -Dosgi.arch=x86_64, -javaagent:/home/jenkins/agent/workspace/Papyrus-Master-Tests-Releng/.repository/org/jacoco/org.jacoco.agent/0.8.6/org.jacoco.agent-0.8.6-runtime.jar=destfile=/home/jenkins/agent/workspace/Papyrus-Master-Tests-Releng/source/tests/junit/plugins/views/org.eclipse.papyrus.views.suite.tests/target/jacoco.exec,includes=org.eclipse.papyrus.*,excludes=org.eclipse.uml2, -Xms512m, -Xmx2048m, -XX:SoftRefLRUPolicyMSPerMB=100, -Dosgi.clean=true, -jar, /home/jenkins/agent/workspace/Papyrus-Master-Tests-Releng/.repository/p2/osgi/bundle/org.eclipse.equinox.launcher/1.6.100.v20201223-0822/org.eclipse.equinox.launcher-1.6.100.v20201223-0822.jar, -data, /home/jenkins/agent/workspace/Papyrus-Master-Tests-Releng/source/tests/junit/plugins/views/org.eclipse.papyrus.views.suite.tests/target/work/data, -install, /home/jenkins/agent/workspace/Papyrus-Master-Tests-Releng/source/tests/junit/plugins/views/org.eclipse.papyrus.views.suite.tests/target/work, -configuration, /home/jenkins/agent/workspace/Papyrus-Master-Tests-Releng/source/tests/junit/plugins/views/org.eclipse.papyrus.views.suite.tests/target/work/configuration, -application, org.eclipse.tycho.surefire.osgibooter.uitest, -testproperties, /home/jenkins/agent/workspace/Papyrus-Master-Tests-Releng/source/tests/junit/plugins/views/org.eclipse.papyrus.views.suite.tests/target/surefire.properties, -product, org.eclipse.sdk.ide, -testConfig=CI_TESTS_CONFIG]
01:09:56 Running org.eclipse.papyrus.views.suite.tests.AllTests
01:10:14 No JFaces support for org.eclipse.jface.viewers.TableTreeViewer
01:10:29 Tests run: 11, Failures: 0, Errors: 0, Skipped: 0, Time elapsed: 36.795 s - in org.eclipse.papyrus.views.suite.tests.AllTests
01:10:51 revealSemanticElement_rootTest(org.eclipse.papyrus.views.modelexplorer.tests.ModelExplorerViewTests)  Time elapsed: 18.12 s
01:10:51 deleteDiagramTest(org.eclipse.papyrus.views.modelexplorer.tests.DeleteHandlerTest)  Time elapsed: 5.181 s
01:10:51 deleteTableTest(org.eclipse.papyrus.views.modelexplorer.tests.DeleteHandlerTest)  Time elapsed: 3.516 s
01:10:51 deleteLinkItemTest(org.eclipse.papyrus.views.modelexplorer.tests.DeleteHandlerTest)  Time elapsed: 1.564 s
01:10:51 deleteRootOfTheModel(org.eclipse.papyrus.views.modelexplorer.tests.DeleteHandlerTest)  Time elapsed: 1.524 s
01:10:51 testOpendiagramTest(org.eclipse.papyrus.views.modelexplorer.tests.OpendiagramTest)  Time elapsed: 0.808 s
01:10:51 documentationViewTests(org.eclipse.papyrus.views.documentation.tests.DocumentationViewTests)  Time elapsed: 2.639 s
01:10:51 handleXWTFileFromResourceSet(org.eclipse.papyrus.views.properties.toolsmiths.tests.qvt.TransformationsTests)  Time elapsed: 1.3 s
01:10:51 handleXWTFileFromResource(org.eclipse.papyrus.views.properties.toolsmiths.tests.qvt.TransformationsTests)  Time elapsed: 0.257 s
01:10:51 generateEcoreContext(org.eclipse.papyrus.views.properties.toolsmiths.tests.qvt.TransformationsTests)  Time elapsed: 0.11 s
01:10:51 generateProfileContext(org.eclipse.papyrus.views.properties.toolsmiths.tests.qvt.TransformationsTests)  Time elapsed: 0.873 s
01:10:51 
01:10:51 Results:
01:10:51 
01:10:51 Tests run: 11, Failures: 0, Errors: 0, Skipped: 0
01:10:51 
01:10:51 [INFO] All tests passed!
01:10:54 [INFO] 
01:10:54 [INFO] --- jacoco-maven-plugin:0.8.6:report (default-report) @ org.eclipse.papyrus.views.suite.tests ---
01:10:54 [INFO] Loading execution data file /home/jenkins/agent/workspace/Papyrus-Master-Tests-Releng/source/tests/junit/plugins/views/org.eclipse.papyrus.views.suite.tests/target/jacoco.exec
01:10:54 [INFO] Analyzed bundle 'org.eclipse.papyrus.views.suite.tests' with 0 classes
01:10:54 [INFO] 
01:10:54 [INFO] --< org.eclipse.papyrus.tests:org.eclipse.papyrus.views.documentation.tests.releng >--
01:10:54 [INFO] Building org.eclipse.papyrus.views.documentation.tests.releng 0.0.1-SNAPSHOT [169/172]
01:10:54 [INFO] --------------------------------[ pom ]---------------------------------
01:10:54 [INFO] 
01:10:54 [INFO] --- maven-clean-plugin:3.1.0:clean (default-clean) @ org.eclipse.papyrus.views.documentation.tests.releng ---
01:10:54 [INFO] 
01:10:54 [INFO] --- jacoco-maven-plugin:0.8.6:prepare-agent (default-prepare-agent) @ org.eclipse.papyrus.views.documentation.tests.releng ---
01:10:54 [INFO] argLine set to -javaagent:/home/jenkins/agent/workspace/Papyrus-Master-Tests-Releng/.repository/org/jacoco/org.jacoco.agent/0.8.6/org.jacoco.agent-0.8.6-runtime.jar=destfile=/home/jenkins/agent/workspace/Papyrus-Master-Tests-Releng/source/tests/junit/plugins/views/documentation/target/jacoco.exec,includes=org.eclipse.papyrus.*,excludes=org.eclipse.uml2
01:10:54 [INFO] 
01:10:54 [INFO] --- jacoco-maven-plugin:0.8.6:report (default-report) @ org.eclipse.papyrus.views.documentation.tests.releng ---
01:10:54 [INFO] Skipping JaCoCo execution due to missing execution data file.
01:10:54 [INFO] 
01:10:54 [INFO] -----< org.eclipse.papyrus:org.eclipse.papyrus.tests.main.releng >------
01:10:54 [INFO] Building org.eclipse.papyrus.tests.main.releng 1.2.0-SNAPSHOT  [170/172]
01:10:54 [INFO] --------------------------------[ pom ]---------------------------------
01:10:54 [INFO] 
01:10:54 [INFO] --- maven-clean-plugin:3.1.0:clean (default-clean) @ org.eclipse.papyrus.tests.main.releng ---
01:10:54 [INFO] 
01:10:54 [INFO] --- jacoco-maven-plugin:0.8.6:prepare-agent (default-prepare-agent) @ org.eclipse.papyrus.tests.main.releng ---
01:10:54 [INFO] argLine set to -javaagent:/home/jenkins/agent/workspace/Papyrus-Master-Tests-Releng/.repository/org/jacoco/org.jacoco.agent/0.8.6/org.jacoco.agent-0.8.6-runtime.jar=destfile=/home/jenkins/agent/workspace/Papyrus-Master-Tests-Releng/source/releng/tests/main-tests/target/jacoco.exec,includes=org.eclipse.papyrus.*,excludes=org.eclipse.uml2
01:10:54 [INFO] 
01:10:54 [INFO] --- jacoco-maven-plugin:0.8.6:report (default-report) @ org.eclipse.papyrus.tests.main.releng ---
01:10:54 [INFO] Skipping JaCoCo execution due to missing execution data file.
01:10:54 [INFO] 
01:10:54 [INFO] --< org.eclipse.papyrus:org.eclipse.papyrus.main.tests.target.parent >--
01:10:54 [INFO] Building org.eclipse.papyrus.main.tests.target.parent 0.0.1-SNAPSHOT [171/172]
01:10:54 [INFO] --------------------------------[ pom ]---------------------------------
01:10:54 [INFO] 
01:10:54 [INFO] --- maven-clean-plugin:3.1.0:clean (default-clean) @ org.eclipse.papyrus.main.tests.target.parent ---
01:10:54 [INFO] 
01:10:54 [INFO] --- jacoco-maven-plugin:0.8.6:prepare-agent (default-prepare-agent) @ org.eclipse.papyrus.main.tests.target.parent ---
01:10:54 [INFO] argLine set to -javaagent:/home/jenkins/agent/workspace/Papyrus-Master-Tests-Releng/.repository/org/jacoco/org.jacoco.agent/0.8.6/org.jacoco.agent-0.8.6-runtime.jar=destfile=/home/jenkins/agent/workspace/Papyrus-Master-Tests-Releng/source/releng/tests/main-tests/targetPlatform/target/jacoco.exec,includes=org.eclipse.papyrus.*,excludes=org.eclipse.uml2
01:10:54 [INFO] 
01:10:54 [INFO] --- jacoco-maven-plugin:0.8.6:report (default-report) @ org.eclipse.papyrus.main.tests.target.parent ---
01:10:54 [INFO] Skipping JaCoCo execution due to missing execution data file.
01:10:54 [INFO] 
01:10:54 [INFO] --< org.eclipse.papyrus:org.eclipse.papyrus.main.tests.portable.target >--
01:10:54 [INFO] Building org.eclipse.papyrus.main.tests.portable.target 0.0.1-SNAPSHOT [172/172]
01:10:54 [INFO] ---------------------[ eclipse-target-definition ]----------------------
01:10:54 [INFO] 
01:10:54 [INFO] --- maven-clean-plugin:3.1.0:clean (default-clean) @ org.eclipse.papyrus.main.tests.portable.target ---
01:10:54 [INFO] 
01:10:54 [INFO] --- jacoco-maven-plugin:0.8.6:prepare-agent (default-prepare-agent) @ org.eclipse.papyrus.main.tests.portable.target ---
01:10:54 [INFO] argLine set to -javaagent:/home/jenkins/agent/workspace/Papyrus-Master-Tests-Releng/.repository/org/jacoco/org.jacoco.agent/0.8.6/org.jacoco.agent-0.8.6-runtime.jar=destfile=/home/jenkins/agent/workspace/Papyrus-Master-Tests-Releng/source/releng/tests/main-tests/targetPlatform/portable/target/jacoco.exec,includes=org.eclipse.papyrus.*,excludes=org.eclipse.uml2
01:10:54 [INFO] 
01:10:54 [INFO] --- tycho-packaging-plugin:2.2.0:package-target-definition (default-package-target-definition) @ org.eclipse.papyrus.main.tests.portable.target ---
01:10:54 [INFO] 
01:10:54 [INFO] --- jacoco-maven-plugin:0.8.6:report (default-report) @ org.eclipse.papyrus.main.tests.portable.target ---
01:10:54 [INFO] Skipping JaCoCo execution due to missing execution data file.
01:10:54 [INFO] ------------------------------------------------------------------------
01:10:54 [INFO] Reactor Summary:
01:10:54 [INFO] 
01:10:54 [INFO] org.eclipse.papyrus.tests.releng 0.0.1-SNAPSHOT .... SUCCESS [01:08 min]
01:10:54 [INFO] org.eclipse.papyrus.plugins.tests.releng 0.0.1-SNAPSHOT SUCCESS [  0.007 s]
01:10:54 [INFO] org.eclipse.papyrus.editor.tests.releng 0.0.1-SNAPSHOT SUCCESS [  0.010 s]
01:10:54 [INFO] org.eclipse.papyrus.editor.integration.tests 2.1.0-SNAPSHOT SUCCESS [ 15.790 s]
01:10:54 [INFO] org.eclipse.papyrus.emf.facet.tests 0.0.1-SNAPSHOT . SUCCESS [  0.007 s]
01:10:54 [INFO] org.eclipse.papyrus.emf.facet.architecture.tests 1.0.0-SNAPSHOT SUCCESS [ 18.730 s]
01:10:54 [INFO] org.eclipse.papyrus.infra.tests.releng 0.0.1-SNAPSHOT SUCCESS [  0.007 s]
01:10:54 [INFO] org.eclipse.papyrus.infra.core.tests.releng 0.0.1-SNAPSHOT SUCCESS [  0.013 s]
01:10:54 [INFO] org.eclipse.papyrus.infra.core.clipboard.tests 2.0.0-SNAPSHOT SUCCESS [  1.011 s]
01:10:54 [INFO] org.eclipse.papyrus.infra.core.sasheditor.tests 2.0.0-SNAPSHOT SUCCESS [  2.629 s]
01:10:54 [INFO] org.eclipse.papyrus.infra.core.sasheditor.di.tests 2.0.0-SNAPSHOT SUCCESS [  1.182 s]
01:10:54 [INFO] org.eclipse.papyrus.infra.core.tests 4.1.0-SNAPSHOT  SUCCESS [  2.625 s]
01:10:54 [INFO] org.eclipse.papyrus.infra.editor.tests.releng 0.0.1-SNAPSHOT SUCCESS [  0.008 s]
01:10:54 [INFO] org.eclipse.papyrus.infra.editor.welcome.tests 2.0.0-SNAPSHOT SUCCESS [  1.168 s]
01:10:54 [INFO] org.eclipse.papyrus.infra.emf.tests.releng 0.0.1-SNAPSHOT SUCCESS [  0.005 s]
01:10:54 [INFO] org.eclipse.papyrus.infra.emf.gmf.tests 2.0.0-SNAPSHOT SUCCESS [  0.481 s]
01:10:54 [INFO] org.eclipse.papyrus.infra.emf.readonly.tests 2.1.0-SNAPSHOT SUCCESS [  1.236 s]
01:10:54 [INFO] org.eclipse.papyrus.infra.emf.tests 2.1.0-SNAPSHOT . SUCCESS [  1.505 s]
01:10:54 [INFO] org.eclipse.papyrus.infra.filters.tests 2.0.0-SNAPSHOT SUCCESS [  0.505 s]
01:10:54 [INFO] org.eclipse.papyrus.infra.gmfdiag.tests.releng 0.0.1-SNAPSHOT SUCCESS [  0.006 s]
01:10:54 [INFO] org.eclipse.papyrus.infra.gmfdiag.assistant.tests.releng 0.0.1-SNAPSHOT SUCCESS [  0.053 s]
01:10:54 [INFO] org.eclipse.papyrus.infra.gmfdiag.assistant.tests 2.1.0-SNAPSHOT SUCCESS [  1.275 s]
01:10:54 [INFO] org.eclipse.papyrus.infra.gmfdiag.canonical.tests 2.1.0-SNAPSHOT SUCCESS [  1.438 s]
01:10:54 [INFO] org.eclipse.papyrus.infra.gmfdiag.commands.tests 2.1.0-SNAPSHOT SUCCESS [  1.312 s]
01:10:54 [INFO] org.eclipse.papyrus.infra.gmfdiag.common.tests 4.1.0-SNAPSHOT SUCCESS [  1.492 s]
01:10:54 [INFO] org.eclipse.papyrus.infra.gmfdiag.css.tests 2.0.0-SNAPSHOT SUCCESS [  1.214 s]
01:10:54 [INFO] org.eclipse.papyrus.infra.gmfdiag.menu.tests 2.0.0-SNAPSHOT SUCCESS [  0.896 s]
01:10:54 [INFO] org.eclipse.papyrus.infra.gmfdiag.paletteconfiguration.tests 2.1.0-SNAPSHOT SUCCESS [  0.994 s]
01:10:54 [INFO] org.eclipse.papyrus.infra.gmfdiag.welcome.tests 2.0.0-SNAPSHOT SUCCESS [  1.125 s]
01:10:54 [INFO] org.eclipse.papyrus.infra.nattable.main.test 1.2.0-SNAPSHOT SUCCESS [  0.051 s]
01:10:54 [INFO] org.eclipse.papyrus.infra.nattable.common.tests 2.0.0-SNAPSHOT SUCCESS [  0.918 s]
01:10:54 [INFO] org.eclipse.papyrus.infra.nattable.model.tests 2.0.0-SNAPSHOT SUCCESS [  0.405 s]
01:10:54 [INFO] org.eclipse.papyrus.infra.nattable.tests 2.0.0-SNAPSHOT SUCCESS [  0.881 s]
01:10:54 [INFO] org.eclipse.papyrus.infra.nattable.views.tests 2.0.100-SNAPSHOT SUCCESS [  1.197 s]
01:10:54 [INFO] org.eclipse.papyrus.infra.properties.tests.releng 0.0.1-SNAPSHOT SUCCESS [  0.005 s]
01:10:54 [INFO] org.eclipse.papyrus.infra.properties.ui.tests 3.0.0-SNAPSHOT SUCCESS [  0.896 s]
01:10:54 [INFO] org.eclipse.papyrus.infra.services.tests.releng 0.0.1-SNAPSHOT SUCCESS [  0.009 s]
01:10:54 [INFO] org.eclipse.papyrus.infra.services.controlmode.tests 2.1.0-SNAPSHOT SUCCESS [  1.290 s]
01:10:54 [INFO] org.eclipse.papyrus.infra.services.edit.tests 2.0.0-SNAPSHOT SUCCESS [  1.010 s]
01:10:54 [INFO] org.eclipse.papyrus.infra.services.edit.ui.tests 2.0.0-SNAPSHOT SUCCESS [  0.727 s]
01:10:54 [INFO] org.eclipse.papyrus.infra.services.resourceloading.tests 2.0.0-SNAPSHOT SUCCESS [  0.985 s]
01:10:54 [INFO] org.eclipse.papyrus.infra.services.semantic.tests 2.0.0-SNAPSHOT SUCCESS [  0.630 s]
01:10:54 [INFO] org.eclipse.papyrus.infra.tools.tests 2.1.0-SNAPSHOT SUCCESS [  1.549 s]
01:10:54 [INFO] org.eclipse.papyrus.infra.types.tests.releng 0.0.1-SNAPSHOT SUCCESS [  0.005 s]
01:10:54 [INFO] org.eclipse.papyrus.infra.types.tests 4.0.0-SNAPSHOT SUCCESS [  0.997 s]
01:10:54 [INFO] org.eclipse.papyrus.infra.types.ui.tests 4.0.0-SNAPSHOT SUCCESS [  0.713 s]
01:10:54 [INFO] org.eclipse.papyrus.infra.ui.emf.tests 2.1.0-SNAPSHOT SUCCESS [  0.904 s]
01:10:54 [INFO] org.eclipse.papyrus.infra.ui.tests 2.0.0-SNAPSHOT .. SUCCESS [  1.100 s]
01:10:54 [INFO] org.eclipse.papyrus.infra.viewpoints.tests.releng 0.0.1-SNAPSHOT SUCCESS [  0.006 s]
01:10:54 [INFO] org.eclipse.papyrus.infra.viewpoints.policy.tests 2.0.0-SNAPSHOT SUCCESS [  0.724 s]
01:10:54 [INFO] org.eclipse.papyrus.tests.emf.facet.feature 1.0.0-SNAPSHOT SUCCESS [  0.313 s]
01:10:54 [INFO] org.eclipse.papyrus.uml.tests.releng 0.0.1-SNAPSHOT  SUCCESS [  0.007 s]
01:10:54 [INFO] org.eclipse.papyrus.uml.diagram.tests.releng 1.2.0-SNAPSHOT SUCCESS [  0.028 s]
01:10:54 [INFO] org.eclipse.papyrus.uml.diagram.tests 2.0.0-SNAPSHOT SUCCESS [  2.231 s]
01:10:54 [INFO] org.eclipse.papyrus.uml.diagram.clazz.tests 2.0.0-SNAPSHOT SUCCESS [  1.577 s]
01:10:54 [INFO] org.eclipse.papyrus.uml.diagram.activity.tests 2.0.0-SNAPSHOT SUCCESS [  1.801 s]
01:10:54 [INFO] org.eclipse.papyrus.uml.diagram.usecase.tests 5.0.0-SNAPSHOT SUCCESS [  1.029 s]
01:10:54 [INFO] org.eclipse.papyrus.uml.diagram.deployment.tests 2.0.0-SNAPSHOT SUCCESS [  1.201 s]
01:10:54 [INFO] org.eclipse.papyrus.uml.diagram.component.tests 2.0.0-SNAPSHOT SUCCESS [  1.175 s]
01:10:54 [INFO] org.eclipse.papyrus.uml.diagram.timing.tests 2.0.0-SNAPSHOT SUCCESS [  1.185 s]
01:10:54 [INFO] org.eclipse.papyrus.uml.diagram.sequence.tests 2.0.0-SNAPSHOT SUCCESS [  2.315 s]
01:10:54 [INFO] org.eclipse.papyrus.uml.diagram.composite.tests 2.0.0-SNAPSHOT SUCCESS [  1.138 s]
01:10:54 [INFO] org.eclipse.papyrus.uml.diagram.profile.tests 2.0.0-SNAPSHOT SUCCESS [  1.055 s]
01:10:54 [INFO] org.eclipse.papyrus.uml.dynamic.profile.tests 2.0.0-SNAPSHOT SUCCESS [  0.300 s]
01:10:54 [INFO] org.eclipse.papyrus.uml.diagram.common.tests 2.0.0-SNAPSHOT SUCCESS [  1.408 s]
01:10:54 [INFO] org.eclipse.papyrus.uml.diagram.wizards.tests 2.1.0-SNAPSHOT SUCCESS [  1.119 s]
01:10:54 [INFO] org.eclipse.papyrus.tests.uml.diagram.feature 1.2.0-SNAPSHOT SUCCESS [  0.475 s]
01:10:54 [INFO] org.eclipse.papyrus.tests.infra.services.feature 1.2.0-SNAPSHOT SUCCESS [  0.152 s]
01:10:54 [INFO] org.eclipse.papyrus.views.tests.releng 0.0.1-SNAPSHOT SUCCESS [  0.005 s]
01:10:54 [INFO] org.eclipse.papyrus.views.modelexplorer.tests 2.0.0-SNAPSHOT SUCCESS [  0.742 s]
01:10:54 [INFO] org.eclipse.papyrus.uml.modelexplorer.tests.releng 0.0.1-SNAPSHOT SUCCESS [  0.005 s]
01:10:54 [INFO] org.eclipse.papyrus.uml.modelexplorer.tests 2.0.0-SNAPSHOT SUCCESS [  1.223 s]
01:10:54 [INFO] org.eclipse.papyrus.uml.modelrepair.tests 2.1.0-SNAPSHOT SUCCESS [  1.490 s]
01:10:54 [INFO] org.eclipse.papyrus.uml.properties.tests 2.1.0-SNAPSHOT SUCCESS [  1.178 s]
01:10:54 [INFO] org.eclipse.papyrus.uml.service.types.tests 2.1.0-SNAPSHOT SUCCESS [  1.309 s]
01:10:54 [INFO] org.eclipse.papyrus.uml.service.types.ui.tests 2.0.0-SNAPSHOT SUCCESS [  0.926 s]
01:10:54 [INFO] org.eclipse.papyrus.uml.profile.tests.releng 0.0.1-SNAPSHOT SUCCESS [  0.007 s]
01:10:54 [INFO] org.eclipse.papyrus.uml.profile.drafter.tests 2.1.0-SNAPSHOT SUCCESS [  1.292 s]
01:10:54 [INFO] org.eclipse.papyrus.uml.filters.tests 2.0.0-SNAPSHOT SUCCESS [  0.903 s]
01:10:54 [INFO] org.eclipse.papyrus.uml.profile.tests 2.0.0-SNAPSHOT SUCCESS [  0.670 s]
01:10:54 [INFO] org.eclipse.papyrus.tests.uml.feature 1.2.0-SNAPSHOT SUCCESS [  0.324 s]
01:10:54 [INFO] org.eclipse.papyrus.views.documentation.tests 2.0.0-SNAPSHOT SUCCESS [  0.771 s]
01:10:54 [INFO] org.eclipse.papyrus.tests.views.feature 1.2.0-SNAPSHOT SUCCESS [  0.115 s]
01:10:54 [INFO] org.eclipse.papyrus.tests.infra.nattable.feature 1.4.0-SNAPSHOT SUCCESS [  0.186 s]
01:10:54 [INFO] org.eclipse.papyrus.uml.nattable.main.test 1.2.0-SNAPSHOT SUCCESS [  0.005 s]
01:10:54 [INFO] org.eclipse.papyrus.uml.nattable.tests 2.0.0-SNAPSHOT SUCCESS [  0.925 s]
01:10:54 [INFO] org.eclipse.papyrus.uml.nattable.generic.tests 2.0.0-SNAPSHOT SUCCESS [  1.464 s]
01:10:54 [INFO] org.eclipse.papyrus.uml.nattable.clazz.config.tests 2.0.0-SNAPSHOT SUCCESS [  2.148 s]
01:10:54 [INFO] org.eclipse.papyrus.uml.nattable.stereotyped.elements.tests 2.0.0-SNAPSHOT SUCCESS [  1.361 s]
01:10:54 [INFO] org.eclipse.papyrus.uml.nattable.matrix.tests 2.0.0-SNAPSHOT SUCCESS [  1.094 s]
01:10:54 [INFO] org.eclipse.papyrus.tests.uml.nattable.feature 1.3.0-SNAPSHOT SUCCESS [  2.156 s]
01:10:54 [INFO] org.eclipse.papyrus.tests.infra.feature 1.2.0-SNAPSHOT SUCCESS [  0.338 s]
01:10:54 [INFO] org.eclipse.papyrus.tests.infra.core.feature 1.2.0-SNAPSHOT SUCCESS [  0.072 s]
01:10:54 [INFO] org.eclipse.papyrus.uml.tools.tests.releng 0.0.1-SNAPSHOT SUCCESS [  0.005 s]
01:10:54 [INFO] org.eclipse.papyrus.uml.tools.tests 4.1.0-SNAPSHOT . SUCCESS [  1.136 s]
01:10:54 [INFO] org.eclipse.papyrus.uml.tools.utils.tests 2.0.0-SNAPSHOT SUCCESS [  0.931 s]
01:10:54 [INFO] org.eclipse.papyrus.tests.uml.tools.feature 1.2.0-SNAPSHOT SUCCESS [  0.154 s]
01:10:54 [INFO] org.eclipse.papyrus.uml.decoratormodel.tests.releng 0.0.1-SNAPSHOT SUCCESS [  0.004 s]
01:10:54 [INFO] org.eclipse.papyrus.uml.decoratormodel.controlmode.tests 2.1.0-SNAPSHOT SUCCESS [  0.965 s]
01:10:54 [INFO] org.eclipse.papyrus.uml.decoratormodel.tests 2.1.0-SNAPSHOT SUCCESS [  1.339 s]
01:10:54 [INFO] org.eclipse.papyrus.tests.uml.decoratormodel.feature 1.2.0-SNAPSHOT SUCCESS [  0.131 s]
01:10:54 [INFO] org.eclipse.papyrus.uml.textedit.tests.releng 0.0.1-SNAPSHOT SUCCESS [  0.005 s]
01:10:54 [INFO] org.eclipse.papyrus.uml.textedit.parameter.tests 2.0.0-SNAPSHOT SUCCESS [  1.117 s]
01:10:54 [INFO] org.eclipse.papyrus.uml.textedit.port.tests 2.0.0-SNAPSHOT SUCCESS [  0.777 s]
01:10:54 [INFO] org.eclipse.papyrus.uml.textedit.property.tests 2.0.0-SNAPSHOT SUCCESS [  0.890 s]
01:10:54 [INFO] org.eclipse.papyrus.uml.textedit.tests 2.0.0-SNAPSHOT SUCCESS [  0.683 s]
01:10:54 [INFO] org.eclipse.papyrus.uml.textedit.tests.feature 1.2.0-SNAPSHOT SUCCESS [  0.189 s]
01:10:54 [INFO] org.eclipse.papyrus.uml.assistants.tests.releng 0.0.1-SNAPSHOT SUCCESS [  0.006 s]
01:10:54 [INFO] org.eclipse.papyrus.uml.profile.types.generator.tests 2.0.0-SNAPSHOT SUCCESS [  1.027 s]
01:10:54 [INFO] org.eclipse.papyrus.uml.profile.assistants.generator.tests 2.0.0-SNAPSHOT SUCCESS [  1.004 s]
01:10:54 [INFO] org.eclipse.papyrus.tests.uml.assistants.feature 1.2.0-SNAPSHOT SUCCESS [  0.207 s]
01:10:54 [INFO] org.eclipse.papyrus.toolsmiths.tests.releng 0.0.1-SNAPSHOT SUCCESS [  0.005 s]
01:10:54 [INFO] org.eclipse.papyrus.toolsmiths.profilemigration.tests 1.0.0-SNAPSHOT SUCCESS [  0.885 s]
01:10:54 [INFO] org.eclipse.papyrus.toolsmiths.validation.profile.tests 2.0.0-SNAPSHOT SUCCESS [  0.671 s]
01:10:54 [INFO] org.eclipse.papyrus.toolsmiths.validation.common.tests 2.0.0-SNAPSHOT SUCCESS [  1.107 s]
01:10:54 [INFO] org.eclipse.papyrus.toolsmiths.validation.elementtypes.tests 2.0.0-SNAPSHOT SUCCESS [  1.133 s]
01:10:54 [INFO] org.eclipse.papyrus.toolsmiths.validation.architecture.tests 2.0.0-SNAPSHOT SUCCESS [  0.994 s]
01:10:54 [INFO] org.eclipse.papyrus.tests.toolsmiths.feature 1.0.0-SNAPSHOT SUCCESS [  0.281 s]
01:10:54 [INFO] org.eclipse.papyrus.tests.feature 2.0.0-SNAPSHOT ... SUCCESS [  1.037 s]
01:10:54 [INFO] org.eclipse.papyrus.infra.emf.expressions.main.tests 0.0.1-SNAPSHOT SUCCESS [  0.004 s]
01:10:54 [INFO] org.eclipse.papyrus.infra.emf.expressions.tests 2.0.0-SNAPSHOT SUCCESS [  0.460 s]
01:10:54 [INFO] org.eclipse.papyrus.tests.infra.emf.expressions.feature 1.0.0-SNAPSHOT SUCCESS [  0.078 s]
01:10:54 [INFO] org.eclipse.papyrus.infra.internationalization.main.test 1.0.0-SNAPSHOT SUCCESS [  0.005 s]
01:10:54 [INFO] org.eclipse.papyrus.infra.internationalization.tests 2.0.0-SNAPSHOT SUCCESS [  0.633 s]
01:10:54 [INFO] org.eclipse.papyrus.tests.infra.internationalization.feature 1.0.0-SNAPSHOT SUCCESS [  0.112 s]
01:10:54 [INFO] org.eclipse.papyrus.uml.expressions.tests.releng 0.0.1-SNAPSHOT SUCCESS [  0.049 s]
01:10:54 [INFO] org.eclipse.papyrus.uml.expressions.tests 2.0.0-SNAPSHOT SUCCESS [  0.832 s]
01:10:54 [INFO] org.eclipse.papyrus.tests.uml.expressions.feature 1.0.0-SNAPSHOT SUCCESS [  0.114 s]
01:10:54 [INFO] org.eclipse.papyrus.uml.internationalization.main.test 1.0.0-SNAPSHOT SUCCESS [  0.004 s]
01:10:54 [INFO] org.eclipse.papyrus.uml.internationalization.tests 2.0.0-SNAPSHOT SUCCESS [  0.761 s]
01:10:54 [INFO] org.eclipse.papyrus.uml.internationalization.controlmode.tests 2.1.0-SNAPSHOT SUCCESS [  0.711 s]
01:10:54 [INFO] org.eclipse.papyrus.tests.uml.internationalization.feature 1.0.0-SNAPSHOT SUCCESS [  0.114 s]
01:10:54 [INFO] org.eclipse.papyrus.uml.alf.tests 2.0.0-SNAPSHOT ... SUCCESS [ 45.395 s]
01:10:54 [INFO] org.eclipse.papyrus.uml.alf.tests.feature 1.2.0-SNAPSHOT SUCCESS [  0.293 s]
01:10:54 [INFO] Papyrus Tests Features 0.0.1-SNAPSHOT .............. SUCCESS [  0.005 s]
01:10:54 [INFO] org.eclipse.papyrus.developer.suite.tests 1.0.0-SNAPSHOT SUCCESS [ 28.602 s]
01:10:54 [INFO] org.eclipse.papyrus.bundles.tests 0.0.1-SNAPSHOT ... SUCCESS [  0.005 s]
01:10:54 [INFO] org.eclipse.papyrus.eclipse.project.editors.tests 3.1.0-SNAPSHOT SUCCESS [  1.676 s]
01:10:54 [INFO] org.eclipse.papyrus.editors.suite.tests 1.1.0-SNAPSHOT SUCCESS [09:16 min]
01:10:54 [INFO] org.eclipse.papyrus.infra.core.suite.tests 1.1.0-SNAPSHOT SUCCESS [02:25 min]
01:10:54 [INFO] org.eclipse.papyrus.infra.nattable.suite.tests 1.1.0-SNAPSHOT SUCCESS [01:19 min]
01:10:54 [INFO] org.eclipse.papyrus.infra.architecture.tests 2.0.0-SNAPSHOT SUCCESS [  0.424 s]
01:10:54 [INFO] org.eclipse.papyrus.infra.services.labelprovider.tests 2.0.0-SNAPSHOT SUCCESS [  0.597 s]
01:10:54 [INFO] org.eclipse.papyrus.infra.ui.architecture.tests 2.0.0-SNAPSHOT SUCCESS [  0.955 s]
01:10:54 [INFO] org.eclipse.papyrus.infra.suite.tests 1.1.0-SNAPSHOT SUCCESS [06:44 min]
01:10:54 [INFO] org.eclipse.papyrus.infra.newchild.tests 2.0.0-SNAPSHOT SUCCESS [  0.399 s]
01:10:54 [INFO] org.eclipse.papyrus.toolsmiths.suite.tests 1.1.0-SNAPSHOT SUCCESS [ 26.962 s]
01:10:54 [INFO] org.eclipse.papyrus.uml.diagram.communication.tests 2.0.0-SNAPSHOT SUCCESS [  0.702 s]
01:10:54 [INFO] org.eclipse.papyrus.uml.diagram.interactionoverview.tests 2.0.0-SNAPSHOT SUCCESS [  1.182 s]
01:10:54 [INFO] org.eclipse.papyrus.uml.diagram.statemachine.tests 2.0.0-SNAPSHOT SUCCESS [  1.053 s]
01:10:54 [INFO] org.eclipse.papyrus.uml.diagram.suite.tests 1.1.0-SNAPSHOT SUCCESS [14:03 min]
01:10:54 [INFO] org.eclipse.papyrus.uml.diagram.stereotypeproperty.tests 2.0.0-SNAPSHOT SUCCESS [  1.074 s]
01:10:54 [INFO] org.eclipse.papyrus.uml.diagram.dnd.tests 2.0.0-SNAPSHOT SUCCESS [  1.129 s]
01:10:54 [INFO] org.eclipse.papyrus.uml.diagram.properties.tests 2.0.0-SNAPSHOT SUCCESS [  0.867 s]
01:10:54 [INFO] org.eclipse.papyrus.uml.nattable.stereotype.display.tests 2.0.0-SNAPSHOT SUCCESS [  0.729 s]
01:10:54 [INFO] org.eclipse.papyrus.uml.nattable.suite.tests 1.1.0-SNAPSHOT SUCCESS [10:38 min]
01:10:54 [INFO] org.eclipse.papyrus.uml.textedit.valuespecification.tests 2.0.0-SNAPSHOT SUCCESS [  1.127 s]
01:10:54 [INFO] org.eclipse.papyrus.uml.textedit.suite.tests 1.1.0-SNAPSHOT SUCCESS [ 36.255 s]
01:10:54 [INFO] org.eclipse.papyrus.uml.architecture.tests 2.0.0-SNAPSHOT SUCCESS [  0.259 s]
01:10:54 [INFO] org.eclipse.papyrus.uml.validation.tests.releng 0.0.1-SNAPSHOT SUCCESS [  0.005 s]
01:10:54 [INFO] org.eclipse.papyrus.uml.validation.tests.staticprofile 2.0.0-SNAPSHOT SUCCESS [  0.484 s]
01:10:54 [INFO] org.eclipse.papyrus.uml.validation.tests.genvalidation 2.0.0-SNAPSHOT SUCCESS [  0.655 s]
01:10:54 [INFO] org.eclipse.papyrus.uml.validation.tests 2.0.0-SNAPSHOT SUCCESS [  0.941 s]
01:10:54 [INFO] org.eclipse.papyrus.uml.suite.tests 1.1.0-SNAPSHOT . SUCCESS [07:46 min]
01:10:54 [INFO] org.eclipse.papyrus.uml.alf.tests.releng 0.0.1-SNAPSHOT SUCCESS [  0.006 s]
01:10:54 [INFO] org.eclipse.papyrus.uml.alf.backend.tests 2.0.0-SNAPSHOT SUCCESS [  1.538 s]
01:10:54 [INFO] org.eclipse.papyrus.views.properties.toolsmiths.tests 2.0.0-SNAPSHOT SUCCESS [  0.823 s]
01:10:54 [INFO] org.eclipse.papyrus.views.suite.tests 1.1.0-SNAPSHOT SUCCESS [01:00 min]
01:10:54 [INFO] org.eclipse.papyrus.views.documentation.tests.releng 0.0.1-SNAPSHOT SUCCESS [  0.006 s]
01:10:54 [INFO] org.eclipse.papyrus.tests.main.releng 1.2.0-SNAPSHOT SUCCESS [  0.004 s]
01:10:54 [INFO] org.eclipse.papyrus.main.tests.target.parent 0.0.1-SNAPSHOT SUCCESS [  0.004 s]
01:10:54 [INFO] org.eclipse.papyrus.main.tests.portable.target 0.0.1-SNAPSHOT SUCCESS [  0.007 s]
01:10:54 [INFO] ------------------------------------------------------------------------
01:10:54 [INFO] BUILD SUCCESS
01:10:54 [INFO] ------------------------------------------------------------------------
01:10:54 [INFO] Total time:  01:08 h
01:10:54 [INFO] Finished at: 2021-03-25T05:10:54Z
01:10:54 [INFO] ------------------------------------------------------------------------
01:10:54 Taking screenshot.
01:10:56 [Papyrus-Master-Tests-Releng] $ echo $XAUTHORITY
01:10:56 /home/jenkins/agent/workspace/Papyrus-Master-Tests-Releng/.Xauthority-2432383089698387345
01:10:56 [Papyrus-Master-Tests-Releng] $ ls -l $XAUTHORITY
01:10:56 -rw-r--r--. 1 jenkins 1000800000 0 Mar 25 04:02 /home/jenkins/agent/workspace/Papyrus-Master-Tests-Releng/.Xauthority-2432383089698387345
01:10:56 [Papyrus-Master-Tests-Releng] $ import -window root -display :15 screenshot.jpg
01:10:56 Terminating xvnc.
01:10:56 Sending e-mails to: quentin.lemenez@cea.fr
01:11:04 Recording test results
01:11:04 [Checks API] No suitable checks publisher found.
01:11:08 Build step 'Publish JUnit test result report' changed build result to UNSTABLE
01:11:08 Finished: UNSTABLE