UnstableConsole Output

Skipping 2,810 KB.. Full Log
rs.Suite.runChild(Suite.java:128)
13:19:29 	at org.junit.runners.Suite.runChild(Suite.java:27)
13:19:29 	at org.junit.runners.ParentRunner$4.run(ParentRunner.java:331)
13:19:29 	at org.junit.runners.ParentRunner$1.schedule(ParentRunner.java:79)
13:19:29 	at org.junit.runners.ParentRunner.runChildren(ParentRunner.java:329)
13:19:29 	at org.junit.runners.ParentRunner.access$100(ParentRunner.java:66)
13:19:29 	at org.junit.runners.ParentRunner$2.evaluate(ParentRunner.java:293)
13:19:29 	at org.junit.runners.ParentRunner$3.evaluate(ParentRunner.java:306)
13:19:29 	at org.junit.runners.ParentRunner.run(ParentRunner.java:413)
13:19:29 	at org.eclipse.papyrus.junit.framework.classification.ClassificationSuite.run(ClassificationSuite.java:130)
13:19:29 	at org.junit.runners.Suite.runChild(Suite.java:128)
13:19:29 	at org.junit.runners.Suite.runChild(Suite.java:27)
13:19:29 	at org.junit.runners.ParentRunner$4.run(ParentRunner.java:331)
13:19:29 	at org.junit.runners.ParentRunner$1.schedule(ParentRunner.java:79)
13:19:29 	at org.junit.runners.ParentRunner.runChildren(ParentRunner.java:329)
13:19:29 	at org.junit.runners.ParentRunner.access$100(ParentRunner.java:66)
13:19:29 	at org.junit.runners.ParentRunner$2.evaluate(ParentRunner.java:293)
13:19:29 	at org.junit.runners.ParentRunner$3.evaluate(ParentRunner.java:306)
13:19:29 	at org.junit.runners.ParentRunner.run(ParentRunner.java:413)
13:19:29 	at org.apache.maven.surefire.junit4.JUnit4Provider.execute(JUnit4Provider.java:365)
13:19:29 	at org.apache.maven.surefire.junit4.JUnit4Provider.executeWithRerun(JUnit4Provider.java:273)
13:19:29 	at org.apache.maven.surefire.junit4.JUnit4Provider.executeTestSet(JUnit4Provider.java:238)
13:19:29 	at org.apache.maven.surefire.junit4.JUnit4Provider.invoke(JUnit4Provider.java:159)
13:19:29 	at sun.reflect.NativeMethodAccessorImpl.invoke0(Native Method)
13:19:29 	at sun.reflect.NativeMethodAccessorImpl.invoke(NativeMethodAccessorImpl.java:62)
13:19:29 	at sun.reflect.DelegatingMethodAccessorImpl.invoke(DelegatingMethodAccessorImpl.java:43)
13:19:29 	at java.lang.reflect.Method.invoke(Method.java:498)
13:19:29 	at org.apache.maven.surefire.util.ReflectionUtils.invokeMethodWithArray2(ReflectionUtils.java:206)
13:19:29 	at org.apache.maven.surefire.booter.ProviderFactory$ProviderProxy.invoke(ProviderFactory.java:161)
13:19:29 	at org.apache.maven.surefire.booter.ProviderFactory.invokeProvider(ProviderFactory.java:84)
13:19:29 	at org.eclipse.tycho.surefire.osgibooter.OsgiSurefireBooter.run(OsgiSurefireBooter.java:110)
13:19:29 	at org.eclipse.tycho.surefire.osgibooter.AbstractUITestApplication$1.run(AbstractUITestApplication.java:35)
13:19:29 	at org.eclipse.swt.widgets.RunnableLock.run(RunnableLock.java:40)
13:19:29 	at org.eclipse.swt.widgets.Synchronizer.runAsyncMessages(Synchronizer.java:185)
13:19:29 	at org.eclipse.swt.widgets.Display.runAsyncMessages(Display.java:4930)
13:19:29 	at org.eclipse.swt.widgets.Display.readAndDispatch(Display.java:4451)
13:19:29 	at org.eclipse.e4.ui.internal.workbench.swt.PartRenderingEngine$5.run(PartRenderingEngine.java:1160)
13:19:29 	at org.eclipse.core.databinding.observable.Realm.runWithDefault(Realm.java:338)
13:19:29 	at org.eclipse.e4.ui.internal.workbench.swt.PartRenderingEngine.run(PartRenderingEngine.java:1049)
13:19:29 	at org.eclipse.e4.ui.internal.workbench.E4Workbench.createAndRunUI(E4Workbench.java:155)
13:19:29 	at org.eclipse.ui.internal.Workbench.lambda$3(Workbench.java:658)
13:19:29 	at org.eclipse.core.databinding.observable.Realm.runWithDefault(Realm.java:338)
13:19:29 	at org.eclipse.ui.internal.Workbench.createAndRunWorkbench(Workbench.java:557)
13:19:29 	at org.eclipse.ui.PlatformUI.createAndRunWorkbench(PlatformUI.java:154)
13:19:29 	at org.eclipse.ui.internal.ide.application.IDEApplication.start(IDEApplication.java:150)
13:19:29 	at org.eclipse.tycho.surefire.osgibooter.UITestApplication.runApplication(UITestApplication.java:31)
13:19:29 	at org.eclipse.tycho.surefire.osgibooter.AbstractUITestApplication.run(AbstractUITestApplication.java:120)
13:19:29 	at org.eclipse.tycho.surefire.osgibooter.UITestApplication.start(UITestApplication.java:37)
13:19:29 	at org.eclipse.equinox.internal.app.EclipseAppHandle.run(EclipseAppHandle.java:203)
13:19:29 	at org.eclipse.core.runtime.internal.adaptor.EclipseAppLauncher.runApplication(EclipseAppLauncher.java:137)
13:19:29 	at org.eclipse.core.runtime.internal.adaptor.EclipseAppLauncher.start(EclipseAppLauncher.java:107)
13:19:29 	at org.eclipse.core.runtime.adaptor.EclipseStarter.run(EclipseStarter.java:401)
13:19:29 	at org.eclipse.core.runtime.adaptor.EclipseStarter.run(EclipseStarter.java:255)
13:19:29 	at sun.reflect.NativeMethodAccessorImpl.invoke0(Native Method)
13:19:29 	at sun.reflect.NativeMethodAccessorImpl.invoke(NativeMethodAccessorImpl.java:62)
13:19:29 	at sun.reflect.DelegatingMethodAccessorImpl.invoke(DelegatingMethodAccessorImpl.java:43)
13:19:29 	at java.lang.reflect.Method.invoke(Method.java:498)
13:19:29 	at org.eclipse.equinox.launcher.Main.invokeFramework(Main.java:657)
13:19:29 	at org.eclipse.equinox.launcher.Main.basicRun(Main.java:594)
13:19:29 	at org.eclipse.equinox.launcher.Main.run(Main.java:1447)
13:19:29 	at org.eclipse.equinox.launcher.Main.main(Main.java:1420)
13:21:50 log4j:WARN No appenders could be found for logger (org.eclipse.ocl.pivot.internal.resource.StandaloneProjectMap).
13:21:50 log4j:WARN Please initialize the log4j system properly.
13:23:28 Tests run: 658, Failures: 1, Errors: 2, Skipped: 38, Time elapsed: 319.854 s <<< FAILURE! - in org.eclipse.papyrus.uml.suite.tests.AllTests
13:23:28 testUML(org.eclipse.papyrus.uml.service.types.tests.creation.CreatePureUMLElementTest)  Time elapsed: 0.086 s
13:23:28 test(org.eclipse.papyrus.uml.service.types.tests.creation.CreatePureUMLElementTest)  Time elapsed: 0.478 s
13:23:28 testDeleteOneAddVariableValueAction(org.eclipse.papyrus.uml.service.types.tests.deletion.DeletePureUMLElementTest)  Time elapsed: 0.106 s
13:23:28 testDeleteOneCentralBufferNode(org.eclipse.papyrus.uml.service.types.tests.deletion.DeletePureUMLElementTest)  Time elapsed: 0.023 s
13:23:28 stereotypeApplicationsDeleted:command(org.eclipse.papyrus.uml.service.types.tests.deletion.DeleteDependentWithStereotypeApplications458685)  Time elapsed: 1.365 s
13:23:28 stereotypeApplicationsDeleted:elements(org.eclipse.papyrus.uml.service.types.tests.deletion.DeleteDependentWithStereotypeApplications458685)  Time elapsed: 0 s
13:23:28 stereotypeApplicationsDeleted:stereotypes(org.eclipse.papyrus.uml.service.types.tests.deletion.DeleteDependentWithStereotypeApplications458685)  Time elapsed: 0 s
13:23:28 stereotypeApplicationsDeleted:undo(org.eclipse.papyrus.uml.service.types.tests.deletion.DeleteDependentWithStereotypeApplications458685)  Time elapsed: 0 s
13:23:28 stereotypeApplicationsDeleted:redo(org.eclipse.papyrus.uml.service.types.tests.deletion.DeleteDependentWithStereotypeApplications458685)  Time elapsed: 0 s
13:23:28 deleteInitialState(org.eclipse.papyrus.uml.service.types.tests.deletion.DeleteTransitionsWithVertexTest)  Time elapsed: 0.538 s
13:23:28 deleteS1(org.eclipse.papyrus.uml.service.types.tests.deletion.DeleteTransitionsWithVertexTest)  Time elapsed: 0.183 s
13:23:28 deleteS2(org.eclipse.papyrus.uml.service.types.tests.deletion.DeleteTransitionsWithVertexTest)  Time elapsed: 0.256 s
13:23:28 deleteFinalState(org.eclipse.papyrus.uml.service.types.tests.deletion.DeleteTransitionsWithVertexTest)  Time elapsed: 0.163 s
13:23:28 deleteFromContainmentSubset(org.eclipse.papyrus.uml.service.types.tests.deletion.DeleteContainmentSubsetTest)  Time elapsed: 0.123 s
13:23:28 deleteFromTwoContainmentSupersetsAtOnce(org.eclipse.papyrus.uml.service.types.tests.deletion.DeleteContainmentSubsetTest)  Time elapsed: 0.119 s
13:23:28 createAssociationWritable(org.eclipse.papyrus.uml.service.types.tests.creation.ConnectorReadOnlyTestBug465899)  Time elapsed: 0.059 s
13:23:28 createAssociationReadOnly_usecase(org.eclipse.papyrus.uml.service.types.tests.creation.ConnectorReadOnlyTestBug465899)  Time elapsed: 0.062 s
13:23:28 createAssociationReadOnly(org.eclipse.papyrus.uml.service.types.tests.creation.ConnectorReadOnlyTestBug465899)  Time elapsed: 0.043 s
13:23:28 createConnectorTargetReadOnly(org.eclipse.papyrus.uml.service.types.tests.creation.ConnectorReadOnlyTestBug465899)  Time elapsed: 0.035 s
13:23:28 createConnectorSourceReadOnly(org.eclipse.papyrus.uml.service.types.tests.creation.ConnectorReadOnlyTestBug465899)  Time elapsed: 0.041 s
13:23:28 testDeletion(org.eclipse.papyrus.uml.service.types.tests.deletion.DeleteAssociationPropertyTypeTest)  Time elapsed: 0.033 s
13:23:28 testDeletionInCompositeDiagram(org.eclipse.papyrus.uml.service.types.tests.deletion.DeleteCommentLinkTest)  Time elapsed: 6.195 s
13:23:28 testDeletionWithSetRequest(org.eclipse.papyrus.uml.service.types.tests.deletion.DeleteCommentLinkTest) skipped
13:23:28 testDeletionInClassDiagram(org.eclipse.papyrus.uml.service.types.tests.deletion.DeleteCommentLinkTest)  Time elapsed: 1.304 s
13:23:28 testDeletionInComponentDiagram(org.eclipse.papyrus.uml.service.types.tests.deletion.DeleteCommentLinkTest)  Time elapsed: 1.284 s
13:23:28 testCreation(org.eclipse.papyrus.uml.service.types.tests.creation.CreateAssociationTest)  Time elapsed: 0.019 s
13:23:28 testCreation(org.eclipse.papyrus.uml.service.types.tests.creation.CreateAssociationDirectedTest)  Time elapsed: 0.009 s
13:23:28 testCreation(org.eclipse.papyrus.uml.service.types.tests.creation.CreateAssociationCompositeTest)  Time elapsed: 0.009 s
13:23:28 testCreation(org.eclipse.papyrus.uml.service.types.tests.creation.CreateAssociationCompositeDirectedTest)  Time elapsed: 0.006 s
13:23:28 testCreation(org.eclipse.papyrus.uml.service.types.tests.creation.CreateAssociationSharedTest)  Time elapsed: 0.006 s
13:23:28 testCreation(org.eclipse.papyrus.uml.service.types.tests.creation.CreateAssociationSharedDirectedTest)  Time elapsed: 0.011 s
13:23:28 deleteInteractionFragmentInOperand(org.eclipse.papyrus.uml.service.types.tests.deletion.InteractionDeletionTest)  Time elapsed: 0.593 s
13:23:28 deleteAllOperandsOfCombinedFragment(org.eclipse.papyrus.uml.service.types.tests.deletion.InteractionDeletionTest)  Time elapsed: 0.505 s
13:23:28 deleteCombinedFragment(org.eclipse.papyrus.uml.service.types.tests.deletion.InteractionDeletionTest)  Time elapsed: 0.439 s
13:23:28 deleteCombinedFragmentNested(org.eclipse.papyrus.uml.service.types.tests.deletion.InteractionDeletionTest)  Time elapsed: 0.57 s
13:23:28 deleteOperandsOfCombinedFragment(org.eclipse.papyrus.uml.service.types.tests.deletion.InteractionDeletionTest)  Time elapsed: 0.489 s
13:23:28 deleteCombinedFragmentDeeplyNested(org.eclipse.papyrus.uml.service.types.tests.deletion.InteractionDeletionTest)  Time elapsed: 0.421 s
13:23:28 deleteInteractionWithNesting(org.eclipse.papyrus.uml.service.types.tests.deletion.InteractionDeletionTest)  Time elapsed: 0.406 s
13:23:28 deleteInteraction(org.eclipse.papyrus.uml.service.types.tests.deletion.InteractionDeletionTest)  Time elapsed: 0.457 s
13:23:28 testCreateClassInModel(org.eclipse.papyrus.uml.service.types.ui.tests.creation.CreateElementTest)  Time elapsed: 0.012 s
13:23:28 testCreateCentralBufferNodeInActivity(org.eclipse.papyrus.uml.service.types.ui.tests.creation.CreateElementTest)  Time elapsed: 0.016 s
13:23:28 testCreateCentralBufferNodeInActivityWithNode(org.eclipse.papyrus.uml.service.types.ui.tests.creation.CreateElementTest)  Time elapsed: 0.007 s
13:23:28 testCannotCreateOperationRedefinableTemplateSignature_bug468071(org.eclipse.papyrus.uml.service.types.ui.tests.creation.CreateElementTest)  Time elapsed: 0 s
13:23:28 testCreateOperationTemplateSignature_bug468071(org.eclipse.papyrus.uml.service.types.ui.tests.creation.CreateElementTest)  Time elapsed: 0.009 s
13:23:28 testCreateModelInClass(org.eclipse.papyrus.uml.service.types.ui.tests.creation.CreateElementTest)  Time elapsed: 0 s
13:23:28 testCreateDeploymentBetweenNodeAndArtifactInNode(org.eclipse.papyrus.uml.service.types.ui.tests.creation.CreateRelationshipTest)  Time elapsed: 0.006 s
13:23:28 testCreatePackageMergeBetweenPackageAndPackageInPackage2(org.eclipse.papyrus.uml.service.types.ui.tests.creation.CreateRelationshipTest)  Time elapsed: 0.011 s
13:23:28 testCreateTraceBetweenClassAndNullInPackage(org.eclipse.papyrus.uml.service.types.ui.tests.creation.CreateRelationshipTest)  Time elapsed: 0.003 s
13:23:28 testCreateDependencyBetweenClassesInPackage(org.eclipse.papyrus.uml.service.types.ui.tests.creation.CreateRelationshipTest)  Time elapsed: 0.007 s
13:23:28 testCreateProtocolConformanceBetweenPackageAndPackageInPackage(org.eclipse.papyrus.uml.service.types.ui.tests.creation.CreateRelationshipTest)  Time elapsed: 0.006 s
13:23:28 testCreateInformationfloweBetweenClasses2InPackage(org.eclipse.papyrus.uml.service.types.ui.tests.creation.CreateRelationshipTest)  Time elapsed: 0.009 s
13:23:28 testCreateUsageBetweenClassAndNullInPackage(org.eclipse.papyrus.uml.service.types.ui.tests.creation.CreateRelationshipTest)  Time elapsed: 0.003 s
13:23:28 testCreateAbstractionBetweenPackageAndClassesInModel(org.eclipse.papyrus.uml.service.types.ui.tests.creation.CreateRelationshipTest)  Time elapsed: 0.014 s
13:23:28 testCreateComponentRealizationBetweenClassAndComponentInComponent(org.eclipse.papyrus.uml.service.types.ui.tests.creation.CreateRelationshipTest)  Time elapsed: 0.019 s
13:23:28 testCreateAbstractionBetweenClassesInPackage(org.eclipse.papyrus.uml.service.types.ui.tests.creation.CreateRelationshipTest)  Time elapsed: 0.004 s
13:23:28 testCreateUsageBetweenClassesInPackage(org.eclipse.papyrus.uml.service.types.ui.tests.creation.CreateRelationshipTest)  Time elapsed: 0.005 s
13:23:28 testCreatePackageImportBetweenPackageAndPackageInPackage(org.eclipse.papyrus.uml.service.types.ui.tests.creation.CreateRelationshipTest)  Time elapsed: 0.006 s
13:23:28 testCreateComponentRealizationBetweenComponentAndClassInComponent(org.eclipse.papyrus.uml.service.types.ui.tests.creation.CreateRelationshipTest)  Time elapsed: 0.013 s
13:23:28 testCreateElementImportBetweenPackageAndPackageInPackage(org.eclipse.papyrus.uml.service.types.ui.tests.creation.CreateRelationshipTest)  Time elapsed: 0.006 s
13:23:28 testCreateDeploymentBetweenNodeAndArtifactInArtifact(org.eclipse.papyrus.uml.service.types.ui.tests.creation.CreateRelationshipTest)  Time elapsed: 0 s
13:23:28 testCreateGeneralizationBetweenClassesInPackage(org.eclipse.papyrus.uml.service.types.ui.tests.creation.CreateRelationshipTest)  Time elapsed: 0.005 s
13:23:28 testCreateGeneralizationBetweenClassAndNullInClass(org.eclipse.papyrus.uml.service.types.ui.tests.creation.CreateRelationshipTest)  Time elapsed: 0.001 s
13:23:28 testCreateDeploymentBetweenArtifactAndNodeInArtifact(org.eclipse.papyrus.uml.service.types.ui.tests.creation.CreateRelationshipTest)  Time elapsed: 0.009 s
13:23:28 testCreateExtendBetweenClasses2InPackage(org.eclipse.papyrus.uml.service.types.ui.tests.creation.CreateRelationshipTest)  Time elapsed: 0.001 s
13:23:28 testCreateProtocolConformanceBetweenPackageAndPackageInPackage2(org.eclipse.papyrus.uml.service.types.ui.tests.creation.CreateRelationshipTest)  Time elapsed: 0 s
13:23:28 testCreateTransitionBetweenInitialAndState(org.eclipse.papyrus.uml.service.types.ui.tests.creation.CreateRelationshipTest) skipped
13:23:28 testCreateInformationfloweBetweenUseCases2InUseCase(org.eclipse.papyrus.uml.service.types.ui.tests.creation.CreateRelationshipTest)  Time elapsed: 0.004 s
13:23:28 testCreateRefineBetweenClassesInPackage(org.eclipse.papyrus.uml.service.types.ui.tests.creation.CreateRelationshipTest)  Time elapsed: 0.207 s
13:23:28 testCreateComponentRealizationBetweenClassAndComponentInClass(org.eclipse.papyrus.uml.service.types.ui.tests.creation.CreateRelationshipTest)  Time elapsed: 0.007 s
13:23:28 testCreateRealizationBetweenClassAndNullInPackage(org.eclipse.papyrus.uml.service.types.ui.tests.creation.CreateRelationshipTest)  Time elapsed: 0.001 s
13:23:28 testCreateExtensionBetweenClassAndNullInNull(org.eclipse.papyrus.uml.service.types.ui.tests.creation.CreateRelationshipTest)  Time elapsed: 0.002 s
13:23:28 testCreateExtendBetweenUseCases2InUseCase(org.eclipse.papyrus.uml.service.types.ui.tests.creation.CreateRelationshipTest)  Time elapsed: 0.011 s
13:23:28 testCreateElementImportBetweenPackageAndPackageInPackage2(org.eclipse.papyrus.uml.service.types.ui.tests.creation.CreateRelationshipTest)  Time elapsed: 0.004 s
13:23:28 testCreateAssociationBetweenClassesInPackage(org.eclipse.papyrus.uml.service.types.ui.tests.creation.CreateRelationshipTest)  Time elapsed: 0.003 s
13:23:28 testCreateTraceBetweenClassesInClass(org.eclipse.papyrus.uml.service.types.ui.tests.creation.CreateRelationshipTest)  Time elapsed: 0.012 s
13:23:28 testCreateManifestationBetweenArtifactAndPackage2InArtifact(org.eclipse.papyrus.uml.service.types.ui.tests.creation.CreateRelationshipTest)  Time elapsed: 0.006 s
13:23:28 testCreateSubstitutionBetweenClassesInPackage(org.eclipse.papyrus.uml.service.types.ui.tests.creation.CreateRelationshipTest)  Time elapsed: 0.006 s
13:23:28 testCreateAbstractionBetweenClassAndNullInPackage(org.eclipse.papyrus.uml.service.types.ui.tests.creation.CreateRelationshipTest)  Time elapsed: 0.001 s
13:23:28 testCreateAbstractionBetweenClassAndClassInClass(org.eclipse.papyrus.uml.service.types.ui.tests.creation.CreateRelationshipTest)  Time elapsed: 0.004 s
13:23:28 testCreatePackageMergeBetweenPackageAndPackageInPackage(org.eclipse.papyrus.uml.service.types.ui.tests.creation.CreateRelationshipTest)  Time elapsed: 0.003 s
13:23:28 testCreateRealizationBetweenClassesInPackage(org.eclipse.papyrus.uml.service.types.ui.tests.creation.CreateRelationshipTest)  Time elapsed: 0.003 s
13:23:28 testCreateTransitionBetweenStateAndInitial(org.eclipse.papyrus.uml.service.types.ui.tests.creation.CreateRelationshipTest) skipped
13:23:28 testCreateAssociationBetweenClassAndNullInPackage(org.eclipse.papyrus.uml.service.types.ui.tests.creation.CreateRelationshipTest)  Time elapsed: 0.001 s
13:23:28 testCreateRefineBetweenClassAndNullInPackage(org.eclipse.papyrus.uml.service.types.ui.tests.creation.CreateRelationshipTest)  Time elapsed: 0.002 s
13:23:28 testCreateDeploymentBetweenArtifactAndNodeInNode(org.eclipse.papyrus.uml.service.types.ui.tests.creation.CreateRelationshipTest)  Time elapsed: 0.004 s
13:23:28 testCreateIncludeBetweenUseCases2InUseCase(org.eclipse.papyrus.uml.service.types.ui.tests.creation.CreateRelationshipTest)  Time elapsed: 0.007 s
13:23:28 testCreateGeneralizationBetweenClassesInClass(org.eclipse.papyrus.uml.service.types.ui.tests.creation.CreateRelationshipTest)  Time elapsed: 0.003 s
13:23:28 testCreateExtensionBetweenClassAndNullInClass(org.eclipse.papyrus.uml.service.types.ui.tests.creation.CreateRelationshipTest)  Time elapsed: 0 s
13:23:28 testCreateDependencyBetweenClassAndNullInPackage(org.eclipse.papyrus.uml.service.types.ui.tests.creation.CreateRelationshipTest)  Time elapsed: 0.001 s
13:23:28 testCreatePackageImportBetweenPackageAndPackageInPackage2(org.eclipse.papyrus.uml.service.types.ui.tests.creation.CreateRelationshipTest)  Time elapsed: 0.004 s
13:23:28 testCreateComponentRealizationBetweenComponentAndClass(org.eclipse.papyrus.uml.service.types.ui.tests.creation.CreateRelationshipTest)  Time elapsed: 0.001 s
13:23:28 testCreateSubstitutionBetweenClassAndNullInPackage(org.eclipse.papyrus.uml.service.types.ui.tests.creation.CreateRelationshipTest)  Time elapsed: 0.001 s
13:23:28 testCreateInterfaceRealizationBetweenClassAndInterfaceInClass(org.eclipse.papyrus.uml.service.types.ui.tests.creation.CreateRelationshipTest)  Time elapsed: 0.008 s
13:23:28 testCreateTraceBetweenClassesInPackage(org.eclipse.papyrus.uml.service.types.ui.tests.creation.CreateRelationshipTest)  Time elapsed: 0.01 s
13:23:28 testCreateTransitionBetweenStateAndFinal(org.eclipse.papyrus.uml.service.types.ui.tests.creation.CreateRelationshipTest) skipped
13:23:28 testCreateAbstractionBetweenClassAndPackageInModel(org.eclipse.papyrus.uml.service.types.ui.tests.creation.CreateRelationshipTest)  Time elapsed: 0.003 s
13:23:28 testCreateRefineBetweenClassesInClass(org.eclipse.papyrus.uml.service.types.ui.tests.creation.CreateRelationshipTest)  Time elapsed: 0.008 s
13:23:28 testCreateTransitionBetweenFinalAndState(org.eclipse.papyrus.uml.service.types.ui.tests.creation.CreateRelationshipTest) skipped
13:23:28 testCreateManifestationBetweenClassAndPackage2InArtifact(org.eclipse.papyrus.uml.service.types.ui.tests.creation.CreateRelationshipTest)  Time elapsed: 0.004 s
13:23:28 testCreateInterfaceRealizationBetweenUseCases2InUseCase(org.eclipse.papyrus.uml.service.types.ui.tests.creation.CreateRelationshipTest)  Time elapsed: 0.001 s
13:23:28 testCreateIncludeBetweenClasses2InPackage(org.eclipse.papyrus.uml.service.types.ui.tests.creation.CreateRelationshipTest)  Time elapsed: 0 s
13:23:28 testCreateExtensionBetweenStereotypeAndMetaClassInPackage(org.eclipse.papyrus.uml.service.types.ui.tests.creation.CreateProfileRelationshipTest)  Time elapsed: 0.016 s
13:23:28 testMoveTemplateSignatureToOperation_bug468071(org.eclipse.papyrus.uml.service.types.ui.tests.creation.MoveElementTest)  Time elapsed: 0.294 s
13:23:28 testMoveRedefinableTemplateSignatureToClass_bug468071(org.eclipse.papyrus.uml.service.types.ui.tests.creation.MoveElementTest)  Time elapsed: 0.002 s
13:23:28 testCannotMoveRedefinableTemplateSignatureToOperation_bug468071(org.eclipse.papyrus.uml.service.types.ui.tests.creation.MoveElementTest)  Time elapsed: 0 s
13:23:28 testSetTemplateSignatureOfOperation_bug468071(org.eclipse.papyrus.uml.service.types.ui.tests.creation.SetFeatureTest)  Time elapsed: 0.003 s
13:23:28 testSetRedefinableTemplateSignatureOfClass_bug468071(org.eclipse.papyrus.uml.service.types.ui.tests.creation.SetFeatureTest)  Time elapsed: 0.002 s
13:23:28 testCannotSetRedefinableTemplateSignatureOfOperation_bug468071(org.eclipse.papyrus.uml.service.types.ui.tests.creation.SetFeatureTest)  Time elapsed: 0 s
13:23:28 deleteAssociation(org.eclipse.papyrus.uml.service.types.ui.tests.deletion.DeleteAssociationTest)  Time elapsed: 0.236 s
13:23:28 deleteAssociationTarget(org.eclipse.papyrus.uml.service.types.ui.tests.deletion.DeleteAssociationTest)  Time elapsed: 0.23 s
13:23:28 deleteReadOnlyElement(org.eclipse.papyrus.uml.modelexplorer.tests.DeleteModelExplorerTest)  Time elapsed: 0.792 s
13:23:28 deleteClassInTheModel(org.eclipse.papyrus.uml.modelexplorer.tests.DeleteModelExplorerTest)  Time elapsed: 0.856 s
13:23:28 deleteRootOfTheModel(org.eclipse.papyrus.uml.modelexplorer.tests.DeleteModelExplorerTest)  Time elapsed: 0.354 s
13:23:28 renameUMLUnnamedElementTest(org.eclipse.papyrus.uml.modelexplorer.tests.RenameHandlerTest) skipped
13:23:28 renameUMLNamedElementTest(org.eclipse.papyrus.uml.modelexplorer.tests.RenameHandlerTest) skipped
13:23:28 revealSemanticElement_selectRootTest(org.eclipse.papyrus.uml.modelexplorer.tests.ModelExplorerViewTests)  Time elapsed: 1.191 s
13:23:28 revealSemanticElement_selectChildrenTest(org.eclipse.papyrus.uml.modelexplorer.tests.ModelExplorerViewTests)  Time elapsed: 0.854 s
13:23:28 revealSemanticElement_selectImportedPackage(org.eclipse.papyrus.uml.modelexplorer.tests.ModelExplorerViewTests)  Time elapsed: 2.562 s
13:23:28 revealSemanticElement_selectImportedPackageList(org.eclipse.papyrus.uml.modelexplorer.tests.ModelExplorerViewTests)  Time elapsed: 0.934 s
13:23:28 revealSemanticElement_selectChildrenTestList(org.eclipse.papyrus.uml.modelexplorer.tests.ModelExplorerViewTests)  Time elapsed: 0.844 s
13:23:28 cutReadOnlyElement(org.eclipse.papyrus.uml.modelexplorer.tests.paste.CutPasteModelExplorerTest)  Time elapsed: 0.391 s
13:23:28 cutClassTest(org.eclipse.papyrus.uml.modelexplorer.tests.paste.CutPasteModelExplorerTest)  Time elapsed: 0.899 s
13:23:28 cutRootOfTheModel(org.eclipse.papyrus.uml.modelexplorer.tests.paste.CutPasteModelExplorerTest)  Time elapsed: 0.333 s
13:23:28 copyPasteofClass1Test(org.eclipse.papyrus.uml.modelexplorer.tests.paste.CopyPasteModelExplorerTest)  Time elapsed: 0.36 s
13:23:28 pasteOnReadOnlyElement(org.eclipse.papyrus.uml.modelexplorer.tests.paste.CopyPasteModelExplorerTest)  Time elapsed: 0.504 s
13:23:28 copyPasteofClass1And2Test(org.eclipse.papyrus.uml.modelexplorer.tests.paste.CopyPasteModelExplorerTest)  Time elapsed: 0.501 s
13:23:28 copyPasteDiagramTest(org.eclipse.papyrus.uml.modelexplorer.tests.paste.DiagramCopyPasteModelExplorerTest)  Time elapsed: 0.38 s
13:23:28 copyPasteTableTest(org.eclipse.papyrus.uml.modelexplorer.tests.paste.TableCopyPasteModelExplorerTest)  Time elapsed: 0.369 s
13:23:28 copyPasteofClass1Test(org.eclipse.papyrus.uml.modelexplorer.tests.paste.StereotypeCopyPasteModelExplorerTest)  Time elapsed: 0.94 s
13:23:28 advancedModeDoesNotCollapseItself(org.eclipse.papyrus.uml.modelexplorer.tests.AdvancedModeTest)  Time elapsed: 1.041 s  <<< ERROR!
13:23:28 org.eclipse.emf.common.util.BasicEList$BasicIndexOutOfBoundsException: index=0, size=0
13:23:28 
13:23:28 advancedModeDoesNotCollapseItself(org.eclipse.papyrus.uml.modelexplorer.tests.AdvancedModeTest)  Time elapsed: 1.041 s  <<< ERROR!
13:23:28 java.lang.NullPointerException
13:23:28 	at org.eclipse.papyrus.uml.modelexplorer.tests.AdvancedModeTest.advancedModeDoesNotCollapseItself(AdvancedModeTest.java:69)
13:23:28 
13:23:28 validateModel[0](org.eclipse.papyrus.uml.modelexplorer.tests.resources.ModelValidationTest)  Time elapsed: 0.034 s
13:23:28 validateModel[1](org.eclipse.papyrus.uml.modelexplorer.tests.resources.ModelValidationTest)  Time elapsed: 0.016 s
13:23:28 org.eclipse.papyrus.uml.diagram.dnd.tests.tests.InstanceSpecificationTest  Time elapsed: 0.712 s  <<< FAILURE!
13:23:28 java.lang.AssertionError: Cannot load the test diagram
13:23:28 	at org.eclipse.papyrus.uml.diagram.dnd.tests.tests.InstanceSpecificationTest.initModel(InstanceSpecificationTest.java:131)
13:23:28 	at org.eclipse.papyrus.uml.diagram.dnd.tests.tests.InstanceSpecificationTest.init(InstanceSpecificationTest.java:91)
13:23:28 
13:23:28 singleValuePropertyGraphicalTest(org.eclipse.papyrus.uml.tools.tests.tests.ContentProviderTest)  Time elapsed: 0.072 s
13:23:28 singleValuePropertyTest(org.eclipse.papyrus.uml.tools.tests.tests.ContentProviderTest)  Time elapsed: 0.019 s
13:23:28 multipleValuePropertyTest(org.eclipse.papyrus.uml.tools.tests.tests.ContentProviderTest) skipped
13:23:28 enumPropertyTest(org.eclipse.papyrus.uml.tools.tests.tests.ContentProviderTest)  Time elapsed: 0.01 s
13:23:28 testProfileContentWithBaseClassPropertyWithoutInheritedProperties(org.eclipse.papyrus.uml.tools.tests.tests.UMLStereotypePropertyContentProviderTest)  Time elapsed: 0.173 s
13:23:28 testProfileContentWithoutBaseClassPropertyWithoutInheritedProperties(org.eclipse.papyrus.uml.tools.tests.tests.UMLStereotypePropertyContentProviderTest)  Time elapsed: 0.153 s
13:23:28 testProfileContentWithBaseClassPropertyWithInheritedProperties(org.eclipse.papyrus.uml.tools.tests.tests.UMLStereotypePropertyContentProviderTest)  Time elapsed: 0.191 s
13:23:28 testProfileContentWithoutBaseClassPropertyWithInheritedProperties(org.eclipse.papyrus.uml.tools.tests.tests.UMLStereotypePropertyContentProviderTest)  Time elapsed: 0.141 s
13:23:28 testSwitchToProxy(org.eclipse.papyrus.uml.tools.tests.tests.DependencyManagementTest) skipped
13:23:28 testSwitchProfilesWithStereotypes(org.eclipse.papyrus.uml.tools.tests.tests.DependencyManagementTest)  Time elapsed: 1.468 s
13:23:28 testSwitchFromRegistererdToLocal(org.eclipse.papyrus.uml.tools.tests.tests.DependencyManagementTest)  Time elapsed: 1.293 s
13:23:28 testSwitchProfilesWithStereotypeProperties(org.eclipse.papyrus.uml.tools.tests.tests.DependencyManagementTest)  Time elapsed: 1.181 s
13:23:28 testSwitchProfilesWithMissingDefinitions(org.eclipse.papyrus.uml.tools.tests.tests.DependencyManagementTest)  Time elapsed: 1.062 s
13:23:28 testSwitchFromLocalToRegistered(org.eclipse.papyrus.uml.tools.tests.tests.DependencyManagementTest)  Time elapsed: 1.266 s
13:23:28 testSwitchToDifferentVersion(org.eclipse.papyrus.uml.tools.tests.tests.DependencyManagementTest) skipped
13:23:28 testSimpleSwitch(org.eclipse.papyrus.uml.tools.tests.tests.DependencyManagementTest)  Time elapsed: 1.782 s
13:23:28 testSwitchFromProxy(org.eclipse.papyrus.uml.tools.tests.tests.DependencyManagementTest) skipped
13:23:28 testSwitchProfilesStereotypeIdentities(org.eclipse.papyrus.uml.tools.tests.tests.DependencyManagementTest)  Time elapsed: 1.273 s
13:23:28 testSwitchProfilesWithRequiredStereotypes(org.eclipse.papyrus.uml.tools.tests.tests.DependencyManagementTest)  Time elapsed: 1.367 s
13:23:28 testOverloadDoesNotClash(org.eclipse.papyrus.uml.tools.tests.tests.NamedElementValidatorTest)  Time elapsed: 0.057 s
13:23:28 testNameClash(org.eclipse.papyrus.uml.tools.tests.tests.NamedElementValidatorTest)  Time elapsed: 0.062 s
13:23:28 testElementOfDifferentKindDoesNotClash(org.eclipse.papyrus.uml.tools.tests.tests.NamedElementValidatorTest)  Time elapsed: 0.066 s
13:23:28 testModifiedSysMLStereotype(org.eclipse.papyrus.uml.tools.tests.tests.StereotypeElementListenerTest) skipped
13:23:28 testUndoUnapplyProfile(org.eclipse.papyrus.uml.tools.tests.tests.StereotypeElementListenerTest)  Time elapsed: 0.365 s
13:23:28 testAddStereotype(org.eclipse.papyrus.uml.tools.tests.tests.StereotypeElementListenerTest)  Time elapsed: 0.354 s
13:23:28 testStereotypeUnsetAttributeChange(org.eclipse.papyrus.uml.tools.tests.tests.StereotypeElementListenerTest)  Time elapsed: 0.281 s
13:23:28 testUndoAddStereotype(org.eclipse.papyrus.uml.tools.tests.tests.StereotypeElementListenerTest)  Time elapsed: 0.304 s
13:23:28 testAddStereotypes(org.eclipse.papyrus.uml.tools.tests.tests.StereotypeElementListenerTest)  Time elapsed: 0.392 s
13:23:28 testUndoRemoveStereotype(org.eclipse.papyrus.uml.tools.tests.tests.StereotypeElementListenerTest)  Time elapsed: 0.367 s
13:23:28 testAddSysMLStereotype(org.eclipse.papyrus.uml.tools.tests.tests.StereotypeElementListenerTest)  Time elapsed: 0.347 s
13:23:28 testModifiedStereotype(org.eclipse.papyrus.uml.tools.tests.tests.StereotypeElementListenerTest)  Time elapsed: 0.429 s
13:23:28 testAddStereotypeOnSeveralElements(org.eclipse.papyrus.uml.tools.tests.tests.StereotypeElementListenerTest)  Time elapsed: 0.414 s
13:23:28 testUndoAddStereotypes(org.eclipse.papyrus.uml.tools.tests.tests.StereotypeElementListenerTest)  Time elapsed: 0.252 s
13:23:28 testFakeBasedProperty(org.eclipse.papyrus.uml.tools.tests.tests.StereotypeElementListenerTest)  Time elapsed: 0.312 s
13:23:28 testRemoveStereotype(org.eclipse.papyrus.uml.tools.tests.tests.StereotypeElementListenerTest)  Time elapsed: 0.406 s
13:23:28 testRemoveSysMLStereotype(org.eclipse.papyrus.uml.tools.tests.tests.StereotypeElementListenerTest)  Time elapsed: 0.452 s
13:23:28 testUndoAddSysMLStereotype(org.eclipse.papyrus.uml.tools.tests.tests.StereotypeElementListenerTest)  Time elapsed: 0.459 s
13:23:28 testUndoModifiedStereotype(org.eclipse.papyrus.uml.tools.tests.tests.StereotypeElementListenerTest)  Time elapsed: 0.351 s
13:23:28 testUndoAddStereotypeOnSeveralElements(org.eclipse.papyrus.uml.tools.tests.tests.StereotypeElementListenerTest)  Time elapsed: 0.593 s
13:23:28 testUndoRedoAddStereotypeTiming(org.eclipse.papyrus.uml.tools.tests.tests.StereotypeElementListenerTest)  Time elapsed: 0.31 s
13:23:28 testUnapplyProfile(org.eclipse.papyrus.uml.tools.tests.tests.StereotypeElementListenerTest)  Time elapsed: 0.4 s
13:23:28 testUndoRemoveSysMLStereotype(org.eclipse.papyrus.uml.tools.tests.tests.StereotypeElementListenerTest)  Time elapsed: 0.393 s
13:23:28 testUndoModifiedSysMLStereotype(org.eclipse.papyrus.uml.tools.tests.tests.StereotypeElementListenerTest) skipped
13:23:28 testStereotypeListAttributeChange(org.eclipse.papyrus.uml.tools.tests.tests.StereotypeElementListenerTest)  Time elapsed: 0.462 s
13:23:28 twoProfilesUnapplied(org.eclipse.papyrus.uml.tools.tests.tests.ProfileApplicationListenerTest)  Time elapsed: 0.117 s
13:23:28 moveProfileApplication(org.eclipse.papyrus.uml.tools.tests.tests.ProfileApplicationListenerTest)  Time elapsed: 0.642 s
13:23:28 applyProfileThenMoveApplication(org.eclipse.papyrus.uml.tools.tests.tests.ProfileApplicationListenerTest)  Time elapsed: 0.155 s
13:23:28 twoProfilesApplied(org.eclipse.papyrus.uml.tools.tests.tests.ProfileApplicationListenerTest)  Time elapsed: 0.148 s
13:23:28 profileReplacedInAnApplication(org.eclipse.papyrus.uml.tools.tests.tests.ProfileApplicationListenerTest)  Time elapsed: 0.129 s
13:23:28 simpleNewProfileApplication(org.eclipse.papyrus.uml.tools.tests.tests.ProfileApplicationListenerTest)  Time elapsed: 0.131 s
13:23:28 simpleProfileUnapplication(org.eclipse.papyrus.uml.tools.tests.tests.ProfileApplicationListenerTest)  Time elapsed: 0.147 s
13:23:28 profileAppliedThenReplacedInSameApplication(org.eclipse.papyrus.uml.tools.tests.tests.ProfileApplicationListenerTest)  Time elapsed: 0.221 s
13:23:28 testEditToDisplaySingleString_1(org.eclipse.papyrus.uml.tools.tests.tests.UMLReferenceConverterTest)  Time elapsed: 0.066 s
13:23:28 testList(org.eclipse.papyrus.uml.tools.tests.tests.UMLReferenceConverterTest)  Time elapsed: 0.066 s
13:23:28 testNull(org.eclipse.papyrus.uml.tools.tests.tests.UMLReferenceConverterTest)  Time elapsed: 0.032 s
13:23:28 testDisplayToEditString_1(org.eclipse.papyrus.uml.tools.tests.tests.UMLReferenceConverterTest)  Time elapsed: 0.03 s
13:23:28 testEmptyString(org.eclipse.papyrus.uml.tools.tests.tests.UMLReferenceConverterTest)  Time elapsed: 0.082 s
13:23:28 testClass2(org.eclipse.papyrus.uml.tools.tests.tests.UMLReferenceConverterTest)  Time elapsed: 0.137 s
13:23:28 testClass3(org.eclipse.papyrus.uml.tools.tests.tests.UMLReferenceConverterTest)  Time elapsed: 0.096 s
13:23:28 testMatchingElementstSingleValue1(org.eclipse.papyrus.uml.tools.tests.tests.UMLReferenceConverterTest)  Time elapsed: 0.041 s
13:23:28 testMatchingElementstSingleValue2(org.eclipse.papyrus.uml.tools.tests.tests.UMLReferenceConverterTest)  Time elapsed: 0.032 s
13:23:28 testCompletionToFindClass_1(org.eclipse.papyrus.uml.tools.tests.tests.UMLReferenceConverterCompletionTest)  Time elapsed: 0.05 s
13:23:28 testCompletionToFindClass_3(org.eclipse.papyrus.uml.tools.tests.tests.UMLReferenceConverterCompletionTest)  Time elapsed: 0.034 s
13:23:28 testCompletionToFindClass_4(org.eclipse.papyrus.uml.tools.tests.tests.UMLReferenceConverterCompletionTest)  Time elapsed: 0.034 s
13:23:28 testCompletionToFindClass_5(org.eclipse.papyrus.uml.tools.tests.tests.UMLReferenceConverterCompletionTest)  Time elapsed: 0.033 s
13:23:28 testCompletionToFindClass_6(org.eclipse.papyrus.uml.tools.tests.tests.UMLReferenceConverterCompletionTest)  Time elapsed: 0.031 s
13:23:28 testCompletionToFindClass_7(org.eclipse.papyrus.uml.tools.tests.tests.UMLReferenceConverterCompletionTest)  Time elapsed: 0.033 s
13:23:28 testCompletionToFindClass_8(org.eclipse.papyrus.uml.tools.tests.tests.UMLReferenceConverterCompletionTest)  Time elapsed: 0.034 s
13:23:28 testSplitString_1(org.eclipse.papyrus.uml.tools.tests.tests.UMLReferenceConverterCompletionTest)  Time elapsed: 0.033 s
13:23:28 testSplitString_2(org.eclipse.papyrus.uml.tools.tests.tests.UMLReferenceConverterCompletionTest)  Time elapsed: 0.036 s
13:23:28 testCompletionToFindConstraint_1(org.eclipse.papyrus.uml.tools.tests.tests.UMLReferenceConverterCompletionTest)  Time elapsed: 0.034 s
13:23:28 testCompletionToFindConstraint_2(org.eclipse.papyrus.uml.tools.tests.tests.UMLReferenceConverterCompletionTest)  Time elapsed: 0.034 s
13:23:28 testCompletionMultiValueConverterEmptyString(org.eclipse.papyrus.uml.tools.tests.tests.UMLReferenceConverterCompletionTest)  Time elapsed: 0.033 s
13:23:28 testCompletionToFindPackage_1(org.eclipse.papyrus.uml.tools.tests.tests.UMLReferenceConverterCompletionTest)  Time elapsed: 0.039 s
13:23:28 testCompletionToFindPackage_2(org.eclipse.papyrus.uml.tools.tests.tests.UMLReferenceConverterCompletionTest)  Time elapsed: 0.034 s
13:23:28 testCompletionSingleValueConverterEmptyString(org.eclipse.papyrus.uml.tools.tests.tests.UMLReferenceConverterCompletionTest)  Time elapsed: 0.032 s
13:23:28 profileLanguage(org.eclipse.papyrus.uml.tools.tests.tests.UMLLanguageProvidersTest)  Time elapsed: 0.003 s
13:23:28 umlLanguage(org.eclipse.papyrus.uml.tools.tests.tests.UMLLanguageProvidersTest)  Time elapsed: 0.002 s
13:23:28 ValidationStereotypesListClass1Test(org.eclipse.papyrus.uml.tools.tests.tests.IconsStereotypesTest)  Time elapsed: 0.891 s
13:23:28 ValidationStereotypesListClass2Test(org.eclipse.papyrus.uml.tools.tests.tests.IconsStereotypesTest)  Time elapsed: 1.018 s
13:23:28 ValidationStereotypesListClass3Test(org.eclipse.papyrus.uml.tools.tests.tests.IconsStereotypesTest)  Time elapsed: 0.635 s
13:23:28 ValidationStereotypesListClass4Test(org.eclipse.papyrus.uml.tools.tests.tests.IconsStereotypesTest)  Time elapsed: 0.805 s
13:23:28 ValidationImageClass1Test(org.eclipse.papyrus.uml.tools.tests.tests.IconsStereotypesTest)  Time elapsed: 0.997 s
13:23:28 ValidationImageClass2Test(org.eclipse.papyrus.uml.tools.tests.tests.IconsStereotypesTest)  Time elapsed: 0.902 s
13:23:28 ValidationImageClass3Test(org.eclipse.papyrus.uml.tools.tests.tests.IconsStereotypesTest)  Time elapsed: 0.9 s
13:23:28 ValidationImageClass4Test(org.eclipse.papyrus.uml.tools.tests.tests.IconsStereotypesTest)  Time elapsed: 0.769 s
13:23:28 returnedTextTest(org.eclipse.papyrus.uml.tools.tests.tests.CustomizableDelegatingItemLabelProviderTest)  Time elapsed: 0.782 s
13:23:28 returnedStyledTextTest(org.eclipse.papyrus.uml.tools.tests.tests.CustomizableDelegatingItemLabelProviderTest)  Time elapsed: 0.965 s
13:23:28 notifyChange(org.eclipse.papyrus.uml.tools.tests.tests.DelegatingItemLabelProviderTest)  Time elapsed: 0.072 s
13:23:28 copyingInterfaceRealizationDoesNotCorruptTheModel(org.eclipse.papyrus.uml.tools.tests.tests.UMLCopyTest)  Time elapsed: 0.004 s
13:23:28 copyingInterfaceRealizationDoesNotCorruptTheModel(org.eclipse.papyrus.uml.tools.tests.tests.UMLCopyTestME)  Time elapsed: 0.697 s
13:23:28 duplicateStereotypeWithMultivaluedDataTypeContainmentFeatureTest(org.eclipse.papyrus.uml.tools.tests.tests.DuplicateStereotypeCommandTest)  Time elapsed: 1.42 s
13:23:28 duplicateStereotypeWithMultivaluedContainmentFeatureTest(org.eclipse.papyrus.uml.tools.tests.tests.DuplicateStereotypeCommandTest)  Time elapsed: 1.33 s
13:23:28 duplicateStereotypeWithSingleContainmentFeatureTest(org.eclipse.papyrus.uml.tools.tests.tests.DuplicateStereotypeCommandTest)  Time elapsed: 1.32 s
13:23:28 recursiveImportPackage(org.eclipse.papyrus.uml.tools.utils.tests.tests.NameResolutionHelperTest)  Time elapsed: 0.044 s
13:23:28 testIsAutoNamed(org.eclipse.papyrus.uml.tools.utils.tests.tests.NamedElementUtilTest)  Time elapsed: 0.051 s
13:23:28 testGetDefaultNameWithIncrement(org.eclipse.papyrus.uml.tools.utils.tests.tests.NamedElementUtilTest)  Time elapsed: 0.001 s
13:23:28 testAutoNameIncrement(org.eclipse.papyrus.uml.tools.utils.tests.tests.NamedElementUtilTest)  Time elapsed: 0.002 s
13:23:28 testExistingElementHavingNameNotRenamed(org.eclipse.papyrus.uml.tools.utils.tests.tests.NamedElementUtilTest)  Time elapsed: 0.002 s
13:23:28 testGetAppliedSuperstereotype(org.eclipse.papyrus.uml.tools.utils.tests.tests.UMLUtilTest)  Time elapsed: 0.077 s
13:23:28 testGetApplicableStereotype_notStrict_notApplicable(org.eclipse.papyrus.uml.tools.utils.tests.tests.UMLUtilTest)  Time elapsed: 0.328 s
13:23:28 testGetApplicableStereotype_notStrict_applicable(org.eclipse.papyrus.uml.tools.utils.tests.tests.UMLUtilTest)  Time elapsed: 0.712 s
13:23:28 testGetApplicableStereotype_strict_applicable(org.eclipse.papyrus.uml.tools.utils.tests.tests.UMLUtilTest)  Time elapsed: 0.273 s
13:23:28 testGetAppliedSubstereotype_notApplied(org.eclipse.papyrus.uml.tools.utils.tests.tests.UMLUtilTest)  Time elapsed: 0.065 s
13:23:28 testGetApplicableStereotype_strict_notApplicable(org.eclipse.papyrus.uml.tools.utils.tests.tests.UMLUtilTest)  Time elapsed: 0.197 s
13:23:28 testGetAppliedSubstereotype_applied(org.eclipse.papyrus.uml.tools.utils.tests.tests.UMLUtilTest)  Time elapsed: 0.053 s
13:23:28 testUnApplyStereotypeApplication(org.eclipse.papyrus.uml.diagram.stereotypeproperty.TestBadUnapplyProfile2ClosedDiagComment)  Time elapsed: 1.874 s
13:23:28 testStereotypeApplicationOnClass(org.eclipse.papyrus.uml.diagram.stereotypeproperty.TestDropStereotypedClass)  Time elapsed: 0.997 s
13:23:28 testProfileApplicationOnModel(org.eclipse.papyrus.uml.diagram.stereotypeproperty.TestProfileApplication)  Time elapsed: 0.547 s
13:23:28 testBrace(org.eclipse.papyrus.uml.diagram.stereotypeproperty.tests.asbrace.TestDisplayAsBrace)  Time elapsed: 0.87 s
13:23:28 testReopenStereotypeAsComment(org.eclipse.papyrus.uml.diagram.stereotypeproperty.tests.asbrace.TestReopenAsBrace)  Time elapsed: 2.282 s
13:23:28 testStereotypeApplicationOnClass(org.eclipse.papyrus.uml.diagram.stereotypeproperty.tests.ascomment.TestDisplayAsComment)  Time elapsed: 0.709 s
13:23:28 testReopenStereotypeAsComment(org.eclipse.papyrus.uml.diagram.stereotypeproperty.tests.ascomment.TestReopenAsComment)  Time elapsed: 2.609 s
13:23:28 testStereotypeApplicationOnClass(org.eclipse.papyrus.uml.diagram.stereotypeproperty.tests.ascompartment.TestDisplayAsCompartment)  Time elapsed: 1.085 s
13:23:28 testReopenStereotypeAsComment(org.eclipse.papyrus.uml.diagram.stereotypeproperty.tests.ascompartment.TestReopenAsCompartment)  Time elapsed: 2.32 s
13:23:28 test2StereotypeApplicationsOnClass(org.eclipse.papyrus.uml.diagram.stereotypeproperty.tests.displayname.Test2StereotypeApplications)  Time elapsed: 0.665 s
13:23:28 testStereotypeApplicationOnPackage(org.eclipse.papyrus.uml.diagram.stereotypeproperty.tests.displayname.TestStereotypeApplication)  Time elapsed: 0.944 s
13:23:28 testStereotypeApplicationOnClass(org.eclipse.papyrus.uml.diagram.stereotypeproperty.tests.displayname.TestStereotypeApplication)  Time elapsed: 0.082 s
13:23:28 testQNStereotypeApplicationOnClass(org.eclipse.papyrus.uml.diagram.stereotypeproperty.tests.displayname.TestStereotypeApplicationQualifiedName)  Time elapsed: 0.662 s
13:23:28 testLayoutStereotypeApplicationOnClass(org.eclipse.papyrus.uml.diagram.stereotypeproperty.tests.layout.TestLayoutWithStereotype) skipped
13:23:28 testLayoutOnClass(org.eclipse.papyrus.uml.diagram.stereotypeproperty.tests.layout.TestLayoutWithStereotype) skipped
13:23:28 testLayoutStereotypeApplicationOnClass(org.eclipse.papyrus.uml.diagram.stereotypeproperty.tests.layout.TestLayoutWithStereotypeOnEclipseHIPPInstance) skipped
13:23:28 testLayoutOnClass(org.eclipse.papyrus.uml.diagram.stereotypeproperty.tests.layout.TestLayoutWithStereotypeOnEclipseHIPPInstance) skipped
13:23:28 testDiagramFileExtentionLabel(org.eclipse.papyrus.uml.diagram.wizards.TestCreateModelWizard)  Time elapsed: 0.494 s
13:23:28 testDiagramFileExtenstionForUML(org.eclipse.papyrus.uml.diagram.wizards.TestCreateModelWizard)  Time elapsed: 0.17 s
13:23:28 testOrderOfPages(org.eclipse.papyrus.uml.diagram.wizards.TestCreateModelWizard)  Time elapsed: 0.147 s
13:23:28 testDiagramFileExtentionLabel(org.eclipse.papyrus.uml.diagram.wizards.TestInitModelWizard)  Time elapsed: 0.176 s
13:23:28 testDiagramFileExtenstionForUML(org.eclipse.papyrus.uml.diagram.wizards.TestInitModelWizard)  Time elapsed: 0.169 s
13:23:28 testOrderOfPages(org.eclipse.papyrus.uml.diagram.wizards.TestInitModelWizard)  Time elapsed: 0.18 s
13:23:28 testOrderOfPages(org.eclipse.papyrus.uml.diagram.wizards.TestNewProjectWizard)  Time elapsed: 0.197 s
13:23:28 testForSimpleModel(org.eclipse.papyrus.uml.diagram.wizards.TestCreateModelFromExistingModelWizard)  Time elapsed: 0.163 s
13:23:28 testOrderOfPages(org.eclipse.papyrus.uml.diagram.wizards.TestCreateModelFromExistingModelWizard)  Time elapsed: 0.139 s
13:23:28 testForModelWithDot(org.eclipse.papyrus.uml.diagram.wizards.TestCreateModelFromExistingModelWizard)  Time elapsed: 0.173 s
13:23:28 missingSchema(org.eclipse.papyrus.uml.modelrepair.internal.stereotypes.StereotypeApplicationRepairSnippetTest)  Time elapsed: 0.279 s
13:23:28 noCorruptionControlCase(org.eclipse.papyrus.uml.modelrepair.internal.stereotypes.StereotypeApplicationRepairSnippetTest)  Time elapsed: 0.07 s
13:23:28 wrongProfileVersion(org.eclipse.papyrus.uml.modelrepair.internal.stereotypes.StereotypeApplicationRepairSnippetTest)  Time elapsed: 0.214 s
13:23:28 missingProfileApplication(org.eclipse.papyrus.uml.modelrepair.internal.stereotypes.StereotypeApplicationRepairSnippetTest)  Time elapsed: 0.26 s
13:23:28 deleteStereotypes(org.eclipse.papyrus.uml.modelrepair.internal.stereotypes.StereotypeApplicationRepairSnippetTest)  Time elapsed: 0.07 s
13:23:28 nestedProfileApplicationsMissingNamespace_bug434302(org.eclipse.papyrus.uml.modelrepair.internal.stereotypes.StereotypeRepairRegressionTest)  Time elapsed: 0.359 s
13:23:28 orphansOfWrongProfileVersion_bug436666(org.eclipse.papyrus.uml.modelrepair.internal.stereotypes.StereotypeRepairRegressionTest)  Time elapsed: 0.114 s
13:23:28 badSchemaLocationInNonPackageFragment_bug459488(org.eclipse.papyrus.uml.modelrepair.internal.stereotypes.StereotypeRepairRegressionTest)  Time elapsed: 0.691 s
13:23:28 nestedProfilesAndNestedApplicationsWellFormed_bug434302(org.eclipse.papyrus.uml.modelrepair.internal.stereotypes.StereotypeRepairRegressionTest)  Time elapsed: 0.304 s
13:23:28 registeredDynamicProfie_bug455329(org.eclipse.papyrus.uml.modelrepair.internal.stereotypes.StereotypeRepairRegressionTest)  Time elapsed: 0.062 s
13:23:28 nestedPackageSchemaMissing_bug436666(org.eclipse.papyrus.uml.modelrepair.internal.stereotypes.StereotypeRepairRegressionTest)  Time elapsed: 0.297 s
13:23:28 incorrectZombieGroupingWithoutProfileNamespaceURIPattern_bug496307(org.eclipse.papyrus.uml.modelrepair.internal.stereotypes.StereotypeRepairRegressionTest)  Time elapsed: 0.092 s
13:23:28 nonStereotypeApplicationsAreOK_bug436666(org.eclipse.papyrus.uml.modelrepair.internal.stereotypes.StereotypeRepairRegressionTest)  Time elapsed: 0.224 s
13:23:28 nestedProfileApplications2Pkgs1Profile_bug434302(org.eclipse.papyrus.uml.modelrepair.internal.stereotypes.StereotypeRepairRegressionTest)  Time elapsed: 0.351 s
13:23:28 crossReferencedPackageUnitWithoutOwnProfileApplication_bug458736(org.eclipse.papyrus.uml.modelrepair.internal.stereotypes.StereotypeRepairRegressionTest)  Time elapsed: 0.457 s
13:23:28 correctZombieGroupingWithProfileNamespaceURIPattern_bug496307(org.eclipse.papyrus.uml.modelrepair.internal.stereotypes.StereotypeRepairRegressionTest)  Time elapsed: 0.049 s
13:23:28 orphansOfValidSchema_bug436666(org.eclipse.papyrus.uml.modelrepair.internal.stereotypes.StereotypeRepairRegressionTest)  Time elapsed: 0.067 s
13:23:28 packageUnitWithoutOwnProfileApplication_bug455248(org.eclipse.papyrus.uml.modelrepair.internal.stereotypes.StereotypeRepairRegressionTest)  Time elapsed: 0.061 s
13:23:28 nestedPackageInProfileIsOK_bug436666(org.eclipse.papyrus.uml.modelrepair.internal.stereotypes.StereotypeRepairRegressionTest)  Time elapsed: 0.381 s
13:23:28 compareMultiVersionSameURISameVersion(org.eclipse.papyrus.uml.modelrepair.internal.uripattern.ProfileNamespaceURIPatternTest)  Time elapsed: 0.001 s
13:23:28 compareMultiVersionDifferentURIDifferentVersion(org.eclipse.papyrus.uml.modelrepair.internal.uripattern.ProfileNamespaceURIPatternTest)  Time elapsed: 0 s
13:23:28 compareSingleVersionDifferentURISameVersion(org.eclipse.papyrus.uml.modelrepair.internal.uripattern.ProfileNamespaceURIPatternTest)  Time elapsed: 0 s
13:23:28 compareMultiVersionDifferentURISameVersion(org.eclipse.papyrus.uml.modelrepair.internal.uripattern.ProfileNamespaceURIPatternTest)  Time elapsed: 0 s
13:23:28 compareCorrectInvalidComparisonConstantBehavior(org.eclipse.papyrus.uml.modelrepair.internal.uripattern.ProfileNamespaceURIPatternTest)  Time elapsed: 0 s
13:23:28 compareNoVersionSameURI(org.eclipse.papyrus.uml.modelrepair.internal.uripattern.ProfileNamespaceURIPatternTest)  Time elapsed: 0.001 s
13:23:28 compareSingleVersionDifferentURIDifferentVersion(org.eclipse.papyrus.uml.modelrepair.internal.uripattern.ProfileNamespaceURIPatternTest)  Time elapsed: 0 s
13:23:28 matchCorrectNoMatchConstantBehavior(org.eclipse.papyrus.uml.modelrepair.internal.uripattern.ProfileNamespaceURIPatternTest)  Time elapsed: 0 s
13:23:28 matchSingleVersionCorrectURIGivenVersion(org.eclipse.papyrus.uml.modelrepair.internal.uripattern.ProfileNamespaceURIPatternTest)  Time elapsed: 0 s
13:23:28 matchNoVersionCorrectURIDefaultVersion(org.eclipse.papyrus.uml.modelrepair.internal.uripattern.ProfileNamespaceURIPatternTest)  Time elapsed: 0 s
13:23:28 matchMultipleVersionCorrectURIGivenVersion(org.eclipse.papyrus.uml.modelrepair.internal.uripattern.ProfileNamespaceURIPatternTest)  Time elapsed: 0 s
13:23:28 matchMultipleVersionCorrectURIDefaultVersion(org.eclipse.papyrus.uml.modelrepair.internal.uripattern.ProfileNamespaceURIPatternTest)  Time elapsed: 0 s
13:23:28 compareCorrectInvalidComparisonBehaviorWrongLHS(org.eclipse.papyrus.uml.modelrepair.internal.uripattern.ProfileNamespaceURIPatternTest)  Time elapsed: 0 s
13:23:28 compareCorrectInvalidComparisonBehaviorWrongRHS(org.eclipse.papyrus.uml.modelrepair.internal.uripattern.ProfileNamespaceURIPatternTest)  Time elapsed: 0 s
13:23:28 registryExtensionPointCorrectMatch(org.eclipse.papyrus.uml.modelrepair.internal.uripattern.ProfileNamespaceURIPatternTest)  Time elapsed: 0.002 s
13:23:28 compareSingleVersionSameURIDifferentVersion(org.eclipse.papyrus.uml.modelrepair.internal.uripattern.ProfileNamespaceURIPatternTest)  Time elapsed: 0.001 s
13:23:28 compareSingleVersionSameURISameVersion(org.eclipse.papyrus.uml.modelrepair.internal.uripattern.ProfileNamespaceURIPatternTest)  Time elapsed: 0 s
13:23:28 compareMultiVersionSameURIDifferentVersion(org.eclipse.papyrus.uml.modelrepair.internal.uripattern.ProfileNamespaceURIPatternTest)  Time elapsed: 0 s
13:23:28 registryCorrectUnregisterAndRegister(org.eclipse.papyrus.uml.modelrepair.internal.uripattern.ProfileNamespaceURIPatternTest)  Time elapsed: 0 s
13:23:28 registryExtensionPointRegistered(org.eclipse.papyrus.uml.modelrepair.internal.uripattern.ProfileNamespaceURIPatternTest)  Time elapsed: 0 s
13:23:28 compareCorrectInvalidComparisonBehaviorWrongPattern(org.eclipse.papyrus.uml.modelrepair.internal.uripattern.ProfileNamespaceURIPatternTest)  Time elapsed: 0 s
13:23:28 matchNoVersionCorrectURIGivenVersion(org.eclipse.papyrus.uml.modelrepair.internal.uripattern.ProfileNamespaceURIPatternTest)  Time elapsed: 0 s
13:23:28 compareNoVersionDifferentURI(org.eclipse.papyrus.uml.modelrepair.internal.uripattern.ProfileNamespaceURIPatternTest)  Time elapsed: 0 s
13:23:28 matchSingleVersionCorrectURIDefaultVersion(org.eclipse.papyrus.uml.modelrepair.internal.uripattern.ProfileNamespaceURIPatternTest)  Time elapsed: 0 s
13:23:28 matchCorrectNoMatchBehavior(org.eclipse.papyrus.uml.modelrepair.internal.uripattern.ProfileNamespaceURIPatternTest)  Time elapsed: 0 s
13:23:28 interactionOperand_contentProvider(org.eclipse.papyrus.uml.properties.modelelement.tests.UMLModelElementTest)  Time elapsed: 0.092 s
13:23:28 combinedFragment_contentProvider(org.eclipse.papyrus.uml.properties.modelelement.tests.UMLModelElementTest)  Time elapsed: 0.062 s
13:23:28 testObservableValue(org.eclipse.papyrus.uml.properties.databinding.tests.MultiplicityObservableValueTest)  Time elapsed: 0.65 s
13:23:28 testObservableValue(org.eclipse.papyrus.uml.properties.databinding.tests.ExtensionEndMultiplicityObservableValueTest)  Time elapsed: 0.676 s
13:23:28 testObservableValue(org.eclipse.papyrus.uml.properties.databinding.tests.NavigationObservableValueTest)  Time elapsed: 0.655 s
13:23:28 testObservableValue(org.eclipse.papyrus.uml.properties.databinding.tests.OwnerObservableValueTest)  Time elapsed: 0.788 s
13:23:28 testObservableValue(org.eclipse.papyrus.uml.properties.databinding.tests.KeywordObservableValueTest)  Time elapsed: 0.613 s
13:23:28 testObservableValue(org.eclipse.papyrus.uml.properties.databinding.tests.UMLLabelObservableValueTest)  Time elapsed: 0.837 s
13:23:28 testObservableValue(org.eclipse.papyrus.uml.properties.databinding.tests.ImageExpressionObservableValueTest)  Time elapsed: 0.676 s
13:23:28 testObservableValue(org.eclipse.papyrus.uml.properties.databinding.tests.ImageKindObservableValueTest)  Time elapsed: 0.659 s
13:23:28 testObservableValue(org.eclipse.papyrus.uml.properties.databinding.tests.ImageNameObservableValueTest)  Time elapsed: 0.648 s
13:23:28 testObservableValue(org.eclipse.papyrus.uml.properties.databinding.tests.ElementCustomizationElementIconObservableValueTest)  Time elapsed: 0.847 s
13:23:28 testObservableValue(org.eclipse.papyrus.uml.properties.databinding.tests.ElementCustomizationQualifiedNameObservableValueTest)  Time elapsed: 1.019 s
13:23:28 testObservableValue(org.eclipse.papyrus.uml.properties.databinding.tests.ElementCustomizationShadowObservableValueTest)  Time elapsed: 0.865 s
13:23:28 testObservableValue(org.eclipse.papyrus.uml.properties.databinding.tests.ExtensionRequiredObservableValueTest)  Time elapsed: 0.718 s
13:23:28 testObservableValue(org.eclipse.papyrus.uml.properties.databinding.tests.ImportedPackageLocationObservableValueTest)  Time elapsed: 0.568 s
13:23:28 testObservableValue(org.eclipse.papyrus.uml.properties.databinding.tests.UnsettableStringObservableValueTest)  Time elapsed: 0.59 s
13:23:28 testObservableValue(org.eclipse.papyrus.uml.properties.databinding.tests.BasicObservableValueTest)  Time elapsed: 0.613 s
13:23:28 testObservableValue(org.eclipse.papyrus.uml.properties.databinding.tests.AnnotationObservableValueTest)  Time elapsed: 0.78 s
13:23:28 testObservableList(org.eclipse.papyrus.uml.properties.databinding.tests.MaskValueObservableListTest)  Time elapsed: 1.077 s
13:23:28 testObservableList(org.eclipse.papyrus.uml.properties.databinding.tests.AppliedCommentsObservableListTest)  Time elapsed: 1.169 s
13:23:28 testObservableList(org.eclipse.papyrus.uml.properties.databinding.tests.OwnedCommentsObservableListTest)  Time elapsed: 1.203 s
13:23:28 testObservableList(org.eclipse.papyrus.uml.properties.databinding.tests.ProvidedInterfaceObservableListTest)  Time elapsed: 1.763 s
13:23:28 testObservableList(org.eclipse.papyrus.uml.properties.databinding.tests.RequiredInterfaceObservableListTest)  Time elapsed: 0.797 s
13:23:28 testObservableList(org.eclipse.papyrus.uml.properties.databinding.tests.ProfileApplicationObservableListTest)  Time elapsed: 0.941 s
13:23:28 testObservableList(org.eclipse.papyrus.uml.properties.databinding.tests.StereotypeApplicationObservableListTest)  Time elapsed: 0.784 s
13:23:28 testObservableList(org.eclipse.papyrus.uml.properties.databinding.tests.BasicObservableListTest)  Time elapsed: 1.254 s
13:23:28 testObservableValue(org.eclipse.papyrus.uml.diagram.properties.databinding.tests.CanonicalObservableValueTest)  Time elapsed: 1.631 s
13:23:28 testObservableValue(org.eclipse.papyrus.uml.diagram.properties.databinding.tests.ConnectionDecorationStyleObservableValueTest)  Time elapsed: 1.388 s
13:23:28 testObservableValue(org.eclipse.papyrus.uml.diagram.properties.databinding.tests.CustomStringStyleCompartmentObservableValueTest)  Time elapsed: 1.265 s
13:23:28 testObservableValue(org.eclipse.papyrus.uml.diagram.properties.databinding.tests.CustomIntStyleCompartmentObservableValueTest)  Time elapsed: 0.951 s
13:23:28 testObservableValue(org.eclipse.papyrus.uml.diagram.properties.databinding.tests.DiagramLabelObservableValueTest)  Time elapsed: 0.637 s
13:23:28 testObservableValue(org.eclipse.papyrus.uml.diagram.properties.databinding.tests.CustomBooleanStyleWithStoreObservableValueTest)  Time elapsed: 0.642 s
13:23:28 testObservableValue(org.eclipse.papyrus.uml.diagram.properties.databinding.tests.CustomDoubleStyleWithStoreObservableValueTest)  Time elapsed: 0.707 s
13:23:28 testObservableValue(org.eclipse.papyrus.uml.diagram.properties.databinding.tests.CustomIntStyleWithStoreObservableValueTest)  Time elapsed: 0.732 s
13:23:28 testObservableValue(org.eclipse.papyrus.uml.diagram.properties.databinding.tests.RulersUnitStyleObservableValueTest)  Time elapsed: 0.616 s
13:23:28 testObservableValue(org.eclipse.papyrus.uml.diagram.properties.databinding.tests.SwitchOrientationObservableValueTest)  Time elapsed: 1.57 s
13:23:28 outOfDateModelSkipMigration_papyrus(org.eclipse.papyrus.uml.profile.service.ReapplyProfilesServiceTest)  Time elapsed: 1.024 s
13:23:28 upToDateModelDoesNotPromptForMigration_papyrus(org.eclipse.papyrus.uml.profile.service.ReapplyProfilesServiceTest)  Time elapsed: 1.662 s
13:23:28 outOfDateModelDoMigration_dynamic(org.eclipse.papyrus.uml.profile.service.ReapplyProfilesServiceTest)  Time elapsed: 1.274 s
13:23:28 outOfDateModelSkipMigration_uml2(org.eclipse.papyrus.uml.profile.service.ReapplyProfilesServiceTest)  Time elapsed: 1.092 s
13:23:28 outOfDateModelDoMigration_papyrus(org.eclipse.papyrus.uml.profile.service.ReapplyProfilesServiceTest)  Time elapsed: 1.198 s
13:23:28 outOfDateModelSkipMigration_dynamic(org.eclipse.papyrus.uml.profile.service.ReapplyProfilesServiceTest)  Time elapsed: 0.835 s
13:23:28 outOfDateModelDoMigration_uml2(org.eclipse.papyrus.uml.profile.service.ReapplyProfilesServiceTest)  Time elapsed: 1.249 s
13:23:28 upToDateModelDoesNotPromptForMigration_uml2(org.eclipse.papyrus.uml.profile.service.ReapplyProfilesServiceTest)  Time elapsed: 0.93 s
13:23:28 upToDateModelDoesNotPromptForMigration_dynamic(org.eclipse.papyrus.uml.profile.service.ReapplyProfilesServiceTest)  Time elapsed: 0.73 s
13:23:28 loadDecoratorAsMainModel(org.eclipse.papyrus.uml.decoratormodel.tests.ExternalizeProfileApplicationTest)  Time elapsed: 0.553 s
13:23:28 externalizeApplication(org.eclipse.papyrus.uml.decoratormodel.tests.ExternalizeProfileApplicationTest)  Time elapsed: 0.487 s
13:23:28 unloadApplication(org.eclipse.papyrus.uml.decoratormodel.tests.ExternalizeProfileApplicationTest)  Time elapsed: 0.498 s
13:23:28 externalizeApplication_undo(org.eclipse.papyrus.uml.decoratormodel.tests.ExternalizeProfileApplicationTest)  Time elapsed: 0.445 s
13:23:28 unloadedApplicationNotAvailable(org.eclipse.papyrus.uml.decoratormodel.tests.ExternalizeProfileApplicationTest)  Time elapsed: 0.556 s
13:23:28 loadApplication(org.eclipse.papyrus.uml.decoratormodel.tests.ExternalizeProfileApplicationTest)  Time elapsed: 0.515 s
13:23:28 externalizeApplication_undo_redo(org.eclipse.papyrus.uml.decoratormodel.tests.ExternalizeProfileApplicationTest)  Time elapsed: 0.598 s
13:23:28 nestedPackageApplicationOfSameProfile_bug459613(org.eclipse.papyrus.uml.decoratormodel.tests.ExternalizeProfileApplicationTest)  Time elapsed: 2.023 s
13:23:28 externalizeApplication_forNestedPackage(org.eclipse.papyrus.uml.decoratormodel.tests.ExternalizeProfileApplicationTest)  Time elapsed: 0.527 s
13:23:28 internalizeApplication_undo(org.eclipse.papyrus.uml.decoratormodel.tests.InternalizeProfileApplicationTest)  Time elapsed: 0.444 s
13:23:28 internalizeApplication_undo_redo(org.eclipse.papyrus.uml.decoratormodel.tests.InternalizeProfileApplicationTest)  Time elapsed: 0.832 s
13:23:28 internalizeApplication(org.eclipse.papyrus.uml.decoratormodel.tests.InternalizeProfileApplicationTest)  Time elapsed: 0.532 s
13:23:28 migrateProfile(org.eclipse.papyrus.uml.decoratormodel.tests.ProfileMigrationTest)  Time elapsed: 0.723 s
13:23:28 missingSchema(org.eclipse.papyrus.uml.decoratormodel.tests.StereotypeApplicationRepairTest)  Time elapsed: 0.795 s
13:23:28 wrongProfileVersion(org.eclipse.papyrus.uml.decoratormodel.tests.StereotypeApplicationRepairTest)  Time elapsed: 0.558 s
13:23:28 missingProfileApplication(org.eclipse.papyrus.uml.decoratormodel.tests.StereotypeApplicationRepairTest)  Time elapsed: 0.629 s
13:23:28 decoratorModelsForPackageAsync(org.eclipse.papyrus.uml.decoratormodel.internal.resource.tests.DecoratorModelIndexTest)  Time elapsed: 0.564 s
13:23:28 decoratorModelsForPackage_none(org.eclipse.papyrus.uml.decoratormodel.internal.resource.tests.DecoratorModelIndexTest)  Time elapsed: 0.745 s
13:23:28 removeResource(org.eclipse.papyrus.uml.decoratormodel.internal.resource.tests.DecoratorModelIndexTest)  Time elapsed: 0.84 s
13:23:28 decoratorModelsAsync_uri(org.eclipse.papyrus.uml.decoratormodel.internal.resource.tests.DecoratorModelIndexTest)  Time elapsed: 0.925 s
13:23:28 decoratorModelName(org.eclipse.papyrus.uml.decoratormodel.internal.resource.tests.DecoratorModelIndexTest)  Time elapsed: 0.615 s
13:23:28 baseline(org.eclipse.papyrus.uml.decoratormodel.internal.resource.tests.DecoratorModelIndexTest)  Time elapsed: 0.675 s
13:23:28 decoratorModelsForPackage(org.eclipse.papyrus.uml.decoratormodel.internal.resource.tests.DecoratorModelIndexTest)  Time elapsed: 0.628 s
13:23:28 decoratorModelNameAsync(org.eclipse.papyrus.uml.decoratormodel.internal.resource.tests.DecoratorModelIndexTest)  Time elapsed: 0.64 s
13:23:28 appliedProfilesByResourceIndex(org.eclipse.papyrus.uml.decoratormodel.internal.resource.tests.DecoratorModelIndexTest)  Time elapsed: 0.592 s
13:23:28 decoratorModels(org.eclipse.papyrus.uml.decoratormodel.internal.resource.tests.DecoratorModelIndexTest)  Time elapsed: 0.598 s
13:23:28 decoratorModelsAsync(org.eclipse.papyrus.uml.decoratormodel.internal.resource.tests.DecoratorModelIndexTest)  Time elapsed: 0.551 s
13:23:28 allAppliedProfiles(org.eclipse.papyrus.uml.decoratormodel.internal.resource.tests.DecoratorModelIndexTest)  Time elapsed: 0.57 s
13:23:28 decoratorModelNames(org.eclipse.papyrus.uml.decoratormodel.internal.resource.tests.DecoratorModelIndexTest)  Time elapsed: 0.594 s
13:23:28 decoratorModels_uri(org.eclipse.papyrus.uml.decoratormodel.internal.resource.tests.DecoratorModelIndexTest)  Time elapsed: 0.708 s
13:23:28 decoratorModelNamesAsync(org.eclipse.papyrus.uml.decoratormodel.internal.resource.tests.DecoratorModelIndexTest)  Time elapsed: 0.787 s
13:23:28 listener(org.eclipse.papyrus.uml.decoratormodel.internal.resource.tests.DecoratorModelIndexTest)  Time elapsed: 0.907 s
13:23:28 allAppliedProfilesAsync(org.eclipse.papyrus.uml.decoratormodel.internal.resource.tests.DecoratorModelIndexTest)  Time elapsed: 0.469 s
13:23:28 addNewResource(org.eclipse.papyrus.uml.decoratormodel.internal.resource.tests.DecoratorModelIndexTest)  Time elapsed: 1.08 s
13:23:28 decoratorModelsForPackageAsync_none(org.eclipse.papyrus.uml.decoratormodel.internal.resource.tests.DecoratorModelIndexTest)  Time elapsed: 0.692 s
13:23:28 copy_subsetOfProfiles(org.eclipse.papyrus.uml.decoratormodel.internal.resource.tests.DecoratorModelCopierTest)  Time elapsed: 0.881 s
13:23:28 copy_allProfiles(org.eclipse.papyrus.uml.decoratormodel.internal.resource.tests.DecoratorModelCopierTest)  Time elapsed: 0.995 s
13:23:28 testHasUnloadedDecoratorModelsAsync_recursive(org.eclipse.papyrus.uml.decoratormodel.helper.tests.DecoratorModelUtilsTest)  Time elapsed: 0.798 s
13:23:28 testIsDecoratorModelFor(org.eclipse.papyrus.uml.decoratormodel.helper.tests.DecoratorModelUtilsTest)  Time elapsed: 0.457 s
13:23:28 testIsDecoratorModelURI(org.eclipse.papyrus.uml.decoratormodel.helper.tests.DecoratorModelUtilsTest)  Time elapsed: 0.534 s
13:23:28 testInternalizeProfileApplications(org.eclipse.papyrus.uml.decoratormodel.helper.tests.DecoratorModelUtilsTest)  Time elapsed: 0.5 s
13:23:28 testHasUnloadedDecoratorModelsAsync(org.eclipse.papyrus.uml.decoratormodel.helper.tests.DecoratorModelUtilsTest)  Time elapsed: 0.494 s
13:23:28 testExternalizeProfileApplication(org.eclipse.papyrus.uml.decoratormodel.helper.tests.DecoratorModelUtilsTest)  Time elapsed: 0.569 s
13:23:28 testGetDecoratorPackages(org.eclipse.papyrus.uml.decoratormodel.helper.tests.DecoratorModelUtilsTest)  Time elapsed: 0.432 s
13:23:28 testGetDecoratorModelAppliedProfiles(org.eclipse.papyrus.uml.decoratormodel.helper.tests.DecoratorModelUtilsTest)  Time elapsed: 0.493 s
13:23:28 testGetUnloadedDecoratorModelsAsyncResource(org.eclipse.papyrus.uml.decoratormodel.helper.tests.DecoratorModelUtilsTest)  Time elapsed: 0.514 s
13:23:28 testGetExternalizationProfile(org.eclipse.papyrus.uml.decoratormodel.helper.tests.DecoratorModelUtilsTest)  Time elapsed: 0.536 s
13:23:28 testIsDecoratorModelResource(org.eclipse.papyrus.uml.decoratormodel.helper.tests.DecoratorModelUtilsTest)  Time elapsed: 0.405 s
13:23:28 testGetDecoratorModelProfileApplications(org.eclipse.papyrus.uml.decoratormodel.helper.tests.DecoratorModelUtilsTest)  Time elapsed: 0.458 s
13:23:28 testGetUnloadedDecoratorModelsAsyncPackage(org.eclipse.papyrus.uml.decoratormodel.helper.tests.DecoratorModelUtilsTest)  Time elapsed: 0.682 s
13:23:28 testGetLoadedDecoratorModels(org.eclipse.papyrus.uml.decoratormodel.helper.tests.DecoratorModelUtilsTest)  Time elapsed: 0.451 s
13:23:28 testGetLoadedSubUnitPackages(org.eclipse.papyrus.uml.decoratormodel.helper.tests.DecoratorModelUtilsTest)  Time elapsed: 0.395 s
13:23:28 testGetUnloadedDecoratorModels(org.eclipse.papyrus.uml.decoratormodel.helper.tests.DecoratorModelUtilsTest)  Time elapsed: 0.501 s
13:23:28 testHasExternalizationProfile(org.eclipse.papyrus.uml.decoratormodel.helper.tests.DecoratorModelUtilsTest)  Time elapsed: 3.399 s
13:23:28 testGetUnloadedDecoratorModelsAsyncIterableOfResource(org.eclipse.papyrus.uml.decoratormodel.helper.tests.DecoratorModelUtilsTest)  Time elapsed: 1.207 s
13:23:28 testGetUserModelResources(org.eclipse.papyrus.uml.decoratormodel.helper.tests.DecoratorModelUtilsTest)  Time elapsed: 0.475 s
13:23:28 testGetDecoratorProfileApplications(org.eclipse.papyrus.uml.decoratormodel.helper.tests.DecoratorModelUtilsTest)  Time elapsed: 0.443 s
13:23:28 stereotypeApplication_inNestedPackage(org.eclipse.papyrus.uml.decoratormodel.helper.tests.PapyrusStereotypeApplicationHelperTest)  Time elapsed: 0.172 s
13:23:28 stereotypeApplication_inNonPackageSubmodelUnit_bug459613(org.eclipse.papyrus.uml.decoratormodel.helper.tests.PapyrusStereotypeApplicationHelperTest)  Time elapsed: 0.2 s
13:23:28 applyStereotype_resourceSet(org.eclipse.papyrus.uml.decoratormodel.helper.tests.PapyrusStereotypeApplicationHelperTest)  Time elapsed: 0.165 s
13:23:28 applyStereotype_freeFloating(org.eclipse.papyrus.uml.decoratormodel.helper.tests.PapyrusStereotypeApplicationHelperTest)  Time elapsed: 0.165 s
13:23:28 isDecoratorModel_decoratorModelUML(org.eclipse.papyrus.uml.decoratormodel.internal.expressions.tests.FilePropertyTesterTest)  Time elapsed: 0.396 s
13:23:28 isDecoratorModel_decoratorModelNotation(org.eclipse.papyrus.uml.decoratormodel.internal.expressions.tests.FilePropertyTesterTest)  Time elapsed: 0.341 s
13:23:28 isDecoratorModel_userModelUML(org.eclipse.papyrus.uml.decoratormodel.internal.expressions.tests.FilePropertyTesterTest)  Time elapsed: 0.406 s
13:23:28 decoratorIndexing(org.eclipse.papyrus.uml.decoratormodel.internal.resource.index.tests.ProfileIndexTest)  Time elapsed: 0.402 s
13:23:28 userModelIndexing(org.eclipse.papyrus.uml.decoratormodel.internal.resource.index.tests.ProfileIndexTest)  Time elapsed: 0 s
13:23:28 decoratorAsUserModelIndexing(org.eclipse.papyrus.uml.decoratormodel.internal.resource.index.tests.ProfileIndexTest)  Time elapsed: 0 s
13:23:28 migrateProfileExtendingDynamic_bug481302(org.eclipse.papyrus.uml.decoratormodel.tests.RegressionTest)  Time elapsed: 0.458 s
13:23:28 basicUMLMigrateProfileExtendingStatic_bug481302(org.eclipse.papyrus.uml.decoratormodel.tests.RegressionTest) skipped
13:23:28 migrateProfileExtendingStatic_bug481302(org.eclipse.papyrus.uml.decoratormodel.tests.RegressionTest)  Time elapsed: 0.344 s
13:23:28 control_undo_redo_allDecoratorsLoaded(org.eclipse.papyrus.uml.decoratormodel.controlmode.tests.ControlModeWithDecoratorModelsTest)  Time elapsed: 1.198 s
13:23:28 uncontrol_undo_redo_allDecoratorsUnloaded(org.eclipse.papyrus.uml.decoratormodel.controlmode.tests.ControlModeWithDecoratorModelsTest)  Time elapsed: 3.387 s
13:23:28 control_someDecoratorsLoaded(org.eclipse.papyrus.uml.decoratormodel.controlmode.tests.ControlModeWithDecoratorModelsTest)  Time elapsed: 1.572 s
13:23:28 uncontrol_someDecoratorsLoaded(org.eclipse.papyrus.uml.decoratormodel.controlmode.tests.ControlModeWithDecoratorModelsTest)  Time elapsed: 1.76 s
13:23:28 uncontrol_allDecoratorsUnloaded(org.eclipse.papyrus.uml.decoratormodel.controlmode.tests.ControlModeWithDecoratorModelsTest)  Time elapsed: 2.065 s
13:23:28 control_undo_redo_someDecoratorsLoaded(org.eclipse.papyrus.uml.decoratormodel.controlmode.tests.ControlModeWithDecoratorModelsTest)  Time elapsed: 2.773 s
13:23:28 control_allDecoratorsLoaded(org.eclipse.papyrus.uml.decoratormodel.controlmode.tests.ControlModeWithDecoratorModelsTest)  Time elapsed: 0.715 s
13:23:28 control_undo_redo_allDecoratorsUnloaded(org.eclipse.papyrus.uml.decoratormodel.controlmode.tests.ControlModeWithDecoratorModelsTest)  Time elapsed: 3.013 s
13:23:28 control_allDecoratorsUnloaded(org.eclipse.papyrus.uml.decoratormodel.controlmode.tests.ControlModeWithDecoratorModelsTest)  Time elapsed: 1.48 s
13:23:28 uncontrol_undo_redo_someDecoratorsLoaded(org.eclipse.papyrus.uml.decoratormodel.controlmode.tests.ControlModeWithDecoratorModelsTest)  Time elapsed: 2.756 s
13:23:28 uncontrol_undo_redo_allDecoratorsLoaded(org.eclipse.papyrus.uml.decoratormodel.controlmode.tests.ControlModeWithDecoratorModelsTest)  Time elapsed: 0.755 s
13:23:28 uncontrol_allDecoratorsLoaded(org.eclipse.papyrus.uml.decoratormodel.controlmode.tests.ControlModeWithDecoratorModelsTest)  Time elapsed: 0.827 s
13:23:28 nonBaseElementStereotypeCrossReferences(org.eclipse.papyrus.uml.decoratormodel.controlmode.tests.AdditionalModelStructuresTest)  Time elapsed: 1.118 s
13:23:28 classUnitExternalizeParentUnitProfileApplication_bug459613(org.eclipse.papyrus.uml.decoratormodel.controlmode.tests.AdditionalModelStructuresTest)  Time elapsed: 0.379 s
13:23:28 nestedPackagesInheritingExternalProfileApplications(org.eclipse.papyrus.uml.decoratormodel.controlmode.tests.AdditionalModelStructuresTest)  Time elapsed: 1.824 s
13:23:28 validateOCLOnInstanceSpec(org.eclipse.papyrus.uml.validation.tests.rules.TestOCLConstraintOnInstanceSpec)  Time elapsed: 3.979 s
13:23:28 validateCamelCaseRule(org.eclipse.papyrus.uml.validation.tests.rules.TestOCLValidationRuleFromFile)  Time elapsed: 0.961 s
13:23:28 validateIsActiveOCLRule_inactiveClass(org.eclipse.papyrus.uml.validation.tests.rules.TestValidationRulesInPluginXML)  Time elapsed: 1.836 s
13:23:28 validateIsPassiveJavaRule_inactiveClass(org.eclipse.papyrus.uml.validation.tests.rules.TestValidationRulesInPluginXML)  Time elapsed: 1.382 s
13:23:28 validateIsPassiveJavaRule_activeClass(org.eclipse.papyrus.uml.validation.tests.rules.TestValidationRulesInPluginXML)  Time elapsed: 1.78 s
13:23:28 validateMalformedActiveRule_notActiveCapsule(org.eclipse.papyrus.uml.validation.tests.rules.TestValidationRulesInProfile)  Time elapsed: 2.186 s
13:23:28 validateIsActiveRule_notActiveCapsule(org.eclipse.papyrus.uml.validation.tests.rules.TestValidationRulesInProfile)  Time elapsed: 1.891 s
13:23:28 validateIsActiveRule_ActiveCapsule(org.eclipse.papyrus.uml.validation.tests.rules.TestValidationRulesInProfile)  Time elapsed: 1.777 s
13:23:28 validateNameClashDetection(org.eclipse.papyrus.uml.validation.tests.rules.TestUMLValidationRules)  Time elapsed: 1.263 s
13:23:28 validateNonStandardMultiplicity(org.eclipse.papyrus.uml.validation.tests.rules.TestUMLValidationRules)  Time elapsed: 0.918 s
13:23:28 validateUnsetStereotypeAttribute(org.eclipse.papyrus.uml.validation.tests.rules.TestStereotypeValidation)  Time elapsed: 1.363 s
13:23:28 testResolveProfile__Object(org.eclipse.papyrus.uml.filters.tests.ProfileAppliedTest)  Time elapsed: 0.035 s
13:23:28 testMatches__Object(org.eclipse.papyrus.uml.filters.tests.ProfileAppliedTest)  Time elapsed: 0.014 s
13:23:28 profileAppliedFilterResourceURI_bug480221(org.eclipse.papyrus.uml.filters.tests.ProfileAppliedRegressionTest)  Time elapsed: 0.024 s
13:23:28 profileAppliedFilterDoesNotLoadProfiles_miss_bug480221(org.eclipse.papyrus.uml.filters.tests.ProfileAppliedRegressionTest)  Time elapsed: 0.021 s
13:23:28 profileAppliedFilterDoesNotLoadProfiles_hit_bug480221(org.eclipse.papyrus.uml.filters.tests.ProfileAppliedRegressionTest)  Time elapsed: 0.021 s
13:23:28 popupsGenerated(org.eclipse.papyrus.uml.profile.assistants.generator.tests.BasicAssistantsGenerationTest)  Time elapsed: 0.017 s
13:23:28 connectionTargetFilters(org.eclipse.papyrus.uml.profile.assistants.generator.tests.BasicAssistantsGenerationTest)  Time elapsed: 0.006 s
13:23:28 popupFilters(org.eclipse.papyrus.uml.profile.assistants.generator.tests.BasicAssistantsGenerationTest)  Time elapsed: 0.001 s
13:23:28 connectionSourceFilters(org.eclipse.papyrus.uml.profile.assistants.generator.tests.BasicAssistantsGenerationTest)  Time elapsed: 0.001 s
13:23:28 connectionsGenerated(org.eclipse.papyrus.uml.profile.assistants.generator.tests.BasicAssistantsGenerationTest)  Time elapsed: 0.001 s
13:23:28 popupsGenerated(org.eclipse.papyrus.uml.profile.assistants.generator.tests.DiagramSpecificAssistantsGenerationTest)  Time elapsed: 0.027 s
13:23:28 connectionTargetFilters(org.eclipse.papyrus.uml.profile.assistants.generator.tests.DiagramSpecificAssistantsGenerationTest)  Time elapsed: 0.004 s
13:23:28 distinctConnectionHintsGenerated(org.eclipse.papyrus.uml.profile.assistants.generator.tests.DiagramSpecificAssistantsGenerationTest)  Time elapsed: 0.002 s
13:23:28 popupFilters(org.eclipse.papyrus.uml.profile.assistants.generator.tests.DiagramSpecificAssistantsGenerationTest)  Time elapsed: 0.001 s
13:23:28 connectionSourceFilters(org.eclipse.papyrus.uml.profile.assistants.generator.tests.DiagramSpecificAssistantsGenerationTest)  Time elapsed: 0.001 s
13:23:28 distinctPopupHintsGenerated(org.eclipse.papyrus.uml.profile.assistants.generator.tests.DiagramSpecificAssistantsGenerationTest)  Time elapsed: 0 s
13:23:28 connectionsGenerated(org.eclipse.papyrus.uml.profile.assistants.generator.tests.DiagramSpecificAssistantsGenerationTest)  Time elapsed: 0 s
13:23:28 popupsGenerated(org.eclipse.papyrus.uml.profile.assistants.generator.tests.ProfilesWithPackageNestingTest)  Time elapsed: 0.003 s
13:23:28 connectionTargetFilters(org.eclipse.papyrus.uml.profile.assistants.generator.tests.ProfilesWithPackageNestingTest)  Time elapsed: 0.002 s
13:23:28 popupFilters(org.eclipse.papyrus.uml.profile.assistants.generator.tests.ProfilesWithPackageNestingTest)  Time elapsed: 0 s
13:23:28 connectionSourceFilters(org.eclipse.papyrus.uml.profile.assistants.generator.tests.ProfilesWithPackageNestingTest)  Time elapsed: 0.001 s
13:23:28 connectionsGenerated(org.eclipse.papyrus.uml.profile.assistants.generator.tests.ProfilesWithPackageNestingTest)  Time elapsed: 0 s
13:23:28 connectionsGenerated[<<Indirect>> Generalization](org.eclipse.papyrus.uml.profile.assistants.generator.tests.ConnectionTypesTest)  Time elapsed: 0.003 s
13:23:28 connectionsGenerated[<<Indirect>> GeneralizationSet](org.eclipse.papyrus.uml.profile.assistants.generator.tests.ConnectionTypesTest)  Time elapsed: 0 s
13:23:28 connectionsGenerated[<<Virtual>> ControlFlow](org.eclipse.papyrus.uml.profile.assistants.generator.tests.ConnectionTypesTest)  Time elapsed: 0 s
13:23:28 connectionsGenerated[<<Virtual>> ObjectFlow](org.eclipse.papyrus.uml.profile.assistants.generator.tests.ConnectionTypesTest)  Time elapsed: 0 s
13:23:28 connectionsGenerated[<<Virtual>> Transition](org.eclipse.papyrus.uml.profile.assistants.generator.tests.ConnectionTypesTest)  Time elapsed: 0 s
13:23:28 connectionsGenerated[<<Virtual>> Message](org.eclipse.papyrus.uml.profile.assistants.generator.tests.ConnectionTypesTest)  Time elapsed: 0 s
13:23:28 connectionsGenerated[<<Indirect>> Connector](org.eclipse.papyrus.uml.profile.assistants.generator.tests.ConnectionTypesTest)  Time elapsed: 0 s
13:23:28 iconGenerated(org.eclipse.papyrus.uml.profile.types.generator.tests.BasicElementTypesGenerationTest)  Time elapsed: 0.013 s
13:23:28 elementTypeSpecializedTypes_bug461717(org.eclipse.papyrus.uml.profile.types.generator.tests.BasicElementTypesGenerationTest)  Time elapsed: 0.013 s
13:23:28 multipleElementTypesForOneStereotypeGenerated(org.eclipse.papyrus.uml.profile.types.generator.tests.BasicElementTypesGenerationTest)  Time elapsed: 0 s
13:23:28 stereotypeAdviceGenerated(org.eclipse.papyrus.uml.profile.types.generator.tests.BasicElementTypesGenerationTest)  Time elapsed: 0.001 s
13:23:28 elementTypesGenerated(org.eclipse.papyrus.uml.profile.types.generator.tests.BasicElementTypesGenerationTest)  Time elapsed: 0.001 s
13:23:28 stereotypeMatcherGenerated(org.eclipse.papyrus.uml.profile.types.generator.tests.BasicElementTypesGenerationTest)  Time elapsed: 0 s
13:23:28 stereotypeAdviceNotGenerated(org.eclipse.papyrus.uml.profile.types.generator.tests.DiagramSpecificElementTypesGenerationTest)  Time elapsed: 0.004 s
13:23:28 distinctHintsGenerated(org.eclipse.papyrus.uml.profile.types.generator.tests.DiagramSpecificElementTypesGenerationTest)  Time elapsed: 0.003 s
13:23:28 stereotypeMatcherNotGenerated(org.eclipse.papyrus.uml.profile.types.generator.tests.DiagramSpecificElementTypesGenerationTest)  Time elapsed: 0 s
13:23:28 iconGenerated(org.eclipse.papyrus.uml.profile.types.generator.tests.DiagramSpecificElementTypesGenerationTest)  Time elapsed: 0.001 s
13:23:28 elementTypeSpecializedTypes_bug461717(org.eclipse.papyrus.uml.profile.types.generator.tests.DiagramSpecificElementTypesGenerationTest)  Time elapsed: 0.024 s
13:23:28 elementTypesGenerated(org.eclipse.papyrus.uml.profile.types.generator.tests.DiagramSpecificElementTypesGenerationTest)  Time elapsed: 0 s
13:23:28 iconGenerated(org.eclipse.papyrus.uml.profile.types.generator.tests.ProfilesWithPackageNestingTest)  Time elapsed: 0.007 s
13:23:28 stereotypeAdviceGenerated(org.eclipse.papyrus.uml.profile.types.generator.tests.ProfilesWithPackageNestingTest)  Time elapsed: 0 s
13:23:28 elementTypesGenerated(org.eclipse.papyrus.uml.profile.types.generator.tests.ProfilesWithPackageNestingTest)  Time elapsed: 0 s
13:23:28 stereotypeMatcherGenerated(org.eclipse.papyrus.uml.profile.types.generator.tests.ProfilesWithPackageNestingTest)  Time elapsed: 0 s
13:23:28 elementTypeSpecializedTypes(org.eclipse.papyrus.uml.profile.types.generator.tests.DiagramSpecificElementTypesGenerationBug461717Test)  Time elapsed: 0.044 s
13:23:28 stereotypeAdviceGenerated(org.eclipse.papyrus.uml.profile.types.generator.tests.DiagramSpecificElementTypesGenerationBug461717Test)  Time elapsed: 0.001 s
13:23:28 stereotypeMatcherGenerated(org.eclipse.papyrus.uml.profile.types.generator.tests.DiagramSpecificElementTypesGenerationBug461717Test)  Time elapsed: 0.001 s
13:23:28 testGetStereotypeNames(org.eclipse.papyrus.uml.profile.drafter.tests.ProfileCatalogTest)  Time elapsed: 0.06 s
13:23:28 testGetStereotypes(org.eclipse.papyrus.uml.profile.drafter.tests.ProfileCatalogTest)  Time elapsed: 0.036 s
13:23:28 testGetAllStereotypeNames(org.eclipse.papyrus.uml.profile.drafter.tests.ProfileCatalogTest) skipped
13:23:28 testGetProfileNames(org.eclipse.papyrus.uml.profile.drafter.tests.ProfileCatalogTest)  Time elapsed: 0.063 s
13:23:28 testProfileCatalog(org.eclipse.papyrus.uml.profile.drafter.tests.ProfileCatalogTest)  Time elapsed: 0.073 s
13:23:28 testLookupStereotype(org.eclipse.papyrus.uml.profile.drafter.tests.ProfileCatalogTest)  Time elapsed: 0.054 s
13:23:28 testLookupStereotypeInAppliedProfile(org.eclipse.papyrus.uml.profile.drafter.tests.ProfileCatalogTest)  Time elapsed: 0.039 s
13:23:28 testProfileCopy(org.eclipse.papyrus.uml.profile.drafter.tests.ProfileCatalogTest)  Time elapsed: 0.032 s
13:23:28 testGetProfiles(org.eclipse.papyrus.uml.profile.drafter.tests.ProfileCatalogTest)  Time elapsed: 0.968 s
13:23:28 testGetNamedElement(org.eclipse.papyrus.uml.profile.drafter.tests.ProfileCatalogTest)  Time elapsed: 0.129 s
13:23:28 testIsModelsExist(org.eclipse.papyrus.uml.profile.drafter.tests.ProfileCatalogTest)  Time elapsed: 0.055 s
13:23:28 testGetStereotypeQualifiedNames(org.eclipse.papyrus.uml.profile.drafter.tests.ProfileCatalogTest)  Time elapsed: 0.058 s
13:23:28 testGetProfileQualifiedNames(org.eclipse.papyrus.uml.profile.drafter.tests.ProfileCatalogTest)  Time elapsed: 0.059 s
13:23:28 testCopyResources(org.eclipse.papyrus.uml.profile.drafter.tests.EclipseProjectTest)  Time elapsed: 0.139 s
13:23:28 testCopyResource(org.eclipse.papyrus.uml.profile.drafter.tests.EclipseProjectTest)  Time elapsed: 0.004 s
13:23:28 testGetProject(org.eclipse.papyrus.uml.profile.drafter.tests.EclipseProjectTest)  Time elapsed: 0 s
13:23:28 testEclipseProject(org.eclipse.papyrus.uml.profile.drafter.tests.EclipseProjectTest)  Time elapsed: 0 s
13:23:28 testGetUmlModelWithIFile(org.eclipse.papyrus.uml.profile.drafter.tests.ModelSetManagerTest)  Time elapsed: 0.067 s
13:23:28 testModelSetManagerString(org.eclipse.papyrus.uml.profile.drafter.tests.ModelSetManagerTest)  Time elapsed: 0.006 s
13:23:28 testModelSetManagerURI(org.eclipse.papyrus.uml.profile.drafter.tests.ModelSetManagerTest)  Time elapsed: 0.007 s
13:23:28 testGetNamedElementByNameString(org.eclipse.papyrus.uml.profile.drafter.tests.ModelSetManagerTest)  Time elapsed: 0.01 s
13:23:28 testGetUmlModel(org.eclipse.papyrus.uml.profile.drafter.tests.ModelSetManagerTest)  Time elapsed: 0.19 s
13:23:28 testModelSetManagerStringModels(org.eclipse.papyrus.uml.profile.drafter.tests.ModelSetManagerTest)  Time elapsed: 0.003 s
13:23:28 testGetNamedElementByNameWithSterotype(org.eclipse.papyrus.uml.profile.drafter.tests.ModelSetManagerTest)  Time elapsed: 0.054 s
13:23:28 testCreation(org.eclipse.papyrus.uml.profile.drafter.tests.utils.UMLModelCreatorTest)  Time elapsed: 0.004 s
13:23:28 testCreateClass(org.eclipse.papyrus.uml.profile.drafter.tests.utils.UMLModelCreatorTest)  Time elapsed: 0 s
13:23:28 testCreateModel(org.eclipse.papyrus.uml.profile.drafter.tests.utils.UMLModelCreatorTest)  Time elapsed: 0 s
13:23:28 testCreatePackage(org.eclipse.papyrus.uml.profile.drafter.tests.utils.UMLModelCreatorTest)  Time elapsed: 0 s
13:23:28 testCd(org.eclipse.papyrus.uml.profile.drafter.tests.utils.UMLModelCreatorTest)  Time elapsed: 0.001 s
13:23:28 testUMLModelCreatorResourceFailing(org.eclipse.papyrus.uml.profile.drafter.tests.utils.UMLModelCreatorTest)  Time elapsed: 0 s
13:23:28 testUMLModelCreatorStringString(org.eclipse.papyrus.uml.profile.drafter.tests.utils.UMLModelCreatorTest)  Time elapsed: 0 s
13:23:28 testUMLModelCreatorResource(org.eclipse.papyrus.uml.profile.drafter.tests.utils.UMLModelCreatorTest)  Time elapsed: 0 s
13:23:28 testCreateDatatype(org.eclipse.papyrus.uml.profile.drafter.tests.utils.UMLModelCreatorTest)  Time elapsed: 0.001 s
13:23:28 testCompoundTypeProvider(org.eclipse.papyrus.uml.profile.drafter.ui.model.CompoundTypeProviderTest)  Time elapsed: 0.002 s
13:23:28 testGetTypes(org.eclipse.papyrus.uml.profile.drafter.ui.model.CompoundTypeProviderTest)  Time elapsed: 0 s
13:23:28 testAddITypeProvider(org.eclipse.papyrus.uml.profile.drafter.ui.model.CompoundTypeProviderTest)  Time elapsed: 0 s
13:23:28 testIterator(org.eclipse.papyrus.uml.profile.drafter.ui.model.CompoundTypeProviderTest)  Time elapsed: 0 s
13:23:28 testVisitMetaclassesModel(org.eclipse.papyrus.uml.profile.drafter.ui.model.SimpleModelVisitorTest) skipped
13:23:28 testVisitPropertyModel(org.eclipse.papyrus.uml.profile.drafter.ui.model.SimpleModelVisitorTest) skipped
13:23:28 testSimpleModelVisitor(org.eclipse.papyrus.uml.profile.drafter.ui.model.SimpleModelVisitorTest)  Time elapsed: 0.002 s
13:23:28 testDoVisitStereoptypeModel(org.eclipse.papyrus.uml.profile.drafter.ui.model.SimpleModelVisitorTest) skipped
13:23:28 testDoVisitPropertyModel(org.eclipse.papyrus.uml.profile.drafter.ui.model.SimpleModelVisitorTest) skipped
13:23:28 testVisitStereoptypeModel(org.eclipse.papyrus.uml.profile.drafter.ui.model.SimpleModelVisitorTest) skipped
13:23:28 testDoVisitMetaclassesModel(org.eclipse.papyrus.uml.profile.drafter.ui.model.SimpleModelVisitorTest) skipped
13:23:28 testSetStereotypeName(org.eclipse.papyrus.uml.profile.drafter.ui.model.StereotypeURLTest)  Time elapsed: 0.028 s
13:23:28 testGetProfileName(org.eclipse.papyrus.uml.profile.drafter.ui.model.StereotypeURLTest)  Time elapsed: 0 s
13:23:28 testAddPropertyChangeListenerPropertyChangeListener(org.eclipse.papyrus.uml.profile.drafter.ui.model.StereotypeURLTest)  Time elapsed: 0.001 s
13:23:28 testSetQualifiedNameComplex(org.eclipse.papyrus.uml.profile.drafter.ui.model.StereotypeURLTest)  Time elapsed: 0 s
13:23:28 testClear(org.eclipse.papyrus.uml.profile.drafter.ui.model.StereotypeURLTest)  Time elapsed: 0 s
13:23:28 testStereotypeURLString(org.eclipse.papyrus.uml.profile.drafter.ui.model.StereotypeURLTest)  Time elapsed: 0 s
13:23:28 testToString(org.eclipse.papyrus.uml.profile.drafter.ui.model.StereotypeURLTest)  Time elapsed: 0 s
13:23:28 testGetStereotypeName(org.eclipse.papyrus.uml.profile.drafter.ui.model.StereotypeURLTest)  Time elapsed: 0 s
13:23:28 testAddPropertyChangeListenerStringPropertyChangeListener(org.eclipse.papyrus.uml.profile.drafter.ui.model.StereotypeURLTest)  Time elapsed: 0 s
13:23:28 testStereotypeURL(org.eclipse.papyrus.uml.profile.drafter.ui.model.StereotypeURLTest)  Time elapsed: 0 s
13:23:28 testRemovePropertyChangeListenerPropertyChangeListener(org.eclipse.papyrus.uml.profile.drafter.ui.model.StereotypeURLTest)  Time elapsed: 0 s
13:23:28 testSetQualifiedNameSimple(org.eclipse.papyrus.uml.profile.drafter.ui.model.StereotypeURLTest)  Time elapsed: 0 s
13:23:28 testSetProfileName(org.eclipse.papyrus.uml.profile.drafter.ui.model.StereotypeURLTest)  Time elapsed: 0 s
13:23:28 testRemovePropertyChangeListenerStringPropertyChangeListener(org.eclipse.papyrus.uml.profile.drafter.ui.model.StereotypeURLTest)  Time elapsed: 0.001 s
13:23:28 testComputeQualifiedName(org.eclipse.papyrus.uml.profile.drafter.ui.model.StereotypeURLTest)  Time elapsed: 0 s
13:23:28 testGetQualifiedName(org.eclipse.papyrus.uml.profile.drafter.ui.model.StereotypeURLTest)  Time elapsed: 0.001 s
13:23:28 testStereotypeURLStringString(org.eclipse.papyrus.uml.profile.drafter.ui.model.StereotypeURLTest)  Time elapsed: 0 s
13:23:28 testGetTypes(org.eclipse.papyrus.uml.profile.drafter.ui.model.TypeProviderTest)  Time elapsed: 0.002 s
13:23:28 testTypeProvider(org.eclipse.papyrus.uml.profile.drafter.ui.model.TypeProviderTest)  Time elapsed: 0.001 s
13:23:28 testIterator(org.eclipse.papyrus.uml.profile.drafter.ui.model.TypeProviderTest)  Time elapsed: 0 s
13:23:28 testGetTypes(org.eclipse.papyrus.uml.profile.drafter.ui.model.TypeProviderTest2)  Time elapsed: 0 s
13:23:28 testAddType(org.eclipse.papyrus.uml.profile.drafter.ui.model.TypeProviderTest2)  Time elapsed: 0 s
13:23:28 testAddTypeFromConstructor(org.eclipse.papyrus.uml.profile.drafter.ui.model.TypeProviderTest2)  Time elapsed: 0 s
13:23:28 testTypeProvider(org.eclipse.papyrus.uml.profile.drafter.ui.model.TypeProviderTest2)  Time elapsed: 0 s
13:23:28 testTypeProviderTypeArray(org.eclipse.papyrus.uml.profile.drafter.ui.model.TypeProviderTest2)  Time elapsed: 0 s
13:23:28 testIterator(org.eclipse.papyrus.uml.profile.drafter.ui.model.TypeProviderTest2)  Time elapsed: 0 s
13:23:28 testUMLPrimitiveTypesModel(org.eclipse.papyrus.uml.profile.drafter.utils.UMLPrimitiveTypesModelTest)  Time elapsed: 0.016 s
13:23:28 testGetLibraryPackage(org.eclipse.papyrus.uml.profile.drafter.utils.UMLPrimitiveTypesModelTest)  Time elapsed: 0.016 s
13:23:28 testUseInternationalizationModification(org.eclipse.papyrus.uml.internationalization.tests.tests.UMLInternationalizationChangePreferencesTest)  Time elapsed: 1.285 s
13:23:28 testLanguageModification(org.eclipse.papyrus.uml.internationalization.tests.tests.UMLInternationalizationChangeLanguageTest)  Time elapsed: 1.227 s
13:23:28 rebuildAdapters(org.eclipse.papyrus.uml.internationalization.tests.tests.InternationalizationUMLItemProviderAdapterFactoryTest)  Time elapsed: 1.003 s
13:23:28 normalAdapters(org.eclipse.papyrus.uml.internationalization.tests.tests.InternationalizationUMLItemProviderAdapterFactoryTest)  Time elapsed: 0.924 s
13:23:28 testLabelProviderAdapter(org.eclipse.papyrus.uml.internationalization.tests.tests.InternationalizationAdapterTest)  Time elapsed: 0.003 s
13:23:28 testMapping(org.eclipse.papyrus.uml.alf.tests.mapper.MappingTest) skipped
13:23:28 org.eclipse.papyrus.uml.alf.tests.mapper.MappingTest skipped
13:23:28 testMerging(org.eclipse.papyrus.uml.alf.tests.mapper.MergeTest) skipped
13:23:28 org.eclipse.papyrus.uml.alf.tests.mapper.MergeTest skipped
13:23:28 testStaticSemantics(org.eclipse.papyrus.uml.alf.tests.SemanticTest) skipped
13:23:28 org.eclipse.papyrus.uml.alf.tests.SemanticTest skipped
13:23:28 testOneFile(org.eclipse.papyrus.uml.alf.tests.SingleTest) skipped
13:23:28 org.eclipse.papyrus.uml.alf.tests.SingleTest skipped
13:23:28 testSyntax(org.eclipse.papyrus.uml.alf.tests.SyntacticTest) skipped
13:23:28 org.eclipse.papyrus.uml.alf.tests.SyntacticTest skipped
13:23:28 testGeneration(org.eclipse.papyrus.uml.alf.tests.generator.GenerationTest) skipped
13:23:28 org.eclipse.papyrus.uml.alf.tests.generator.GenerationTest skipped
13:23:28 org.eclipse.papyrus.uml.alf.tests.AllTests skipped
13:23:28 IsStereotypedWithExpression_Test10(org.eclipse.papyrus.uml.expressions.tests.IsStereotypedWithExpressionTests)  Time elapsed: 1.116 s
13:23:28 IsStereotypedWithExpression_Test11(org.eclipse.papyrus.uml.expressions.tests.IsStereotypedWithExpressionTests)  Time elapsed: 1.258 s
13:23:28 IsStereotypedWithExpression_Test12(org.eclipse.papyrus.uml.expressions.tests.IsStereotypedWithExpressionTests)  Time elapsed: 1.054 s
13:23:28 IsStereotypedWithExpression_Test13(org.eclipse.papyrus.uml.expressions.tests.IsStereotypedWithExpressionTests)  Time elapsed: 1.129 s
13:23:28 IsStereotypedWithExpression_Test1(org.eclipse.papyrus.uml.expressions.tests.IsStereotypedWithExpressionTests)  Time elapsed: 1.164 s
13:23:28 IsStereotypedWithExpression_Test2(org.eclipse.papyrus.uml.expressions.tests.IsStereotypedWithExpressionTests)  Time elapsed: 1.442 s
13:23:28 IsStereotypedWithExpression_Test3(org.eclipse.papyrus.uml.expressions.tests.IsStereotypedWithExpressionTests)  Time elapsed: 1.416 s
13:23:28 IsStereotypedWithExpression_Test4(org.eclipse.papyrus.uml.expressions.tests.IsStereotypedWithExpressionTests)  Time elapsed: 1.212 s
13:23:28 IsStereotypedWithExpression_Test5(org.eclipse.papyrus.uml.expressions.tests.IsStereotypedWithExpressionTests)  Time elapsed: 1.267 s
13:23:28 IsStereotypedWithExpression_Test6(org.eclipse.papyrus.uml.expressions.tests.IsStereotypedWithExpressionTests)  Time elapsed: 1.182 s
13:23:28 IsStereotypedWithExpression_Test7(org.eclipse.papyrus.uml.expressions.tests.IsStereotypedWithExpressionTests)  Time elapsed: 1.287 s
13:23:28 IsStereotypedWithExpression_Test8(org.eclipse.papyrus.uml.expressions.tests.IsStereotypedWithExpressionTests)  Time elapsed: 1.731 s
13:23:28 IsStereotypedWithExpression_Test9(org.eclipse.papyrus.uml.expressions.tests.IsStereotypedWithExpressionTests)  Time elapsed: 1.547 s
13:23:28 HasStereotypeExpressionTests_Test1(org.eclipse.papyrus.uml.expressions.tests.HasAppliedStereotypeExpressionTests)  Time elapsed: 1.226 s
13:23:28 HasStereotypeExpressionTests_Test2(org.eclipse.papyrus.uml.expressions.tests.HasAppliedStereotypeExpressionTests)  Time elapsed: 1.27 s
13:23:28 HasStereotypeExpressionTests_Test3(org.eclipse.papyrus.uml.expressions.tests.HasAppliedStereotypeExpressionTests)  Time elapsed: 1.154 s
13:23:28 HasStereotypeExpressionTests_Test4(org.eclipse.papyrus.uml.expressions.tests.HasAppliedStereotypeExpressionTests)  Time elapsed: 1.021 s
13:23:28 metaclassAndNoContext(org.eclipse.papyrus.uml.expressions.tests.IsKindOfExpressionTest)  Time elapsed: 0.009 s
13:23:28 noMetaclassAndNoContextTest(org.eclipse.papyrus.uml.expressions.tests.IsKindOfExpressionTest)  Time elapsed: 0 s
13:23:28 metaclassAndValidContext_1(org.eclipse.papyrus.uml.expressions.tests.IsKindOfExpressionTest)  Time elapsed: 0 s
13:23:28 metaclassAndValidContext_2(org.eclipse.papyrus.uml.expressions.tests.IsKindOfExpressionTest)  Time elapsed: 0 s
13:23:28 metaclassAndInvalidContext(org.eclipse.papyrus.uml.expressions.tests.IsKindOfExpressionTest)  Time elapsed: 0 s
13:23:28 metaclassAndNoContext(org.eclipse.papyrus.uml.expressions.tests.IsTypeOfExpressionTests)  Time elapsed: 0.002 s
13:23:28 noMetaclassAndNoContextTest(org.eclipse.papyrus.uml.expressions.tests.IsTypeOfExpressionTests)  Time elapsed: 0 s
13:23:28 metaclassAndValidContext_2(org.eclipse.papyrus.uml.expressions.tests.IsTypeOfExpressionTests)  Time elapsed: 0 s
13:23:28 metaclassAndInValidContext_1(org.eclipse.papyrus.uml.expressions.tests.IsTypeOfExpressionTests)  Time elapsed: 0 s
13:23:28 IsKindOfStereotypeExpression_Test10(org.eclipse.papyrus.uml.expressions.tests.IsKindOfStereotypeExpressionTests)  Time elapsed: 1.124 s
13:23:28 IsKindOfStereotypeExpression_Test11(org.eclipse.papyrus.uml.expressions.tests.IsKindOfStereotypeExpressionTests)  Time elapsed: 1.597 s
13:23:28 IsKindOfStereotypeExpression_Test12(org.eclipse.papyrus.uml.expressions.tests.IsKindOfStereotypeExpressionTests)  Time elapsed: 0.984 s
13:23:28 IsKindOfStereotypeExpression_Test13(org.eclipse.papyrus.uml.expressions.tests.IsKindOfStereotypeExpressionTests)  Time elapsed: 0.981 s
13:23:28 IsKindOfStereotypeExpression_Test14(org.eclipse.papyrus.uml.expressions.tests.IsKindOfStereotypeExpressionTests)  Time elapsed: 1.034 s
13:23:28 IsKindOfStereotypeExpression_Test1(org.eclipse.papyrus.uml.expressions.tests.IsKindOfStereotypeExpressionTests)  Time elapsed: 1.046 s
13:23:28 IsKindOfStereotypeExpression_Test2(org.eclipse.papyrus.uml.expressions.tests.IsKindOfStereotypeExpressionTests)  Time elapsed: 1.074 s
13:23:28 IsKindOfStereotypeExpression_Test3(org.eclipse.papyrus.uml.expressions.tests.IsKindOfStereotypeExpressionTests)  Time elapsed: 1.466 s
13:23:28 IsKindOfStereotypeExpression_Test4(org.eclipse.papyrus.uml.expressions.tests.IsKindOfStereotypeExpressionTests)  Time elapsed: 1.366 s
13:23:28 IsKindOfStereotypeExpression_Test5(org.eclipse.papyrus.uml.expressions.tests.IsKindOfStereotypeExpressionTests)  Time elapsed: 1.01 s
13:23:28 IsKindOfStereotypeExpression_Test6(org.eclipse.papyrus.uml.expressions.tests.IsKindOfStereotypeExpressionTests)  Time elapsed: 1.285 s
13:23:28 IsKindOfStereotypeExpression_Test7(org.eclipse.papyrus.uml.expressions.tests.IsKindOfStereotypeExpressionTests)  Time elapsed: 0.994 s
13:23:28 IsKindOfStereotypeExpression_Test8(org.eclipse.papyrus.uml.expressions.tests.IsKindOfStereotypeExpressionTests)  Time elapsed: 1.467 s
13:23:28 IsKindOfStereotypeExpression_Test9(org.eclipse.papyrus.uml.expressions.tests.IsKindOfStereotypeExpressionTests)  Time elapsed: 1.273 s
13:23:28 IsTypeOfStereotypeExpression_Test1(org.eclipse.papyrus.uml.expressions.tests.IsTypeOfStereotypeExpressionTests)  Time elapsed: 1.12 s
13:23:28 IsTypeOfStereotypeExpression_Test2(org.eclipse.papyrus.uml.expressions.tests.IsTypeOfStereotypeExpressionTests)  Time elapsed: 1.12 s
13:23:28 IsTypeOfStereotypeExpression_Test3(org.eclipse.papyrus.uml.expressions.tests.IsTypeOfStereotypeExpressionTests)  Time elapsed: 1.284 s
13:23:28 IsTypeOfStereotypeExpression_Test4(org.eclipse.papyrus.uml.expressions.tests.IsTypeOfStereotypeExpressionTests)  Time elapsed: 1.423 s
13:23:28 IsTypeOfStereotypeExpression_Test5(org.eclipse.papyrus.uml.expressions.tests.IsTypeOfStereotypeExpressionTests)  Time elapsed: 1.065 s
13:23:28 IsTypeOfStereotypeExpression_Test6(org.eclipse.papyrus.uml.expressions.tests.IsTypeOfStereotypeExpressionTests)  Time elapsed: 1.15 s
13:23:28 IsTypeOfStereotypeExpression_Test7(org.eclipse.papyrus.uml.expressions.tests.IsTypeOfStereotypeExpressionTests)  Time elapsed: 1.037 s
13:23:28 IsTypeOfStereotypeExpression_Test8(org.eclipse.papyrus.uml.expressions.tests.IsTypeOfStereotypeExpressionTests)  Time elapsed: 0.89 s
13:23:28 IsTypeOfStereotypeExpression_Test9(org.eclipse.papyrus.uml.expressions.tests.IsTypeOfStereotypeExpressionTests)  Time elapsed: 0.99 s
13:23:28 IsTypeOfStereotypeExpression_Test10(org.eclipse.papyrus.uml.expressions.tests.IsTypeOfStereotypeExpressionTests)  Time elapsed: 0.928 s
13:23:28 IsTypeOfStereotypeExpression_Test11(org.eclipse.papyrus.uml.expressions.tests.IsTypeOfStereotypeExpressionTests)  Time elapsed: 0.951 s
13:23:28 IsTypeOfStereotypeExpression_Test12(org.eclipse.papyrus.uml.expressions.tests.IsTypeOfStereotypeExpressionTests)  Time elapsed: 0.976 s
13:23:28 IsTypeOfStereotypeExpression_Test13(org.eclipse.papyrus.uml.expressions.tests.IsTypeOfStereotypeExpressionTests)  Time elapsed: 0.885 s
13:23:28 SingleStereotypeAttributeEqualityExpressionTests_Test10(org.eclipse.papyrus.uml.expressions.tests.SingleStereotypeAttributeEqualityExpressionTests)  Time elapsed: 0.993 s
13:23:28 SingleStereotypeAttributeEqualityExpressionTests_Test11(org.eclipse.papyrus.uml.expressions.tests.SingleStereotypeAttributeEqualityExpressionTests)  Time elapsed: 1.278 s
13:23:28 SingleStereotypeAttributeEqualityExpressionTests_Test12(org.eclipse.papyrus.uml.expressions.tests.SingleStereotypeAttributeEqualityExpressionTests)  Time elapsed: 1.096 s
13:23:28 SingleStereotypeAttributeEqualityExpressionTests_Test13(org.eclipse.papyrus.uml.expressions.tests.SingleStereotypeAttributeEqualityExpressionTests)  Time elapsed: 1.045 s
13:23:28 SingleStereotypeAttributeEqualityExpressionTests_Test1(org.eclipse.papyrus.uml.expressions.tests.SingleStereotypeAttributeEqualityExpressionTests)  Time elapsed: 1.137 s
13:23:28 SingleStereotypeAttributeEqualityExpressionTests_Test2(org.eclipse.papyrus.uml.expressions.tests.SingleStereotypeAttributeEqualityExpressionTests)  Time elapsed: 1.16 s
13:23:28 SingleStereotypeAttributeEqualityExpressionTests_Test3(org.eclipse.papyrus.uml.expressions.tests.SingleStereotypeAttributeEqualityExpressionTests)  Time elapsed: 0.98 s
13:23:28 SingleStereotypeAttributeEqualityExpressionTests_Test4(org.eclipse.papyrus.uml.expressions.tests.SingleStereotypeAttributeEqualityExpressionTests)  Time elapsed: 1.018 s
13:23:28 SingleStereotypeAttributeEqualityExpressionTests_Test5(org.eclipse.papyrus.uml.expressions.tests.SingleStereotypeAttributeEqualityExpressionTests)  Time elapsed: 1.035 s
13:23:28 SingleStereotypeAttributeEqualityExpressionTests_Test6(org.eclipse.papyrus.uml.expressions.tests.SingleStereotypeAttributeEqualityExpressionTests)  Time elapsed: 1.055 s
13:23:28 SingleStereotypeAttributeEqualityExpressionTests_Test7(org.eclipse.papyrus.uml.expressions.tests.SingleStereotypeAttributeEqualityExpressionTests)  Time elapsed: 0.974 s
13:23:28 SingleStereotypeAttributeEqualityExpressionTests_Test8(org.eclipse.papyrus.uml.expressions.tests.SingleStereotypeAttributeEqualityExpressionTests)  Time elapsed: 0.944 s
13:23:28 SingleStereotypeAttributeEqualityExpressionTests_Test9(org.eclipse.papyrus.uml.expressions.tests.SingleStereotypeAttributeEqualityExpressionTests)  Time elapsed: 0.918 s
13:23:28 validateModel[0](org.eclipse.papyrus.uml.architecture.tests.resources.ModelValidationTest)  Time elapsed: 0.125 s
13:23:28 
13:23:28 Results:
13:23:28 
13:23:28 Failures: 
13:23:28   InstanceSpecificationTest.init:91->initModel:131 Cannot load the test diagram
13:23:28 Errors: 
13:23:28 org.eclipse.papyrus.uml.modelexplorer.tests.AdvancedModeTest.advancedModeDoesNotCollapseItself(org.eclipse.papyrus.uml.modelexplorer.tests.AdvancedModeTest)
13:23:28   Run 1: AdvancedModeTest.advancedModeDoesNotCollapseItself » BasicIndexOutOfBounds ind...
13:23:28   Run 2: AdvancedModeTest.advancedModeDoesNotCollapseItself:69 » NullPointer
13:23:28 
13:23:28 
13:23:28 Tests run: 657, Failures: 1, Errors: 1, Skipped: 38
13:23:28 
13:23:31 [ERROR] There are test failures.
13:23:31 
13:23:31 Please refer to /jobs/genie.papyrus/Papyrus-Master-Tests/workspace/source/tests/junit/plugins/uml/org.eclipse.papyrus.uml.suite.tests/target/surefire-reports for the individual test results.
13:23:31 [INFO] 
13:23:31 [INFO] --- jacoco-maven-plugin:0.8.2:report (default-report) @ org.eclipse.papyrus.uml.suite.tests ---
13:23:31 [INFO] Loading execution data file /jobs/genie.papyrus/Papyrus-Master-Tests/workspace/source/tests/junit/plugins/uml/org.eclipse.papyrus.uml.suite.tests/target/jacoco.exec
13:23:31 [INFO] Analyzed bundle 'org.eclipse.papyrus.uml.suite.tests' with 0 classes
13:23:31 [INFO] 
13:23:31 [INFO] --< org.eclipse.papyrus.tests:org.eclipse.papyrus.uml.alf.tests.releng >--
13:23:31 [INFO] Building org.eclipse.papyrus.uml.alf.tests.releng 0.0.1-SNAPSHOT [159/167]
13:23:31 [INFO] --------------------------------[ pom ]---------------------------------
13:23:31 [INFO] 
13:23:31 [INFO] --- maven-clean-plugin:3.1.0:clean (default-clean) @ org.eclipse.papyrus.uml.alf.tests.releng ---
13:23:31 [INFO] 
13:23:31 [INFO] --- jacoco-maven-plugin:0.8.2:prepare-agent (default-prepare-agent) @ org.eclipse.papyrus.uml.alf.tests.releng ---
13:23:31 [INFO] argLine set to -javaagent:/home/hudson/genie.papyrus/.jenkins/jobs/Papyrus-Master-Tests/workspace/.repository/org/jacoco/org.jacoco.agent/0.8.2/org.jacoco.agent-0.8.2-runtime.jar=destfile=/jobs/genie.papyrus/Papyrus-Master-Tests/workspace/source/tests/junit/plugins/uml/alf/target/jacoco.exec,includes=org.eclipse.papyrus.*,excludes=org.eclipse.uml2
13:23:31 [INFO] 
13:23:31 [INFO] --- jacoco-maven-plugin:0.8.2:report (default-report) @ org.eclipse.papyrus.uml.alf.tests.releng ---
13:23:31 [INFO] Skipping JaCoCo execution due to missing execution data file.
13:23:31 [INFO] 
13:23:31 [INFO] --< org.eclipse.papyrus.tests:org.eclipse.papyrus.uml.alf.backend.tests >--
13:23:31 [INFO] Building org.eclipse.papyrus.uml.alf.backend.tests 1.1.0-SNAPSHOT [160/167]
13:23:31 [INFO] ------------------------[ eclipse-test-plugin ]-------------------------
13:23:31 [INFO] 
13:23:31 [INFO] --- maven-clean-plugin:3.1.0:clean (default-clean) @ org.eclipse.papyrus.uml.alf.backend.tests ---
13:23:31 [INFO] 
13:23:31 [INFO] --- tycho-packaging-plugin:1.3.0:build-qualifier (default-build-qualifier) @ org.eclipse.papyrus.uml.alf.backend.tests ---
13:23:31 [INFO] The project's OSGi version is 1.1.0.202003281628
13:23:31 [INFO] 
13:23:31 [INFO] --- tycho-packaging-plugin:1.3.0:validate-id (default-validate-id) @ org.eclipse.papyrus.uml.alf.backend.tests ---
13:23:31 [INFO] 
13:23:31 [INFO] --- tycho-packaging-plugin:1.3.0:validate-version (default-validate-version) @ org.eclipse.papyrus.uml.alf.backend.tests ---
13:23:31 [INFO] 
13:23:31 [INFO] --- jacoco-maven-plugin:0.8.2:prepare-agent (default-prepare-agent) @ org.eclipse.papyrus.uml.alf.backend.tests ---
13:23:31 [INFO] tycho.testArgLine set to -javaagent:/home/hudson/genie.papyrus/.jenkins/jobs/Papyrus-Master-Tests/workspace/.repository/org/jacoco/org.jacoco.agent/0.8.2/org.jacoco.agent-0.8.2-runtime.jar=destfile=/jobs/genie.papyrus/Papyrus-Master-Tests/workspace/source/tests/junit/plugins/uml/alf/org.eclipse.papyrus.uml.alf.backend.tests/target/jacoco.exec,includes=org.eclipse.papyrus.*,excludes=org.eclipse.uml2
13:23:31 [INFO] 
13:23:31 [INFO] --- xtend-maven-plugin:2.16.0:compile (default) @ org.eclipse.papyrus.uml.alf.backend.tests ---
13:23:32 [INFO] 
13:23:32 [INFO] --- maven-resources-plugin:3.1.0:resources (default-resources) @ org.eclipse.papyrus.uml.alf.backend.tests ---
13:23:32 [INFO] Using 'UTF-8' encoding to copy filtered resources.
13:23:32 [INFO] skip non existing resourceDirectory /jobs/genie.papyrus/Papyrus-Master-Tests/workspace/source/tests/junit/plugins/uml/alf/org.eclipse.papyrus.uml.alf.backend.tests/src/main/resources
13:23:32 [INFO] 
13:23:32 [INFO] --- tycho-compiler-plugin:1.3.0:compile (default-compile) @ org.eclipse.papyrus.uml.alf.backend.tests ---
13:23:32 [WARNING] The effective compiler target level 1.8 is incompatible with the following OSGi execution environments: [JavaSE-1.7 (assumes 1.7)] @ MavenProject: org.eclipse.papyrus.tests:org.eclipse.papyrus.uml.alf.backend.tests:1.1.0-SNAPSHOT @ /jobs/genie.papyrus/Papyrus-Master-Tests/workspace/source/tests/junit/plugins/uml/alf/org.eclipse.papyrus.uml.alf.backend.tests/pom.xml
13:23:32 [INFO] Compiling 4 source files to /jobs/genie.papyrus/Papyrus-Master-Tests/workspace/source/tests/junit/plugins/uml/alf/org.eclipse.papyrus.uml.alf.backend.tests/bin
13:23:32 [INFO] 
13:23:32 [INFO] --- maven-resources-plugin:3.1.0:testResources (default-testResources) @ org.eclipse.papyrus.uml.alf.backend.tests ---
13:23:32 [INFO] Using 'UTF-8' encoding to copy filtered resources.
13:23:32 [INFO] skip non existing resourceDirectory /jobs/genie.papyrus/Papyrus-Master-Tests/workspace/source/tests/junit/plugins/uml/alf/org.eclipse.papyrus.uml.alf.backend.tests/src/test/resources
13:23:32 [INFO] 
13:23:32 [INFO] --- target-platform-configuration:1.3.0:target-platform (default-target-platform) @ org.eclipse.papyrus.uml.alf.backend.tests ---
13:23:32 [INFO] 
13:23:32 [INFO] --- tycho-packaging-plugin:1.3.0:package-plugin (default-package-plugin) @ org.eclipse.papyrus.uml.alf.backend.tests ---
13:23:32 [INFO] Building jar: /jobs/genie.papyrus/Papyrus-Master-Tests/workspace/source/tests/junit/plugins/uml/alf/org.eclipse.papyrus.uml.alf.backend.tests/target/org.eclipse.papyrus.uml.alf.backend.tests-1.1.0-SNAPSHOT.jar
13:23:32 [INFO] 
13:23:32 [INFO] --- tycho-p2-plugin:1.3.0:p2-metadata-default (default-p2-metadata-default) @ org.eclipse.papyrus.uml.alf.backend.tests ---
13:23:32 [INFO] 
13:23:32 [INFO] --- tycho-surefire-plugin:1.3.0:test (default-test) @ org.eclipse.papyrus.uml.alf.backend.tests ---
13:23:32 [INFO] Skipping tests
13:23:32 [INFO] 
13:23:32 [INFO] --- jacoco-maven-plugin:0.8.2:report (default-report) @ org.eclipse.papyrus.uml.alf.backend.tests ---
13:23:32 [INFO] Skipping JaCoCo execution due to missing execution data file.
13:23:32 [INFO] 
13:23:32 [INFO] --< org.eclipse.papyrus.tests:org.eclipse.papyrus.views.properties.toolsmiths.tests >--
13:23:32 [INFO] Building org.eclipse.papyrus.views.properties.toolsmiths.tests 1.2.0-SNAPSHOT [161/167]
13:23:32 [INFO] ------------------------[ eclipse-test-plugin ]-------------------------
13:23:32 [INFO] 
13:23:32 [INFO] --- maven-clean-plugin:3.1.0:clean (default-clean) @ org.eclipse.papyrus.views.properties.toolsmiths.tests ---
13:23:32 [INFO] 
13:23:32 [INFO] --- tycho-packaging-plugin:1.3.0:build-qualifier (default-build-qualifier) @ org.eclipse.papyrus.views.properties.toolsmiths.tests ---
13:23:32 [INFO] The project's OSGi version is 1.2.0.202003281628
13:23:32 [INFO] 
13:23:32 [INFO] --- tycho-packaging-plugin:1.3.0:validate-id (default-validate-id) @ org.eclipse.papyrus.views.properties.toolsmiths.tests ---
13:23:32 [INFO] 
13:23:32 [INFO] --- tycho-packaging-plugin:1.3.0:validate-version (default-validate-version) @ org.eclipse.papyrus.views.properties.toolsmiths.tests ---
13:23:32 [INFO] 
13:23:32 [INFO] --- jacoco-maven-plugin:0.8.2:prepare-agent (default-prepare-agent) @ org.eclipse.papyrus.views.properties.toolsmiths.tests ---
13:23:32 [INFO] tycho.testArgLine set to -javaagent:/home/hudson/genie.papyrus/.jenkins/jobs/Papyrus-Master-Tests/workspace/.repository/org/jacoco/org.jacoco.agent/0.8.2/org.jacoco.agent-0.8.2-runtime.jar=destfile=/jobs/genie.papyrus/Papyrus-Master-Tests/workspace/source/tests/junit/plugins/views/org.eclipse.papyrus.views.properties.toolsmiths.tests/target/jacoco.exec,includes=org.eclipse.papyrus.*,excludes=org.eclipse.uml2
13:23:32 [INFO] 
13:23:32 [INFO] --- maven-resources-plugin:3.1.0:resources (default-resources) @ org.eclipse.papyrus.views.properties.toolsmiths.tests ---
13:23:32 [INFO] Using 'UTF-8' encoding to copy filtered resources.
13:23:32 [INFO] skip non existing resourceDirectory /jobs/genie.papyrus/Papyrus-Master-Tests/workspace/source/tests/junit/plugins/views/org.eclipse.papyrus.views.properties.toolsmiths.tests/src/main/resources
13:23:32 [INFO] 
13:23:32 [INFO] --- tycho-compiler-plugin:1.3.0:compile (default-compile) @ org.eclipse.papyrus.views.properties.toolsmiths.tests ---
13:23:32 [WARNING] The effective compiler target level 1.8 is incompatible with the following OSGi execution environments: [J2SE-1.5 (assumes 1.5)] @ MavenProject: org.eclipse.papyrus.tests:org.eclipse.papyrus.views.properties.toolsmiths.tests:1.2.0-SNAPSHOT @ /jobs/genie.papyrus/Papyrus-Master-Tests/workspace/source/tests/junit/plugins/views/org.eclipse.papyrus.views.properties.toolsmiths.tests/pom.xml
13:23:32 [INFO] Compiling 3 source files to /jobs/genie.papyrus/Papyrus-Master-Tests/workspace/source/tests/junit/plugins/views/org.eclipse.papyrus.views.properties.toolsmiths.tests/bin
13:23:33 [WARNING] /jobs/genie.papyrus/Papyrus-Master-Tests/workspace/source/tests/junit/plugins/views/org.eclipse.papyrus.views.properties.toolsmiths.tests/src/org/eclipse/papyrus/views/properties/toolsmiths/tests/qvt/TransformationsTests.java:[274] 
13:23:33 	DataContextElement st3Element = findContextElement(context, "Stereotype3");
13:23:33 	                   ^^^^^^^^^^
13:23:33 The value of the local variable st3Element is not used
13:23:33 1 problem (1 warning)
13:23:33 [INFO] 
13:23:33 [INFO] --- maven-resources-plugin:3.1.0:testResources (default-testResources) @ org.eclipse.papyrus.views.properties.toolsmiths.tests ---
13:23:33 [INFO] Using 'UTF-8' encoding to copy filtered resources.
13:23:33 [INFO] skip non existing resourceDirectory /jobs/genie.papyrus/Papyrus-Master-Tests/workspace/source/tests/junit/plugins/views/org.eclipse.papyrus.views.properties.toolsmiths.tests/src/test/resources
13:23:33 [INFO] 
13:23:33 [INFO] --- target-platform-configuration:1.3.0:target-platform (default-target-platform) @ org.eclipse.papyrus.views.properties.toolsmiths.tests ---
13:23:33 [INFO] 
13:23:33 [INFO] --- tycho-packaging-plugin:1.3.0:package-plugin (default-package-plugin) @ org.eclipse.papyrus.views.properties.toolsmiths.tests ---
13:23:33 [INFO] Building jar: /jobs/genie.papyrus/Papyrus-Master-Tests/workspace/source/tests/junit/plugins/views/org.eclipse.papyrus.views.properties.toolsmiths.tests/target/org.eclipse.papyrus.views.properties.toolsmiths.tests-1.2.0-SNAPSHOT.jar
13:23:33 [INFO] 
13:23:33 [INFO] --- tycho-p2-plugin:1.3.0:p2-metadata-default (default-p2-metadata-default) @ org.eclipse.papyrus.views.properties.toolsmiths.tests ---
13:23:33 [INFO] 
13:23:33 [INFO] --- tycho-surefire-plugin:1.3.0:test (default-test) @ org.eclipse.papyrus.views.properties.toolsmiths.tests ---
13:23:33 [INFO] Skipping tests
13:23:33 [INFO] 
13:23:33 [INFO] --- jacoco-maven-plugin:0.8.2:report (default-report) @ org.eclipse.papyrus.views.properties.toolsmiths.tests ---
13:23:33 [INFO] Skipping JaCoCo execution due to missing execution data file.
13:23:33 [INFO] 
13:23:33 [INFO] --< org.eclipse.papyrus.tests:org.eclipse.papyrus.views.suite.tests >---
13:23:33 [INFO] Building org.eclipse.papyrus.views.suite.tests 0.0.1-SNAPSHOT  [162/167]
13:23:33 [INFO] ------------------------[ eclipse-test-plugin ]-------------------------
13:23:33 [INFO] 
13:23:33 [INFO] --- maven-clean-plugin:3.1.0:clean (default-clean) @ org.eclipse.papyrus.views.suite.tests ---
13:23:33 [INFO] 
13:23:33 [INFO] --- tycho-packaging-plugin:1.3.0:build-qualifier (default-build-qualifier) @ org.eclipse.papyrus.views.suite.tests ---
13:23:33 [INFO] The project's OSGi version is 0.0.1.202003281628
13:23:33 [INFO] 
13:23:33 [INFO] --- tycho-packaging-plugin:1.3.0:validate-id (default-validate-id) @ org.eclipse.papyrus.views.suite.tests ---
13:23:33 [INFO] 
13:23:33 [INFO] --- tycho-packaging-plugin:1.3.0:validate-version (default-validate-version) @ org.eclipse.papyrus.views.suite.tests ---
13:23:33 [INFO] 
13:23:33 [INFO] --- jacoco-maven-plugin:0.8.2:prepare-agent (default-prepare-agent) @ org.eclipse.papyrus.views.suite.tests ---
13:23:33 [INFO] tycho.testArgLine set to -javaagent:/home/hudson/genie.papyrus/.jenkins/jobs/Papyrus-Master-Tests/workspace/.repository/org/jacoco/org.jacoco.agent/0.8.2/org.jacoco.agent-0.8.2-runtime.jar=destfile=/jobs/genie.papyrus/Papyrus-Master-Tests/workspace/source/tests/junit/plugins/views/org.eclipse.papyrus.views.suite.tests/target/jacoco.exec,includes=org.eclipse.papyrus.*,excludes=org.eclipse.uml2
13:23:33 [INFO] 
13:23:33 [INFO] --- maven-resources-plugin:3.1.0:resources (default-resources) @ org.eclipse.papyrus.views.suite.tests ---
13:23:33 [INFO] Using 'UTF-8' encoding to copy filtered resources.
13:23:33 [INFO] skip non existing resourceDirectory /jobs/genie.papyrus/Papyrus-Master-Tests/workspace/source/tests/junit/plugins/views/org.eclipse.papyrus.views.suite.tests/src/main/resources
13:23:33 [INFO] 
13:23:33 [INFO] --- tycho-compiler-plugin:1.3.0:compile (default-compile) @ org.eclipse.papyrus.views.suite.tests ---
13:23:33 [INFO] Compiling 2 source files to /jobs/genie.papyrus/Papyrus-Master-Tests/workspace/source/tests/junit/plugins/views/org.eclipse.papyrus.views.suite.tests/bin
13:23:33 [INFO] 
13:23:33 [INFO] --- maven-resources-plugin:3.1.0:testResources (default-testResources) @ org.eclipse.papyrus.views.suite.tests ---
13:23:33 [INFO] Using 'UTF-8' encoding to copy filtered resources.
13:23:33 [INFO] skip non existing resourceDirectory /jobs/genie.papyrus/Papyrus-Master-Tests/workspace/source/tests/junit/plugins/views/org.eclipse.papyrus.views.suite.tests/src/test/resources
13:23:33 [INFO] 
13:23:33 [INFO] --- target-platform-configuration:1.3.0:target-platform (default-target-platform) @ org.eclipse.papyrus.views.suite.tests ---
13:23:33 [INFO] 
13:23:33 [INFO] --- tycho-packaging-plugin:1.3.0:package-plugin (default-package-plugin) @ org.eclipse.papyrus.views.suite.tests ---
13:23:33 [INFO] Building jar: /jobs/genie.papyrus/Papyrus-Master-Tests/workspace/source/tests/junit/plugins/views/org.eclipse.papyrus.views.suite.tests/target/org.eclipse.papyrus.views.suite.tests-0.0.1-SNAPSHOT.jar
13:23:33 [INFO] 
13:23:33 [INFO] --- tycho-p2-plugin:1.3.0:p2-metadata-default (default-p2-metadata-default) @ org.eclipse.papyrus.views.suite.tests ---
13:23:33 [INFO] 
13:23:33 [INFO] --- tycho-surefire-plugin:1.3.0:test (default-test) @ org.eclipse.papyrus.views.suite.tests ---
13:23:42 [INFO] Expected eclipse log file: /jobs/genie.papyrus/Papyrus-Master-Tests/workspace/source/tests/junit/plugins/views/org.eclipse.papyrus.views.suite.tests/target/work/data/.metadata/.log
13:23:42 [INFO] Command line:
13:23:42 	[/opt/public/common/java/oracle/jdk1.8.0_202_x64/jre/bin/java, -Dosgi.noShutdown=false, -Dosgi.os=linux, -Dosgi.ws=gtk, -Dosgi.arch=x86_64, -javaagent:/home/hudson/genie.papyrus/.jenkins/jobs/Papyrus-Master-Tests/workspace/.repository/org/jacoco/org.jacoco.agent/0.8.2/org.jacoco.agent-0.8.2-runtime.jar=destfile=/jobs/genie.papyrus/Papyrus-Master-Tests/workspace/source/tests/junit/plugins/views/org.eclipse.papyrus.views.suite.tests/target/jacoco.exec,includes=org.eclipse.papyrus.*,excludes=org.eclipse.uml2, -Xms512m, -Xmx2048m, -XX:SoftRefLRUPolicyMSPerMB=100, -Dosgi.clean=true, -jar, /jobs/genie.papyrus/Papyrus-Master-Tests/workspace/.repository/p2/osgi/bundle/org.eclipse.equinox.launcher/1.5.700.v20200207-2156/org.eclipse.equinox.launcher-1.5.700.v20200207-2156.jar, -data, /jobs/genie.papyrus/Papyrus-Master-Tests/workspace/source/tests/junit/plugins/views/org.eclipse.papyrus.views.suite.tests/target/work/data, -install, /jobs/genie.papyrus/Papyrus-Master-Tests/workspace/source/tests/junit/plugins/views/org.eclipse.papyrus.views.suite.tests/target/work, -configuration, /jobs/genie.papyrus/Papyrus-Master-Tests/workspace/source/tests/junit/plugins/views/org.eclipse.papyrus.views.suite.tests/target/work/configuration, -application, org.eclipse.tycho.surefire.osgibooter.uitest, -testproperties, /jobs/genie.papyrus/Papyrus-Master-Tests/workspace/source/tests/junit/plugins/views/org.eclipse.papyrus.views.suite.tests/target/surefire.properties, -product, org.eclipse.sdk.ide, -testConfig=CI_TESTS_CONFIG]
13:23:42 Picked up JAVA_TOOL_OPTIONS: -Xmx2G -Djava.io.tmpdir=/tmp/genie.papyrus -DforkCount=1
13:23:46 ***WARNING: GTK+ version too old (micro mismatch)
13:23:46 ***WARNING: SWT requires GTK 3.14.0
13:23:46 ***WARNING: Detected: 3.10.9
13:23:54 SWT Webkit: Warning, You are using an old version of webkitgtk. (pre 2.4) BrowserFunction functionality will not be avaliable
13:23:54 SWT WebKit: error initializing DBus server, dBusServer == 0
13:23:55 Running org.eclipse.papyrus.views.suite.tests.AllTests
13:24:00 No JFaces support for org.eclipse.jface.viewers.TableTreeViewer
13:24:11 Tests run: 11, Failures: 0, Errors: 0, Skipped: 0, Time elapsed: 16.707 s - in org.eclipse.papyrus.views.suite.tests.AllTests
13:24:11 revealSemanticElement_rootTest(org.eclipse.papyrus.views.modelexplorer.tests.ModelExplorerViewTests)  Time elapsed: 6.873 s
13:24:11 deleteDiagramTest(org.eclipse.papyrus.views.modelexplorer.tests.DeleteHandlerTest)  Time elapsed: 3.106 s
13:24:11 deleteTableTest(org.eclipse.papyrus.views.modelexplorer.tests.DeleteHandlerTest)  Time elapsed: 1.425 s
13:24:11 deleteLinkItemTest(org.eclipse.papyrus.views.modelexplorer.tests.DeleteHandlerTest)  Time elapsed: 0.84 s
13:24:11 deleteRootOfTheModel(org.eclipse.papyrus.views.modelexplorer.tests.DeleteHandlerTest)  Time elapsed: 0.672 s
13:24:11 testOpendiagramTest(org.eclipse.papyrus.views.modelexplorer.tests.OpendiagramTest)  Time elapsed: 0.408 s
13:24:11 documentationViewTests(org.eclipse.papyrus.views.documentation.tests.DocumentationViewTests)  Time elapsed: 1.581 s
13:24:11 handleXWTFileFromResourceSet(org.eclipse.papyrus.views.properties.toolsmiths.tests.qvt.TransformationsTests)  Time elapsed: 0.784 s
13:24:11 handleXWTFileFromResource(org.eclipse.papyrus.views.properties.toolsmiths.tests.qvt.TransformationsTests)  Time elapsed: 0.107 s
13:24:11 generateEcoreContext(org.eclipse.papyrus.views.properties.toolsmiths.tests.qvt.TransformationsTests)  Time elapsed: 0.062 s
13:24:11 generateProfileContext(org.eclipse.papyrus.views.properties.toolsmiths.tests.qvt.TransformationsTests)  Time elapsed: 0.347 s
13:24:11 
13:24:11 Results:
13:24:11 
13:24:11 Tests run: 11, Failures: 0, Errors: 0, Skipped: 0
13:24:11 
13:24:13 [INFO] All tests passed!
13:24:13 [INFO] 
13:24:13 [INFO] --- jacoco-maven-plugin:0.8.2:report (default-report) @ org.eclipse.papyrus.views.suite.tests ---
13:24:13 [INFO] Loading execution data file /jobs/genie.papyrus/Papyrus-Master-Tests/workspace/source/tests/junit/plugins/views/org.eclipse.papyrus.views.suite.tests/target/jacoco.exec
13:24:13 [INFO] Analyzed bundle 'org.eclipse.papyrus.views.suite.tests' with 0 classes
13:24:13 [INFO] 
13:24:13 [INFO] --< org.eclipse.papyrus.tests:org.eclipse.papyrus.views.documentation.tests.releng >--
13:24:13 [INFO] Building org.eclipse.papyrus.views.documentation.tests.releng 0.0.1-SNAPSHOT [163/167]
13:24:13 [INFO] --------------------------------[ pom ]---------------------------------
13:24:13 [INFO] 
13:24:13 [INFO] --- maven-clean-plugin:3.1.0:clean (default-clean) @ org.eclipse.papyrus.views.documentation.tests.releng ---
13:24:13 [INFO] 
13:24:13 [INFO] --- jacoco-maven-plugin:0.8.2:prepare-agent (default-prepare-agent) @ org.eclipse.papyrus.views.documentation.tests.releng ---
13:24:13 [INFO] argLine set to -javaagent:/home/hudson/genie.papyrus/.jenkins/jobs/Papyrus-Master-Tests/workspace/.repository/org/jacoco/org.jacoco.agent/0.8.2/org.jacoco.agent-0.8.2-runtime.jar=destfile=/jobs/genie.papyrus/Papyrus-Master-Tests/workspace/source/tests/junit/plugins/views/documentation/target/jacoco.exec,includes=org.eclipse.papyrus.*,excludes=org.eclipse.uml2
13:24:13 [INFO] 
13:24:13 [INFO] --- jacoco-maven-plugin:0.8.2:report (default-report) @ org.eclipse.papyrus.views.documentation.tests.releng ---
13:24:13 [INFO] Skipping JaCoCo execution due to missing execution data file.
13:24:13 [INFO] 
13:24:13 [INFO] --< org.eclipse.papyrus.tests:org.eclipse.papyrus.toolsmiths.suite.tests >--
13:24:13 [INFO] Building org.eclipse.papyrus.toolsmiths.suite.tests 0.0.1-SNAPSHOT [164/167]
13:24:13 [INFO] ------------------------[ eclipse-test-plugin ]-------------------------
13:24:14 [INFO] 
13:24:14 [INFO] --- maven-clean-plugin:3.1.0:clean (default-clean) @ org.eclipse.papyrus.toolsmiths.suite.tests ---
13:24:14 [INFO] 
13:24:14 [INFO] --- tycho-packaging-plugin:1.3.0:build-qualifier (default-build-qualifier) @ org.eclipse.papyrus.toolsmiths.suite.tests ---
13:24:14 [INFO] The project's OSGi version is 0.0.1.202003281628
13:24:14 [INFO] 
13:24:14 [INFO] --- tycho-packaging-plugin:1.3.0:validate-id (default-validate-id) @ org.eclipse.papyrus.toolsmiths.suite.tests ---
13:24:14 [INFO] 
13:24:14 [INFO] --- tycho-packaging-plugin:1.3.0:validate-version (default-validate-version) @ org.eclipse.papyrus.toolsmiths.suite.tests ---
13:24:14 [INFO] 
13:24:14 [INFO] --- jacoco-maven-plugin:0.8.2:prepare-agent (default-prepare-agent) @ org.eclipse.papyrus.toolsmiths.suite.tests ---
13:24:14 [INFO] tycho.testArgLine set to -javaagent:/home/hudson/genie.papyrus/.jenkins/jobs/Papyrus-Master-Tests/workspace/.repository/org/jacoco/org.jacoco.agent/0.8.2/org.jacoco.agent-0.8.2-runtime.jar=destfile=/jobs/genie.papyrus/Papyrus-Master-Tests/workspace/source/tests/junit/plugins/toolsmiths/org.eclipse.papyrus.toolsmiths.suite.tests/target/jacoco.exec,includes=org.eclipse.papyrus.*,excludes=org.eclipse.uml2
13:24:14 [INFO] 
13:24:14 [INFO] --- maven-resources-plugin:3.1.0:resources (default-resources) @ org.eclipse.papyrus.toolsmiths.suite.tests ---
13:24:14 [INFO] Using 'UTF-8' encoding to copy filtered resources.
13:24:14 [INFO] skip non existing resourceDirectory /jobs/genie.papyrus/Papyrus-Master-Tests/workspace/source/tests/junit/plugins/toolsmiths/org.eclipse.papyrus.toolsmiths.suite.tests/src/main/resources
13:24:14 [INFO] 
13:24:14 [INFO] --- tycho-compiler-plugin:1.3.0:compile (default-compile) @ org.eclipse.papyrus.toolsmiths.suite.tests ---
13:24:14 [INFO] Compiling 2 source files to /jobs/genie.papyrus/Papyrus-Master-Tests/workspace/source/tests/junit/plugins/toolsmiths/org.eclipse.papyrus.toolsmiths.suite.tests/bin
13:24:14 [INFO] 
13:24:14 [INFO] --- maven-resources-plugin:3.1.0:testResources (default-testResources) @ org.eclipse.papyrus.toolsmiths.suite.tests ---
13:24:14 [INFO] Using 'UTF-8' encoding to copy filtered resources.
13:24:14 [INFO] skip non existing resourceDirectory /jobs/genie.papyrus/Papyrus-Master-Tests/workspace/source/tests/junit/plugins/toolsmiths/org.eclipse.papyrus.toolsmiths.suite.tests/src/test/resources
13:24:14 [INFO] 
13:24:14 [INFO] --- target-platform-configuration:1.3.0:target-platform (default-target-platform) @ org.eclipse.papyrus.toolsmiths.suite.tests ---
13:24:14 [INFO] 
13:24:14 [INFO] --- tycho-packaging-plugin:1.3.0:package-plugin (default-package-plugin) @ org.eclipse.papyrus.toolsmiths.suite.tests ---
13:24:14 [INFO] Building jar: /jobs/genie.papyrus/Papyrus-Master-Tests/workspace/source/tests/junit/plugins/toolsmiths/org.eclipse.papyrus.toolsmiths.suite.tests/target/org.eclipse.papyrus.toolsmiths.suite.tests-0.0.1-SNAPSHOT.jar
13:24:14 [INFO] 
13:24:14 [INFO] --- tycho-p2-plugin:1.3.0:p2-metadata-default (default-p2-metadata-default) @ org.eclipse.papyrus.toolsmiths.suite.tests ---
13:24:14 [INFO] 
13:24:14 [INFO] --- tycho-surefire-plugin:1.3.0:test (default-test) @ org.eclipse.papyrus.toolsmiths.suite.tests ---
13:24:25 [INFO] Expected eclipse log file: /jobs/genie.papyrus/Papyrus-Master-Tests/workspace/source/tests/junit/plugins/toolsmiths/org.eclipse.papyrus.toolsmiths.suite.tests/target/work/data/.metadata/.log
13:24:25 [INFO] Command line:
13:24:25 	[/opt/public/common/java/oracle/jdk1.8.0_202_x64/jre/bin/java, -Dosgi.noShutdown=false, -Dosgi.os=linux, -Dosgi.ws=gtk, -Dosgi.arch=x86_64, -javaagent:/home/hudson/genie.papyrus/.jenkins/jobs/Papyrus-Master-Tests/workspace/.repository/org/jacoco/org.jacoco.agent/0.8.2/org.jacoco.agent-0.8.2-runtime.jar=destfile=/jobs/genie.papyrus/Papyrus-Master-Tests/workspace/source/tests/junit/plugins/toolsmiths/org.eclipse.papyrus.toolsmiths.suite.tests/target/jacoco.exec,includes=org.eclipse.papyrus.*,excludes=org.eclipse.uml2, -Xms512m, -Xmx2048m, -XX:SoftRefLRUPolicyMSPerMB=100, -Dosgi.clean=true, -jar, /jobs/genie.papyrus/Papyrus-Master-Tests/workspace/.repository/p2/osgi/bundle/org.eclipse.equinox.launcher/1.5.700.v20200207-2156/org.eclipse.equinox.launcher-1.5.700.v20200207-2156.jar, -data, /jobs/genie.papyrus/Papyrus-Master-Tests/workspace/source/tests/junit/plugins/toolsmiths/org.eclipse.papyrus.toolsmiths.suite.tests/target/work/data, -install, /jobs/genie.papyrus/Papyrus-Master-Tests/workspace/source/tests/junit/plugins/toolsmiths/org.eclipse.papyrus.toolsmiths.suite.tests/target/work, -configuration, /jobs/genie.papyrus/Papyrus-Master-Tests/workspace/source/tests/junit/plugins/toolsmiths/org.eclipse.papyrus.toolsmiths.suite.tests/target/work/configuration, -application, org.eclipse.tycho.surefire.osgibooter.uitest, -testproperties, /jobs/genie.papyrus/Papyrus-Master-Tests/workspace/source/tests/junit/plugins/toolsmiths/org.eclipse.papyrus.toolsmiths.suite.tests/target/surefire.properties, -product, org.eclipse.sdk.ide, -testConfig=CI_TESTS_CONFIG]
13:24:25 Picked up JAVA_TOOL_OPTIONS: -Xmx2G -Djava.io.tmpdir=/tmp/genie.papyrus -DforkCount=1
13:24:29 ***WARNING: GTK+ version too old (micro mismatch)
13:24:29 ***WARNING: SWT requires GTK 3.14.0
13:24:29 ***WARNING: Detected: 3.10.9
13:24:34 SWT Webkit: Warning, You are using an old version of webkitgtk. (pre 2.4) BrowserFunction functionality will not be avaliable
13:24:34 SWT WebKit: error initializing DBus server, dBusServer == 0
13:24:35 Running org.eclipse.papyrus.toolsmiths.suite.tests.AllTests
13:24:36 log4j:WARN No appenders could be found for logger (org.eclipse.emf.compare.EMFCompare).
13:24:36 log4j:WARN Please initialize the log4j system properly.
13:24:38 Tests run: 21, Failures: 0, Errors: 0, Skipped: 0, Time elapsed: 2.7 s - in org.eclipse.papyrus.toolsmiths.suite.tests.AllTests
13:24:38 ProfileAutomaticMigrationTest(org.eclipse.papyrus.toolsmiths.profilemigration.tests.automatic.AutomaticMigrationTest)  Time elapsed: 0.009 s
13:24:38 PackageAutomaticMigrationTest(org.eclipse.papyrus.toolsmiths.profilemigration.tests.automatic.AutomaticMigrationTest)  Time elapsed: 0.002 s
13:24:38 StereotypeAutomaticMigrationTest_Stereotype_delete_Property(org.eclipse.papyrus.toolsmiths.profilemigration.tests.automatic.AutomaticMigrationTest)  Time elapsed: 0 s
13:24:38 PropertyAutomaticMigrationTest(org.eclipse.papyrus.toolsmiths.profilemigration.tests.automatic.AutomaticMigrationTest)  Time elapsed: 0.001 s
13:24:38 StereotypeAutomaticMigrationTest(org.eclipse.papyrus.toolsmiths.profilemigration.tests.automatic.AutomaticMigrationTest)  Time elapsed: 0.001 s
13:24:38 GeneralizationAutomaticMigrationTest(org.eclipse.papyrus.toolsmiths.profilemigration.tests.automatic.AutomaticMigrationTest)  Time elapsed: 0.001 s
13:24:38 atomicListTest(org.eclipse.papyrus.toolsmiths.profilemigration.tests.migrators.ChangeIsAbstractFromStereotypeTest)  Time elapsed: 0.002 s
13:24:38 atomicListMoveProfileIntoNonApplyProfileTest(org.eclipse.papyrus.toolsmiths.profilemigration.tests.migrators.MoveMigratorTest)  Time elapsed: 0.042 s
13:24:38 atomicListMoveStereotypeIntoNonApplyProfileTest(org.eclipse.papyrus.toolsmiths.profilemigration.tests.migrators.MoveMigratorTest)  Time elapsed: 0.035 s
13:24:38 atomicListMovePackageIntoAlreadyApplyProfileTest(org.eclipse.papyrus.toolsmiths.profilemigration.tests.migrators.MoveMigratorTest)  Time elapsed: 0.033 s
13:24:38 atomicListMoveStereotypeIntoAlreadyApplyProfileTest(org.eclipse.papyrus.toolsmiths.profilemigration.tests.migrators.MoveMigratorTest)  Time elapsed: 0.038 s
13:24:38 atomicListMovePackageIntoNonApplyProfileTest(org.eclipse.papyrus.toolsmiths.profilemigration.tests.migrators.MoveMigratorTest)  Time elapsed: 0.046 s
13:24:38 atomicListMoveProfileIntoAlreadyApplyProfileTest(org.eclipse.papyrus.toolsmiths.profilemigration.tests.migrators.MoveMigratorTest)  Time elapsed: 0.049 s
13:24:38 UpperMultiplicityTest(org.eclipse.papyrus.toolsmiths.profilemigration.tests.migrators.ChangeMultiplicityFromPropertyMigratorTest)  Time elapsed: 0.003 s
13:24:38 atomicListTest(org.eclipse.papyrus.toolsmiths.profilemigration.tests.migrators.ChangeMultiplicityFromPropertyMigratorTest)  Time elapsed: 0 s
13:24:38 LowerMultiplicityTest(org.eclipse.papyrus.toolsmiths.profilemigration.tests.migrators.ChangeMultiplicityFromPropertyMigratorTest)  Time elapsed: 0 s
13:24:38 DeleteEnumerationLiteralTest(org.eclipse.papyrus.toolsmiths.profilemigration.tests.migrators.DeleteEnumLiteralFromEnumerationTest)  Time elapsed: 0.003 s
13:24:38 MoveEnumerationLiteralTest(org.eclipse.papyrus.toolsmiths.profilemigration.tests.migrators.DeleteEnumLiteralFromEnumerationTest)  Time elapsed: 0 s
13:24:38 atomicListTest(org.eclipse.papyrus.toolsmiths.profilemigration.tests.migrators.DeleteEnumLiteralFromEnumerationTest)  Time elapsed: 0.001 s
13:24:38 atomicListTest(org.eclipse.papyrus.toolsmiths.profilemigration.tests.migrators.ChangeIsStaticFromPropertyTest)  Time elapsed: 0.001 s
13:24:38 atomicListTest(org.eclipse.papyrus.toolsmiths.profilemigration.tests.migrators.AddPropertyToStereotypeTest)  Time elapsed: 0.001 s
13:24:38 
13:24:38 Results:
13:24:38 
13:24:38 Tests run: 21, Failures: 0, Errors: 0, Skipped: 0
13:24:38 
13:24:40 [INFO] All tests passed!
13:24:40 [INFO] 
13:24:40 [INFO] --- jacoco-maven-plugin:0.8.2:report (default-report) @ org.eclipse.papyrus.toolsmiths.suite.tests ---
13:24:40 [INFO] Loading execution data file /jobs/genie.papyrus/Papyrus-Master-Tests/workspace/source/tests/junit/plugins/toolsmiths/org.eclipse.papyrus.toolsmiths.suite.tests/target/jacoco.exec
13:24:40 [INFO] Analyzed bundle 'org.eclipse.papyrus.toolsmiths.suite.tests' with 0 classes
13:24:40 [INFO] 
13:24:40 [INFO] -----< org.eclipse.papyrus:org.eclipse.papyrus.tests.main.releng >------
13:24:40 [INFO] Building org.eclipse.papyrus.tests.main.releng 1.2.0-SNAPSHOT  [165/167]
13:24:40 [INFO] --------------------------------[ pom ]---------------------------------
13:24:40 [INFO] 
13:24:40 [INFO] --- maven-clean-plugin:3.1.0:clean (default-clean) @ org.eclipse.papyrus.tests.main.releng ---
13:24:40 [INFO] 
13:24:40 [INFO] --- jacoco-maven-plugin:0.8.2:prepare-agent (default-prepare-agent) @ org.eclipse.papyrus.tests.main.releng ---
13:24:40 [INFO] argLine set to -javaagent:/home/hudson/genie.papyrus/.jenkins/jobs/Papyrus-Master-Tests/workspace/.repository/org/jacoco/org.jacoco.agent/0.8.2/org.jacoco.agent-0.8.2-runtime.jar=destfile=/jobs/genie.papyrus/Papyrus-Master-Tests/workspace/source/releng/tests/main-tests/target/jacoco.exec,includes=org.eclipse.papyrus.*,excludes=org.eclipse.uml2
13:24:40 [INFO] 
13:24:40 [INFO] --- jacoco-maven-plugin:0.8.2:report (default-report) @ org.eclipse.papyrus.tests.main.releng ---
13:24:40 [INFO] Skipping JaCoCo execution due to missing execution data file.
13:24:40 [INFO] 
13:24:40 [INFO] --< org.eclipse.papyrus:org.eclipse.papyrus.main.tests.target.parent >--
13:24:40 [INFO] Building org.eclipse.papyrus.main.tests.target.parent 0.0.1-SNAPSHOT [166/167]
13:24:40 [INFO] --------------------------------[ pom ]---------------------------------
13:24:40 [INFO] 
13:24:40 [INFO] --- maven-clean-plugin:3.1.0:clean (default-clean) @ org.eclipse.papyrus.main.tests.target.parent ---
13:24:40 [INFO] 
13:24:40 [INFO] --- jacoco-maven-plugin:0.8.2:prepare-agent (default-prepare-agent) @ org.eclipse.papyrus.main.tests.target.parent ---
13:24:40 [INFO] argLine set to -javaagent:/home/hudson/genie.papyrus/.jenkins/jobs/Papyrus-Master-Tests/workspace/.repository/org/jacoco/org.jacoco.agent/0.8.2/org.jacoco.agent-0.8.2-runtime.jar=destfile=/jobs/genie.papyrus/Papyrus-Master-Tests/workspace/source/releng/tests/main-tests/targetPlatform/target/jacoco.exec,includes=org.eclipse.papyrus.*,excludes=org.eclipse.uml2
13:24:40 [INFO] 
13:24:40 [INFO] --- jacoco-maven-plugin:0.8.2:report (default-report) @ org.eclipse.papyrus.main.tests.target.parent ---
13:24:40 [INFO] Skipping JaCoCo execution due to missing execution data file.
13:24:40 [INFO] 
13:24:40 [INFO] --< org.eclipse.papyrus:org.eclipse.papyrus.main.tests.portable.target >--
13:24:40 [INFO] Building org.eclipse.papyrus.main.tests.portable.target 0.0.1-SNAPSHOT [167/167]
13:24:40 [INFO] ---------------------[ eclipse-target-definition ]----------------------
13:24:40 [INFO] 
13:24:40 [INFO] --- maven-clean-plugin:3.1.0:clean (default-clean) @ org.eclipse.papyrus.main.tests.portable.target ---
13:24:40 [INFO] 
13:24:40 [INFO] --- jacoco-maven-plugin:0.8.2:prepare-agent (default-prepare-agent) @ org.eclipse.papyrus.main.tests.portable.target ---
13:24:40 [INFO] argLine set to -javaagent:/home/hudson/genie.papyrus/.jenkins/jobs/Papyrus-Master-Tests/workspace/.repository/org/jacoco/org.jacoco.agent/0.8.2/org.jacoco.agent-0.8.2-runtime.jar=destfile=/jobs/genie.papyrus/Papyrus-Master-Tests/workspace/source/releng/tests/main-tests/targetPlatform/portable/target/jacoco.exec,includes=org.eclipse.papyrus.*,excludes=org.eclipse.uml2
13:24:40 [INFO] 
13:24:40 [INFO] --- tycho-packaging-plugin:1.3.0:package-target-definition (default-package-target-definition) @ org.eclipse.papyrus.main.tests.portable.target ---
13:24:40 [INFO] 
13:24:40 [INFO] --- jacoco-maven-plugin:0.8.2:report (default-report) @ org.eclipse.papyrus.main.tests.portable.target ---
13:24:40 [INFO] Skipping JaCoCo execution due to missing execution data file.
13:24:40 [INFO] ------------------------------------------------------------------------
13:24:40 [INFO] Reactor Summary:
13:24:40 [INFO] 
13:24:40 [INFO] org.eclipse.papyrus.tests.releng 0.0.1-SNAPSHOT .... SUCCESS [  0.361 s]
13:24:40 [INFO] org.eclipse.papyrus.plugins.tests.releng 0.0.1-SNAPSHOT SUCCESS [  0.006 s]
13:24:40 [INFO] org.eclipse.papyrus.editor.tests.releng 0.0.1-SNAPSHOT SUCCESS [  0.005 s]
13:24:40 [INFO] org.eclipse.papyrus.editor.integration.tests 1.4.0-SNAPSHOT SUCCESS [  1.710 s]
13:24:40 [INFO] org.eclipse.papyrus.infra.tests.releng 0.0.1-SNAPSHOT SUCCESS [  0.013 s]
13:24:40 [INFO] org.eclipse.papyrus.infra.core.tests.releng 0.0.1-SNAPSHOT SUCCESS [  0.012 s]
13:24:40 [INFO] org.eclipse.papyrus.infra.core.clipboard.tests 1.3.0-SNAPSHOT SUCCESS [  0.685 s]
13:24:40 [INFO] org.eclipse.papyrus.infra.core.sasheditor.tests 1.2.0-SNAPSHOT SUCCESS [  0.715 s]
13:24:40 [INFO] org.eclipse.papyrus.infra.core.sasheditor.di.tests 1.2.0-SNAPSHOT SUCCESS [  0.461 s]
13:24:40 [INFO] org.eclipse.papyrus.infra.core.tests 3.1.0-SNAPSHOT  SUCCESS [  1.455 s]
13:24:40 [INFO] org.eclipse.papyrus.infra.editor.tests.releng 0.0.1-SNAPSHOT SUCCESS [  0.004 s]
13:24:40 [INFO] org.eclipse.papyrus.infra.editor.welcome.tests 1.2.0-SNAPSHOT SUCCESS [  0.599 s]
13:24:40 [INFO] org.eclipse.papyrus.infra.emf.tests.releng 0.0.1-SNAPSHOT SUCCESS [  0.005 s]
13:24:40 [INFO] org.eclipse.papyrus.infra.emf.gmf.tests 1.2.100-SNAPSHOT SUCCESS [  0.386 s]
13:24:40 [INFO] org.eclipse.papyrus.infra.emf.readonly.tests 1.3.0-SNAPSHOT SUCCESS [  0.411 s]
13:24:40 [INFO] org.eclipse.papyrus.infra.emf.tests 1.5.0-SNAPSHOT . SUCCESS [  0.759 s]
13:24:40 [INFO] org.eclipse.papyrus.infra.filters.tests 1.2.0-SNAPSHOT SUCCESS [  0.150 s]
13:24:40 [INFO] org.eclipse.papyrus.infra.gmfdiag.tests.releng 0.0.1-SNAPSHOT SUCCESS [  0.004 s]
13:24:40 [INFO] org.eclipse.papyrus.infra.gmfdiag.assistant.tests.releng 0.0.1-SNAPSHOT SUCCESS [  0.004 s]
13:24:40 [INFO] org.eclipse.papyrus.infra.gmfdiag.assistant.tests 1.3.0-SNAPSHOT SUCCESS [  0.822 s]
13:24:40 [INFO] org.eclipse.papyrus.infra.gmfdiag.canonical.tests 1.3.0-SNAPSHOT SUCCESS [  0.759 s]
13:24:40 [INFO] org.eclipse.papyrus.infra.gmfdiag.commands.tests 1.3.0-SNAPSHOT SUCCESS [  0.703 s]
13:24:40 [INFO] org.eclipse.papyrus.infra.gmfdiag.common.tests 3.1.0-SNAPSHOT SUCCESS [  0.791 s]
13:24:40 [INFO] org.eclipse.papyrus.infra.gmfdiag.css.tests 1.2.0-SNAPSHOT SUCCESS [  0.578 s]
13:24:40 [INFO] org.eclipse.papyrus.infra.gmfdiag.menu.tests 1.2.100-SNAPSHOT SUCCESS [  0.565 s]
13:24:40 [INFO] org.eclipse.papyrus.infra.gmfdiag.paletteconfiguration.tests 1.3.0-SNAPSHOT SUCCESS [  0.646 s]
13:24:40 [INFO] org.eclipse.papyrus.infra.gmfdiag.welcome.tests 1.2.0-SNAPSHOT SUCCESS [  0.627 s]
13:24:40 [INFO] org.eclipse.papyrus.infra.nattable.main.test 1.2.0-SNAPSHOT SUCCESS [  0.005 s]
13:24:40 [INFO] org.eclipse.papyrus.infra.nattable.common.tests 1.2.200-SNAPSHOT SUCCESS [  0.625 s]
13:24:40 [INFO] org.eclipse.papyrus.infra.nattable.model.tests 1.2.100-SNAPSHOT SUCCESS [  0.481 s]
13:24:40 [INFO] org.eclipse.papyrus.infra.nattable.tests 1.2.200-SNAPSHOT SUCCESS [  0.678 s]
13:24:40 [INFO] org.eclipse.papyrus.infra.nattable.views.tests 1.2.100-SNAPSHOT SUCCESS [  0.675 s]
13:24:40 [INFO] org.eclipse.papyrus.infra.properties.tests.releng 0.0.1-SNAPSHOT SUCCESS [  0.004 s]
13:24:40 [INFO] org.eclipse.papyrus.infra.properties.ui.tests 2.0.0-SNAPSHOT SUCCESS [  0.814 s]
13:24:40 [INFO] org.eclipse.papyrus.infra.services.tests.releng 0.0.1-SNAPSHOT SUCCESS [  0.005 s]
13:24:40 [INFO] org.eclipse.papyrus.infra.services.controlmode.tests 1.5.0-SNAPSHOT SUCCESS [  0.688 s]
13:24:40 [INFO] org.eclipse.papyrus.infra.services.edit.tests 1.2.0-SNAPSHOT SUCCESS [  0.425 s]
13:24:40 [INFO] org.eclipse.papyrus.infra.services.edit.ui.tests 1.2.0-SNAPSHOT SUCCESS [  0.383 s]
13:24:40 [INFO] org.eclipse.papyrus.infra.services.resourceloading.tests 1.2.0-SNAPSHOT SUCCESS [  0.317 s]
13:24:40 [INFO] org.eclipse.papyrus.infra.services.semantic.tests 1.2.100-SNAPSHOT SUCCESS [  0.718 s]
13:24:40 [INFO] org.eclipse.papyrus.infra.tools.tests 1.3.0-SNAPSHOT SUCCESS [  0.959 s]
13:24:40 [INFO] org.eclipse.papyrus.infra.types.tests.releng 0.0.1-SNAPSHOT SUCCESS [  0.005 s]
13:24:40 [INFO] org.eclipse.papyrus.infra.types.tests 3.0.100-SNAPSHOT SUCCESS [  0.770 s]
13:24:40 [INFO] org.eclipse.papyrus.infra.types.ui.tests 3.0.100-SNAPSHOT SUCCESS [  0.585 s]
13:24:40 [INFO] org.eclipse.papyrus.infra.ui.emf.tests 1.3.0-SNAPSHOT SUCCESS [  1.244 s]
13:24:40 [INFO] org.eclipse.papyrus.infra.ui.tests 1.2.0-SNAPSHOT .. SUCCESS [  0.650 s]
13:24:40 [INFO] org.eclipse.papyrus.infra.viewpoints.tests.releng 1.2.0-SNAPSHOT SUCCESS [  0.006 s]
13:24:40 [INFO] org.eclipse.papyrus.infra.viewpoints.policy.tests 1.2.0-SNAPSHOT SUCCESS [  0.477 s]
13:24:40 [INFO] org.eclipse.papyrus.uml.tests.releng 0.0.1-SNAPSHOT  SUCCESS [  0.004 s]
13:24:40 [INFO] org.eclipse.papyrus.uml.diagram.tests.releng 1.2.0-SNAPSHOT SUCCESS [  0.003 s]
13:24:40 [INFO] org.eclipse.papyrus.uml.diagram.tests 1.3.100-SNAPSHOT SUCCESS [  1.028 s]
13:24:40 [INFO] org.eclipse.papyrus.uml.diagram.clazz.tests 1.3.100-SNAPSHOT SUCCESS [  0.743 s]
13:24:40 [INFO] org.eclipse.papyrus.uml.diagram.activity.tests 1.2.100-SNAPSHOT SUCCESS [  0.902 s]
13:24:40 [INFO] org.eclipse.papyrus.uml.diagram.usecase.tests 4.0.100-SNAPSHOT SUCCESS [  0.714 s]
13:24:40 [INFO] org.eclipse.papyrus.uml.diagram.deployment.tests 1.2.100-SNAPSHOT SUCCESS [  0.598 s]
13:24:40 [INFO] org.eclipse.papyrus.uml.diagram.component.tests 1.2.100-SNAPSHOT SUCCESS [  0.681 s]
13:24:40 [INFO] org.eclipse.papyrus.uml.diagram.timing.tests 1.2.100-SNAPSHOT SUCCESS [  0.771 s]
13:24:40 [INFO] org.eclipse.papyrus.uml.diagram.stereotypeproperty.tests 1.2.100-SNAPSHOT SUCCESS [  0.720 s]
13:24:40 [INFO] org.eclipse.papyrus.uml.diagram.sequence.tests 1.3.100-SNAPSHOT SUCCESS [  1.311 s]
13:24:40 [INFO] org.eclipse.papyrus.uml.diagram.composite.tests 1.2.100-SNAPSHOT SUCCESS [  2.399 s]
13:24:40 [INFO] org.eclipse.papyrus.uml.diagram.profile.tests 1.2.100-SNAPSHOT SUCCESS [  1.014 s]
13:24:40 [INFO] org.eclipse.papyrus.uml.dynamic.profile.tests 1.2.0-SNAPSHOT SUCCESS [  0.041 s]
13:24:40 [INFO] org.eclipse.papyrus.uml.diagram.common.tests 1.3.100-SNAPSHOT SUCCESS [  0.941 s]
13:24:40 [INFO] org.eclipse.papyrus.uml.diagram.wizards.tests 1.3.0-SNAPSHOT SUCCESS [  0.789 s]
13:24:40 [INFO] org.eclipse.papyrus.tests.uml.diagram.feature 1.2.0-SNAPSHOT SUCCESS [  0.279 s]
13:24:40 [INFO] org.eclipse.papyrus.tests.infra.services.feature 1.2.0-SNAPSHOT SUCCESS [  0.103 s]
13:24:40 [INFO] org.eclipse.papyrus.views.tests.releng 0.0.1-SNAPSHOT SUCCESS [  0.005 s]
13:24:40 [INFO] org.eclipse.papyrus.views.modelexplorer.tests 1.2.100-SNAPSHOT SUCCESS [  0.544 s]
13:24:40 [INFO] org.eclipse.papyrus.uml.modelexplorer.tests.releng 0.0.1-SNAPSHOT SUCCESS [  0.005 s]
13:24:40 [INFO] org.eclipse.papyrus.uml.modelexplorer.tests 1.3.100-SNAPSHOT SUCCESS [  0.440 s]
13:24:40 [INFO] org.eclipse.papyrus.uml.modelrepair.tests 1.3.0-SNAPSHOT SUCCESS [  0.754 s]
13:24:40 [INFO] org.eclipse.papyrus.uml.properties.tests 1.1.0-SNAPSHOT SUCCESS [  0.591 s]
13:24:40 [INFO] org.eclipse.papyrus.uml.service.types.tests 1.3.0-SNAPSHOT SUCCESS [  0.576 s]
13:24:40 [INFO] org.eclipse.papyrus.uml.service.types.ui.tests 1.2.100-SNAPSHOT SUCCESS [  0.695 s]
13:24:40 [INFO] org.eclipse.papyrus.uml.profile.tests.releng 0.0.1-SNAPSHOT SUCCESS [  0.006 s]
13:24:40 [INFO] org.eclipse.papyrus.uml.profile.drafter.tests 1.3.0-SNAPSHOT SUCCESS [  0.551 s]
13:24:40 [INFO] org.eclipse.papyrus.uml.filters.tests 1.2.0-SNAPSHOT SUCCESS [  0.475 s]
13:24:40 [INFO] org.eclipse.papyrus.uml.profile.tests 1.2.0-SNAPSHOT SUCCESS [  0.752 s]
13:24:40 [INFO] org.eclipse.papyrus.tests.uml.feature 1.2.0-SNAPSHOT SUCCESS [  0.168 s]
13:24:40 [INFO] org.eclipse.papyrus.views.documentation.tests 1.0.0-SNAPSHOT SUCCESS [  0.851 s]
13:24:40 [INFO] org.eclipse.papyrus.tests.views.feature 1.2.0-SNAPSHOT SUCCESS [  0.107 s]
13:24:40 [INFO] org.eclipse.papyrus.tests.infra.nattable.feature 1.4.0-SNAPSHOT SUCCESS [  0.096 s]
13:24:40 [INFO] org.eclipse.papyrus.uml.nattable.main.test 1.2.0-SNAPSHOT SUCCESS [  0.003 s]
13:24:40 [INFO] org.eclipse.papyrus.uml.nattable.tests 1.2.100-SNAPSHOT SUCCESS [  0.520 s]
13:24:40 [INFO] org.eclipse.papyrus.uml.nattable.generic.tests 1.2.200-SNAPSHOT SUCCESS [  0.902 s]
13:24:40 [INFO] org.eclipse.papyrus.uml.nattable.clazz.config.tests 1.2.200-SNAPSHOT SUCCESS [  1.001 s]
13:24:40 [INFO] org.eclipse.papyrus.uml.nattable.stereotyped.elements.tests 1.0.200-SNAPSHOT SUCCESS [  0.780 s]
13:24:40 [INFO] org.eclipse.papyrus.uml.nattable.matrix.tests 1.0.100-SNAPSHOT SUCCESS [  0.519 s]
13:24:40 [INFO] org.eclipse.papyrus.tests.uml.nattable.feature 1.3.0-SNAPSHOT SUCCESS [  0.207 s]
13:24:40 [INFO] org.eclipse.papyrus.tests.infra.feature 1.2.0-SNAPSHOT SUCCESS [  0.267 s]
13:24:40 [INFO] org.eclipse.papyrus.tests.infra.core.feature 1.2.0-SNAPSHOT SUCCESS [  0.064 s]
13:24:40 [INFO] org.eclipse.papyrus.uml.tools.tests.releng 0.0.1-SNAPSHOT SUCCESS [  0.003 s]
13:24:40 [INFO] org.eclipse.papyrus.uml.tools.tests 3.1.0-SNAPSHOT . SUCCESS [  0.726 s]
13:24:40 [INFO] org.eclipse.papyrus.uml.tools.utils.tests 1.3.0-SNAPSHOT SUCCESS [  0.566 s]
13:24:40 [INFO] org.eclipse.papyrus.tests.uml.tools.feature 1.2.0-SNAPSHOT SUCCESS [  0.079 s]
13:24:40 [INFO] org.eclipse.papyrus.uml.decoratormodel.tests.releng 0.0.1-SNAPSHOT SUCCESS [  0.004 s]
13:24:40 [INFO] org.eclipse.papyrus.uml.decoratormodel.controlmode.tests 1.3.0-SNAPSHOT SUCCESS [  0.528 s]
13:24:40 [INFO] org.eclipse.papyrus.uml.decoratormodel.tests 1.3.0-SNAPSHOT SUCCESS [  0.820 s]
13:24:40 [INFO] org.eclipse.papyrus.tests.uml.decoratormodel.feature 1.2.0-SNAPSHOT SUCCESS [  0.080 s]
13:24:40 [INFO] org.eclipse.papyrus.uml.textedit.tests.releng 0.0.1-SNAPSHOT SUCCESS [  0.003 s]
13:24:40 [INFO] org.eclipse.papyrus.uml.textedit.parameter.tests 1.2.100-SNAPSHOT SUCCESS [  0.459 s]
13:24:40 [INFO] org.eclipse.papyrus.uml.textedit.port.tests 1.2.100-SNAPSHOT SUCCESS [  0.440 s]
13:24:40 [INFO] org.eclipse.papyrus.uml.textedit.property.tests 1.2.200-SNAPSHOT SUCCESS [  0.552 s]
13:24:40 [INFO] org.eclipse.papyrus.uml.textedit.tests 1.3.100-SNAPSHOT SUCCESS [  0.617 s]
13:24:40 [INFO] org.eclipse.papyrus.uml.textedit.tests.feature 1.2.0-SNAPSHOT SUCCESS [  0.096 s]
13:24:40 [INFO] org.eclipse.papyrus.uml.assistants.tests.releng 0.0.1-SNAPSHOT SUCCESS [  0.003 s]
13:24:40 [INFO] org.eclipse.papyrus.uml.profile.types.generator.tests 1.2.100-SNAPSHOT SUCCESS [  0.717 s]
13:24:40 [INFO] org.eclipse.papyrus.uml.profile.assistants.generator.tests 1.2.100-SNAPSHOT SUCCESS [  0.615 s]
13:24:40 [INFO] org.eclipse.papyrus.tests.uml.assistants.feature 1.2.0-SNAPSHOT SUCCESS [  0.072 s]
13:24:40 [INFO] org.eclipse.papyrus.toolsmiths.tests.releng 0.0.1-SNAPSHOT SUCCESS [  0.004 s]
13:24:40 [INFO] org.eclipse.papyrus.toolsmiths.profilemigration.tests 0.7.0-SNAPSHOT SUCCESS [  0.634 s]
13:24:40 [INFO] org.eclipse.papyrus.toolsmiths.validation.profile.tests 1.0.0-SNAPSHOT SUCCESS [  0.578 s]
13:24:40 [INFO] org.eclipse.papyrus.toolsmiths.validation.elementtypes.tests 1.0.0-SNAPSHOT SUCCESS [  0.494 s]
13:24:40 [INFO] org.eclipse.papyrus.tests.toolsmiths.feature 1.0.0-SNAPSHOT SUCCESS [  0.070 s]
13:24:40 [INFO] org.eclipse.papyrus.tests.feature 2.0.0-SNAPSHOT ... SUCCESS [  0.968 s]
13:24:40 [INFO] org.eclipse.papyrus.infra.emf.expressions.main.tests 0.0.1-SNAPSHOT SUCCESS [  0.004 s]
13:24:40 [INFO] org.eclipse.papyrus.infra.emf.expressions.tests 1.0.0-SNAPSHOT SUCCESS [  0.138 s]
13:24:40 [INFO] org.eclipse.papyrus.tests.infra.emf.expressions.feature 1.0.0-SNAPSHOT SUCCESS [  0.034 s]
13:24:40 [INFO] org.eclipse.papyrus.infra.internationalization.main.test 1.0.0-SNAPSHOT SUCCESS [  0.004 s]
13:24:40 [INFO] org.eclipse.papyrus.infra.internationalization.tests 1.100.0-SNAPSHOT SUCCESS [  0.443 s]
13:24:40 [INFO] org.eclipse.papyrus.tests.infra.internationalization.feature 1.0.0-SNAPSHOT SUCCESS [  0.060 s]
13:24:40 [INFO] org.eclipse.papyrus.uml.expressions.tests.releng 0.0.1-SNAPSHOT SUCCESS [  0.003 s]
13:24:40 [INFO] org.eclipse.papyrus.uml.expressions.tests 1.1.0-SNAPSHOT SUCCESS [  0.497 s]
13:24:40 [INFO] org.eclipse.papyrus.tests.uml.expressions.feature 1.0.0-SNAPSHOT SUCCESS [  0.081 s]
13:24:40 [INFO] org.eclipse.papyrus.uml.internationalization.main.test 1.0.0-SNAPSHOT SUCCESS [  0.004 s]
13:24:40 [INFO] org.eclipse.papyrus.uml.internationalization.tests 1.100.0-SNAPSHOT SUCCESS [  0.500 s]
13:24:40 [INFO] org.eclipse.papyrus.uml.internationalization.controlmode.tests 1.1.0-SNAPSHOT SUCCESS [  0.530 s]
13:24:40 [INFO] org.eclipse.papyrus.tests.uml.internationalization.feature 1.0.0-SNAPSHOT SUCCESS [  0.059 s]
13:24:40 [INFO] org.eclipse.papyrus.uml.alf.tests 1.2.0-SNAPSHOT ... SUCCESS [  7.191 s]
13:24:40 [INFO] org.eclipse.papyrus.uml.alf.tests.feature 1.2.0-SNAPSHOT SUCCESS [  0.145 s]
13:24:40 [INFO] Papyrus Tests Features 0.0.1-SNAPSHOT .............. SUCCESS [  0.014 s]
13:24:40 [INFO] org.eclipse.papyrus.developer.suite.tests 0.0.1-SNAPSHOT SUCCESS [ 31.523 s]
13:24:40 [INFO] org.eclipse.papyrus.bundles.tests 0.0.1-SNAPSHOT ... SUCCESS [  0.009 s]
13:24:40 [INFO] org.eclipse.papyrus.eclipse.project.editors.tests 2.1.0-SNAPSHOT SUCCESS [  0.864 s]
13:24:40 [INFO] org.eclipse.papyrus.editors.suite.tests 0.0.1-SNAPSHOT SUCCESS [05:41 min]
13:24:40 [INFO] org.eclipse.papyrus.infra.core.suite.tests 0.0.1-SNAPSHOT SUCCESS [ 54.123 s]
13:24:40 [INFO] org.eclipse.papyrus.infra.nattable.suite.tests 0.0.1-SNAPSHOT SUCCESS [ 53.705 s]
13:24:40 [INFO] org.eclipse.papyrus.infra.architecture.tests 1.0.0-SNAPSHOT SUCCESS [  0.611 s]
13:24:40 [INFO] org.eclipse.papyrus.infra.services.labelprovider.tests 1.2.200-SNAPSHOT SUCCESS [  0.708 s]
13:24:40 [INFO] org.eclipse.papyrus.infra.ui.architecture.tests 1.0.0-SNAPSHOT SUCCESS [  0.569 s]
13:24:40 [INFO] org.eclipse.papyrus.infra.suite.tests 0.0.1-SNAPSHOT SUCCESS [05:18 min]
13:24:40 [INFO] org.eclipse.papyrus.infra.newchild.tests 1.2.100-SNAPSHOT SUCCESS [  0.770 s]
13:24:40 [INFO] org.eclipse.papyrus.uml.diagram.communication.tests 1.2.100-SNAPSHOT SUCCESS [  0.901 s]
13:24:40 [INFO] org.eclipse.papyrus.uml.diagram.interactionoverview.tests 1.2.0-SNAPSHOT SUCCESS [  0.719 s]
13:24:40 [INFO] org.eclipse.papyrus.uml.diagram.statemachine.tests 1.2.100-SNAPSHOT SUCCESS [  0.929 s]
13:24:40 [INFO] org.eclipse.papyrus.uml.diagram.suite.tests 0.0.1-SNAPSHOT SUCCESS [10:57 min]
13:24:40 [INFO] org.eclipse.papyrus.uml.diagram.dnd.tests 1.2.100-SNAPSHOT SUCCESS [  0.544 s]
13:24:40 [INFO] org.eclipse.papyrus.uml.diagram.properties.tests 1.0.0-SNAPSHOT SUCCESS [  0.508 s]
13:24:40 [INFO] org.eclipse.papyrus.uml.nattable.stereotype.display.tests 1.2.100-SNAPSHOT SUCCESS [  0.716 s]
13:24:40 [INFO] org.eclipse.papyrus.uml.nattable.suite.tests 0.0.1-SNAPSHOT SUCCESS [13:03 min]
13:24:40 [INFO] org.eclipse.papyrus.uml.textedit.valuespecification.tests 1.2.100-SNAPSHOT SUCCESS [  0.643 s]
13:24:40 [INFO] org.eclipse.papyrus.uml.textedit.suite.tests 0.0.1-SNAPSHOT SUCCESS [ 28.809 s]
13:24:40 [INFO] org.eclipse.papyrus.uml.architecture.tests 1.1.200-SNAPSHOT SUCCESS [  0.191 s]
13:24:40 [INFO] org.eclipse.papyrus.uml.validation.tests.releng 0.0.1-SNAPSHOT SUCCESS [  0.006 s]
13:24:40 [INFO] org.eclipse.papyrus.uml.validation.tests.staticprofile 1.2.0-SNAPSHOT SUCCESS [  0.253 s]
13:24:40 [INFO] org.eclipse.papyrus.uml.validation.tests.genvalidation 1.2.0-SNAPSHOT SUCCESS [  0.605 s]
13:24:40 [INFO] org.eclipse.papyrus.uml.validation.tests 1.2.100-SNAPSHOT SUCCESS [  0.819 s]
13:24:40 [INFO] org.eclipse.papyrus.uml.suite.tests 0.0.1-SNAPSHOT . SUCCESS [05:47 min]
13:24:40 [INFO] org.eclipse.papyrus.uml.alf.tests.releng 0.0.1-SNAPSHOT SUCCESS [  0.005 s]
13:24:40 [INFO] org.eclipse.papyrus.uml.alf.backend.tests 1.1.0-SNAPSHOT SUCCESS [  1.500 s]
13:24:40 [INFO] org.eclipse.papyrus.views.properties.toolsmiths.tests 1.2.0-SNAPSHOT SUCCESS [  0.453 s]
13:24:40 [INFO] org.eclipse.papyrus.views.suite.tests 0.0.1-SNAPSHOT SUCCESS [ 40.812 s]
13:24:40 [INFO] org.eclipse.papyrus.views.documentation.tests.releng 0.0.1-SNAPSHOT SUCCESS [  0.004 s]
13:24:40 [INFO] org.eclipse.papyrus.toolsmiths.suite.tests 0.0.1-SNAPSHOT SUCCESS [ 26.744 s]
13:24:40 [INFO] org.eclipse.papyrus.tests.main.releng 1.2.0-SNAPSHOT SUCCESS [  0.004 s]
13:24:40 [INFO] org.eclipse.papyrus.main.tests.target.parent 0.0.1-SNAPSHOT SUCCESS [  0.004 s]
13:24:40 [INFO] org.eclipse.papyrus.main.tests.portable.target 0.0.1-SNAPSHOT SUCCESS [  0.006 s]
13:24:40 [INFO] ------------------------------------------------------------------------
13:24:40 [INFO] BUILD SUCCESS
13:24:40 [INFO] ------------------------------------------------------------------------
13:24:40 [INFO] Total time:  56:32 min
13:24:40 [INFO] Finished at: 2020-03-28T13:24:40-04:00
13:24:40 [INFO] ------------------------------------------------------------------------
13:24:42 Taking screenshot.
13:24:42 [workspace] $ echo $XAUTHORITY
13:24:42 /home/hudson/genie.papyrus/.jenkins/jobs/Papyrus-Master-Tests/workspace/.Xauthority-6859167669436475695
13:24:42 [workspace] $ ls -l $XAUTHORITY
13:24:42 -rw-rw-r-- 1 genie.papyrus 8303 0 Mar 28 12:28 /home/hudson/genie.papyrus/.jenkins/jobs/Papyrus-Master-Tests/workspace/.Xauthority-6859167669436475695
13:24:42 [workspace] $ import -window root -display :729 screenshot.jpg
13:24:42 Terminating xvnc.
13:27:46 Sending e-mails to: patrick.tessier@cea.fr vincent.lorenzo@cea.fr quentin.lemenez@cea.fr
13:27:47 Recording test results
13:27:48 Build step 'Publish JUnit test result report' changed build result to UNSTABLE
13:27:48 Started calculate disk usage of build
13:27:48 Finished Calculation of disk usage of build in 0 seconds
13:27:48 Started calculate disk usage of workspace
13:27:49 Finished Calculation of disk usage of workspace in  1 second
13:27:49 Finished: UNSTABLE