UnstableConsole Output

Skipping 2,817 KB.. Full Log
it.runners.Suite.runChild(Suite.java:128)
01:22:13 	at org.junit.runners.Suite.runChild(Suite.java:27)
01:22:13 	at org.junit.runners.ParentRunner$4.run(ParentRunner.java:331)
01:22:13 	at org.junit.runners.ParentRunner$1.schedule(ParentRunner.java:79)
01:22:13 	at org.junit.runners.ParentRunner.runChildren(ParentRunner.java:329)
01:22:13 	at org.junit.runners.ParentRunner.access$100(ParentRunner.java:66)
01:22:13 	at org.junit.runners.ParentRunner$2.evaluate(ParentRunner.java:293)
01:22:13 	at org.junit.runners.ParentRunner$3.evaluate(ParentRunner.java:306)
01:22:13 	at org.junit.runners.ParentRunner.run(ParentRunner.java:413)
01:22:13 	at org.eclipse.papyrus.junit.framework.classification.ClassificationSuite.run(ClassificationSuite.java:130)
01:22:13 	at org.junit.runners.Suite.runChild(Suite.java:128)
01:22:13 	at org.junit.runners.Suite.runChild(Suite.java:27)
01:22:13 	at org.junit.runners.ParentRunner$4.run(ParentRunner.java:331)
01:22:13 	at org.junit.runners.ParentRunner$1.schedule(ParentRunner.java:79)
01:22:13 	at org.junit.runners.ParentRunner.runChildren(ParentRunner.java:329)
01:22:13 	at org.junit.runners.ParentRunner.access$100(ParentRunner.java:66)
01:22:13 	at org.junit.runners.ParentRunner$2.evaluate(ParentRunner.java:293)
01:22:13 	at org.junit.runners.ParentRunner$3.evaluate(ParentRunner.java:306)
01:22:13 	at org.junit.runners.ParentRunner.run(ParentRunner.java:413)
01:22:13 	at org.apache.maven.surefire.junit4.JUnit4Provider.execute(JUnit4Provider.java:365)
01:22:13 	at org.apache.maven.surefire.junit4.JUnit4Provider.executeWithRerun(JUnit4Provider.java:273)
01:22:13 	at org.apache.maven.surefire.junit4.JUnit4Provider.executeTestSet(JUnit4Provider.java:238)
01:22:13 	at org.apache.maven.surefire.junit4.JUnit4Provider.invoke(JUnit4Provider.java:159)
01:22:13 	at sun.reflect.NativeMethodAccessorImpl.invoke0(Native Method)
01:22:13 	at sun.reflect.NativeMethodAccessorImpl.invoke(NativeMethodAccessorImpl.java:62)
01:22:13 	at sun.reflect.DelegatingMethodAccessorImpl.invoke(DelegatingMethodAccessorImpl.java:43)
01:22:13 	at java.lang.reflect.Method.invoke(Method.java:498)
01:22:13 	at org.apache.maven.surefire.util.ReflectionUtils.invokeMethodWithArray2(ReflectionUtils.java:206)
01:22:13 	at org.apache.maven.surefire.booter.ProviderFactory$ProviderProxy.invoke(ProviderFactory.java:161)
01:22:13 	at org.apache.maven.surefire.booter.ProviderFactory.invokeProvider(ProviderFactory.java:84)
01:22:13 	at org.eclipse.tycho.surefire.osgibooter.OsgiSurefireBooter.run(OsgiSurefireBooter.java:110)
01:22:13 	at org.eclipse.tycho.surefire.osgibooter.AbstractUITestApplication$1.run(AbstractUITestApplication.java:35)
01:22:13 	at org.eclipse.swt.widgets.RunnableLock.run(RunnableLock.java:40)
01:22:13 	at org.eclipse.swt.widgets.Synchronizer.runAsyncMessages(Synchronizer.java:185)
01:22:13 	at org.eclipse.swt.widgets.Display.runAsyncMessages(Display.java:4930)
01:22:13 	at org.eclipse.swt.widgets.Display.readAndDispatch(Display.java:4451)
01:22:13 	at org.eclipse.e4.ui.internal.workbench.swt.PartRenderingEngine$5.run(PartRenderingEngine.java:1160)
01:22:13 	at org.eclipse.core.databinding.observable.Realm.runWithDefault(Realm.java:338)
01:22:13 	at org.eclipse.e4.ui.internal.workbench.swt.PartRenderingEngine.run(PartRenderingEngine.java:1049)
01:22:13 	at org.eclipse.e4.ui.internal.workbench.E4Workbench.createAndRunUI(E4Workbench.java:155)
01:22:13 	at org.eclipse.ui.internal.Workbench.lambda$3(Workbench.java:658)
01:22:13 	at org.eclipse.core.databinding.observable.Realm.runWithDefault(Realm.java:338)
01:22:13 	at org.eclipse.ui.internal.Workbench.createAndRunWorkbench(Workbench.java:557)
01:22:13 	at org.eclipse.ui.PlatformUI.createAndRunWorkbench(PlatformUI.java:154)
01:22:13 	at org.eclipse.ui.internal.ide.application.IDEApplication.start(IDEApplication.java:150)
01:22:13 	at org.eclipse.tycho.surefire.osgibooter.UITestApplication.runApplication(UITestApplication.java:31)
01:22:13 	at org.eclipse.tycho.surefire.osgibooter.AbstractUITestApplication.run(AbstractUITestApplication.java:120)
01:22:13 	at org.eclipse.tycho.surefire.osgibooter.UITestApplication.start(UITestApplication.java:37)
01:22:13 	at org.eclipse.equinox.internal.app.EclipseAppHandle.run(EclipseAppHandle.java:203)
01:22:13 	at org.eclipse.core.runtime.internal.adaptor.EclipseAppLauncher.runApplication(EclipseAppLauncher.java:137)
01:22:13 	at org.eclipse.core.runtime.internal.adaptor.EclipseAppLauncher.start(EclipseAppLauncher.java:107)
01:22:13 	at org.eclipse.core.runtime.adaptor.EclipseStarter.run(EclipseStarter.java:401)
01:22:13 	at org.eclipse.core.runtime.adaptor.EclipseStarter.run(EclipseStarter.java:255)
01:22:13 	at sun.reflect.NativeMethodAccessorImpl.invoke0(Native Method)
01:22:13 	at sun.reflect.NativeMethodAccessorImpl.invoke(NativeMethodAccessorImpl.java:62)
01:22:13 	at sun.reflect.DelegatingMethodAccessorImpl.invoke(DelegatingMethodAccessorImpl.java:43)
01:22:13 	at java.lang.reflect.Method.invoke(Method.java:498)
01:22:13 	at org.eclipse.equinox.launcher.Main.invokeFramework(Main.java:657)
01:22:13 	at org.eclipse.equinox.launcher.Main.basicRun(Main.java:594)
01:22:13 	at org.eclipse.equinox.launcher.Main.run(Main.java:1447)
01:22:13 	at org.eclipse.equinox.launcher.Main.main(Main.java:1420)
01:24:28 log4j:WARN No appenders could be found for logger (org.eclipse.ocl.pivot.internal.resource.StandaloneProjectMap).
01:24:28 log4j:WARN Please initialize the log4j system properly.
01:25:54 Tests run: 658, Failures: 1, Errors: 2, Skipped: 38, Time elapsed: 310.046 s <<< FAILURE! - in org.eclipse.papyrus.uml.suite.tests.AllTests
01:25:54 testUML(org.eclipse.papyrus.uml.service.types.tests.creation.CreatePureUMLElementTest)  Time elapsed: 0.098 s
01:25:54 test(org.eclipse.papyrus.uml.service.types.tests.creation.CreatePureUMLElementTest)  Time elapsed: 0.316 s
01:25:54 testDeleteOneAddVariableValueAction(org.eclipse.papyrus.uml.service.types.tests.deletion.DeletePureUMLElementTest)  Time elapsed: 0.087 s
01:25:54 testDeleteOneCentralBufferNode(org.eclipse.papyrus.uml.service.types.tests.deletion.DeletePureUMLElementTest)  Time elapsed: 0.022 s
01:25:54 stereotypeApplicationsDeleted:command(org.eclipse.papyrus.uml.service.types.tests.deletion.DeleteDependentWithStereotypeApplications458685)  Time elapsed: 1.39 s
01:25:54 stereotypeApplicationsDeleted:elements(org.eclipse.papyrus.uml.service.types.tests.deletion.DeleteDependentWithStereotypeApplications458685)  Time elapsed: 0 s
01:25:54 stereotypeApplicationsDeleted:stereotypes(org.eclipse.papyrus.uml.service.types.tests.deletion.DeleteDependentWithStereotypeApplications458685)  Time elapsed: 0 s
01:25:54 stereotypeApplicationsDeleted:undo(org.eclipse.papyrus.uml.service.types.tests.deletion.DeleteDependentWithStereotypeApplications458685)  Time elapsed: 0 s
01:25:54 stereotypeApplicationsDeleted:redo(org.eclipse.papyrus.uml.service.types.tests.deletion.DeleteDependentWithStereotypeApplications458685)  Time elapsed: 0 s
01:25:54 deleteInitialState(org.eclipse.papyrus.uml.service.types.tests.deletion.DeleteTransitionsWithVertexTest)  Time elapsed: 0.507 s
01:25:54 deleteS1(org.eclipse.papyrus.uml.service.types.tests.deletion.DeleteTransitionsWithVertexTest)  Time elapsed: 0.189 s
01:25:54 deleteS2(org.eclipse.papyrus.uml.service.types.tests.deletion.DeleteTransitionsWithVertexTest)  Time elapsed: 0.394 s
01:25:54 deleteFinalState(org.eclipse.papyrus.uml.service.types.tests.deletion.DeleteTransitionsWithVertexTest)  Time elapsed: 0.22 s
01:25:54 deleteFromContainmentSubset(org.eclipse.papyrus.uml.service.types.tests.deletion.DeleteContainmentSubsetTest)  Time elapsed: 0.157 s
01:25:54 deleteFromTwoContainmentSupersetsAtOnce(org.eclipse.papyrus.uml.service.types.tests.deletion.DeleteContainmentSubsetTest)  Time elapsed: 0.132 s
01:25:54 createAssociationWritable(org.eclipse.papyrus.uml.service.types.tests.creation.ConnectorReadOnlyTestBug465899)  Time elapsed: 0.521 s
01:25:54 createAssociationReadOnly_usecase(org.eclipse.papyrus.uml.service.types.tests.creation.ConnectorReadOnlyTestBug465899)  Time elapsed: 0.097 s
01:25:54 createAssociationReadOnly(org.eclipse.papyrus.uml.service.types.tests.creation.ConnectorReadOnlyTestBug465899)  Time elapsed: 0.065 s
01:25:54 createConnectorTargetReadOnly(org.eclipse.papyrus.uml.service.types.tests.creation.ConnectorReadOnlyTestBug465899)  Time elapsed: 0.058 s
01:25:54 createConnectorSourceReadOnly(org.eclipse.papyrus.uml.service.types.tests.creation.ConnectorReadOnlyTestBug465899)  Time elapsed: 0.062 s
01:25:54 testDeletion(org.eclipse.papyrus.uml.service.types.tests.deletion.DeleteAssociationPropertyTypeTest)  Time elapsed: 0.037 s
01:25:54 testDeletionInCompositeDiagram(org.eclipse.papyrus.uml.service.types.tests.deletion.DeleteCommentLinkTest)  Time elapsed: 5.687 s
01:25:54 testDeletionWithSetRequest(org.eclipse.papyrus.uml.service.types.tests.deletion.DeleteCommentLinkTest) skipped
01:25:54 testDeletionInClassDiagram(org.eclipse.papyrus.uml.service.types.tests.deletion.DeleteCommentLinkTest)  Time elapsed: 1.352 s
01:25:54 testDeletionInComponentDiagram(org.eclipse.papyrus.uml.service.types.tests.deletion.DeleteCommentLinkTest)  Time elapsed: 1.446 s
01:25:54 testCreation(org.eclipse.papyrus.uml.service.types.tests.creation.CreateAssociationTest)  Time elapsed: 0.016 s
01:25:54 testCreation(org.eclipse.papyrus.uml.service.types.tests.creation.CreateAssociationDirectedTest)  Time elapsed: 0.021 s
01:25:54 testCreation(org.eclipse.papyrus.uml.service.types.tests.creation.CreateAssociationCompositeTest)  Time elapsed: 0.01 s
01:25:54 testCreation(org.eclipse.papyrus.uml.service.types.tests.creation.CreateAssociationCompositeDirectedTest)  Time elapsed: 0.006 s
01:25:54 testCreation(org.eclipse.papyrus.uml.service.types.tests.creation.CreateAssociationSharedTest)  Time elapsed: 0.006 s
01:25:54 testCreation(org.eclipse.papyrus.uml.service.types.tests.creation.CreateAssociationSharedDirectedTest)  Time elapsed: 0.007 s
01:25:54 deleteInteractionFragmentInOperand(org.eclipse.papyrus.uml.service.types.tests.deletion.InteractionDeletionTest)  Time elapsed: 0.6 s
01:25:54 deleteAllOperandsOfCombinedFragment(org.eclipse.papyrus.uml.service.types.tests.deletion.InteractionDeletionTest)  Time elapsed: 0.5 s
01:25:54 deleteCombinedFragment(org.eclipse.papyrus.uml.service.types.tests.deletion.InteractionDeletionTest)  Time elapsed: 1.325 s
01:25:54 deleteCombinedFragmentNested(org.eclipse.papyrus.uml.service.types.tests.deletion.InteractionDeletionTest)  Time elapsed: 1.443 s
01:25:54 deleteOperandsOfCombinedFragment(org.eclipse.papyrus.uml.service.types.tests.deletion.InteractionDeletionTest)  Time elapsed: 0.813 s
01:25:54 deleteCombinedFragmentDeeplyNested(org.eclipse.papyrus.uml.service.types.tests.deletion.InteractionDeletionTest)  Time elapsed: 0.612 s
01:25:54 deleteInteractionWithNesting(org.eclipse.papyrus.uml.service.types.tests.deletion.InteractionDeletionTest)  Time elapsed: 0.913 s
01:25:54 deleteInteraction(org.eclipse.papyrus.uml.service.types.tests.deletion.InteractionDeletionTest)  Time elapsed: 1.176 s
01:25:54 testCreateClassInModel(org.eclipse.papyrus.uml.service.types.ui.tests.creation.CreateElementTest)  Time elapsed: 0.023 s
01:25:54 testCreateCentralBufferNodeInActivity(org.eclipse.papyrus.uml.service.types.ui.tests.creation.CreateElementTest)  Time elapsed: 0.032 s
01:25:54 testCreateCentralBufferNodeInActivityWithNode(org.eclipse.papyrus.uml.service.types.ui.tests.creation.CreateElementTest)  Time elapsed: 0.009 s
01:25:54 testCannotCreateOperationRedefinableTemplateSignature_bug468071(org.eclipse.papyrus.uml.service.types.ui.tests.creation.CreateElementTest)  Time elapsed: 0.002 s
01:25:54 testCreateOperationTemplateSignature_bug468071(org.eclipse.papyrus.uml.service.types.ui.tests.creation.CreateElementTest)  Time elapsed: 0.014 s
01:25:54 testCreateModelInClass(org.eclipse.papyrus.uml.service.types.ui.tests.creation.CreateElementTest)  Time elapsed: 0.001 s
01:25:54 testCreateDeploymentBetweenNodeAndArtifactInNode(org.eclipse.papyrus.uml.service.types.ui.tests.creation.CreateRelationshipTest)  Time elapsed: 0.009 s
01:25:54 testCreatePackageMergeBetweenPackageAndPackageInPackage2(org.eclipse.papyrus.uml.service.types.ui.tests.creation.CreateRelationshipTest)  Time elapsed: 0.023 s
01:25:54 testCreateTraceBetweenClassAndNullInPackage(org.eclipse.papyrus.uml.service.types.ui.tests.creation.CreateRelationshipTest)  Time elapsed: 0.008 s
01:25:54 testCreateDependencyBetweenClassesInPackage(org.eclipse.papyrus.uml.service.types.ui.tests.creation.CreateRelationshipTest)  Time elapsed: 0.01 s
01:25:54 testCreateProtocolConformanceBetweenPackageAndPackageInPackage(org.eclipse.papyrus.uml.service.types.ui.tests.creation.CreateRelationshipTest)  Time elapsed: 0.01 s
01:25:54 testCreateInformationfloweBetweenClasses2InPackage(org.eclipse.papyrus.uml.service.types.ui.tests.creation.CreateRelationshipTest)  Time elapsed: 0.01 s
01:25:54 testCreateUsageBetweenClassAndNullInPackage(org.eclipse.papyrus.uml.service.types.ui.tests.creation.CreateRelationshipTest)  Time elapsed: 0.002 s
01:25:54 testCreateAbstractionBetweenPackageAndClassesInModel(org.eclipse.papyrus.uml.service.types.ui.tests.creation.CreateRelationshipTest)  Time elapsed: 0.012 s
01:25:54 testCreateComponentRealizationBetweenClassAndComponentInComponent(org.eclipse.papyrus.uml.service.types.ui.tests.creation.CreateRelationshipTest)  Time elapsed: 0.017 s
01:25:54 testCreateAbstractionBetweenClassesInPackage(org.eclipse.papyrus.uml.service.types.ui.tests.creation.CreateRelationshipTest)  Time elapsed: 0.005 s
01:25:54 testCreateUsageBetweenClassesInPackage(org.eclipse.papyrus.uml.service.types.ui.tests.creation.CreateRelationshipTest)  Time elapsed: 0.004 s
01:25:54 testCreatePackageImportBetweenPackageAndPackageInPackage(org.eclipse.papyrus.uml.service.types.ui.tests.creation.CreateRelationshipTest)  Time elapsed: 0.006 s
01:25:54 testCreateComponentRealizationBetweenComponentAndClassInComponent(org.eclipse.papyrus.uml.service.types.ui.tests.creation.CreateRelationshipTest)  Time elapsed: 0.014 s
01:25:54 testCreateElementImportBetweenPackageAndPackageInPackage(org.eclipse.papyrus.uml.service.types.ui.tests.creation.CreateRelationshipTest)  Time elapsed: 0.007 s
01:25:54 testCreateDeploymentBetweenNodeAndArtifactInArtifact(org.eclipse.papyrus.uml.service.types.ui.tests.creation.CreateRelationshipTest)  Time elapsed: 0 s
01:25:54 testCreateGeneralizationBetweenClassesInPackage(org.eclipse.papyrus.uml.service.types.ui.tests.creation.CreateRelationshipTest)  Time elapsed: 0.006 s
01:25:54 testCreateGeneralizationBetweenClassAndNullInClass(org.eclipse.papyrus.uml.service.types.ui.tests.creation.CreateRelationshipTest)  Time elapsed: 0.001 s
01:25:54 testCreateDeploymentBetweenArtifactAndNodeInArtifact(org.eclipse.papyrus.uml.service.types.ui.tests.creation.CreateRelationshipTest)  Time elapsed: 0.008 s
01:25:54 testCreateExtendBetweenClasses2InPackage(org.eclipse.papyrus.uml.service.types.ui.tests.creation.CreateRelationshipTest)  Time elapsed: 0 s
01:25:54 testCreateProtocolConformanceBetweenPackageAndPackageInPackage2(org.eclipse.papyrus.uml.service.types.ui.tests.creation.CreateRelationshipTest)  Time elapsed: 0.001 s
01:25:54 testCreateTransitionBetweenInitialAndState(org.eclipse.papyrus.uml.service.types.ui.tests.creation.CreateRelationshipTest) skipped
01:25:54 testCreateInformationfloweBetweenUseCases2InUseCase(org.eclipse.papyrus.uml.service.types.ui.tests.creation.CreateRelationshipTest)  Time elapsed: 0.003 s
01:25:54 testCreateRefineBetweenClassesInPackage(org.eclipse.papyrus.uml.service.types.ui.tests.creation.CreateRelationshipTest)  Time elapsed: 0.208 s
01:25:54 testCreateComponentRealizationBetweenClassAndComponentInClass(org.eclipse.papyrus.uml.service.types.ui.tests.creation.CreateRelationshipTest)  Time elapsed: 0.006 s
01:25:54 testCreateRealizationBetweenClassAndNullInPackage(org.eclipse.papyrus.uml.service.types.ui.tests.creation.CreateRelationshipTest)  Time elapsed: 0.001 s
01:25:54 testCreateExtensionBetweenClassAndNullInNull(org.eclipse.papyrus.uml.service.types.ui.tests.creation.CreateRelationshipTest)  Time elapsed: 0.001 s
01:25:54 testCreateExtendBetweenUseCases2InUseCase(org.eclipse.papyrus.uml.service.types.ui.tests.creation.CreateRelationshipTest)  Time elapsed: 0.011 s
01:25:54 testCreateElementImportBetweenPackageAndPackageInPackage2(org.eclipse.papyrus.uml.service.types.ui.tests.creation.CreateRelationshipTest)  Time elapsed: 0.004 s
01:25:54 testCreateAssociationBetweenClassesInPackage(org.eclipse.papyrus.uml.service.types.ui.tests.creation.CreateRelationshipTest)  Time elapsed: 0.004 s
01:25:54 testCreateTraceBetweenClassesInClass(org.eclipse.papyrus.uml.service.types.ui.tests.creation.CreateRelationshipTest)  Time elapsed: 0.012 s
01:25:54 testCreateManifestationBetweenArtifactAndPackage2InArtifact(org.eclipse.papyrus.uml.service.types.ui.tests.creation.CreateRelationshipTest)  Time elapsed: 0.007 s
01:25:54 testCreateSubstitutionBetweenClassesInPackage(org.eclipse.papyrus.uml.service.types.ui.tests.creation.CreateRelationshipTest)  Time elapsed: 0.007 s
01:25:54 testCreateAbstractionBetweenClassAndNullInPackage(org.eclipse.papyrus.uml.service.types.ui.tests.creation.CreateRelationshipTest)  Time elapsed: 0.002 s
01:25:54 testCreateAbstractionBetweenClassAndClassInClass(org.eclipse.papyrus.uml.service.types.ui.tests.creation.CreateRelationshipTest)  Time elapsed: 0.003 s
01:25:54 testCreatePackageMergeBetweenPackageAndPackageInPackage(org.eclipse.papyrus.uml.service.types.ui.tests.creation.CreateRelationshipTest)  Time elapsed: 0.003 s
01:25:54 testCreateRealizationBetweenClassesInPackage(org.eclipse.papyrus.uml.service.types.ui.tests.creation.CreateRelationshipTest)  Time elapsed: 0.003 s
01:25:54 testCreateTransitionBetweenStateAndInitial(org.eclipse.papyrus.uml.service.types.ui.tests.creation.CreateRelationshipTest) skipped
01:25:54 testCreateAssociationBetweenClassAndNullInPackage(org.eclipse.papyrus.uml.service.types.ui.tests.creation.CreateRelationshipTest)  Time elapsed: 0.001 s
01:25:54 testCreateRefineBetweenClassAndNullInPackage(org.eclipse.papyrus.uml.service.types.ui.tests.creation.CreateRelationshipTest)  Time elapsed: 0.002 s
01:25:54 testCreateDeploymentBetweenArtifactAndNodeInNode(org.eclipse.papyrus.uml.service.types.ui.tests.creation.CreateRelationshipTest)  Time elapsed: 0.005 s
01:25:54 testCreateIncludeBetweenUseCases2InUseCase(org.eclipse.papyrus.uml.service.types.ui.tests.creation.CreateRelationshipTest)  Time elapsed: 0.006 s
01:25:54 testCreateGeneralizationBetweenClassesInClass(org.eclipse.papyrus.uml.service.types.ui.tests.creation.CreateRelationshipTest)  Time elapsed: 0.003 s
01:25:54 testCreateExtensionBetweenClassAndNullInClass(org.eclipse.papyrus.uml.service.types.ui.tests.creation.CreateRelationshipTest)  Time elapsed: 0 s
01:25:54 testCreateDependencyBetweenClassAndNullInPackage(org.eclipse.papyrus.uml.service.types.ui.tests.creation.CreateRelationshipTest)  Time elapsed: 0.002 s
01:25:54 testCreatePackageImportBetweenPackageAndPackageInPackage2(org.eclipse.papyrus.uml.service.types.ui.tests.creation.CreateRelationshipTest)  Time elapsed: 0.003 s
01:25:54 testCreateComponentRealizationBetweenComponentAndClass(org.eclipse.papyrus.uml.service.types.ui.tests.creation.CreateRelationshipTest)  Time elapsed: 0.001 s
01:25:54 testCreateSubstitutionBetweenClassAndNullInPackage(org.eclipse.papyrus.uml.service.types.ui.tests.creation.CreateRelationshipTest)  Time elapsed: 0.001 s
01:25:54 testCreateInterfaceRealizationBetweenClassAndInterfaceInClass(org.eclipse.papyrus.uml.service.types.ui.tests.creation.CreateRelationshipTest)  Time elapsed: 0.007 s
01:25:54 testCreateTraceBetweenClassesInPackage(org.eclipse.papyrus.uml.service.types.ui.tests.creation.CreateRelationshipTest)  Time elapsed: 0.009 s
01:25:54 testCreateTransitionBetweenStateAndFinal(org.eclipse.papyrus.uml.service.types.ui.tests.creation.CreateRelationshipTest) skipped
01:25:54 testCreateAbstractionBetweenClassAndPackageInModel(org.eclipse.papyrus.uml.service.types.ui.tests.creation.CreateRelationshipTest)  Time elapsed: 0.004 s
01:25:54 testCreateRefineBetweenClassesInClass(org.eclipse.papyrus.uml.service.types.ui.tests.creation.CreateRelationshipTest)  Time elapsed: 0.008 s
01:25:54 testCreateTransitionBetweenFinalAndState(org.eclipse.papyrus.uml.service.types.ui.tests.creation.CreateRelationshipTest) skipped
01:25:54 testCreateManifestationBetweenClassAndPackage2InArtifact(org.eclipse.papyrus.uml.service.types.ui.tests.creation.CreateRelationshipTest)  Time elapsed: 0.007 s
01:25:54 testCreateInterfaceRealizationBetweenUseCases2InUseCase(org.eclipse.papyrus.uml.service.types.ui.tests.creation.CreateRelationshipTest)  Time elapsed: 0.002 s
01:25:54 testCreateIncludeBetweenClasses2InPackage(org.eclipse.papyrus.uml.service.types.ui.tests.creation.CreateRelationshipTest)  Time elapsed: 0 s
01:25:54 testCreateExtensionBetweenStereotypeAndMetaClassInPackage(org.eclipse.papyrus.uml.service.types.ui.tests.creation.CreateProfileRelationshipTest)  Time elapsed: 0.018 s
01:25:54 testMoveTemplateSignatureToOperation_bug468071(org.eclipse.papyrus.uml.service.types.ui.tests.creation.MoveElementTest)  Time elapsed: 0.37 s
01:25:54 testMoveRedefinableTemplateSignatureToClass_bug468071(org.eclipse.papyrus.uml.service.types.ui.tests.creation.MoveElementTest)  Time elapsed: 0.005 s
01:25:54 testCannotMoveRedefinableTemplateSignatureToOperation_bug468071(org.eclipse.papyrus.uml.service.types.ui.tests.creation.MoveElementTest)  Time elapsed: 0 s
01:25:54 testSetTemplateSignatureOfOperation_bug468071(org.eclipse.papyrus.uml.service.types.ui.tests.creation.SetFeatureTest)  Time elapsed: 0.005 s
01:25:54 testSetRedefinableTemplateSignatureOfClass_bug468071(org.eclipse.papyrus.uml.service.types.ui.tests.creation.SetFeatureTest)  Time elapsed: 0.002 s
01:25:54 testCannotSetRedefinableTemplateSignatureOfOperation_bug468071(org.eclipse.papyrus.uml.service.types.ui.tests.creation.SetFeatureTest)  Time elapsed: 0 s
01:25:54 deleteAssociation(org.eclipse.papyrus.uml.service.types.ui.tests.deletion.DeleteAssociationTest)  Time elapsed: 0.31 s
01:25:54 deleteAssociationTarget(org.eclipse.papyrus.uml.service.types.ui.tests.deletion.DeleteAssociationTest)  Time elapsed: 0.275 s
01:25:54 deleteReadOnlyElement(org.eclipse.papyrus.uml.modelexplorer.tests.DeleteModelExplorerTest)  Time elapsed: 1.373 s
01:25:54 deleteClassInTheModel(org.eclipse.papyrus.uml.modelexplorer.tests.DeleteModelExplorerTest)  Time elapsed: 0.947 s
01:25:54 deleteRootOfTheModel(org.eclipse.papyrus.uml.modelexplorer.tests.DeleteModelExplorerTest)  Time elapsed: 0.715 s
01:25:54 renameUMLUnnamedElementTest(org.eclipse.papyrus.uml.modelexplorer.tests.RenameHandlerTest) skipped
01:25:54 renameUMLNamedElementTest(org.eclipse.papyrus.uml.modelexplorer.tests.RenameHandlerTest) skipped
01:25:54 revealSemanticElement_selectRootTest(org.eclipse.papyrus.uml.modelexplorer.tests.ModelExplorerViewTests)  Time elapsed: 0.83 s
01:25:54 revealSemanticElement_selectChildrenTest(org.eclipse.papyrus.uml.modelexplorer.tests.ModelExplorerViewTests)  Time elapsed: 1.116 s
01:25:54 revealSemanticElement_selectImportedPackage(org.eclipse.papyrus.uml.modelexplorer.tests.ModelExplorerViewTests)  Time elapsed: 0.776 s
01:25:54 revealSemanticElement_selectImportedPackageList(org.eclipse.papyrus.uml.modelexplorer.tests.ModelExplorerViewTests)  Time elapsed: 1.158 s
01:25:54 revealSemanticElement_selectChildrenTestList(org.eclipse.papyrus.uml.modelexplorer.tests.ModelExplorerViewTests)  Time elapsed: 1.069 s
01:25:54 cutReadOnlyElement(org.eclipse.papyrus.uml.modelexplorer.tests.paste.CutPasteModelExplorerTest)  Time elapsed: 0.815 s
01:25:54 cutClassTest(org.eclipse.papyrus.uml.modelexplorer.tests.paste.CutPasteModelExplorerTest)  Time elapsed: 1.053 s
01:25:54 cutRootOfTheModel(org.eclipse.papyrus.uml.modelexplorer.tests.paste.CutPasteModelExplorerTest)  Time elapsed: 0.494 s
01:25:54 copyPasteofClass1Test(org.eclipse.papyrus.uml.modelexplorer.tests.paste.CopyPasteModelExplorerTest)  Time elapsed: 0.368 s
01:25:54 pasteOnReadOnlyElement(org.eclipse.papyrus.uml.modelexplorer.tests.paste.CopyPasteModelExplorerTest)  Time elapsed: 0.451 s
01:25:54 copyPasteofClass1And2Test(org.eclipse.papyrus.uml.modelexplorer.tests.paste.CopyPasteModelExplorerTest)  Time elapsed: 0.493 s
01:25:54 copyPasteDiagramTest(org.eclipse.papyrus.uml.modelexplorer.tests.paste.DiagramCopyPasteModelExplorerTest)  Time elapsed: 0.394 s
01:25:54 copyPasteTableTest(org.eclipse.papyrus.uml.modelexplorer.tests.paste.TableCopyPasteModelExplorerTest)  Time elapsed: 0.364 s
01:25:54 copyPasteofClass1Test(org.eclipse.papyrus.uml.modelexplorer.tests.paste.StereotypeCopyPasteModelExplorerTest)  Time elapsed: 1.042 s
01:25:54 advancedModeDoesNotCollapseItself(org.eclipse.papyrus.uml.modelexplorer.tests.AdvancedModeTest)  Time elapsed: 2.573 s  <<< ERROR!
01:25:54 org.eclipse.emf.common.util.BasicEList$BasicIndexOutOfBoundsException: index=0, size=0
01:25:54 
01:25:54 advancedModeDoesNotCollapseItself(org.eclipse.papyrus.uml.modelexplorer.tests.AdvancedModeTest)  Time elapsed: 2.573 s  <<< ERROR!
01:25:54 java.lang.NullPointerException
01:25:54 	at org.eclipse.papyrus.uml.modelexplorer.tests.AdvancedModeTest.advancedModeDoesNotCollapseItself(AdvancedModeTest.java:69)
01:25:54 
01:25:54 validateModel[0](org.eclipse.papyrus.uml.modelexplorer.tests.resources.ModelValidationTest)  Time elapsed: 0.028 s
01:25:54 validateModel[1](org.eclipse.papyrus.uml.modelexplorer.tests.resources.ModelValidationTest)  Time elapsed: 0.012 s
01:25:54 org.eclipse.papyrus.uml.diagram.dnd.tests.tests.InstanceSpecificationTest  Time elapsed: 0.99 s  <<< FAILURE!
01:25:54 java.lang.AssertionError: Cannot load the test diagram
01:25:54 	at org.eclipse.papyrus.uml.diagram.dnd.tests.tests.InstanceSpecificationTest.initModel(InstanceSpecificationTest.java:131)
01:25:54 	at org.eclipse.papyrus.uml.diagram.dnd.tests.tests.InstanceSpecificationTest.init(InstanceSpecificationTest.java:91)
01:25:54 
01:25:54 singleValuePropertyGraphicalTest(org.eclipse.papyrus.uml.tools.tests.tests.ContentProviderTest)  Time elapsed: 0.11 s
01:25:54 singleValuePropertyTest(org.eclipse.papyrus.uml.tools.tests.tests.ContentProviderTest)  Time elapsed: 0.022 s
01:25:54 multipleValuePropertyTest(org.eclipse.papyrus.uml.tools.tests.tests.ContentProviderTest) skipped
01:25:54 enumPropertyTest(org.eclipse.papyrus.uml.tools.tests.tests.ContentProviderTest)  Time elapsed: 0.008 s
01:25:54 testProfileContentWithBaseClassPropertyWithoutInheritedProperties(org.eclipse.papyrus.uml.tools.tests.tests.UMLStereotypePropertyContentProviderTest)  Time elapsed: 0.202 s
01:25:54 testProfileContentWithoutBaseClassPropertyWithoutInheritedProperties(org.eclipse.papyrus.uml.tools.tests.tests.UMLStereotypePropertyContentProviderTest)  Time elapsed: 0.187 s
01:25:54 testProfileContentWithBaseClassPropertyWithInheritedProperties(org.eclipse.papyrus.uml.tools.tests.tests.UMLStereotypePropertyContentProviderTest)  Time elapsed: 0.131 s
01:25:54 testProfileContentWithoutBaseClassPropertyWithInheritedProperties(org.eclipse.papyrus.uml.tools.tests.tests.UMLStereotypePropertyContentProviderTest)  Time elapsed: 0.122 s
01:25:54 testSwitchToProxy(org.eclipse.papyrus.uml.tools.tests.tests.DependencyManagementTest) skipped
01:25:54 testSwitchProfilesWithStereotypes(org.eclipse.papyrus.uml.tools.tests.tests.DependencyManagementTest)  Time elapsed: 1.69 s
01:25:54 testSwitchFromRegistererdToLocal(org.eclipse.papyrus.uml.tools.tests.tests.DependencyManagementTest)  Time elapsed: 4.376 s
01:25:54 testSwitchProfilesWithStereotypeProperties(org.eclipse.papyrus.uml.tools.tests.tests.DependencyManagementTest)  Time elapsed: 1.418 s
01:25:54 testSwitchProfilesWithMissingDefinitions(org.eclipse.papyrus.uml.tools.tests.tests.DependencyManagementTest)  Time elapsed: 1.257 s
01:25:54 testSwitchFromLocalToRegistered(org.eclipse.papyrus.uml.tools.tests.tests.DependencyManagementTest)  Time elapsed: 1.193 s
01:25:54 testSwitchToDifferentVersion(org.eclipse.papyrus.uml.tools.tests.tests.DependencyManagementTest) skipped
01:25:54 testSimpleSwitch(org.eclipse.papyrus.uml.tools.tests.tests.DependencyManagementTest)  Time elapsed: 1.283 s
01:25:54 testSwitchFromProxy(org.eclipse.papyrus.uml.tools.tests.tests.DependencyManagementTest) skipped
01:25:54 testSwitchProfilesStereotypeIdentities(org.eclipse.papyrus.uml.tools.tests.tests.DependencyManagementTest)  Time elapsed: 1.184 s
01:25:54 testSwitchProfilesWithRequiredStereotypes(org.eclipse.papyrus.uml.tools.tests.tests.DependencyManagementTest)  Time elapsed: 1.176 s
01:25:54 testOverloadDoesNotClash(org.eclipse.papyrus.uml.tools.tests.tests.NamedElementValidatorTest)  Time elapsed: 0.07 s
01:25:54 testNameClash(org.eclipse.papyrus.uml.tools.tests.tests.NamedElementValidatorTest)  Time elapsed: 0.058 s
01:25:54 testElementOfDifferentKindDoesNotClash(org.eclipse.papyrus.uml.tools.tests.tests.NamedElementValidatorTest)  Time elapsed: 0.059 s
01:25:54 testModifiedSysMLStereotype(org.eclipse.papyrus.uml.tools.tests.tests.StereotypeElementListenerTest) skipped
01:25:54 testUndoUnapplyProfile(org.eclipse.papyrus.uml.tools.tests.tests.StereotypeElementListenerTest)  Time elapsed: 0.383 s
01:25:54 testAddStereotype(org.eclipse.papyrus.uml.tools.tests.tests.StereotypeElementListenerTest)  Time elapsed: 0.351 s
01:25:54 testStereotypeUnsetAttributeChange(org.eclipse.papyrus.uml.tools.tests.tests.StereotypeElementListenerTest)  Time elapsed: 0.43 s
01:25:54 testUndoAddStereotype(org.eclipse.papyrus.uml.tools.tests.tests.StereotypeElementListenerTest)  Time elapsed: 0.366 s
01:25:54 testAddStereotypes(org.eclipse.papyrus.uml.tools.tests.tests.StereotypeElementListenerTest)  Time elapsed: 0.425 s
01:25:54 testUndoRemoveStereotype(org.eclipse.papyrus.uml.tools.tests.tests.StereotypeElementListenerTest)  Time elapsed: 0.293 s
01:25:54 testAddSysMLStereotype(org.eclipse.papyrus.uml.tools.tests.tests.StereotypeElementListenerTest)  Time elapsed: 0.304 s
01:25:54 testModifiedStereotype(org.eclipse.papyrus.uml.tools.tests.tests.StereotypeElementListenerTest)  Time elapsed: 0.447 s
01:25:54 testAddStereotypeOnSeveralElements(org.eclipse.papyrus.uml.tools.tests.tests.StereotypeElementListenerTest)  Time elapsed: 0.408 s
01:25:54 testUndoAddStereotypes(org.eclipse.papyrus.uml.tools.tests.tests.StereotypeElementListenerTest)  Time elapsed: 0.438 s
01:25:54 testFakeBasedProperty(org.eclipse.papyrus.uml.tools.tests.tests.StereotypeElementListenerTest)  Time elapsed: 0.35 s
01:25:54 testRemoveStereotype(org.eclipse.papyrus.uml.tools.tests.tests.StereotypeElementListenerTest)  Time elapsed: 0.477 s
01:25:54 testRemoveSysMLStereotype(org.eclipse.papyrus.uml.tools.tests.tests.StereotypeElementListenerTest)  Time elapsed: 0.373 s
01:25:54 testUndoAddSysMLStereotype(org.eclipse.papyrus.uml.tools.tests.tests.StereotypeElementListenerTest)  Time elapsed: 0.392 s
01:25:54 testUndoModifiedStereotype(org.eclipse.papyrus.uml.tools.tests.tests.StereotypeElementListenerTest)  Time elapsed: 0.416 s
01:25:54 testUndoAddStereotypeOnSeveralElements(org.eclipse.papyrus.uml.tools.tests.tests.StereotypeElementListenerTest)  Time elapsed: 0.451 s
01:25:54 testUndoRedoAddStereotypeTiming(org.eclipse.papyrus.uml.tools.tests.tests.StereotypeElementListenerTest)  Time elapsed: 0.432 s
01:25:54 testUnapplyProfile(org.eclipse.papyrus.uml.tools.tests.tests.StereotypeElementListenerTest)  Time elapsed: 0.499 s
01:25:54 testUndoRemoveSysMLStereotype(org.eclipse.papyrus.uml.tools.tests.tests.StereotypeElementListenerTest)  Time elapsed: 0.715 s
01:25:54 testUndoModifiedSysMLStereotype(org.eclipse.papyrus.uml.tools.tests.tests.StereotypeElementListenerTest) skipped
01:25:54 testStereotypeListAttributeChange(org.eclipse.papyrus.uml.tools.tests.tests.StereotypeElementListenerTest)  Time elapsed: 1.009 s
01:25:54 twoProfilesUnapplied(org.eclipse.papyrus.uml.tools.tests.tests.ProfileApplicationListenerTest)  Time elapsed: 0.179 s
01:25:54 moveProfileApplication(org.eclipse.papyrus.uml.tools.tests.tests.ProfileApplicationListenerTest)  Time elapsed: 0.133 s
01:25:54 applyProfileThenMoveApplication(org.eclipse.papyrus.uml.tools.tests.tests.ProfileApplicationListenerTest)  Time elapsed: 0.205 s
01:25:54 twoProfilesApplied(org.eclipse.papyrus.uml.tools.tests.tests.ProfileApplicationListenerTest)  Time elapsed: 0.114 s
01:25:54 profileReplacedInAnApplication(org.eclipse.papyrus.uml.tools.tests.tests.ProfileApplicationListenerTest)  Time elapsed: 0.226 s
01:25:54 simpleNewProfileApplication(org.eclipse.papyrus.uml.tools.tests.tests.ProfileApplicationListenerTest)  Time elapsed: 0.188 s
01:25:54 simpleProfileUnapplication(org.eclipse.papyrus.uml.tools.tests.tests.ProfileApplicationListenerTest)  Time elapsed: 0.137 s
01:25:54 profileAppliedThenReplacedInSameApplication(org.eclipse.papyrus.uml.tools.tests.tests.ProfileApplicationListenerTest)  Time elapsed: 0.295 s
01:25:54 testEditToDisplaySingleString_1(org.eclipse.papyrus.uml.tools.tests.tests.UMLReferenceConverterTest)  Time elapsed: 0.054 s
01:25:54 testList(org.eclipse.papyrus.uml.tools.tests.tests.UMLReferenceConverterTest)  Time elapsed: 0.101 s
01:25:54 testNull(org.eclipse.papyrus.uml.tools.tests.tests.UMLReferenceConverterTest)  Time elapsed: 0.082 s
01:25:54 testDisplayToEditString_1(org.eclipse.papyrus.uml.tools.tests.tests.UMLReferenceConverterTest)  Time elapsed: 0.059 s
01:25:54 testEmptyString(org.eclipse.papyrus.uml.tools.tests.tests.UMLReferenceConverterTest)  Time elapsed: 0.058 s
01:25:54 testClass2(org.eclipse.papyrus.uml.tools.tests.tests.UMLReferenceConverterTest)  Time elapsed: 0.067 s
01:25:54 testClass3(org.eclipse.papyrus.uml.tools.tests.tests.UMLReferenceConverterTest)  Time elapsed: 0.057 s
01:25:54 testMatchingElementstSingleValue1(org.eclipse.papyrus.uml.tools.tests.tests.UMLReferenceConverterTest)  Time elapsed: 0.084 s
01:25:54 testMatchingElementstSingleValue2(org.eclipse.papyrus.uml.tools.tests.tests.UMLReferenceConverterTest)  Time elapsed: 0.076 s
01:25:54 testCompletionToFindClass_1(org.eclipse.papyrus.uml.tools.tests.tests.UMLReferenceConverterCompletionTest)  Time elapsed: 0.072 s
01:25:54 testCompletionToFindClass_3(org.eclipse.papyrus.uml.tools.tests.tests.UMLReferenceConverterCompletionTest)  Time elapsed: 0.15 s
01:25:54 testCompletionToFindClass_4(org.eclipse.papyrus.uml.tools.tests.tests.UMLReferenceConverterCompletionTest)  Time elapsed: 0.067 s
01:25:54 testCompletionToFindClass_5(org.eclipse.papyrus.uml.tools.tests.tests.UMLReferenceConverterCompletionTest)  Time elapsed: 0.06 s
01:25:54 testCompletionToFindClass_6(org.eclipse.papyrus.uml.tools.tests.tests.UMLReferenceConverterCompletionTest)  Time elapsed: 0.053 s
01:25:54 testCompletionToFindClass_7(org.eclipse.papyrus.uml.tools.tests.tests.UMLReferenceConverterCompletionTest)  Time elapsed: 0.041 s
01:25:54 testCompletionToFindClass_8(org.eclipse.papyrus.uml.tools.tests.tests.UMLReferenceConverterCompletionTest)  Time elapsed: 0.04 s
01:25:54 testSplitString_1(org.eclipse.papyrus.uml.tools.tests.tests.UMLReferenceConverterCompletionTest)  Time elapsed: 0.077 s
01:25:54 testSplitString_2(org.eclipse.papyrus.uml.tools.tests.tests.UMLReferenceConverterCompletionTest)  Time elapsed: 0.078 s
01:25:54 testCompletionToFindConstraint_1(org.eclipse.papyrus.uml.tools.tests.tests.UMLReferenceConverterCompletionTest)  Time elapsed: 0.102 s
01:25:54 testCompletionToFindConstraint_2(org.eclipse.papyrus.uml.tools.tests.tests.UMLReferenceConverterCompletionTest)  Time elapsed: 0.042 s
01:25:54 testCompletionMultiValueConverterEmptyString(org.eclipse.papyrus.uml.tools.tests.tests.UMLReferenceConverterCompletionTest)  Time elapsed: 0.078 s
01:25:54 testCompletionToFindPackage_1(org.eclipse.papyrus.uml.tools.tests.tests.UMLReferenceConverterCompletionTest)  Time elapsed: 0.048 s
01:25:54 testCompletionToFindPackage_2(org.eclipse.papyrus.uml.tools.tests.tests.UMLReferenceConverterCompletionTest)  Time elapsed: 0.041 s
01:25:54 testCompletionSingleValueConverterEmptyString(org.eclipse.papyrus.uml.tools.tests.tests.UMLReferenceConverterCompletionTest)  Time elapsed: 0.034 s
01:25:54 profileLanguage(org.eclipse.papyrus.uml.tools.tests.tests.UMLLanguageProvidersTest)  Time elapsed: 0.002 s
01:25:54 umlLanguage(org.eclipse.papyrus.uml.tools.tests.tests.UMLLanguageProvidersTest)  Time elapsed: 0.001 s
01:25:54 ValidationStereotypesListClass1Test(org.eclipse.papyrus.uml.tools.tests.tests.IconsStereotypesTest)  Time elapsed: 0.751 s
01:25:54 ValidationStereotypesListClass2Test(org.eclipse.papyrus.uml.tools.tests.tests.IconsStereotypesTest)  Time elapsed: 0.865 s
01:25:54 ValidationStereotypesListClass3Test(org.eclipse.papyrus.uml.tools.tests.tests.IconsStereotypesTest)  Time elapsed: 0.84 s
01:25:54 ValidationStereotypesListClass4Test(org.eclipse.papyrus.uml.tools.tests.tests.IconsStereotypesTest)  Time elapsed: 0.856 s
01:25:54 ValidationImageClass1Test(org.eclipse.papyrus.uml.tools.tests.tests.IconsStereotypesTest)  Time elapsed: 1.315 s
01:25:54 ValidationImageClass2Test(org.eclipse.papyrus.uml.tools.tests.tests.IconsStereotypesTest)  Time elapsed: 1.033 s
01:25:54 ValidationImageClass3Test(org.eclipse.papyrus.uml.tools.tests.tests.IconsStereotypesTest)  Time elapsed: 0.925 s
01:25:54 ValidationImageClass4Test(org.eclipse.papyrus.uml.tools.tests.tests.IconsStereotypesTest)  Time elapsed: 1.189 s
01:25:54 returnedTextTest(org.eclipse.papyrus.uml.tools.tests.tests.CustomizableDelegatingItemLabelProviderTest)  Time elapsed: 1.094 s
01:25:54 returnedStyledTextTest(org.eclipse.papyrus.uml.tools.tests.tests.CustomizableDelegatingItemLabelProviderTest)  Time elapsed: 0.899 s
01:25:54 notifyChange(org.eclipse.papyrus.uml.tools.tests.tests.DelegatingItemLabelProviderTest)  Time elapsed: 0.081 s
01:25:54 copyingInterfaceRealizationDoesNotCorruptTheModel(org.eclipse.papyrus.uml.tools.tests.tests.UMLCopyTest)  Time elapsed: 0.006 s
01:25:54 copyingInterfaceRealizationDoesNotCorruptTheModel(org.eclipse.papyrus.uml.tools.tests.tests.UMLCopyTestME)  Time elapsed: 0.786 s
01:25:54 duplicateStereotypeWithMultivaluedDataTypeContainmentFeatureTest(org.eclipse.papyrus.uml.tools.tests.tests.DuplicateStereotypeCommandTest)  Time elapsed: 1.176 s
01:25:54 duplicateStereotypeWithMultivaluedContainmentFeatureTest(org.eclipse.papyrus.uml.tools.tests.tests.DuplicateStereotypeCommandTest)  Time elapsed: 0.991 s
01:25:54 duplicateStereotypeWithSingleContainmentFeatureTest(org.eclipse.papyrus.uml.tools.tests.tests.DuplicateStereotypeCommandTest)  Time elapsed: 1.107 s
01:25:54 recursiveImportPackage(org.eclipse.papyrus.uml.tools.utils.tests.tests.NameResolutionHelperTest)  Time elapsed: 0.045 s
01:25:54 testIsAutoNamed(org.eclipse.papyrus.uml.tools.utils.tests.tests.NamedElementUtilTest)  Time elapsed: 0.034 s
01:25:54 testGetDefaultNameWithIncrement(org.eclipse.papyrus.uml.tools.utils.tests.tests.NamedElementUtilTest)  Time elapsed: 0.001 s
01:25:54 testAutoNameIncrement(org.eclipse.papyrus.uml.tools.utils.tests.tests.NamedElementUtilTest)  Time elapsed: 0.002 s
01:25:54 testExistingElementHavingNameNotRenamed(org.eclipse.papyrus.uml.tools.utils.tests.tests.NamedElementUtilTest)  Time elapsed: 0.001 s
01:25:54 testGetAppliedSuperstereotype(org.eclipse.papyrus.uml.tools.utils.tests.tests.UMLUtilTest)  Time elapsed: 0.088 s
01:25:54 testGetApplicableStereotype_notStrict_notApplicable(org.eclipse.papyrus.uml.tools.utils.tests.tests.UMLUtilTest)  Time elapsed: 0.283 s
01:25:54 testGetApplicableStereotype_notStrict_applicable(org.eclipse.papyrus.uml.tools.utils.tests.tests.UMLUtilTest)  Time elapsed: 0.252 s
01:25:54 testGetApplicableStereotype_strict_applicable(org.eclipse.papyrus.uml.tools.utils.tests.tests.UMLUtilTest)  Time elapsed: 0.206 s
01:25:54 testGetAppliedSubstereotype_notApplied(org.eclipse.papyrus.uml.tools.utils.tests.tests.UMLUtilTest)  Time elapsed: 0.084 s
01:25:54 testGetApplicableStereotype_strict_notApplicable(org.eclipse.papyrus.uml.tools.utils.tests.tests.UMLUtilTest)  Time elapsed: 0.238 s
01:25:54 testGetAppliedSubstereotype_applied(org.eclipse.papyrus.uml.tools.utils.tests.tests.UMLUtilTest)  Time elapsed: 0.043 s
01:25:54 testUnApplyStereotypeApplication(org.eclipse.papyrus.uml.diagram.stereotypeproperty.TestBadUnapplyProfile2ClosedDiagComment)  Time elapsed: 1.934 s
01:25:54 testStereotypeApplicationOnClass(org.eclipse.papyrus.uml.diagram.stereotypeproperty.TestDropStereotypedClass)  Time elapsed: 1.125 s
01:25:54 testProfileApplicationOnModel(org.eclipse.papyrus.uml.diagram.stereotypeproperty.TestProfileApplication)  Time elapsed: 0.667 s
01:25:54 testBrace(org.eclipse.papyrus.uml.diagram.stereotypeproperty.tests.asbrace.TestDisplayAsBrace)  Time elapsed: 1.47 s
01:25:54 testReopenStereotypeAsComment(org.eclipse.papyrus.uml.diagram.stereotypeproperty.tests.asbrace.TestReopenAsBrace)  Time elapsed: 2.706 s
01:25:54 testStereotypeApplicationOnClass(org.eclipse.papyrus.uml.diagram.stereotypeproperty.tests.ascomment.TestDisplayAsComment)  Time elapsed: 0.773 s
01:25:54 testReopenStereotypeAsComment(org.eclipse.papyrus.uml.diagram.stereotypeproperty.tests.ascomment.TestReopenAsComment)  Time elapsed: 1.902 s
01:25:54 testStereotypeApplicationOnClass(org.eclipse.papyrus.uml.diagram.stereotypeproperty.tests.ascompartment.TestDisplayAsCompartment)  Time elapsed: 0.98 s
01:25:54 testReopenStereotypeAsComment(org.eclipse.papyrus.uml.diagram.stereotypeproperty.tests.ascompartment.TestReopenAsCompartment)  Time elapsed: 2.382 s
01:25:54 test2StereotypeApplicationsOnClass(org.eclipse.papyrus.uml.diagram.stereotypeproperty.tests.displayname.Test2StereotypeApplications)  Time elapsed: 0.605 s
01:25:54 testStereotypeApplicationOnPackage(org.eclipse.papyrus.uml.diagram.stereotypeproperty.tests.displayname.TestStereotypeApplication)  Time elapsed: 0.773 s
01:25:54 testStereotypeApplicationOnClass(org.eclipse.papyrus.uml.diagram.stereotypeproperty.tests.displayname.TestStereotypeApplication)  Time elapsed: 0.068 s
01:25:54 testQNStereotypeApplicationOnClass(org.eclipse.papyrus.uml.diagram.stereotypeproperty.tests.displayname.TestStereotypeApplicationQualifiedName)  Time elapsed: 0.553 s
01:25:54 testLayoutStereotypeApplicationOnClass(org.eclipse.papyrus.uml.diagram.stereotypeproperty.tests.layout.TestLayoutWithStereotype) skipped
01:25:54 testLayoutOnClass(org.eclipse.papyrus.uml.diagram.stereotypeproperty.tests.layout.TestLayoutWithStereotype) skipped
01:25:54 testLayoutStereotypeApplicationOnClass(org.eclipse.papyrus.uml.diagram.stereotypeproperty.tests.layout.TestLayoutWithStereotypeOnEclipseHIPPInstance) skipped
01:25:54 testLayoutOnClass(org.eclipse.papyrus.uml.diagram.stereotypeproperty.tests.layout.TestLayoutWithStereotypeOnEclipseHIPPInstance) skipped
01:25:54 testDiagramFileExtentionLabel(org.eclipse.papyrus.uml.diagram.wizards.TestCreateModelWizard)  Time elapsed: 0.289 s
01:25:54 testDiagramFileExtenstionForUML(org.eclipse.papyrus.uml.diagram.wizards.TestCreateModelWizard)  Time elapsed: 0.077 s
01:25:54 testOrderOfPages(org.eclipse.papyrus.uml.diagram.wizards.TestCreateModelWizard)  Time elapsed: 0.07 s
01:25:54 testDiagramFileExtentionLabel(org.eclipse.papyrus.uml.diagram.wizards.TestInitModelWizard)  Time elapsed: 0.07 s
01:25:54 testDiagramFileExtenstionForUML(org.eclipse.papyrus.uml.diagram.wizards.TestInitModelWizard)  Time elapsed: 0.063 s
01:25:54 testOrderOfPages(org.eclipse.papyrus.uml.diagram.wizards.TestInitModelWizard)  Time elapsed: 0.067 s
01:25:54 testOrderOfPages(org.eclipse.papyrus.uml.diagram.wizards.TestNewProjectWizard)  Time elapsed: 0.077 s
01:25:54 testForSimpleModel(org.eclipse.papyrus.uml.diagram.wizards.TestCreateModelFromExistingModelWizard)  Time elapsed: 0.149 s
01:25:54 testOrderOfPages(org.eclipse.papyrus.uml.diagram.wizards.TestCreateModelFromExistingModelWizard)  Time elapsed: 0.086 s
01:25:54 testForModelWithDot(org.eclipse.papyrus.uml.diagram.wizards.TestCreateModelFromExistingModelWizard)  Time elapsed: 0.079 s
01:25:54 missingSchema(org.eclipse.papyrus.uml.modelrepair.internal.stereotypes.StereotypeApplicationRepairSnippetTest)  Time elapsed: 0.296 s
01:25:54 noCorruptionControlCase(org.eclipse.papyrus.uml.modelrepair.internal.stereotypes.StereotypeApplicationRepairSnippetTest)  Time elapsed: 0.1 s
01:25:54 wrongProfileVersion(org.eclipse.papyrus.uml.modelrepair.internal.stereotypes.StereotypeApplicationRepairSnippetTest)  Time elapsed: 0.256 s
01:25:54 missingProfileApplication(org.eclipse.papyrus.uml.modelrepair.internal.stereotypes.StereotypeApplicationRepairSnippetTest)  Time elapsed: 0.299 s
01:25:54 deleteStereotypes(org.eclipse.papyrus.uml.modelrepair.internal.stereotypes.StereotypeApplicationRepairSnippetTest)  Time elapsed: 0.066 s
01:25:54 nestedProfileApplicationsMissingNamespace_bug434302(org.eclipse.papyrus.uml.modelrepair.internal.stereotypes.StereotypeRepairRegressionTest)  Time elapsed: 0.421 s
01:25:54 orphansOfWrongProfileVersion_bug436666(org.eclipse.papyrus.uml.modelrepair.internal.stereotypes.StereotypeRepairRegressionTest)  Time elapsed: 0.093 s
01:25:54 badSchemaLocationInNonPackageFragment_bug459488(org.eclipse.papyrus.uml.modelrepair.internal.stereotypes.StereotypeRepairRegressionTest)  Time elapsed: 0.704 s
01:25:54 nestedProfilesAndNestedApplicationsWellFormed_bug434302(org.eclipse.papyrus.uml.modelrepair.internal.stereotypes.StereotypeRepairRegressionTest)  Time elapsed: 0.568 s
01:25:54 registeredDynamicProfie_bug455329(org.eclipse.papyrus.uml.modelrepair.internal.stereotypes.StereotypeRepairRegressionTest)  Time elapsed: 0.066 s
01:25:54 nestedPackageSchemaMissing_bug436666(org.eclipse.papyrus.uml.modelrepair.internal.stereotypes.StereotypeRepairRegressionTest)  Time elapsed: 0.349 s
01:25:54 incorrectZombieGroupingWithoutProfileNamespaceURIPattern_bug496307(org.eclipse.papyrus.uml.modelrepair.internal.stereotypes.StereotypeRepairRegressionTest)  Time elapsed: 0.127 s
01:25:54 nonStereotypeApplicationsAreOK_bug436666(org.eclipse.papyrus.uml.modelrepair.internal.stereotypes.StereotypeRepairRegressionTest)  Time elapsed: 0.028 s
01:25:54 nestedProfileApplications2Pkgs1Profile_bug434302(org.eclipse.papyrus.uml.modelrepair.internal.stereotypes.StereotypeRepairRegressionTest)  Time elapsed: 0.292 s
01:25:54 crossReferencedPackageUnitWithoutOwnProfileApplication_bug458736(org.eclipse.papyrus.uml.modelrepair.internal.stereotypes.StereotypeRepairRegressionTest)  Time elapsed: 0.528 s
01:25:54 correctZombieGroupingWithProfileNamespaceURIPattern_bug496307(org.eclipse.papyrus.uml.modelrepair.internal.stereotypes.StereotypeRepairRegressionTest)  Time elapsed: 0.168 s
01:25:54 orphansOfValidSchema_bug436666(org.eclipse.papyrus.uml.modelrepair.internal.stereotypes.StereotypeRepairRegressionTest)  Time elapsed: 0.1 s
01:25:54 packageUnitWithoutOwnProfileApplication_bug455248(org.eclipse.papyrus.uml.modelrepair.internal.stereotypes.StereotypeRepairRegressionTest)  Time elapsed: 0.307 s
01:25:54 nestedPackageInProfileIsOK_bug436666(org.eclipse.papyrus.uml.modelrepair.internal.stereotypes.StereotypeRepairRegressionTest)  Time elapsed: 0.332 s
01:25:54 compareMultiVersionSameURISameVersion(org.eclipse.papyrus.uml.modelrepair.internal.uripattern.ProfileNamespaceURIPatternTest)  Time elapsed: 0 s
01:25:54 compareMultiVersionDifferentURIDifferentVersion(org.eclipse.papyrus.uml.modelrepair.internal.uripattern.ProfileNamespaceURIPatternTest)  Time elapsed: 0 s
01:25:54 compareSingleVersionDifferentURISameVersion(org.eclipse.papyrus.uml.modelrepair.internal.uripattern.ProfileNamespaceURIPatternTest)  Time elapsed: 0.001 s
01:25:54 compareMultiVersionDifferentURISameVersion(org.eclipse.papyrus.uml.modelrepair.internal.uripattern.ProfileNamespaceURIPatternTest)  Time elapsed: 0 s
01:25:54 compareCorrectInvalidComparisonConstantBehavior(org.eclipse.papyrus.uml.modelrepair.internal.uripattern.ProfileNamespaceURIPatternTest)  Time elapsed: 0 s
01:25:54 compareNoVersionSameURI(org.eclipse.papyrus.uml.modelrepair.internal.uripattern.ProfileNamespaceURIPatternTest)  Time elapsed: 0 s
01:25:54 compareSingleVersionDifferentURIDifferentVersion(org.eclipse.papyrus.uml.modelrepair.internal.uripattern.ProfileNamespaceURIPatternTest)  Time elapsed: 0 s
01:25:54 matchCorrectNoMatchConstantBehavior(org.eclipse.papyrus.uml.modelrepair.internal.uripattern.ProfileNamespaceURIPatternTest)  Time elapsed: 0 s
01:25:54 matchSingleVersionCorrectURIGivenVersion(org.eclipse.papyrus.uml.modelrepair.internal.uripattern.ProfileNamespaceURIPatternTest)  Time elapsed: 0 s
01:25:54 matchNoVersionCorrectURIDefaultVersion(org.eclipse.papyrus.uml.modelrepair.internal.uripattern.ProfileNamespaceURIPatternTest)  Time elapsed: 0.001 s
01:25:54 matchMultipleVersionCorrectURIGivenVersion(org.eclipse.papyrus.uml.modelrepair.internal.uripattern.ProfileNamespaceURIPatternTest)  Time elapsed: 0 s
01:25:54 matchMultipleVersionCorrectURIDefaultVersion(org.eclipse.papyrus.uml.modelrepair.internal.uripattern.ProfileNamespaceURIPatternTest)  Time elapsed: 0 s
01:25:54 compareCorrectInvalidComparisonBehaviorWrongLHS(org.eclipse.papyrus.uml.modelrepair.internal.uripattern.ProfileNamespaceURIPatternTest)  Time elapsed: 0 s
01:25:54 compareCorrectInvalidComparisonBehaviorWrongRHS(org.eclipse.papyrus.uml.modelrepair.internal.uripattern.ProfileNamespaceURIPatternTest)  Time elapsed: 0 s
01:25:54 registryExtensionPointCorrectMatch(org.eclipse.papyrus.uml.modelrepair.internal.uripattern.ProfileNamespaceURIPatternTest)  Time elapsed: 0.001 s
01:25:54 compareSingleVersionSameURIDifferentVersion(org.eclipse.papyrus.uml.modelrepair.internal.uripattern.ProfileNamespaceURIPatternTest)  Time elapsed: 0 s
01:25:54 compareSingleVersionSameURISameVersion(org.eclipse.papyrus.uml.modelrepair.internal.uripattern.ProfileNamespaceURIPatternTest)  Time elapsed: 0 s
01:25:54 compareMultiVersionSameURIDifferentVersion(org.eclipse.papyrus.uml.modelrepair.internal.uripattern.ProfileNamespaceURIPatternTest)  Time elapsed: 0 s
01:25:54 registryCorrectUnregisterAndRegister(org.eclipse.papyrus.uml.modelrepair.internal.uripattern.ProfileNamespaceURIPatternTest)  Time elapsed: 0 s
01:25:54 registryExtensionPointRegistered(org.eclipse.papyrus.uml.modelrepair.internal.uripattern.ProfileNamespaceURIPatternTest)  Time elapsed: 0 s
01:25:54 compareCorrectInvalidComparisonBehaviorWrongPattern(org.eclipse.papyrus.uml.modelrepair.internal.uripattern.ProfileNamespaceURIPatternTest)  Time elapsed: 0 s
01:25:54 matchNoVersionCorrectURIGivenVersion(org.eclipse.papyrus.uml.modelrepair.internal.uripattern.ProfileNamespaceURIPatternTest)  Time elapsed: 0.001 s
01:25:54 compareNoVersionDifferentURI(org.eclipse.papyrus.uml.modelrepair.internal.uripattern.ProfileNamespaceURIPatternTest)  Time elapsed: 0 s
01:25:54 matchSingleVersionCorrectURIDefaultVersion(org.eclipse.papyrus.uml.modelrepair.internal.uripattern.ProfileNamespaceURIPatternTest)  Time elapsed: 0 s
01:25:54 matchCorrectNoMatchBehavior(org.eclipse.papyrus.uml.modelrepair.internal.uripattern.ProfileNamespaceURIPatternTest)  Time elapsed: 0 s
01:25:54 interactionOperand_contentProvider(org.eclipse.papyrus.uml.properties.modelelement.tests.UMLModelElementTest)  Time elapsed: 0.082 s
01:25:54 combinedFragment_contentProvider(org.eclipse.papyrus.uml.properties.modelelement.tests.UMLModelElementTest)  Time elapsed: 0.041 s
01:25:54 testObservableValue(org.eclipse.papyrus.uml.properties.databinding.tests.MultiplicityObservableValueTest)  Time elapsed: 0.584 s
01:25:54 testObservableValue(org.eclipse.papyrus.uml.properties.databinding.tests.ExtensionEndMultiplicityObservableValueTest)  Time elapsed: 0.877 s
01:25:54 testObservableValue(org.eclipse.papyrus.uml.properties.databinding.tests.NavigationObservableValueTest)  Time elapsed: 0.617 s
01:25:54 testObservableValue(org.eclipse.papyrus.uml.properties.databinding.tests.OwnerObservableValueTest)  Time elapsed: 0.543 s
01:25:54 testObservableValue(org.eclipse.papyrus.uml.properties.databinding.tests.KeywordObservableValueTest)  Time elapsed: 0.561 s
01:25:54 testObservableValue(org.eclipse.papyrus.uml.properties.databinding.tests.UMLLabelObservableValueTest)  Time elapsed: 0.842 s
01:25:54 testObservableValue(org.eclipse.papyrus.uml.properties.databinding.tests.ImageExpressionObservableValueTest)  Time elapsed: 0.839 s
01:25:54 testObservableValue(org.eclipse.papyrus.uml.properties.databinding.tests.ImageKindObservableValueTest)  Time elapsed: 0.726 s
01:25:54 testObservableValue(org.eclipse.papyrus.uml.properties.databinding.tests.ImageNameObservableValueTest)  Time elapsed: 0.677 s
01:25:54 testObservableValue(org.eclipse.papyrus.uml.properties.databinding.tests.ElementCustomizationElementIconObservableValueTest)  Time elapsed: 0.973 s
01:25:54 testObservableValue(org.eclipse.papyrus.uml.properties.databinding.tests.ElementCustomizationQualifiedNameObservableValueTest)  Time elapsed: 0.897 s
01:25:54 testObservableValue(org.eclipse.papyrus.uml.properties.databinding.tests.ElementCustomizationShadowObservableValueTest)  Time elapsed: 0.941 s
01:25:54 testObservableValue(org.eclipse.papyrus.uml.properties.databinding.tests.ExtensionRequiredObservableValueTest)  Time elapsed: 0.848 s
01:25:54 testObservableValue(org.eclipse.papyrus.uml.properties.databinding.tests.ImportedPackageLocationObservableValueTest)  Time elapsed: 0.606 s
01:25:54 testObservableValue(org.eclipse.papyrus.uml.properties.databinding.tests.UnsettableStringObservableValueTest)  Time elapsed: 0.637 s
01:25:54 testObservableValue(org.eclipse.papyrus.uml.properties.databinding.tests.BasicObservableValueTest)  Time elapsed: 0.556 s
01:25:54 testObservableValue(org.eclipse.papyrus.uml.properties.databinding.tests.AnnotationObservableValueTest)  Time elapsed: 0.691 s
01:25:54 testObservableList(org.eclipse.papyrus.uml.properties.databinding.tests.MaskValueObservableListTest)  Time elapsed: 0.99 s
01:25:54 testObservableList(org.eclipse.papyrus.uml.properties.databinding.tests.AppliedCommentsObservableListTest)  Time elapsed: 1.042 s
01:25:54 testObservableList(org.eclipse.papyrus.uml.properties.databinding.tests.OwnedCommentsObservableListTest)  Time elapsed: 1.236 s
01:25:54 testObservableList(org.eclipse.papyrus.uml.properties.databinding.tests.ProvidedInterfaceObservableListTest)  Time elapsed: 0.962 s
01:25:54 testObservableList(org.eclipse.papyrus.uml.properties.databinding.tests.RequiredInterfaceObservableListTest)  Time elapsed: 0.668 s
01:25:54 testObservableList(org.eclipse.papyrus.uml.properties.databinding.tests.ProfileApplicationObservableListTest)  Time elapsed: 1.073 s
01:25:54 testObservableList(org.eclipse.papyrus.uml.properties.databinding.tests.StereotypeApplicationObservableListTest)  Time elapsed: 0.813 s
01:25:54 testObservableList(org.eclipse.papyrus.uml.properties.databinding.tests.BasicObservableListTest)  Time elapsed: 0.686 s
01:25:54 testObservableValue(org.eclipse.papyrus.uml.diagram.properties.databinding.tests.CanonicalObservableValueTest)  Time elapsed: 1.303 s
01:25:54 testObservableValue(org.eclipse.papyrus.uml.diagram.properties.databinding.tests.ConnectionDecorationStyleObservableValueTest)  Time elapsed: 1.291 s
01:25:54 testObservableValue(org.eclipse.papyrus.uml.diagram.properties.databinding.tests.CustomStringStyleCompartmentObservableValueTest)  Time elapsed: 1.051 s
01:25:54 testObservableValue(org.eclipse.papyrus.uml.diagram.properties.databinding.tests.CustomIntStyleCompartmentObservableValueTest)  Time elapsed: 1.188 s
01:25:54 testObservableValue(org.eclipse.papyrus.uml.diagram.properties.databinding.tests.DiagramLabelObservableValueTest)  Time elapsed: 0.681 s
01:25:54 testObservableValue(org.eclipse.papyrus.uml.diagram.properties.databinding.tests.CustomBooleanStyleWithStoreObservableValueTest)  Time elapsed: 0.649 s
01:25:54 testObservableValue(org.eclipse.papyrus.uml.diagram.properties.databinding.tests.CustomDoubleStyleWithStoreObservableValueTest)  Time elapsed: 0.616 s
01:25:54 testObservableValue(org.eclipse.papyrus.uml.diagram.properties.databinding.tests.CustomIntStyleWithStoreObservableValueTest)  Time elapsed: 0.651 s
01:25:54 testObservableValue(org.eclipse.papyrus.uml.diagram.properties.databinding.tests.RulersUnitStyleObservableValueTest)  Time elapsed: 1.138 s
01:25:54 testObservableValue(org.eclipse.papyrus.uml.diagram.properties.databinding.tests.SwitchOrientationObservableValueTest)  Time elapsed: 1.585 s
01:25:54 outOfDateModelSkipMigration_papyrus(org.eclipse.papyrus.uml.profile.service.ReapplyProfilesServiceTest)  Time elapsed: 1.116 s
01:25:54 upToDateModelDoesNotPromptForMigration_papyrus(org.eclipse.papyrus.uml.profile.service.ReapplyProfilesServiceTest)  Time elapsed: 1.126 s
01:25:54 outOfDateModelDoMigration_dynamic(org.eclipse.papyrus.uml.profile.service.ReapplyProfilesServiceTest)  Time elapsed: 1.027 s
01:25:54 outOfDateModelSkipMigration_uml2(org.eclipse.papyrus.uml.profile.service.ReapplyProfilesServiceTest)  Time elapsed: 0.986 s
01:25:54 outOfDateModelDoMigration_papyrus(org.eclipse.papyrus.uml.profile.service.ReapplyProfilesServiceTest)  Time elapsed: 1.323 s
01:25:54 outOfDateModelSkipMigration_dynamic(org.eclipse.papyrus.uml.profile.service.ReapplyProfilesServiceTest)  Time elapsed: 0.943 s
01:25:54 outOfDateModelDoMigration_uml2(org.eclipse.papyrus.uml.profile.service.ReapplyProfilesServiceTest)  Time elapsed: 1.694 s
01:25:54 upToDateModelDoesNotPromptForMigration_uml2(org.eclipse.papyrus.uml.profile.service.ReapplyProfilesServiceTest)  Time elapsed: 0.913 s
01:25:54 upToDateModelDoesNotPromptForMigration_dynamic(org.eclipse.papyrus.uml.profile.service.ReapplyProfilesServiceTest)  Time elapsed: 0.867 s
01:25:54 loadDecoratorAsMainModel(org.eclipse.papyrus.uml.decoratormodel.tests.ExternalizeProfileApplicationTest)  Time elapsed: 0.563 s
01:25:54 externalizeApplication(org.eclipse.papyrus.uml.decoratormodel.tests.ExternalizeProfileApplicationTest)  Time elapsed: 0.453 s
01:25:54 unloadApplication(org.eclipse.papyrus.uml.decoratormodel.tests.ExternalizeProfileApplicationTest)  Time elapsed: 0.486 s
01:25:54 externalizeApplication_undo(org.eclipse.papyrus.uml.decoratormodel.tests.ExternalizeProfileApplicationTest)  Time elapsed: 0.465 s
01:25:54 unloadedApplicationNotAvailable(org.eclipse.papyrus.uml.decoratormodel.tests.ExternalizeProfileApplicationTest)  Time elapsed: 1.011 s
01:25:54 loadApplication(org.eclipse.papyrus.uml.decoratormodel.tests.ExternalizeProfileApplicationTest)  Time elapsed: 0.605 s
01:25:54 externalizeApplication_undo_redo(org.eclipse.papyrus.uml.decoratormodel.tests.ExternalizeProfileApplicationTest)  Time elapsed: 0.495 s
01:25:54 nestedPackageApplicationOfSameProfile_bug459613(org.eclipse.papyrus.uml.decoratormodel.tests.ExternalizeProfileApplicationTest)  Time elapsed: 0.455 s
01:25:54 externalizeApplication_forNestedPackage(org.eclipse.papyrus.uml.decoratormodel.tests.ExternalizeProfileApplicationTest)  Time elapsed: 0.465 s
01:25:54 internalizeApplication_undo(org.eclipse.papyrus.uml.decoratormodel.tests.InternalizeProfileApplicationTest)  Time elapsed: 0.416 s
01:25:54 internalizeApplication_undo_redo(org.eclipse.papyrus.uml.decoratormodel.tests.InternalizeProfileApplicationTest)  Time elapsed: 0.643 s
01:25:54 internalizeApplication(org.eclipse.papyrus.uml.decoratormodel.tests.InternalizeProfileApplicationTest)  Time elapsed: 0.564 s
01:25:54 migrateProfile(org.eclipse.papyrus.uml.decoratormodel.tests.ProfileMigrationTest)  Time elapsed: 0.7 s
01:25:54 missingSchema(org.eclipse.papyrus.uml.decoratormodel.tests.StereotypeApplicationRepairTest)  Time elapsed: 0.542 s
01:25:54 wrongProfileVersion(org.eclipse.papyrus.uml.decoratormodel.tests.StereotypeApplicationRepairTest)  Time elapsed: 0.44 s
01:25:54 missingProfileApplication(org.eclipse.papyrus.uml.decoratormodel.tests.StereotypeApplicationRepairTest)  Time elapsed: 0.505 s
01:25:54 decoratorModelsForPackageAsync(org.eclipse.papyrus.uml.decoratormodel.internal.resource.tests.DecoratorModelIndexTest)  Time elapsed: 0.638 s
01:25:54 decoratorModelsForPackage_none(org.eclipse.papyrus.uml.decoratormodel.internal.resource.tests.DecoratorModelIndexTest)  Time elapsed: 0.558 s
01:25:54 removeResource(org.eclipse.papyrus.uml.decoratormodel.internal.resource.tests.DecoratorModelIndexTest)  Time elapsed: 0.887 s
01:25:54 decoratorModelsAsync_uri(org.eclipse.papyrus.uml.decoratormodel.internal.resource.tests.DecoratorModelIndexTest)  Time elapsed: 0.548 s
01:25:54 decoratorModelName(org.eclipse.papyrus.uml.decoratormodel.internal.resource.tests.DecoratorModelIndexTest)  Time elapsed: 0.464 s
01:25:54 baseline(org.eclipse.papyrus.uml.decoratormodel.internal.resource.tests.DecoratorModelIndexTest)  Time elapsed: 0.51 s
01:25:54 decoratorModelsForPackage(org.eclipse.papyrus.uml.decoratormodel.internal.resource.tests.DecoratorModelIndexTest)  Time elapsed: 0.484 s
01:25:54 decoratorModelNameAsync(org.eclipse.papyrus.uml.decoratormodel.internal.resource.tests.DecoratorModelIndexTest)  Time elapsed: 0.507 s
01:25:54 appliedProfilesByResourceIndex(org.eclipse.papyrus.uml.decoratormodel.internal.resource.tests.DecoratorModelIndexTest)  Time elapsed: 1.37 s
01:25:54 decoratorModels(org.eclipse.papyrus.uml.decoratormodel.internal.resource.tests.DecoratorModelIndexTest)  Time elapsed: 0.653 s
01:25:54 decoratorModelsAsync(org.eclipse.papyrus.uml.decoratormodel.internal.resource.tests.DecoratorModelIndexTest)  Time elapsed: 0.56 s
01:25:54 allAppliedProfiles(org.eclipse.papyrus.uml.decoratormodel.internal.resource.tests.DecoratorModelIndexTest)  Time elapsed: 0.604 s
01:25:54 decoratorModelNames(org.eclipse.papyrus.uml.decoratormodel.internal.resource.tests.DecoratorModelIndexTest)  Time elapsed: 0.68 s
01:25:54 decoratorModels_uri(org.eclipse.papyrus.uml.decoratormodel.internal.resource.tests.DecoratorModelIndexTest)  Time elapsed: 0.496 s
01:25:54 decoratorModelNamesAsync(org.eclipse.papyrus.uml.decoratormodel.internal.resource.tests.DecoratorModelIndexTest)  Time elapsed: 0.746 s
01:25:54 listener(org.eclipse.papyrus.uml.decoratormodel.internal.resource.tests.DecoratorModelIndexTest)  Time elapsed: 0.765 s
01:25:54 allAppliedProfilesAsync(org.eclipse.papyrus.uml.decoratormodel.internal.resource.tests.DecoratorModelIndexTest)  Time elapsed: 0.557 s
01:25:54 addNewResource(org.eclipse.papyrus.uml.decoratormodel.internal.resource.tests.DecoratorModelIndexTest)  Time elapsed: 0.994 s
01:25:54 decoratorModelsForPackageAsync_none(org.eclipse.papyrus.uml.decoratormodel.internal.resource.tests.DecoratorModelIndexTest)  Time elapsed: 0.567 s
01:25:54 copy_subsetOfProfiles(org.eclipse.papyrus.uml.decoratormodel.internal.resource.tests.DecoratorModelCopierTest)  Time elapsed: 1.114 s
01:25:54 copy_allProfiles(org.eclipse.papyrus.uml.decoratormodel.internal.resource.tests.DecoratorModelCopierTest)  Time elapsed: 1.01 s
01:25:54 testHasUnloadedDecoratorModelsAsync_recursive(org.eclipse.papyrus.uml.decoratormodel.helper.tests.DecoratorModelUtilsTest)  Time elapsed: 0.892 s
01:25:54 testIsDecoratorModelFor(org.eclipse.papyrus.uml.decoratormodel.helper.tests.DecoratorModelUtilsTest)  Time elapsed: 0.465 s
01:25:54 testIsDecoratorModelURI(org.eclipse.papyrus.uml.decoratormodel.helper.tests.DecoratorModelUtilsTest)  Time elapsed: 0.501 s
01:25:54 testInternalizeProfileApplications(org.eclipse.papyrus.uml.decoratormodel.helper.tests.DecoratorModelUtilsTest)  Time elapsed: 0.519 s
01:25:54 testHasUnloadedDecoratorModelsAsync(org.eclipse.papyrus.uml.decoratormodel.helper.tests.DecoratorModelUtilsTest)  Time elapsed: 0.588 s
01:25:54 testExternalizeProfileApplication(org.eclipse.papyrus.uml.decoratormodel.helper.tests.DecoratorModelUtilsTest)  Time elapsed: 0.571 s
01:25:54 testGetDecoratorPackages(org.eclipse.papyrus.uml.decoratormodel.helper.tests.DecoratorModelUtilsTest)  Time elapsed: 0.526 s
01:25:54 testGetDecoratorModelAppliedProfiles(org.eclipse.papyrus.uml.decoratormodel.helper.tests.DecoratorModelUtilsTest)  Time elapsed: 0.506 s
01:25:54 testGetUnloadedDecoratorModelsAsyncResource(org.eclipse.papyrus.uml.decoratormodel.helper.tests.DecoratorModelUtilsTest)  Time elapsed: 0.675 s
01:25:54 testGetExternalizationProfile(org.eclipse.papyrus.uml.decoratormodel.helper.tests.DecoratorModelUtilsTest)  Time elapsed: 0.405 s
01:25:54 testIsDecoratorModelResource(org.eclipse.papyrus.uml.decoratormodel.helper.tests.DecoratorModelUtilsTest)  Time elapsed: 0.452 s
01:25:54 testGetDecoratorModelProfileApplications(org.eclipse.papyrus.uml.decoratormodel.helper.tests.DecoratorModelUtilsTest)  Time elapsed: 0.578 s
01:25:54 testGetUnloadedDecoratorModelsAsyncPackage(org.eclipse.papyrus.uml.decoratormodel.helper.tests.DecoratorModelUtilsTest)  Time elapsed: 0.559 s
01:25:54 testGetLoadedDecoratorModels(org.eclipse.papyrus.uml.decoratormodel.helper.tests.DecoratorModelUtilsTest)  Time elapsed: 0.497 s
01:25:54 testGetLoadedSubUnitPackages(org.eclipse.papyrus.uml.decoratormodel.helper.tests.DecoratorModelUtilsTest)  Time elapsed: 0.429 s
01:25:54 testGetUnloadedDecoratorModels(org.eclipse.papyrus.uml.decoratormodel.helper.tests.DecoratorModelUtilsTest)  Time elapsed: 0.525 s
01:25:54 testHasExternalizationProfile(org.eclipse.papyrus.uml.decoratormodel.helper.tests.DecoratorModelUtilsTest)  Time elapsed: 0.443 s
01:25:54 testGetUnloadedDecoratorModelsAsyncIterableOfResource(org.eclipse.papyrus.uml.decoratormodel.helper.tests.DecoratorModelUtilsTest)  Time elapsed: 1.07 s
01:25:54 testGetUserModelResources(org.eclipse.papyrus.uml.decoratormodel.helper.tests.DecoratorModelUtilsTest)  Time elapsed: 0.626 s
01:25:54 testGetDecoratorProfileApplications(org.eclipse.papyrus.uml.decoratormodel.helper.tests.DecoratorModelUtilsTest)  Time elapsed: 0.418 s
01:25:54 stereotypeApplication_inNestedPackage(org.eclipse.papyrus.uml.decoratormodel.helper.tests.PapyrusStereotypeApplicationHelperTest)  Time elapsed: 0.145 s
01:25:54 stereotypeApplication_inNonPackageSubmodelUnit_bug459613(org.eclipse.papyrus.uml.decoratormodel.helper.tests.PapyrusStereotypeApplicationHelperTest)  Time elapsed: 0.14 s
01:25:54 applyStereotype_resourceSet(org.eclipse.papyrus.uml.decoratormodel.helper.tests.PapyrusStereotypeApplicationHelperTest)  Time elapsed: 0.139 s
01:25:54 applyStereotype_freeFloating(org.eclipse.papyrus.uml.decoratormodel.helper.tests.PapyrusStereotypeApplicationHelperTest)  Time elapsed: 0.135 s
01:25:54 isDecoratorModel_decoratorModelUML(org.eclipse.papyrus.uml.decoratormodel.internal.expressions.tests.FilePropertyTesterTest)  Time elapsed: 0.401 s
01:25:54 isDecoratorModel_decoratorModelNotation(org.eclipse.papyrus.uml.decoratormodel.internal.expressions.tests.FilePropertyTesterTest)  Time elapsed: 0.393 s
01:25:54 isDecoratorModel_userModelUML(org.eclipse.papyrus.uml.decoratormodel.internal.expressions.tests.FilePropertyTesterTest)  Time elapsed: 0.347 s
01:25:54 decoratorIndexing(org.eclipse.papyrus.uml.decoratormodel.internal.resource.index.tests.ProfileIndexTest)  Time elapsed: 0.402 s
01:25:54 userModelIndexing(org.eclipse.papyrus.uml.decoratormodel.internal.resource.index.tests.ProfileIndexTest)  Time elapsed: 0 s
01:25:54 decoratorAsUserModelIndexing(org.eclipse.papyrus.uml.decoratormodel.internal.resource.index.tests.ProfileIndexTest)  Time elapsed: 0 s
01:25:54 migrateProfileExtendingDynamic_bug481302(org.eclipse.papyrus.uml.decoratormodel.tests.RegressionTest)  Time elapsed: 0.641 s
01:25:54 basicUMLMigrateProfileExtendingStatic_bug481302(org.eclipse.papyrus.uml.decoratormodel.tests.RegressionTest) skipped
01:25:54 migrateProfileExtendingStatic_bug481302(org.eclipse.papyrus.uml.decoratormodel.tests.RegressionTest)  Time elapsed: 0.38 s
01:25:54 control_undo_redo_allDecoratorsLoaded(org.eclipse.papyrus.uml.decoratormodel.controlmode.tests.ControlModeWithDecoratorModelsTest)  Time elapsed: 1.275 s
01:25:54 uncontrol_undo_redo_allDecoratorsUnloaded(org.eclipse.papyrus.uml.decoratormodel.controlmode.tests.ControlModeWithDecoratorModelsTest)  Time elapsed: 3.589 s
01:25:54 control_someDecoratorsLoaded(org.eclipse.papyrus.uml.decoratormodel.controlmode.tests.ControlModeWithDecoratorModelsTest)  Time elapsed: 1.796 s
01:25:54 uncontrol_someDecoratorsLoaded(org.eclipse.papyrus.uml.decoratormodel.controlmode.tests.ControlModeWithDecoratorModelsTest)  Time elapsed: 1.753 s
01:25:54 uncontrol_allDecoratorsUnloaded(org.eclipse.papyrus.uml.decoratormodel.controlmode.tests.ControlModeWithDecoratorModelsTest)  Time elapsed: 1.834 s
01:25:54 control_undo_redo_someDecoratorsLoaded(org.eclipse.papyrus.uml.decoratormodel.controlmode.tests.ControlModeWithDecoratorModelsTest)  Time elapsed: 2.213 s
01:25:54 control_allDecoratorsLoaded(org.eclipse.papyrus.uml.decoratormodel.controlmode.tests.ControlModeWithDecoratorModelsTest)  Time elapsed: 0.74 s
01:25:54 control_undo_redo_allDecoratorsUnloaded(org.eclipse.papyrus.uml.decoratormodel.controlmode.tests.ControlModeWithDecoratorModelsTest)  Time elapsed: 2.761 s
01:25:54 control_allDecoratorsUnloaded(org.eclipse.papyrus.uml.decoratormodel.controlmode.tests.ControlModeWithDecoratorModelsTest)  Time elapsed: 1.57 s
01:25:54 uncontrol_undo_redo_someDecoratorsLoaded(org.eclipse.papyrus.uml.decoratormodel.controlmode.tests.ControlModeWithDecoratorModelsTest)  Time elapsed: 2.78 s
01:25:54 uncontrol_undo_redo_allDecoratorsLoaded(org.eclipse.papyrus.uml.decoratormodel.controlmode.tests.ControlModeWithDecoratorModelsTest)  Time elapsed: 0.724 s
01:25:54 uncontrol_allDecoratorsLoaded(org.eclipse.papyrus.uml.decoratormodel.controlmode.tests.ControlModeWithDecoratorModelsTest)  Time elapsed: 0.795 s
01:25:54 nonBaseElementStereotypeCrossReferences(org.eclipse.papyrus.uml.decoratormodel.controlmode.tests.AdditionalModelStructuresTest)  Time elapsed: 1.085 s
01:25:54 classUnitExternalizeParentUnitProfileApplication_bug459613(org.eclipse.papyrus.uml.decoratormodel.controlmode.tests.AdditionalModelStructuresTest)  Time elapsed: 0.432 s
01:25:54 nestedPackagesInheritingExternalProfileApplications(org.eclipse.papyrus.uml.decoratormodel.controlmode.tests.AdditionalModelStructuresTest)  Time elapsed: 2.091 s
01:25:54 validateOCLOnInstanceSpec(org.eclipse.papyrus.uml.validation.tests.rules.TestOCLConstraintOnInstanceSpec)  Time elapsed: 4.07 s
01:25:54 validateCamelCaseRule(org.eclipse.papyrus.uml.validation.tests.rules.TestOCLValidationRuleFromFile)  Time elapsed: 1.236 s
01:25:54 validateIsActiveOCLRule_inactiveClass(org.eclipse.papyrus.uml.validation.tests.rules.TestValidationRulesInPluginXML)  Time elapsed: 2.044 s
01:25:54 validateIsPassiveJavaRule_inactiveClass(org.eclipse.papyrus.uml.validation.tests.rules.TestValidationRulesInPluginXML)  Time elapsed: 1.253 s
01:25:54 validateIsPassiveJavaRule_activeClass(org.eclipse.papyrus.uml.validation.tests.rules.TestValidationRulesInPluginXML)  Time elapsed: 2.602 s
01:25:54 validateMalformedActiveRule_notActiveCapsule(org.eclipse.papyrus.uml.validation.tests.rules.TestValidationRulesInProfile)  Time elapsed: 2.544 s
01:25:54 validateIsActiveRule_notActiveCapsule(org.eclipse.papyrus.uml.validation.tests.rules.TestValidationRulesInProfile)  Time elapsed: 1.706 s
01:25:54 validateIsActiveRule_ActiveCapsule(org.eclipse.papyrus.uml.validation.tests.rules.TestValidationRulesInProfile)  Time elapsed: 1.897 s
01:25:54 validateNameClashDetection(org.eclipse.papyrus.uml.validation.tests.rules.TestUMLValidationRules)  Time elapsed: 1.014 s
01:25:54 validateNonStandardMultiplicity(org.eclipse.papyrus.uml.validation.tests.rules.TestUMLValidationRules)  Time elapsed: 1.207 s
01:25:54 validateUnsetStereotypeAttribute(org.eclipse.papyrus.uml.validation.tests.rules.TestStereotypeValidation)  Time elapsed: 1.402 s
01:25:54 testResolveProfile__Object(org.eclipse.papyrus.uml.filters.tests.ProfileAppliedTest)  Time elapsed: 0.033 s
01:25:54 testMatches__Object(org.eclipse.papyrus.uml.filters.tests.ProfileAppliedTest)  Time elapsed: 0.013 s
01:25:54 profileAppliedFilterResourceURI_bug480221(org.eclipse.papyrus.uml.filters.tests.ProfileAppliedRegressionTest)  Time elapsed: 0.025 s
01:25:54 profileAppliedFilterDoesNotLoadProfiles_miss_bug480221(org.eclipse.papyrus.uml.filters.tests.ProfileAppliedRegressionTest)  Time elapsed: 0.023 s
01:25:54 profileAppliedFilterDoesNotLoadProfiles_hit_bug480221(org.eclipse.papyrus.uml.filters.tests.ProfileAppliedRegressionTest)  Time elapsed: 0.021 s
01:25:54 popupsGenerated(org.eclipse.papyrus.uml.profile.assistants.generator.tests.BasicAssistantsGenerationTest)  Time elapsed: 0.009 s
01:25:54 connectionTargetFilters(org.eclipse.papyrus.uml.profile.assistants.generator.tests.BasicAssistantsGenerationTest)  Time elapsed: 0.002 s
01:25:54 popupFilters(org.eclipse.papyrus.uml.profile.assistants.generator.tests.BasicAssistantsGenerationTest)  Time elapsed: 0.001 s
01:25:54 connectionSourceFilters(org.eclipse.papyrus.uml.profile.assistants.generator.tests.BasicAssistantsGenerationTest)  Time elapsed: 0 s
01:25:54 connectionsGenerated(org.eclipse.papyrus.uml.profile.assistants.generator.tests.BasicAssistantsGenerationTest)  Time elapsed: 0 s
01:25:54 popupsGenerated(org.eclipse.papyrus.uml.profile.assistants.generator.tests.DiagramSpecificAssistantsGenerationTest)  Time elapsed: 0.026 s
01:25:54 connectionTargetFilters(org.eclipse.papyrus.uml.profile.assistants.generator.tests.DiagramSpecificAssistantsGenerationTest)  Time elapsed: 0.004 s
01:25:54 distinctConnectionHintsGenerated(org.eclipse.papyrus.uml.profile.assistants.generator.tests.DiagramSpecificAssistantsGenerationTest)  Time elapsed: 0.004 s
01:25:54 popupFilters(org.eclipse.papyrus.uml.profile.assistants.generator.tests.DiagramSpecificAssistantsGenerationTest)  Time elapsed: 0.002 s
01:25:54 connectionSourceFilters(org.eclipse.papyrus.uml.profile.assistants.generator.tests.DiagramSpecificAssistantsGenerationTest)  Time elapsed: 0.001 s
01:25:54 distinctPopupHintsGenerated(org.eclipse.papyrus.uml.profile.assistants.generator.tests.DiagramSpecificAssistantsGenerationTest)  Time elapsed: 0 s
01:25:54 connectionsGenerated(org.eclipse.papyrus.uml.profile.assistants.generator.tests.DiagramSpecificAssistantsGenerationTest)  Time elapsed: 0 s
01:25:54 popupsGenerated(org.eclipse.papyrus.uml.profile.assistants.generator.tests.ProfilesWithPackageNestingTest)  Time elapsed: 0.002 s
01:25:54 connectionTargetFilters(org.eclipse.papyrus.uml.profile.assistants.generator.tests.ProfilesWithPackageNestingTest)  Time elapsed: 0.003 s
01:25:54 popupFilters(org.eclipse.papyrus.uml.profile.assistants.generator.tests.ProfilesWithPackageNestingTest)  Time elapsed: 0 s
01:25:54 connectionSourceFilters(org.eclipse.papyrus.uml.profile.assistants.generator.tests.ProfilesWithPackageNestingTest)  Time elapsed: 0.001 s
01:25:54 connectionsGenerated(org.eclipse.papyrus.uml.profile.assistants.generator.tests.ProfilesWithPackageNestingTest)  Time elapsed: 0 s
01:25:54 connectionsGenerated[<<Indirect>> Generalization](org.eclipse.papyrus.uml.profile.assistants.generator.tests.ConnectionTypesTest)  Time elapsed: 0.002 s
01:25:54 connectionsGenerated[<<Indirect>> GeneralizationSet](org.eclipse.papyrus.uml.profile.assistants.generator.tests.ConnectionTypesTest)  Time elapsed: 0 s
01:25:54 connectionsGenerated[<<Virtual>> ControlFlow](org.eclipse.papyrus.uml.profile.assistants.generator.tests.ConnectionTypesTest)  Time elapsed: 0 s
01:25:54 connectionsGenerated[<<Virtual>> ObjectFlow](org.eclipse.papyrus.uml.profile.assistants.generator.tests.ConnectionTypesTest)  Time elapsed: 0 s
01:25:54 connectionsGenerated[<<Virtual>> Transition](org.eclipse.papyrus.uml.profile.assistants.generator.tests.ConnectionTypesTest)  Time elapsed: 0.001 s
01:25:54 connectionsGenerated[<<Virtual>> Message](org.eclipse.papyrus.uml.profile.assistants.generator.tests.ConnectionTypesTest)  Time elapsed: 0 s
01:25:54 connectionsGenerated[<<Indirect>> Connector](org.eclipse.papyrus.uml.profile.assistants.generator.tests.ConnectionTypesTest)  Time elapsed: 0 s
01:25:54 iconGenerated(org.eclipse.papyrus.uml.profile.types.generator.tests.BasicElementTypesGenerationTest)  Time elapsed: 0.005 s
01:25:54 elementTypeSpecializedTypes_bug461717(org.eclipse.papyrus.uml.profile.types.generator.tests.BasicElementTypesGenerationTest)  Time elapsed: 0.011 s
01:25:54 multipleElementTypesForOneStereotypeGenerated(org.eclipse.papyrus.uml.profile.types.generator.tests.BasicElementTypesGenerationTest)  Time elapsed: 0.001 s
01:25:54 stereotypeAdviceGenerated(org.eclipse.papyrus.uml.profile.types.generator.tests.BasicElementTypesGenerationTest)  Time elapsed: 0.001 s
01:25:54 elementTypesGenerated(org.eclipse.papyrus.uml.profile.types.generator.tests.BasicElementTypesGenerationTest)  Time elapsed: 0 s
01:25:54 stereotypeMatcherGenerated(org.eclipse.papyrus.uml.profile.types.generator.tests.BasicElementTypesGenerationTest)  Time elapsed: 0 s
01:25:54 stereotypeAdviceNotGenerated(org.eclipse.papyrus.uml.profile.types.generator.tests.DiagramSpecificElementTypesGenerationTest)  Time elapsed: 0.003 s
01:25:54 distinctHintsGenerated(org.eclipse.papyrus.uml.profile.types.generator.tests.DiagramSpecificElementTypesGenerationTest)  Time elapsed: 0.002 s
01:25:54 stereotypeMatcherNotGenerated(org.eclipse.papyrus.uml.profile.types.generator.tests.DiagramSpecificElementTypesGenerationTest)  Time elapsed: 0.001 s
01:25:54 iconGenerated(org.eclipse.papyrus.uml.profile.types.generator.tests.DiagramSpecificElementTypesGenerationTest)  Time elapsed: 0 s
01:25:54 elementTypeSpecializedTypes_bug461717(org.eclipse.papyrus.uml.profile.types.generator.tests.DiagramSpecificElementTypesGenerationTest)  Time elapsed: 0.017 s
01:25:54 elementTypesGenerated(org.eclipse.papyrus.uml.profile.types.generator.tests.DiagramSpecificElementTypesGenerationTest)  Time elapsed: 0 s
01:25:54 iconGenerated(org.eclipse.papyrus.uml.profile.types.generator.tests.ProfilesWithPackageNestingTest)  Time elapsed: 0.002 s
01:25:54 stereotypeAdviceGenerated(org.eclipse.papyrus.uml.profile.types.generator.tests.ProfilesWithPackageNestingTest)  Time elapsed: 0 s
01:25:54 elementTypesGenerated(org.eclipse.papyrus.uml.profile.types.generator.tests.ProfilesWithPackageNestingTest)  Time elapsed: 0.001 s
01:25:54 stereotypeMatcherGenerated(org.eclipse.papyrus.uml.profile.types.generator.tests.ProfilesWithPackageNestingTest)  Time elapsed: 0 s
01:25:54 elementTypeSpecializedTypes(org.eclipse.papyrus.uml.profile.types.generator.tests.DiagramSpecificElementTypesGenerationBug461717Test)  Time elapsed: 0.018 s
01:25:54 stereotypeAdviceGenerated(org.eclipse.papyrus.uml.profile.types.generator.tests.DiagramSpecificElementTypesGenerationBug461717Test)  Time elapsed: 0 s
01:25:54 stereotypeMatcherGenerated(org.eclipse.papyrus.uml.profile.types.generator.tests.DiagramSpecificElementTypesGenerationBug461717Test)  Time elapsed: 0.001 s
01:25:54 testGetStereotypeNames(org.eclipse.papyrus.uml.profile.drafter.tests.ProfileCatalogTest)  Time elapsed: 0.033 s
01:25:54 testGetStereotypes(org.eclipse.papyrus.uml.profile.drafter.tests.ProfileCatalogTest)  Time elapsed: 0.174 s
01:25:54 testGetAllStereotypeNames(org.eclipse.papyrus.uml.profile.drafter.tests.ProfileCatalogTest) skipped
01:25:54 testGetProfileNames(org.eclipse.papyrus.uml.profile.drafter.tests.ProfileCatalogTest)  Time elapsed: 0.046 s
01:25:54 testProfileCatalog(org.eclipse.papyrus.uml.profile.drafter.tests.ProfileCatalogTest)  Time elapsed: 0.035 s
01:25:54 testLookupStereotype(org.eclipse.papyrus.uml.profile.drafter.tests.ProfileCatalogTest)  Time elapsed: 0.142 s
01:25:54 testLookupStereotypeInAppliedProfile(org.eclipse.papyrus.uml.profile.drafter.tests.ProfileCatalogTest)  Time elapsed: 0.049 s
01:25:54 testProfileCopy(org.eclipse.papyrus.uml.profile.drafter.tests.ProfileCatalogTest)  Time elapsed: 0.044 s
01:25:54 testGetProfiles(org.eclipse.papyrus.uml.profile.drafter.tests.ProfileCatalogTest)  Time elapsed: 0.05 s
01:25:54 testGetNamedElement(org.eclipse.papyrus.uml.profile.drafter.tests.ProfileCatalogTest)  Time elapsed: 0.098 s
01:25:54 testIsModelsExist(org.eclipse.papyrus.uml.profile.drafter.tests.ProfileCatalogTest)  Time elapsed: 0.17 s
01:25:54 testGetStereotypeQualifiedNames(org.eclipse.papyrus.uml.profile.drafter.tests.ProfileCatalogTest)  Time elapsed: 0.044 s
01:25:54 testGetProfileQualifiedNames(org.eclipse.papyrus.uml.profile.drafter.tests.ProfileCatalogTest)  Time elapsed: 0.054 s
01:25:54 testCopyResources(org.eclipse.papyrus.uml.profile.drafter.tests.EclipseProjectTest)  Time elapsed: 0.007 s
01:25:54 testCopyResource(org.eclipse.papyrus.uml.profile.drafter.tests.EclipseProjectTest)  Time elapsed: 0.004 s
01:25:54 testGetProject(org.eclipse.papyrus.uml.profile.drafter.tests.EclipseProjectTest)  Time elapsed: 0 s
01:25:54 testEclipseProject(org.eclipse.papyrus.uml.profile.drafter.tests.EclipseProjectTest)  Time elapsed: 0 s
01:25:54 testGetUmlModelWithIFile(org.eclipse.papyrus.uml.profile.drafter.tests.ModelSetManagerTest)  Time elapsed: 0.058 s
01:25:54 testModelSetManagerString(org.eclipse.papyrus.uml.profile.drafter.tests.ModelSetManagerTest)  Time elapsed: 0.005 s
01:25:54 testModelSetManagerURI(org.eclipse.papyrus.uml.profile.drafter.tests.ModelSetManagerTest)  Time elapsed: 0.004 s
01:25:54 testGetNamedElementByNameString(org.eclipse.papyrus.uml.profile.drafter.tests.ModelSetManagerTest)  Time elapsed: 0.003 s
01:25:54 testGetUmlModel(org.eclipse.papyrus.uml.profile.drafter.tests.ModelSetManagerTest)  Time elapsed: 0.022 s
01:25:54 testModelSetManagerStringModels(org.eclipse.papyrus.uml.profile.drafter.tests.ModelSetManagerTest)  Time elapsed: 0.003 s
01:25:54 testGetNamedElementByNameWithSterotype(org.eclipse.papyrus.uml.profile.drafter.tests.ModelSetManagerTest)  Time elapsed: 0.025 s
01:25:54 testCreation(org.eclipse.papyrus.uml.profile.drafter.tests.utils.UMLModelCreatorTest)  Time elapsed: 0.003 s
01:25:54 testCreateClass(org.eclipse.papyrus.uml.profile.drafter.tests.utils.UMLModelCreatorTest)  Time elapsed: 0 s
01:25:54 testCreateModel(org.eclipse.papyrus.uml.profile.drafter.tests.utils.UMLModelCreatorTest)  Time elapsed: 0 s
01:25:54 testCreatePackage(org.eclipse.papyrus.uml.profile.drafter.tests.utils.UMLModelCreatorTest)  Time elapsed: 0 s
01:25:54 testCd(org.eclipse.papyrus.uml.profile.drafter.tests.utils.UMLModelCreatorTest)  Time elapsed: 0 s
01:25:54 testUMLModelCreatorResourceFailing(org.eclipse.papyrus.uml.profile.drafter.tests.utils.UMLModelCreatorTest)  Time elapsed: 0 s
01:25:54 testUMLModelCreatorStringString(org.eclipse.papyrus.uml.profile.drafter.tests.utils.UMLModelCreatorTest)  Time elapsed: 0 s
01:25:54 testUMLModelCreatorResource(org.eclipse.papyrus.uml.profile.drafter.tests.utils.UMLModelCreatorTest)  Time elapsed: 0.001 s
01:25:54 testCreateDatatype(org.eclipse.papyrus.uml.profile.drafter.tests.utils.UMLModelCreatorTest)  Time elapsed: 0 s
01:25:54 testCompoundTypeProvider(org.eclipse.papyrus.uml.profile.drafter.ui.model.CompoundTypeProviderTest)  Time elapsed: 0.001 s
01:25:54 testGetTypes(org.eclipse.papyrus.uml.profile.drafter.ui.model.CompoundTypeProviderTest)  Time elapsed: 0 s
01:25:54 testAddITypeProvider(org.eclipse.papyrus.uml.profile.drafter.ui.model.CompoundTypeProviderTest)  Time elapsed: 0 s
01:25:54 testIterator(org.eclipse.papyrus.uml.profile.drafter.ui.model.CompoundTypeProviderTest)  Time elapsed: 0 s
01:25:54 testVisitMetaclassesModel(org.eclipse.papyrus.uml.profile.drafter.ui.model.SimpleModelVisitorTest) skipped
01:25:54 testVisitPropertyModel(org.eclipse.papyrus.uml.profile.drafter.ui.model.SimpleModelVisitorTest) skipped
01:25:54 testSimpleModelVisitor(org.eclipse.papyrus.uml.profile.drafter.ui.model.SimpleModelVisitorTest)  Time elapsed: 0.002 s
01:25:54 testDoVisitStereoptypeModel(org.eclipse.papyrus.uml.profile.drafter.ui.model.SimpleModelVisitorTest) skipped
01:25:54 testDoVisitPropertyModel(org.eclipse.papyrus.uml.profile.drafter.ui.model.SimpleModelVisitorTest) skipped
01:25:54 testVisitStereoptypeModel(org.eclipse.papyrus.uml.profile.drafter.ui.model.SimpleModelVisitorTest) skipped
01:25:54 testDoVisitMetaclassesModel(org.eclipse.papyrus.uml.profile.drafter.ui.model.SimpleModelVisitorTest) skipped
01:25:54 testSetStereotypeName(org.eclipse.papyrus.uml.profile.drafter.ui.model.StereotypeURLTest)  Time elapsed: 0.02 s
01:25:54 testGetProfileName(org.eclipse.papyrus.uml.profile.drafter.ui.model.StereotypeURLTest)  Time elapsed: 0 s
01:25:54 testAddPropertyChangeListenerPropertyChangeListener(org.eclipse.papyrus.uml.profile.drafter.ui.model.StereotypeURLTest)  Time elapsed: 0.001 s
01:25:54 testSetQualifiedNameComplex(org.eclipse.papyrus.uml.profile.drafter.ui.model.StereotypeURLTest)  Time elapsed: 0 s
01:25:54 testClear(org.eclipse.papyrus.uml.profile.drafter.ui.model.StereotypeURLTest)  Time elapsed: 0 s
01:25:54 testStereotypeURLString(org.eclipse.papyrus.uml.profile.drafter.ui.model.StereotypeURLTest)  Time elapsed: 0 s
01:25:54 testToString(org.eclipse.papyrus.uml.profile.drafter.ui.model.StereotypeURLTest)  Time elapsed: 0 s
01:25:54 testGetStereotypeName(org.eclipse.papyrus.uml.profile.drafter.ui.model.StereotypeURLTest)  Time elapsed: 0 s
01:25:54 testAddPropertyChangeListenerStringPropertyChangeListener(org.eclipse.papyrus.uml.profile.drafter.ui.model.StereotypeURLTest)  Time elapsed: 0 s
01:25:54 testStereotypeURL(org.eclipse.papyrus.uml.profile.drafter.ui.model.StereotypeURLTest)  Time elapsed: 0 s
01:25:54 testRemovePropertyChangeListenerPropertyChangeListener(org.eclipse.papyrus.uml.profile.drafter.ui.model.StereotypeURLTest)  Time elapsed: 0 s
01:25:54 testSetQualifiedNameSimple(org.eclipse.papyrus.uml.profile.drafter.ui.model.StereotypeURLTest)  Time elapsed: 0 s
01:25:54 testSetProfileName(org.eclipse.papyrus.uml.profile.drafter.ui.model.StereotypeURLTest)  Time elapsed: 0 s
01:25:54 testRemovePropertyChangeListenerStringPropertyChangeListener(org.eclipse.papyrus.uml.profile.drafter.ui.model.StereotypeURLTest)  Time elapsed: 0 s
01:25:54 testComputeQualifiedName(org.eclipse.papyrus.uml.profile.drafter.ui.model.StereotypeURLTest)  Time elapsed: 0 s
01:25:54 testGetQualifiedName(org.eclipse.papyrus.uml.profile.drafter.ui.model.StereotypeURLTest)  Time elapsed: 0.002 s
01:25:54 testStereotypeURLStringString(org.eclipse.papyrus.uml.profile.drafter.ui.model.StereotypeURLTest)  Time elapsed: 0 s
01:25:54 testGetTypes(org.eclipse.papyrus.uml.profile.drafter.ui.model.TypeProviderTest)  Time elapsed: 0.002 s
01:25:54 testTypeProvider(org.eclipse.papyrus.uml.profile.drafter.ui.model.TypeProviderTest)  Time elapsed: 0 s
01:25:54 testIterator(org.eclipse.papyrus.uml.profile.drafter.ui.model.TypeProviderTest)  Time elapsed: 0 s
01:25:54 testGetTypes(org.eclipse.papyrus.uml.profile.drafter.ui.model.TypeProviderTest2)  Time elapsed: 0 s
01:25:54 testAddType(org.eclipse.papyrus.uml.profile.drafter.ui.model.TypeProviderTest2)  Time elapsed: 0.001 s
01:25:54 testAddTypeFromConstructor(org.eclipse.papyrus.uml.profile.drafter.ui.model.TypeProviderTest2)  Time elapsed: 0 s
01:25:54 testTypeProvider(org.eclipse.papyrus.uml.profile.drafter.ui.model.TypeProviderTest2)  Time elapsed: 0 s
01:25:54 testTypeProviderTypeArray(org.eclipse.papyrus.uml.profile.drafter.ui.model.TypeProviderTest2)  Time elapsed: 0 s
01:25:54 testIterator(org.eclipse.papyrus.uml.profile.drafter.ui.model.TypeProviderTest2)  Time elapsed: 0 s
01:25:54 testUMLPrimitiveTypesModel(org.eclipse.papyrus.uml.profile.drafter.utils.UMLPrimitiveTypesModelTest)  Time elapsed: 0.015 s
01:25:54 testGetLibraryPackage(org.eclipse.papyrus.uml.profile.drafter.utils.UMLPrimitiveTypesModelTest)  Time elapsed: 0.012 s
01:25:54 testUseInternationalizationModification(org.eclipse.papyrus.uml.internationalization.tests.tests.UMLInternationalizationChangePreferencesTest)  Time elapsed: 0.913 s
01:25:54 testLanguageModification(org.eclipse.papyrus.uml.internationalization.tests.tests.UMLInternationalizationChangeLanguageTest)  Time elapsed: 0.704 s
01:25:54 rebuildAdapters(org.eclipse.papyrus.uml.internationalization.tests.tests.InternationalizationUMLItemProviderAdapterFactoryTest)  Time elapsed: 0.719 s
01:25:54 normalAdapters(org.eclipse.papyrus.uml.internationalization.tests.tests.InternationalizationUMLItemProviderAdapterFactoryTest)  Time elapsed: 0.767 s
01:25:54 testLabelProviderAdapter(org.eclipse.papyrus.uml.internationalization.tests.tests.InternationalizationAdapterTest)  Time elapsed: 0.003 s
01:25:54 testMapping(org.eclipse.papyrus.uml.alf.tests.mapper.MappingTest) skipped
01:25:54 org.eclipse.papyrus.uml.alf.tests.mapper.MappingTest skipped
01:25:54 testMerging(org.eclipse.papyrus.uml.alf.tests.mapper.MergeTest) skipped
01:25:54 org.eclipse.papyrus.uml.alf.tests.mapper.MergeTest skipped
01:25:54 testStaticSemantics(org.eclipse.papyrus.uml.alf.tests.SemanticTest) skipped
01:25:54 org.eclipse.papyrus.uml.alf.tests.SemanticTest skipped
01:25:54 testOneFile(org.eclipse.papyrus.uml.alf.tests.SingleTest) skipped
01:25:54 org.eclipse.papyrus.uml.alf.tests.SingleTest skipped
01:25:54 testSyntax(org.eclipse.papyrus.uml.alf.tests.SyntacticTest) skipped
01:25:54 org.eclipse.papyrus.uml.alf.tests.SyntacticTest skipped
01:25:54 testGeneration(org.eclipse.papyrus.uml.alf.tests.generator.GenerationTest) skipped
01:25:54 org.eclipse.papyrus.uml.alf.tests.generator.GenerationTest skipped
01:25:54 org.eclipse.papyrus.uml.alf.tests.AllTests skipped
01:25:54 IsStereotypedWithExpression_Test10(org.eclipse.papyrus.uml.expressions.tests.IsStereotypedWithExpressionTests)  Time elapsed: 0.962 s
01:25:54 IsStereotypedWithExpression_Test11(org.eclipse.papyrus.uml.expressions.tests.IsStereotypedWithExpressionTests)  Time elapsed: 0.869 s
01:25:54 IsStereotypedWithExpression_Test12(org.eclipse.papyrus.uml.expressions.tests.IsStereotypedWithExpressionTests)  Time elapsed: 0.939 s
01:25:54 IsStereotypedWithExpression_Test13(org.eclipse.papyrus.uml.expressions.tests.IsStereotypedWithExpressionTests)  Time elapsed: 1.429 s
01:25:54 IsStereotypedWithExpression_Test1(org.eclipse.papyrus.uml.expressions.tests.IsStereotypedWithExpressionTests)  Time elapsed: 1.173 s
01:25:54 IsStereotypedWithExpression_Test2(org.eclipse.papyrus.uml.expressions.tests.IsStereotypedWithExpressionTests)  Time elapsed: 0.984 s
01:25:54 IsStereotypedWithExpression_Test3(org.eclipse.papyrus.uml.expressions.tests.IsStereotypedWithExpressionTests)  Time elapsed: 0.912 s
01:25:54 IsStereotypedWithExpression_Test4(org.eclipse.papyrus.uml.expressions.tests.IsStereotypedWithExpressionTests)  Time elapsed: 0.922 s
01:25:54 IsStereotypedWithExpression_Test5(org.eclipse.papyrus.uml.expressions.tests.IsStereotypedWithExpressionTests)  Time elapsed: 1.077 s
01:25:54 IsStereotypedWithExpression_Test6(org.eclipse.papyrus.uml.expressions.tests.IsStereotypedWithExpressionTests)  Time elapsed: 1.479 s
01:25:54 IsStereotypedWithExpression_Test7(org.eclipse.papyrus.uml.expressions.tests.IsStereotypedWithExpressionTests)  Time elapsed: 0.97 s
01:25:54 IsStereotypedWithExpression_Test8(org.eclipse.papyrus.uml.expressions.tests.IsStereotypedWithExpressionTests)  Time elapsed: 1.128 s
01:25:54 IsStereotypedWithExpression_Test9(org.eclipse.papyrus.uml.expressions.tests.IsStereotypedWithExpressionTests)  Time elapsed: 0.96 s
01:25:54 HasStereotypeExpressionTests_Test1(org.eclipse.papyrus.uml.expressions.tests.HasAppliedStereotypeExpressionTests)  Time elapsed: 0.928 s
01:25:54 HasStereotypeExpressionTests_Test2(org.eclipse.papyrus.uml.expressions.tests.HasAppliedStereotypeExpressionTests)  Time elapsed: 0.899 s
01:25:54 HasStereotypeExpressionTests_Test3(org.eclipse.papyrus.uml.expressions.tests.HasAppliedStereotypeExpressionTests)  Time elapsed: 0.843 s
01:25:54 HasStereotypeExpressionTests_Test4(org.eclipse.papyrus.uml.expressions.tests.HasAppliedStereotypeExpressionTests)  Time elapsed: 0.857 s
01:25:54 metaclassAndNoContext(org.eclipse.papyrus.uml.expressions.tests.IsKindOfExpressionTest)  Time elapsed: 0.003 s
01:25:54 noMetaclassAndNoContextTest(org.eclipse.papyrus.uml.expressions.tests.IsKindOfExpressionTest)  Time elapsed: 0 s
01:25:54 metaclassAndValidContext_1(org.eclipse.papyrus.uml.expressions.tests.IsKindOfExpressionTest)  Time elapsed: 0 s
01:25:54 metaclassAndValidContext_2(org.eclipse.papyrus.uml.expressions.tests.IsKindOfExpressionTest)  Time elapsed: 0 s
01:25:54 metaclassAndInvalidContext(org.eclipse.papyrus.uml.expressions.tests.IsKindOfExpressionTest)  Time elapsed: 0 s
01:25:54 metaclassAndNoContext(org.eclipse.papyrus.uml.expressions.tests.IsTypeOfExpressionTests)  Time elapsed: 0.001 s
01:25:54 noMetaclassAndNoContextTest(org.eclipse.papyrus.uml.expressions.tests.IsTypeOfExpressionTests)  Time elapsed: 0 s
01:25:54 metaclassAndValidContext_2(org.eclipse.papyrus.uml.expressions.tests.IsTypeOfExpressionTests)  Time elapsed: 0 s
01:25:54 metaclassAndInValidContext_1(org.eclipse.papyrus.uml.expressions.tests.IsTypeOfExpressionTests)  Time elapsed: 0 s
01:25:54 IsKindOfStereotypeExpression_Test10(org.eclipse.papyrus.uml.expressions.tests.IsKindOfStereotypeExpressionTests)  Time elapsed: 1.052 s
01:25:54 IsKindOfStereotypeExpression_Test11(org.eclipse.papyrus.uml.expressions.tests.IsKindOfStereotypeExpressionTests)  Time elapsed: 0.897 s
01:25:54 IsKindOfStereotypeExpression_Test12(org.eclipse.papyrus.uml.expressions.tests.IsKindOfStereotypeExpressionTests)  Time elapsed: 0.921 s
01:25:54 IsKindOfStereotypeExpression_Test13(org.eclipse.papyrus.uml.expressions.tests.IsKindOfStereotypeExpressionTests)  Time elapsed: 0.842 s
01:25:54 IsKindOfStereotypeExpression_Test14(org.eclipse.papyrus.uml.expressions.tests.IsKindOfStereotypeExpressionTests)  Time elapsed: 0.827 s
01:25:54 IsKindOfStereotypeExpression_Test1(org.eclipse.papyrus.uml.expressions.tests.IsKindOfStereotypeExpressionTests)  Time elapsed: 0.91 s
01:25:54 IsKindOfStereotypeExpression_Test2(org.eclipse.papyrus.uml.expressions.tests.IsKindOfStereotypeExpressionTests)  Time elapsed: 0.802 s
01:25:54 IsKindOfStereotypeExpression_Test3(org.eclipse.papyrus.uml.expressions.tests.IsKindOfStereotypeExpressionTests)  Time elapsed: 0.806 s
01:25:54 IsKindOfStereotypeExpression_Test4(org.eclipse.papyrus.uml.expressions.tests.IsKindOfStereotypeExpressionTests)  Time elapsed: 0.998 s
01:25:54 IsKindOfStereotypeExpression_Test5(org.eclipse.papyrus.uml.expressions.tests.IsKindOfStereotypeExpressionTests)  Time elapsed: 0.933 s
01:25:54 IsKindOfStereotypeExpression_Test6(org.eclipse.papyrus.uml.expressions.tests.IsKindOfStereotypeExpressionTests)  Time elapsed: 0.968 s
01:25:54 IsKindOfStereotypeExpression_Test7(org.eclipse.papyrus.uml.expressions.tests.IsKindOfStereotypeExpressionTests)  Time elapsed: 0.999 s
01:25:54 IsKindOfStereotypeExpression_Test8(org.eclipse.papyrus.uml.expressions.tests.IsKindOfStereotypeExpressionTests)  Time elapsed: 0.86 s
01:25:54 IsKindOfStereotypeExpression_Test9(org.eclipse.papyrus.uml.expressions.tests.IsKindOfStereotypeExpressionTests)  Time elapsed: 1.033 s
01:25:54 IsTypeOfStereotypeExpression_Test1(org.eclipse.papyrus.uml.expressions.tests.IsTypeOfStereotypeExpressionTests)  Time elapsed: 0.915 s
01:25:54 IsTypeOfStereotypeExpression_Test2(org.eclipse.papyrus.uml.expressions.tests.IsTypeOfStereotypeExpressionTests)  Time elapsed: 1.115 s
01:25:54 IsTypeOfStereotypeExpression_Test3(org.eclipse.papyrus.uml.expressions.tests.IsTypeOfStereotypeExpressionTests)  Time elapsed: 1.026 s
01:25:54 IsTypeOfStereotypeExpression_Test4(org.eclipse.papyrus.uml.expressions.tests.IsTypeOfStereotypeExpressionTests)  Time elapsed: 0.998 s
01:25:54 IsTypeOfStereotypeExpression_Test5(org.eclipse.papyrus.uml.expressions.tests.IsTypeOfStereotypeExpressionTests)  Time elapsed: 1.031 s
01:25:54 IsTypeOfStereotypeExpression_Test6(org.eclipse.papyrus.uml.expressions.tests.IsTypeOfStereotypeExpressionTests)  Time elapsed: 0.786 s
01:25:54 IsTypeOfStereotypeExpression_Test7(org.eclipse.papyrus.uml.expressions.tests.IsTypeOfStereotypeExpressionTests)  Time elapsed: 0.93 s
01:25:54 IsTypeOfStereotypeExpression_Test8(org.eclipse.papyrus.uml.expressions.tests.IsTypeOfStereotypeExpressionTests)  Time elapsed: 0.998 s
01:25:54 IsTypeOfStereotypeExpression_Test9(org.eclipse.papyrus.uml.expressions.tests.IsTypeOfStereotypeExpressionTests)  Time elapsed: 1.021 s
01:25:54 IsTypeOfStereotypeExpression_Test10(org.eclipse.papyrus.uml.expressions.tests.IsTypeOfStereotypeExpressionTests)  Time elapsed: 1.088 s
01:25:54 IsTypeOfStereotypeExpression_Test11(org.eclipse.papyrus.uml.expressions.tests.IsTypeOfStereotypeExpressionTests)  Time elapsed: 0.927 s
01:25:54 IsTypeOfStereotypeExpression_Test12(org.eclipse.papyrus.uml.expressions.tests.IsTypeOfStereotypeExpressionTests)  Time elapsed: 1.017 s
01:25:54 IsTypeOfStereotypeExpression_Test13(org.eclipse.papyrus.uml.expressions.tests.IsTypeOfStereotypeExpressionTests)  Time elapsed: 0.99 s
01:25:54 SingleStereotypeAttributeEqualityExpressionTests_Test10(org.eclipse.papyrus.uml.expressions.tests.SingleStereotypeAttributeEqualityExpressionTests)  Time elapsed: 1.101 s
01:25:54 SingleStereotypeAttributeEqualityExpressionTests_Test11(org.eclipse.papyrus.uml.expressions.tests.SingleStereotypeAttributeEqualityExpressionTests)  Time elapsed: 0.973 s
01:25:54 SingleStereotypeAttributeEqualityExpressionTests_Test12(org.eclipse.papyrus.uml.expressions.tests.SingleStereotypeAttributeEqualityExpressionTests)  Time elapsed: 0.962 s
01:25:54 SingleStereotypeAttributeEqualityExpressionTests_Test13(org.eclipse.papyrus.uml.expressions.tests.SingleStereotypeAttributeEqualityExpressionTests)  Time elapsed: 0.917 s
01:25:54 SingleStereotypeAttributeEqualityExpressionTests_Test1(org.eclipse.papyrus.uml.expressions.tests.SingleStereotypeAttributeEqualityExpressionTests)  Time elapsed: 1.017 s
01:25:54 SingleStereotypeAttributeEqualityExpressionTests_Test2(org.eclipse.papyrus.uml.expressions.tests.SingleStereotypeAttributeEqualityExpressionTests)  Time elapsed: 0.951 s
01:25:54 SingleStereotypeAttributeEqualityExpressionTests_Test3(org.eclipse.papyrus.uml.expressions.tests.SingleStereotypeAttributeEqualityExpressionTests)  Time elapsed: 0.915 s
01:25:54 SingleStereotypeAttributeEqualityExpressionTests_Test4(org.eclipse.papyrus.uml.expressions.tests.SingleStereotypeAttributeEqualityExpressionTests)  Time elapsed: 1.027 s
01:25:54 SingleStereotypeAttributeEqualityExpressionTests_Test5(org.eclipse.papyrus.uml.expressions.tests.SingleStereotypeAttributeEqualityExpressionTests)  Time elapsed: 0.934 s
01:25:54 SingleStereotypeAttributeEqualityExpressionTests_Test6(org.eclipse.papyrus.uml.expressions.tests.SingleStereotypeAttributeEqualityExpressionTests)  Time elapsed: 0.859 s
01:25:54 SingleStereotypeAttributeEqualityExpressionTests_Test7(org.eclipse.papyrus.uml.expressions.tests.SingleStereotypeAttributeEqualityExpressionTests)  Time elapsed: 0.856 s
01:25:54 SingleStereotypeAttributeEqualityExpressionTests_Test8(org.eclipse.papyrus.uml.expressions.tests.SingleStereotypeAttributeEqualityExpressionTests)  Time elapsed: 0.825 s
01:25:54 SingleStereotypeAttributeEqualityExpressionTests_Test9(org.eclipse.papyrus.uml.expressions.tests.SingleStereotypeAttributeEqualityExpressionTests)  Time elapsed: 1.045 s
01:25:54 validateModel[0](org.eclipse.papyrus.uml.architecture.tests.resources.ModelValidationTest)  Time elapsed: 0.1 s
01:25:54 
01:25:54 Results:
01:25:54 
01:25:54 Failures: 
01:25:54   InstanceSpecificationTest.init:91->initModel:131 Cannot load the test diagram
01:25:54 Errors: 
01:25:54 org.eclipse.papyrus.uml.modelexplorer.tests.AdvancedModeTest.advancedModeDoesNotCollapseItself(org.eclipse.papyrus.uml.modelexplorer.tests.AdvancedModeTest)
01:25:54   Run 1: AdvancedModeTest.advancedModeDoesNotCollapseItself » BasicIndexOutOfBounds ind...
01:25:54   Run 2: AdvancedModeTest.advancedModeDoesNotCollapseItself:69 » NullPointer
01:25:54 
01:25:54 
01:25:54 Tests run: 657, Failures: 1, Errors: 1, Skipped: 38
01:25:54 
01:25:56 [ERROR] There are test failures.
01:25:56 
01:25:56 Please refer to /jobs/genie.papyrus/Papyrus-Master-Tests/workspace/source/tests/junit/plugins/uml/org.eclipse.papyrus.uml.suite.tests/target/surefire-reports for the individual test results.
01:25:56 [INFO] 
01:25:56 [INFO] --- jacoco-maven-plugin:0.8.2:report (default-report) @ org.eclipse.papyrus.uml.suite.tests ---
01:25:56 [INFO] Loading execution data file /jobs/genie.papyrus/Papyrus-Master-Tests/workspace/source/tests/junit/plugins/uml/org.eclipse.papyrus.uml.suite.tests/target/jacoco.exec
01:25:56 [INFO] Analyzed bundle 'org.eclipse.papyrus.uml.suite.tests' with 0 classes
01:25:56 [INFO] 
01:25:56 [INFO] --< org.eclipse.papyrus.tests:org.eclipse.papyrus.uml.alf.tests.releng >--
01:25:56 [INFO] Building org.eclipse.papyrus.uml.alf.tests.releng 0.0.1-SNAPSHOT [159/167]
01:25:56 [INFO] --------------------------------[ pom ]---------------------------------
01:25:56 [INFO] 
01:25:56 [INFO] --- maven-clean-plugin:3.1.0:clean (default-clean) @ org.eclipse.papyrus.uml.alf.tests.releng ---
01:25:56 [INFO] 
01:25:56 [INFO] --- jacoco-maven-plugin:0.8.2:prepare-agent (default-prepare-agent) @ org.eclipse.papyrus.uml.alf.tests.releng ---
01:25:56 [INFO] argLine set to -javaagent:/home/hudson/genie.papyrus/.jenkins/jobs/Papyrus-Master-Tests/workspace/.repository/org/jacoco/org.jacoco.agent/0.8.2/org.jacoco.agent-0.8.2-runtime.jar=destfile=/jobs/genie.papyrus/Papyrus-Master-Tests/workspace/source/tests/junit/plugins/uml/alf/target/jacoco.exec,includes=org.eclipse.papyrus.*,excludes=org.eclipse.uml2
01:25:56 [INFO] 
01:25:56 [INFO] --- jacoco-maven-plugin:0.8.2:report (default-report) @ org.eclipse.papyrus.uml.alf.tests.releng ---
01:25:56 [INFO] Skipping JaCoCo execution due to missing execution data file.
01:25:56 [INFO] 
01:25:56 [INFO] --< org.eclipse.papyrus.tests:org.eclipse.papyrus.uml.alf.backend.tests >--
01:25:56 [INFO] Building org.eclipse.papyrus.uml.alf.backend.tests 1.1.0-SNAPSHOT [160/167]
01:25:56 [INFO] ------------------------[ eclipse-test-plugin ]-------------------------
01:25:56 [INFO] 
01:25:56 [INFO] --- maven-clean-plugin:3.1.0:clean (default-clean) @ org.eclipse.papyrus.uml.alf.backend.tests ---
01:25:56 [INFO] 
01:25:56 [INFO] --- tycho-packaging-plugin:1.3.0:build-qualifier (default-build-qualifier) @ org.eclipse.papyrus.uml.alf.backend.tests ---
01:25:56 [INFO] The project's OSGi version is 1.1.0.202004080424
01:25:56 [INFO] 
01:25:56 [INFO] --- tycho-packaging-plugin:1.3.0:validate-id (default-validate-id) @ org.eclipse.papyrus.uml.alf.backend.tests ---
01:25:56 [INFO] 
01:25:56 [INFO] --- tycho-packaging-plugin:1.3.0:validate-version (default-validate-version) @ org.eclipse.papyrus.uml.alf.backend.tests ---
01:25:56 [INFO] 
01:25:56 [INFO] --- jacoco-maven-plugin:0.8.2:prepare-agent (default-prepare-agent) @ org.eclipse.papyrus.uml.alf.backend.tests ---
01:25:56 [INFO] tycho.testArgLine set to -javaagent:/home/hudson/genie.papyrus/.jenkins/jobs/Papyrus-Master-Tests/workspace/.repository/org/jacoco/org.jacoco.agent/0.8.2/org.jacoco.agent-0.8.2-runtime.jar=destfile=/jobs/genie.papyrus/Papyrus-Master-Tests/workspace/source/tests/junit/plugins/uml/alf/org.eclipse.papyrus.uml.alf.backend.tests/target/jacoco.exec,includes=org.eclipse.papyrus.*,excludes=org.eclipse.uml2
01:25:56 [INFO] 
01:25:56 [INFO] --- xtend-maven-plugin:2.16.0:compile (default) @ org.eclipse.papyrus.uml.alf.backend.tests ---
01:25:57 [INFO] 
01:25:57 [INFO] --- maven-resources-plugin:3.1.0:resources (default-resources) @ org.eclipse.papyrus.uml.alf.backend.tests ---
01:25:57 [INFO] Using 'UTF-8' encoding to copy filtered resources.
01:25:57 [INFO] skip non existing resourceDirectory /jobs/genie.papyrus/Papyrus-Master-Tests/workspace/source/tests/junit/plugins/uml/alf/org.eclipse.papyrus.uml.alf.backend.tests/src/main/resources
01:25:57 [INFO] 
01:25:57 [INFO] --- tycho-compiler-plugin:1.3.0:compile (default-compile) @ org.eclipse.papyrus.uml.alf.backend.tests ---
01:25:57 [WARNING] The effective compiler target level 1.8 is incompatible with the following OSGi execution environments: [JavaSE-1.7 (assumes 1.7)] @ MavenProject: org.eclipse.papyrus.tests:org.eclipse.papyrus.uml.alf.backend.tests:1.1.0-SNAPSHOT @ /jobs/genie.papyrus/Papyrus-Master-Tests/workspace/source/tests/junit/plugins/uml/alf/org.eclipse.papyrus.uml.alf.backend.tests/pom.xml
01:25:57 [INFO] Compiling 4 source files to /jobs/genie.papyrus/Papyrus-Master-Tests/workspace/source/tests/junit/plugins/uml/alf/org.eclipse.papyrus.uml.alf.backend.tests/bin
01:25:57 [INFO] 
01:25:57 [INFO] --- maven-resources-plugin:3.1.0:testResources (default-testResources) @ org.eclipse.papyrus.uml.alf.backend.tests ---
01:25:57 [INFO] Using 'UTF-8' encoding to copy filtered resources.
01:25:57 [INFO] skip non existing resourceDirectory /jobs/genie.papyrus/Papyrus-Master-Tests/workspace/source/tests/junit/plugins/uml/alf/org.eclipse.papyrus.uml.alf.backend.tests/src/test/resources
01:25:57 [INFO] 
01:25:57 [INFO] --- target-platform-configuration:1.3.0:target-platform (default-target-platform) @ org.eclipse.papyrus.uml.alf.backend.tests ---
01:25:57 [INFO] 
01:25:57 [INFO] --- tycho-packaging-plugin:1.3.0:package-plugin (default-package-plugin) @ org.eclipse.papyrus.uml.alf.backend.tests ---
01:25:57 [INFO] Building jar: /jobs/genie.papyrus/Papyrus-Master-Tests/workspace/source/tests/junit/plugins/uml/alf/org.eclipse.papyrus.uml.alf.backend.tests/target/org.eclipse.papyrus.uml.alf.backend.tests-1.1.0-SNAPSHOT.jar
01:25:57 [INFO] 
01:25:57 [INFO] --- tycho-p2-plugin:1.3.0:p2-metadata-default (default-p2-metadata-default) @ org.eclipse.papyrus.uml.alf.backend.tests ---
01:25:57 [INFO] 
01:25:57 [INFO] --- tycho-surefire-plugin:1.3.0:test (default-test) @ org.eclipse.papyrus.uml.alf.backend.tests ---
01:25:57 [INFO] Skipping tests
01:25:57 [INFO] 
01:25:57 [INFO] --- jacoco-maven-plugin:0.8.2:report (default-report) @ org.eclipse.papyrus.uml.alf.backend.tests ---
01:25:57 [INFO] Skipping JaCoCo execution due to missing execution data file.
01:25:57 [INFO] 
01:25:57 [INFO] --< org.eclipse.papyrus.tests:org.eclipse.papyrus.views.properties.toolsmiths.tests >--
01:25:57 [INFO] Building org.eclipse.papyrus.views.properties.toolsmiths.tests 1.2.0-SNAPSHOT [161/167]
01:25:57 [INFO] ------------------------[ eclipse-test-plugin ]-------------------------
01:25:57 [INFO] 
01:25:57 [INFO] --- maven-clean-plugin:3.1.0:clean (default-clean) @ org.eclipse.papyrus.views.properties.toolsmiths.tests ---
01:25:57 [INFO] 
01:25:57 [INFO] --- tycho-packaging-plugin:1.3.0:build-qualifier (default-build-qualifier) @ org.eclipse.papyrus.views.properties.toolsmiths.tests ---
01:25:57 [INFO] The project's OSGi version is 1.2.0.202004080424
01:25:57 [INFO] 
01:25:57 [INFO] --- tycho-packaging-plugin:1.3.0:validate-id (default-validate-id) @ org.eclipse.papyrus.views.properties.toolsmiths.tests ---
01:25:57 [INFO] 
01:25:57 [INFO] --- tycho-packaging-plugin:1.3.0:validate-version (default-validate-version) @ org.eclipse.papyrus.views.properties.toolsmiths.tests ---
01:25:57 [INFO] 
01:25:57 [INFO] --- jacoco-maven-plugin:0.8.2:prepare-agent (default-prepare-agent) @ org.eclipse.papyrus.views.properties.toolsmiths.tests ---
01:25:57 [INFO] tycho.testArgLine set to -javaagent:/home/hudson/genie.papyrus/.jenkins/jobs/Papyrus-Master-Tests/workspace/.repository/org/jacoco/org.jacoco.agent/0.8.2/org.jacoco.agent-0.8.2-runtime.jar=destfile=/jobs/genie.papyrus/Papyrus-Master-Tests/workspace/source/tests/junit/plugins/views/org.eclipse.papyrus.views.properties.toolsmiths.tests/target/jacoco.exec,includes=org.eclipse.papyrus.*,excludes=org.eclipse.uml2
01:25:57 [INFO] 
01:25:57 [INFO] --- maven-resources-plugin:3.1.0:resources (default-resources) @ org.eclipse.papyrus.views.properties.toolsmiths.tests ---
01:25:57 [INFO] Using 'UTF-8' encoding to copy filtered resources.
01:25:57 [INFO] skip non existing resourceDirectory /jobs/genie.papyrus/Papyrus-Master-Tests/workspace/source/tests/junit/plugins/views/org.eclipse.papyrus.views.properties.toolsmiths.tests/src/main/resources
01:25:57 [INFO] 
01:25:57 [INFO] --- tycho-compiler-plugin:1.3.0:compile (default-compile) @ org.eclipse.papyrus.views.properties.toolsmiths.tests ---
01:25:57 [WARNING] The effective compiler target level 1.8 is incompatible with the following OSGi execution environments: [J2SE-1.5 (assumes 1.5)] @ MavenProject: org.eclipse.papyrus.tests:org.eclipse.papyrus.views.properties.toolsmiths.tests:1.2.0-SNAPSHOT @ /jobs/genie.papyrus/Papyrus-Master-Tests/workspace/source/tests/junit/plugins/views/org.eclipse.papyrus.views.properties.toolsmiths.tests/pom.xml
01:25:57 [INFO] Compiling 3 source files to /jobs/genie.papyrus/Papyrus-Master-Tests/workspace/source/tests/junit/plugins/views/org.eclipse.papyrus.views.properties.toolsmiths.tests/bin
01:25:57 [WARNING] /jobs/genie.papyrus/Papyrus-Master-Tests/workspace/source/tests/junit/plugins/views/org.eclipse.papyrus.views.properties.toolsmiths.tests/src/org/eclipse/papyrus/views/properties/toolsmiths/tests/qvt/TransformationsTests.java:[274] 
01:25:57 	DataContextElement st3Element = findContextElement(context, "Stereotype3");
01:25:57 	                   ^^^^^^^^^^
01:25:57 The value of the local variable st3Element is not used
01:25:57 1 problem (1 warning)
01:25:57 [INFO] 
01:25:57 [INFO] --- maven-resources-plugin:3.1.0:testResources (default-testResources) @ org.eclipse.papyrus.views.properties.toolsmiths.tests ---
01:25:57 [INFO] Using 'UTF-8' encoding to copy filtered resources.
01:25:57 [INFO] skip non existing resourceDirectory /jobs/genie.papyrus/Papyrus-Master-Tests/workspace/source/tests/junit/plugins/views/org.eclipse.papyrus.views.properties.toolsmiths.tests/src/test/resources
01:25:57 [INFO] 
01:25:57 [INFO] --- target-platform-configuration:1.3.0:target-platform (default-target-platform) @ org.eclipse.papyrus.views.properties.toolsmiths.tests ---
01:25:57 [INFO] 
01:25:57 [INFO] --- tycho-packaging-plugin:1.3.0:package-plugin (default-package-plugin) @ org.eclipse.papyrus.views.properties.toolsmiths.tests ---
01:25:57 [INFO] Building jar: /jobs/genie.papyrus/Papyrus-Master-Tests/workspace/source/tests/junit/plugins/views/org.eclipse.papyrus.views.properties.toolsmiths.tests/target/org.eclipse.papyrus.views.properties.toolsmiths.tests-1.2.0-SNAPSHOT.jar
01:25:57 [INFO] 
01:25:57 [INFO] --- tycho-p2-plugin:1.3.0:p2-metadata-default (default-p2-metadata-default) @ org.eclipse.papyrus.views.properties.toolsmiths.tests ---
01:25:57 [INFO] 
01:25:57 [INFO] --- tycho-surefire-plugin:1.3.0:test (default-test) @ org.eclipse.papyrus.views.properties.toolsmiths.tests ---
01:25:57 [INFO] Skipping tests
01:25:57 [INFO] 
01:25:57 [INFO] --- jacoco-maven-plugin:0.8.2:report (default-report) @ org.eclipse.papyrus.views.properties.toolsmiths.tests ---
01:25:57 [INFO] Skipping JaCoCo execution due to missing execution data file.
01:25:57 [INFO] 
01:25:57 [INFO] --< org.eclipse.papyrus.tests:org.eclipse.papyrus.views.suite.tests >---
01:25:57 [INFO] Building org.eclipse.papyrus.views.suite.tests 0.0.1-SNAPSHOT  [162/167]
01:25:57 [INFO] ------------------------[ eclipse-test-plugin ]-------------------------
01:25:58 [INFO] 
01:25:58 [INFO] --- maven-clean-plugin:3.1.0:clean (default-clean) @ org.eclipse.papyrus.views.suite.tests ---
01:25:58 [INFO] 
01:25:58 [INFO] --- tycho-packaging-plugin:1.3.0:build-qualifier (default-build-qualifier) @ org.eclipse.papyrus.views.suite.tests ---
01:25:58 [INFO] The project's OSGi version is 0.0.1.202004080424
01:25:58 [INFO] 
01:25:58 [INFO] --- tycho-packaging-plugin:1.3.0:validate-id (default-validate-id) @ org.eclipse.papyrus.views.suite.tests ---
01:25:58 [INFO] 
01:25:58 [INFO] --- tycho-packaging-plugin:1.3.0:validate-version (default-validate-version) @ org.eclipse.papyrus.views.suite.tests ---
01:25:58 [INFO] 
01:25:58 [INFO] --- jacoco-maven-plugin:0.8.2:prepare-agent (default-prepare-agent) @ org.eclipse.papyrus.views.suite.tests ---
01:25:58 [INFO] tycho.testArgLine set to -javaagent:/home/hudson/genie.papyrus/.jenkins/jobs/Papyrus-Master-Tests/workspace/.repository/org/jacoco/org.jacoco.agent/0.8.2/org.jacoco.agent-0.8.2-runtime.jar=destfile=/jobs/genie.papyrus/Papyrus-Master-Tests/workspace/source/tests/junit/plugins/views/org.eclipse.papyrus.views.suite.tests/target/jacoco.exec,includes=org.eclipse.papyrus.*,excludes=org.eclipse.uml2
01:25:58 [INFO] 
01:25:58 [INFO] --- maven-resources-plugin:3.1.0:resources (default-resources) @ org.eclipse.papyrus.views.suite.tests ---
01:25:58 [INFO] Using 'UTF-8' encoding to copy filtered resources.
01:25:58 [INFO] skip non existing resourceDirectory /jobs/genie.papyrus/Papyrus-Master-Tests/workspace/source/tests/junit/plugins/views/org.eclipse.papyrus.views.suite.tests/src/main/resources
01:25:58 [INFO] 
01:25:58 [INFO] --- tycho-compiler-plugin:1.3.0:compile (default-compile) @ org.eclipse.papyrus.views.suite.tests ---
01:25:58 [INFO] Compiling 2 source files to /jobs/genie.papyrus/Papyrus-Master-Tests/workspace/source/tests/junit/plugins/views/org.eclipse.papyrus.views.suite.tests/bin
01:25:58 [INFO] 
01:25:58 [INFO] --- maven-resources-plugin:3.1.0:testResources (default-testResources) @ org.eclipse.papyrus.views.suite.tests ---
01:25:58 [INFO] Using 'UTF-8' encoding to copy filtered resources.
01:25:58 [INFO] skip non existing resourceDirectory /jobs/genie.papyrus/Papyrus-Master-Tests/workspace/source/tests/junit/plugins/views/org.eclipse.papyrus.views.suite.tests/src/test/resources
01:25:58 [INFO] 
01:25:58 [INFO] --- target-platform-configuration:1.3.0:target-platform (default-target-platform) @ org.eclipse.papyrus.views.suite.tests ---
01:25:58 [INFO] 
01:25:58 [INFO] --- tycho-packaging-plugin:1.3.0:package-plugin (default-package-plugin) @ org.eclipse.papyrus.views.suite.tests ---
01:25:58 [INFO] Building jar: /jobs/genie.papyrus/Papyrus-Master-Tests/workspace/source/tests/junit/plugins/views/org.eclipse.papyrus.views.suite.tests/target/org.eclipse.papyrus.views.suite.tests-0.0.1-SNAPSHOT.jar
01:25:58 [INFO] 
01:25:58 [INFO] --- tycho-p2-plugin:1.3.0:p2-metadata-default (default-p2-metadata-default) @ org.eclipse.papyrus.views.suite.tests ---
01:25:58 [INFO] 
01:25:58 [INFO] --- tycho-surefire-plugin:1.3.0:test (default-test) @ org.eclipse.papyrus.views.suite.tests ---
01:26:10 [INFO] Expected eclipse log file: /jobs/genie.papyrus/Papyrus-Master-Tests/workspace/source/tests/junit/plugins/views/org.eclipse.papyrus.views.suite.tests/target/work/data/.metadata/.log
01:26:10 [INFO] Command line:
01:26:10 	[/opt/public/common/java/oracle/jdk1.8.0_202_x64/jre/bin/java, -Dosgi.noShutdown=false, -Dosgi.os=linux, -Dosgi.ws=gtk, -Dosgi.arch=x86_64, -javaagent:/home/hudson/genie.papyrus/.jenkins/jobs/Papyrus-Master-Tests/workspace/.repository/org/jacoco/org.jacoco.agent/0.8.2/org.jacoco.agent-0.8.2-runtime.jar=destfile=/jobs/genie.papyrus/Papyrus-Master-Tests/workspace/source/tests/junit/plugins/views/org.eclipse.papyrus.views.suite.tests/target/jacoco.exec,includes=org.eclipse.papyrus.*,excludes=org.eclipse.uml2, -Xms512m, -Xmx2048m, -XX:SoftRefLRUPolicyMSPerMB=100, -Dosgi.clean=true, -jar, /jobs/genie.papyrus/Papyrus-Master-Tests/workspace/.repository/p2/osgi/bundle/org.eclipse.equinox.launcher/1.5.700.v20200207-2156/org.eclipse.equinox.launcher-1.5.700.v20200207-2156.jar, -data, /jobs/genie.papyrus/Papyrus-Master-Tests/workspace/source/tests/junit/plugins/views/org.eclipse.papyrus.views.suite.tests/target/work/data, -install, /jobs/genie.papyrus/Papyrus-Master-Tests/workspace/source/tests/junit/plugins/views/org.eclipse.papyrus.views.suite.tests/target/work, -configuration, /jobs/genie.papyrus/Papyrus-Master-Tests/workspace/source/tests/junit/plugins/views/org.eclipse.papyrus.views.suite.tests/target/work/configuration, -application, org.eclipse.tycho.surefire.osgibooter.uitest, -testproperties, /jobs/genie.papyrus/Papyrus-Master-Tests/workspace/source/tests/junit/plugins/views/org.eclipse.papyrus.views.suite.tests/target/surefire.properties, -product, org.eclipse.sdk.ide, -testConfig=CI_TESTS_CONFIG]
01:26:10 Picked up JAVA_TOOL_OPTIONS: -Xmx2G -Djava.io.tmpdir=/tmp/genie.papyrus -DforkCount=1
01:26:14 ***WARNING: GTK+ version too old (micro mismatch)
01:26:14 ***WARNING: SWT requires GTK 3.14.0
01:26:14 ***WARNING: Detected: 3.10.9
01:26:19 SWT Webkit: Warning, You are using an old version of webkitgtk. (pre 2.4) BrowserFunction functionality will not be avaliable
01:26:19 SWT WebKit: error initializing DBus server, dBusServer == 0
01:26:20 Running org.eclipse.papyrus.views.suite.tests.AllTests
01:26:25 No JFaces support for org.eclipse.jface.viewers.TableTreeViewer
01:26:40 Tests run: 11, Failures: 0, Errors: 0, Skipped: 0, Time elapsed: 19.766 s - in org.eclipse.papyrus.views.suite.tests.AllTests
01:26:40 revealSemanticElement_rootTest(org.eclipse.papyrus.views.modelexplorer.tests.ModelExplorerViewTests)  Time elapsed: 7.222 s
01:26:40 deleteDiagramTest(org.eclipse.papyrus.views.modelexplorer.tests.DeleteHandlerTest)  Time elapsed: 2.408 s
01:26:40 deleteTableTest(org.eclipse.papyrus.views.modelexplorer.tests.DeleteHandlerTest)  Time elapsed: 1.3 s
01:26:40 deleteLinkItemTest(org.eclipse.papyrus.views.modelexplorer.tests.DeleteHandlerTest)  Time elapsed: 4.592 s
01:26:40 deleteRootOfTheModel(org.eclipse.papyrus.views.modelexplorer.tests.DeleteHandlerTest)  Time elapsed: 0.763 s
01:26:40 testOpendiagramTest(org.eclipse.papyrus.views.modelexplorer.tests.OpendiagramTest)  Time elapsed: 0.417 s
01:26:40 documentationViewTests(org.eclipse.papyrus.views.documentation.tests.DocumentationViewTests)  Time elapsed: 1.19 s
01:26:40 handleXWTFileFromResourceSet(org.eclipse.papyrus.views.properties.toolsmiths.tests.qvt.TransformationsTests)  Time elapsed: 0.725 s
01:26:40 handleXWTFileFromResource(org.eclipse.papyrus.views.properties.toolsmiths.tests.qvt.TransformationsTests)  Time elapsed: 0.108 s
01:26:40 generateEcoreContext(org.eclipse.papyrus.views.properties.toolsmiths.tests.qvt.TransformationsTests)  Time elapsed: 0.094 s
01:26:40 generateProfileContext(org.eclipse.papyrus.views.properties.toolsmiths.tests.qvt.TransformationsTests)  Time elapsed: 0.443 s
01:26:40 
01:26:40 Results:
01:26:40 
01:26:40 Tests run: 11, Failures: 0, Errors: 0, Skipped: 0
01:26:40 
01:26:42 [INFO] All tests passed!
01:26:42 [INFO] 
01:26:42 [INFO] --- jacoco-maven-plugin:0.8.2:report (default-report) @ org.eclipse.papyrus.views.suite.tests ---
01:26:42 [INFO] Loading execution data file /jobs/genie.papyrus/Papyrus-Master-Tests/workspace/source/tests/junit/plugins/views/org.eclipse.papyrus.views.suite.tests/target/jacoco.exec
01:26:42 [INFO] Analyzed bundle 'org.eclipse.papyrus.views.suite.tests' with 0 classes
01:26:42 [INFO] 
01:26:42 [INFO] --< org.eclipse.papyrus.tests:org.eclipse.papyrus.views.documentation.tests.releng >--
01:26:42 [INFO] Building org.eclipse.papyrus.views.documentation.tests.releng 0.0.1-SNAPSHOT [163/167]
01:26:42 [INFO] --------------------------------[ pom ]---------------------------------
01:26:42 [INFO] 
01:26:42 [INFO] --- maven-clean-plugin:3.1.0:clean (default-clean) @ org.eclipse.papyrus.views.documentation.tests.releng ---
01:26:42 [INFO] 
01:26:42 [INFO] --- jacoco-maven-plugin:0.8.2:prepare-agent (default-prepare-agent) @ org.eclipse.papyrus.views.documentation.tests.releng ---
01:26:42 [INFO] argLine set to -javaagent:/home/hudson/genie.papyrus/.jenkins/jobs/Papyrus-Master-Tests/workspace/.repository/org/jacoco/org.jacoco.agent/0.8.2/org.jacoco.agent-0.8.2-runtime.jar=destfile=/jobs/genie.papyrus/Papyrus-Master-Tests/workspace/source/tests/junit/plugins/views/documentation/target/jacoco.exec,includes=org.eclipse.papyrus.*,excludes=org.eclipse.uml2
01:26:42 [INFO] 
01:26:42 [INFO] --- jacoco-maven-plugin:0.8.2:report (default-report) @ org.eclipse.papyrus.views.documentation.tests.releng ---
01:26:42 [INFO] Skipping JaCoCo execution due to missing execution data file.
01:26:42 [INFO] 
01:26:42 [INFO] --< org.eclipse.papyrus.tests:org.eclipse.papyrus.toolsmiths.suite.tests >--
01:26:42 [INFO] Building org.eclipse.papyrus.toolsmiths.suite.tests 0.0.1-SNAPSHOT [164/167]
01:26:42 [INFO] ------------------------[ eclipse-test-plugin ]-------------------------
01:26:42 [INFO] 
01:26:42 [INFO] --- maven-clean-plugin:3.1.0:clean (default-clean) @ org.eclipse.papyrus.toolsmiths.suite.tests ---
01:26:42 [INFO] 
01:26:42 [INFO] --- tycho-packaging-plugin:1.3.0:build-qualifier (default-build-qualifier) @ org.eclipse.papyrus.toolsmiths.suite.tests ---
01:26:42 [INFO] The project's OSGi version is 0.0.1.202004080424
01:26:42 [INFO] 
01:26:42 [INFO] --- tycho-packaging-plugin:1.3.0:validate-id (default-validate-id) @ org.eclipse.papyrus.toolsmiths.suite.tests ---
01:26:42 [INFO] 
01:26:42 [INFO] --- tycho-packaging-plugin:1.3.0:validate-version (default-validate-version) @ org.eclipse.papyrus.toolsmiths.suite.tests ---
01:26:42 [INFO] 
01:26:42 [INFO] --- jacoco-maven-plugin:0.8.2:prepare-agent (default-prepare-agent) @ org.eclipse.papyrus.toolsmiths.suite.tests ---
01:26:42 [INFO] tycho.testArgLine set to -javaagent:/home/hudson/genie.papyrus/.jenkins/jobs/Papyrus-Master-Tests/workspace/.repository/org/jacoco/org.jacoco.agent/0.8.2/org.jacoco.agent-0.8.2-runtime.jar=destfile=/jobs/genie.papyrus/Papyrus-Master-Tests/workspace/source/tests/junit/plugins/toolsmiths/org.eclipse.papyrus.toolsmiths.suite.tests/target/jacoco.exec,includes=org.eclipse.papyrus.*,excludes=org.eclipse.uml2
01:26:42 [INFO] 
01:26:42 [INFO] --- maven-resources-plugin:3.1.0:resources (default-resources) @ org.eclipse.papyrus.toolsmiths.suite.tests ---
01:26:42 [INFO] Using 'UTF-8' encoding to copy filtered resources.
01:26:42 [INFO] skip non existing resourceDirectory /jobs/genie.papyrus/Papyrus-Master-Tests/workspace/source/tests/junit/plugins/toolsmiths/org.eclipse.papyrus.toolsmiths.suite.tests/src/main/resources
01:26:42 [INFO] 
01:26:42 [INFO] --- tycho-compiler-plugin:1.3.0:compile (default-compile) @ org.eclipse.papyrus.toolsmiths.suite.tests ---
01:26:42 [INFO] Compiling 2 source files to /jobs/genie.papyrus/Papyrus-Master-Tests/workspace/source/tests/junit/plugins/toolsmiths/org.eclipse.papyrus.toolsmiths.suite.tests/bin
01:26:42 [INFO] 
01:26:42 [INFO] --- maven-resources-plugin:3.1.0:testResources (default-testResources) @ org.eclipse.papyrus.toolsmiths.suite.tests ---
01:26:42 [INFO] Using 'UTF-8' encoding to copy filtered resources.
01:26:42 [INFO] skip non existing resourceDirectory /jobs/genie.papyrus/Papyrus-Master-Tests/workspace/source/tests/junit/plugins/toolsmiths/org.eclipse.papyrus.toolsmiths.suite.tests/src/test/resources
01:26:42 [INFO] 
01:26:42 [INFO] --- target-platform-configuration:1.3.0:target-platform (default-target-platform) @ org.eclipse.papyrus.toolsmiths.suite.tests ---
01:26:42 [INFO] 
01:26:42 [INFO] --- tycho-packaging-plugin:1.3.0:package-plugin (default-package-plugin) @ org.eclipse.papyrus.toolsmiths.suite.tests ---
01:26:42 [INFO] Building jar: /jobs/genie.papyrus/Papyrus-Master-Tests/workspace/source/tests/junit/plugins/toolsmiths/org.eclipse.papyrus.toolsmiths.suite.tests/target/org.eclipse.papyrus.toolsmiths.suite.tests-0.0.1-SNAPSHOT.jar
01:26:42 [INFO] 
01:26:42 [INFO] --- tycho-p2-plugin:1.3.0:p2-metadata-default (default-p2-metadata-default) @ org.eclipse.papyrus.toolsmiths.suite.tests ---
01:26:42 [INFO] 
01:26:42 [INFO] --- tycho-surefire-plugin:1.3.0:test (default-test) @ org.eclipse.papyrus.toolsmiths.suite.tests ---
01:26:54 [INFO] Expected eclipse log file: /jobs/genie.papyrus/Papyrus-Master-Tests/workspace/source/tests/junit/plugins/toolsmiths/org.eclipse.papyrus.toolsmiths.suite.tests/target/work/data/.metadata/.log
01:26:54 [INFO] Command line:
01:26:54 	[/opt/public/common/java/oracle/jdk1.8.0_202_x64/jre/bin/java, -Dosgi.noShutdown=false, -Dosgi.os=linux, -Dosgi.ws=gtk, -Dosgi.arch=x86_64, -javaagent:/home/hudson/genie.papyrus/.jenkins/jobs/Papyrus-Master-Tests/workspace/.repository/org/jacoco/org.jacoco.agent/0.8.2/org.jacoco.agent-0.8.2-runtime.jar=destfile=/jobs/genie.papyrus/Papyrus-Master-Tests/workspace/source/tests/junit/plugins/toolsmiths/org.eclipse.papyrus.toolsmiths.suite.tests/target/jacoco.exec,includes=org.eclipse.papyrus.*,excludes=org.eclipse.uml2, -Xms512m, -Xmx2048m, -XX:SoftRefLRUPolicyMSPerMB=100, -Dosgi.clean=true, -jar, /jobs/genie.papyrus/Papyrus-Master-Tests/workspace/.repository/p2/osgi/bundle/org.eclipse.equinox.launcher/1.5.700.v20200207-2156/org.eclipse.equinox.launcher-1.5.700.v20200207-2156.jar, -data, /jobs/genie.papyrus/Papyrus-Master-Tests/workspace/source/tests/junit/plugins/toolsmiths/org.eclipse.papyrus.toolsmiths.suite.tests/target/work/data, -install, /jobs/genie.papyrus/Papyrus-Master-Tests/workspace/source/tests/junit/plugins/toolsmiths/org.eclipse.papyrus.toolsmiths.suite.tests/target/work, -configuration, /jobs/genie.papyrus/Papyrus-Master-Tests/workspace/source/tests/junit/plugins/toolsmiths/org.eclipse.papyrus.toolsmiths.suite.tests/target/work/configuration, -application, org.eclipse.tycho.surefire.osgibooter.uitest, -testproperties, /jobs/genie.papyrus/Papyrus-Master-Tests/workspace/source/tests/junit/plugins/toolsmiths/org.eclipse.papyrus.toolsmiths.suite.tests/target/surefire.properties, -product, org.eclipse.sdk.ide, -testConfig=CI_TESTS_CONFIG]
01:26:54 Picked up JAVA_TOOL_OPTIONS: -Xmx2G -Djava.io.tmpdir=/tmp/genie.papyrus -DforkCount=1
01:26:57 ***WARNING: GTK+ version too old (micro mismatch)
01:26:57 ***WARNING: SWT requires GTK 3.14.0
01:26:57 ***WARNING: Detected: 3.10.9
01:27:03 SWT Webkit: Warning, You are using an old version of webkitgtk. (pre 2.4) BrowserFunction functionality will not be avaliable
01:27:03 SWT WebKit: error initializing DBus server, dBusServer == 0
01:27:04 Running org.eclipse.papyrus.toolsmiths.suite.tests.AllTests
01:27:05 log4j:WARN No appenders could be found for logger (org.eclipse.emf.compare.EMFCompare).
01:27:05 log4j:WARN Please initialize the log4j system properly.
01:27:06 Tests run: 21, Failures: 0, Errors: 0, Skipped: 0, Time elapsed: 2.297 s - in org.eclipse.papyrus.toolsmiths.suite.tests.AllTests
01:27:06 ProfileAutomaticMigrationTest(org.eclipse.papyrus.toolsmiths.profilemigration.tests.automatic.AutomaticMigrationTest)  Time elapsed: 0.012 s
01:27:06 PackageAutomaticMigrationTest(org.eclipse.papyrus.toolsmiths.profilemigration.tests.automatic.AutomaticMigrationTest)  Time elapsed: 0.004 s
01:27:06 StereotypeAutomaticMigrationTest_Stereotype_delete_Property(org.eclipse.papyrus.toolsmiths.profilemigration.tests.automatic.AutomaticMigrationTest)  Time elapsed: 0.001 s
01:27:06 PropertyAutomaticMigrationTest(org.eclipse.papyrus.toolsmiths.profilemigration.tests.automatic.AutomaticMigrationTest)  Time elapsed: 0.001 s
01:27:06 StereotypeAutomaticMigrationTest(org.eclipse.papyrus.toolsmiths.profilemigration.tests.automatic.AutomaticMigrationTest)  Time elapsed: 0.001 s
01:27:06 GeneralizationAutomaticMigrationTest(org.eclipse.papyrus.toolsmiths.profilemigration.tests.automatic.AutomaticMigrationTest)  Time elapsed: 0.001 s
01:27:06 atomicListTest(org.eclipse.papyrus.toolsmiths.profilemigration.tests.migrators.ChangeIsAbstractFromStereotypeTest)  Time elapsed: 0.001 s
01:27:06 atomicListMoveProfileIntoNonApplyProfileTest(org.eclipse.papyrus.toolsmiths.profilemigration.tests.migrators.MoveMigratorTest)  Time elapsed: 0.035 s
01:27:06 atomicListMoveStereotypeIntoNonApplyProfileTest(org.eclipse.papyrus.toolsmiths.profilemigration.tests.migrators.MoveMigratorTest)  Time elapsed: 0.031 s
01:27:06 atomicListMovePackageIntoAlreadyApplyProfileTest(org.eclipse.papyrus.toolsmiths.profilemigration.tests.migrators.MoveMigratorTest)  Time elapsed: 0.032 s
01:27:06 atomicListMoveStereotypeIntoAlreadyApplyProfileTest(org.eclipse.papyrus.toolsmiths.profilemigration.tests.migrators.MoveMigratorTest)  Time elapsed: 0.03 s
01:27:06 atomicListMovePackageIntoNonApplyProfileTest(org.eclipse.papyrus.toolsmiths.profilemigration.tests.migrators.MoveMigratorTest)  Time elapsed: 0.026 s
01:27:06 atomicListMoveProfileIntoAlreadyApplyProfileTest(org.eclipse.papyrus.toolsmiths.profilemigration.tests.migrators.MoveMigratorTest)  Time elapsed: 0.033 s
01:27:06 UpperMultiplicityTest(org.eclipse.papyrus.toolsmiths.profilemigration.tests.migrators.ChangeMultiplicityFromPropertyMigratorTest)  Time elapsed: 0.001 s
01:27:06 atomicListTest(org.eclipse.papyrus.toolsmiths.profilemigration.tests.migrators.ChangeMultiplicityFromPropertyMigratorTest)  Time elapsed: 0 s
01:27:06 LowerMultiplicityTest(org.eclipse.papyrus.toolsmiths.profilemigration.tests.migrators.ChangeMultiplicityFromPropertyMigratorTest)  Time elapsed: 0 s
01:27:06 DeleteEnumerationLiteralTest(org.eclipse.papyrus.toolsmiths.profilemigration.tests.migrators.DeleteEnumLiteralFromEnumerationTest)  Time elapsed: 0.002 s
01:27:06 MoveEnumerationLiteralTest(org.eclipse.papyrus.toolsmiths.profilemigration.tests.migrators.DeleteEnumLiteralFromEnumerationTest)  Time elapsed: 0 s
01:27:06 atomicListTest(org.eclipse.papyrus.toolsmiths.profilemigration.tests.migrators.DeleteEnumLiteralFromEnumerationTest)  Time elapsed: 0.001 s
01:27:06 atomicListTest(org.eclipse.papyrus.toolsmiths.profilemigration.tests.migrators.ChangeIsStaticFromPropertyTest)  Time elapsed: 0.001 s
01:27:06 atomicListTest(org.eclipse.papyrus.toolsmiths.profilemigration.tests.migrators.AddPropertyToStereotypeTest)  Time elapsed: 0.001 s
01:27:06 
01:27:06 Results:
01:27:06 
01:27:06 Tests run: 21, Failures: 0, Errors: 0, Skipped: 0
01:27:06 
01:27:09 [INFO] All tests passed!
01:27:09 [INFO] 
01:27:09 [INFO] --- jacoco-maven-plugin:0.8.2:report (default-report) @ org.eclipse.papyrus.toolsmiths.suite.tests ---
01:27:09 [INFO] Loading execution data file /jobs/genie.papyrus/Papyrus-Master-Tests/workspace/source/tests/junit/plugins/toolsmiths/org.eclipse.papyrus.toolsmiths.suite.tests/target/jacoco.exec
01:27:09 [INFO] Analyzed bundle 'org.eclipse.papyrus.toolsmiths.suite.tests' with 0 classes
01:27:09 [INFO] 
01:27:09 [INFO] -----< org.eclipse.papyrus:org.eclipse.papyrus.tests.main.releng >------
01:27:09 [INFO] Building org.eclipse.papyrus.tests.main.releng 1.2.0-SNAPSHOT  [165/167]
01:27:09 [INFO] --------------------------------[ pom ]---------------------------------
01:27:09 [INFO] 
01:27:09 [INFO] --- maven-clean-plugin:3.1.0:clean (default-clean) @ org.eclipse.papyrus.tests.main.releng ---
01:27:09 [INFO] 
01:27:09 [INFO] --- jacoco-maven-plugin:0.8.2:prepare-agent (default-prepare-agent) @ org.eclipse.papyrus.tests.main.releng ---
01:27:09 [INFO] argLine set to -javaagent:/home/hudson/genie.papyrus/.jenkins/jobs/Papyrus-Master-Tests/workspace/.repository/org/jacoco/org.jacoco.agent/0.8.2/org.jacoco.agent-0.8.2-runtime.jar=destfile=/jobs/genie.papyrus/Papyrus-Master-Tests/workspace/source/releng/tests/main-tests/target/jacoco.exec,includes=org.eclipse.papyrus.*,excludes=org.eclipse.uml2
01:27:09 [INFO] 
01:27:09 [INFO] --- jacoco-maven-plugin:0.8.2:report (default-report) @ org.eclipse.papyrus.tests.main.releng ---
01:27:09 [INFO] Skipping JaCoCo execution due to missing execution data file.
01:27:09 [INFO] 
01:27:09 [INFO] --< org.eclipse.papyrus:org.eclipse.papyrus.main.tests.target.parent >--
01:27:09 [INFO] Building org.eclipse.papyrus.main.tests.target.parent 0.0.1-SNAPSHOT [166/167]
01:27:09 [INFO] --------------------------------[ pom ]---------------------------------
01:27:09 [INFO] 
01:27:09 [INFO] --- maven-clean-plugin:3.1.0:clean (default-clean) @ org.eclipse.papyrus.main.tests.target.parent ---
01:27:09 [INFO] 
01:27:09 [INFO] --- jacoco-maven-plugin:0.8.2:prepare-agent (default-prepare-agent) @ org.eclipse.papyrus.main.tests.target.parent ---
01:27:09 [INFO] argLine set to -javaagent:/home/hudson/genie.papyrus/.jenkins/jobs/Papyrus-Master-Tests/workspace/.repository/org/jacoco/org.jacoco.agent/0.8.2/org.jacoco.agent-0.8.2-runtime.jar=destfile=/jobs/genie.papyrus/Papyrus-Master-Tests/workspace/source/releng/tests/main-tests/targetPlatform/target/jacoco.exec,includes=org.eclipse.papyrus.*,excludes=org.eclipse.uml2
01:27:09 [INFO] 
01:27:09 [INFO] --- jacoco-maven-plugin:0.8.2:report (default-report) @ org.eclipse.papyrus.main.tests.target.parent ---
01:27:09 [INFO] Skipping JaCoCo execution due to missing execution data file.
01:27:09 [INFO] 
01:27:09 [INFO] --< org.eclipse.papyrus:org.eclipse.papyrus.main.tests.portable.target >--
01:27:09 [INFO] Building org.eclipse.papyrus.main.tests.portable.target 0.0.1-SNAPSHOT [167/167]
01:27:09 [INFO] ---------------------[ eclipse-target-definition ]----------------------
01:27:09 [INFO] 
01:27:09 [INFO] --- maven-clean-plugin:3.1.0:clean (default-clean) @ org.eclipse.papyrus.main.tests.portable.target ---
01:27:09 [INFO] 
01:27:09 [INFO] --- jacoco-maven-plugin:0.8.2:prepare-agent (default-prepare-agent) @ org.eclipse.papyrus.main.tests.portable.target ---
01:27:09 [INFO] argLine set to -javaagent:/home/hudson/genie.papyrus/.jenkins/jobs/Papyrus-Master-Tests/workspace/.repository/org/jacoco/org.jacoco.agent/0.8.2/org.jacoco.agent-0.8.2-runtime.jar=destfile=/jobs/genie.papyrus/Papyrus-Master-Tests/workspace/source/releng/tests/main-tests/targetPlatform/portable/target/jacoco.exec,includes=org.eclipse.papyrus.*,excludes=org.eclipse.uml2
01:27:09 [INFO] 
01:27:09 [INFO] --- tycho-packaging-plugin:1.3.0:package-target-definition (default-package-target-definition) @ org.eclipse.papyrus.main.tests.portable.target ---
01:27:09 [INFO] 
01:27:09 [INFO] --- jacoco-maven-plugin:0.8.2:report (default-report) @ org.eclipse.papyrus.main.tests.portable.target ---
01:27:09 [INFO] Skipping JaCoCo execution due to missing execution data file.
01:27:09 [INFO] ------------------------------------------------------------------------
01:27:09 [INFO] Reactor Summary:
01:27:09 [INFO] 
01:27:09 [INFO] org.eclipse.papyrus.tests.releng 0.0.1-SNAPSHOT .... SUCCESS [  0.350 s]
01:27:09 [INFO] org.eclipse.papyrus.plugins.tests.releng 0.0.1-SNAPSHOT SUCCESS [  0.006 s]
01:27:09 [INFO] org.eclipse.papyrus.editor.tests.releng 0.0.1-SNAPSHOT SUCCESS [  0.004 s]
01:27:09 [INFO] org.eclipse.papyrus.editor.integration.tests 1.4.0-SNAPSHOT SUCCESS [  1.717 s]
01:27:09 [INFO] org.eclipse.papyrus.infra.tests.releng 0.0.1-SNAPSHOT SUCCESS [  0.005 s]
01:27:09 [INFO] org.eclipse.papyrus.infra.core.tests.releng 0.0.1-SNAPSHOT SUCCESS [  0.004 s]
01:27:09 [INFO] org.eclipse.papyrus.infra.core.clipboard.tests 1.3.0-SNAPSHOT SUCCESS [  0.520 s]
01:27:09 [INFO] org.eclipse.papyrus.infra.core.sasheditor.tests 1.2.0-SNAPSHOT SUCCESS [  0.778 s]
01:27:09 [INFO] org.eclipse.papyrus.infra.core.sasheditor.di.tests 1.2.0-SNAPSHOT SUCCESS [  0.899 s]
01:27:09 [INFO] org.eclipse.papyrus.infra.core.tests 3.1.0-SNAPSHOT  SUCCESS [  0.860 s]
01:27:09 [INFO] org.eclipse.papyrus.infra.editor.tests.releng 0.0.1-SNAPSHOT SUCCESS [  0.004 s]
01:27:09 [INFO] org.eclipse.papyrus.infra.editor.welcome.tests 1.2.0-SNAPSHOT SUCCESS [  0.562 s]
01:27:09 [INFO] org.eclipse.papyrus.infra.emf.tests.releng 0.0.1-SNAPSHOT SUCCESS [  0.003 s]
01:27:09 [INFO] org.eclipse.papyrus.infra.emf.gmf.tests 1.2.100-SNAPSHOT SUCCESS [  0.379 s]
01:27:09 [INFO] org.eclipse.papyrus.infra.emf.readonly.tests 1.3.0-SNAPSHOT SUCCESS [  0.377 s]
01:27:09 [INFO] org.eclipse.papyrus.infra.emf.tests 1.5.0-SNAPSHOT . SUCCESS [  0.733 s]
01:27:09 [INFO] org.eclipse.papyrus.infra.filters.tests 1.2.0-SNAPSHOT SUCCESS [  0.125 s]
01:27:09 [INFO] org.eclipse.papyrus.infra.gmfdiag.tests.releng 0.0.1-SNAPSHOT SUCCESS [  0.002 s]
01:27:09 [INFO] org.eclipse.papyrus.infra.gmfdiag.assistant.tests.releng 0.0.1-SNAPSHOT SUCCESS [  0.004 s]
01:27:09 [INFO] org.eclipse.papyrus.infra.gmfdiag.assistant.tests 1.3.0-SNAPSHOT SUCCESS [  0.531 s]
01:27:09 [INFO] org.eclipse.papyrus.infra.gmfdiag.canonical.tests 1.3.0-SNAPSHOT SUCCESS [  0.608 s]
01:27:09 [INFO] org.eclipse.papyrus.infra.gmfdiag.commands.tests 1.3.0-SNAPSHOT SUCCESS [  0.577 s]
01:27:09 [INFO] org.eclipse.papyrus.infra.gmfdiag.common.tests 3.1.0-SNAPSHOT SUCCESS [  0.578 s]
01:27:09 [INFO] org.eclipse.papyrus.infra.gmfdiag.css.tests 1.2.0-SNAPSHOT SUCCESS [  0.499 s]
01:27:09 [INFO] org.eclipse.papyrus.infra.gmfdiag.menu.tests 1.2.100-SNAPSHOT SUCCESS [  0.396 s]
01:27:09 [INFO] org.eclipse.papyrus.infra.gmfdiag.paletteconfiguration.tests 1.3.0-SNAPSHOT SUCCESS [  0.389 s]
01:27:09 [INFO] org.eclipse.papyrus.infra.gmfdiag.welcome.tests 1.2.0-SNAPSHOT SUCCESS [  0.369 s]
01:27:09 [INFO] org.eclipse.papyrus.infra.nattable.main.test 1.2.0-SNAPSHOT SUCCESS [  0.003 s]
01:27:09 [INFO] org.eclipse.papyrus.infra.nattable.common.tests 1.2.200-SNAPSHOT SUCCESS [  0.361 s]
01:27:09 [INFO] org.eclipse.papyrus.infra.nattable.model.tests 1.2.100-SNAPSHOT SUCCESS [  0.383 s]
01:27:09 [INFO] org.eclipse.papyrus.infra.nattable.tests 1.2.200-SNAPSHOT SUCCESS [  0.474 s]
01:27:09 [INFO] org.eclipse.papyrus.infra.nattable.views.tests 1.2.100-SNAPSHOT SUCCESS [  0.403 s]
01:27:09 [INFO] org.eclipse.papyrus.infra.properties.tests.releng 0.0.1-SNAPSHOT SUCCESS [  0.004 s]
01:27:09 [INFO] org.eclipse.papyrus.infra.properties.ui.tests 2.0.0-SNAPSHOT SUCCESS [  0.396 s]
01:27:09 [INFO] org.eclipse.papyrus.infra.services.tests.releng 0.0.1-SNAPSHOT SUCCESS [  0.003 s]
01:27:09 [INFO] org.eclipse.papyrus.infra.services.controlmode.tests 1.5.0-SNAPSHOT SUCCESS [  0.505 s]
01:27:09 [INFO] org.eclipse.papyrus.infra.services.edit.tests 1.2.0-SNAPSHOT SUCCESS [  0.373 s]
01:27:09 [INFO] org.eclipse.papyrus.infra.services.edit.ui.tests 1.2.0-SNAPSHOT SUCCESS [  0.280 s]
01:27:09 [INFO] org.eclipse.papyrus.infra.services.resourceloading.tests 1.2.0-SNAPSHOT SUCCESS [  0.276 s]
01:27:09 [INFO] org.eclipse.papyrus.infra.services.semantic.tests 1.2.100-SNAPSHOT SUCCESS [  0.397 s]
01:27:09 [INFO] org.eclipse.papyrus.infra.tools.tests 1.3.0-SNAPSHOT SUCCESS [  0.511 s]
01:27:09 [INFO] org.eclipse.papyrus.infra.types.tests.releng 0.0.1-SNAPSHOT SUCCESS [  0.003 s]
01:27:09 [INFO] org.eclipse.papyrus.infra.types.tests 3.0.100-SNAPSHOT SUCCESS [  0.381 s]
01:27:09 [INFO] org.eclipse.papyrus.infra.types.ui.tests 3.0.100-SNAPSHOT SUCCESS [  0.390 s]
01:27:09 [INFO] org.eclipse.papyrus.infra.ui.emf.tests 1.3.0-SNAPSHOT SUCCESS [  0.397 s]
01:27:09 [INFO] org.eclipse.papyrus.infra.ui.tests 1.2.0-SNAPSHOT .. SUCCESS [  0.498 s]
01:27:09 [INFO] org.eclipse.papyrus.infra.viewpoints.tests.releng 1.2.0-SNAPSHOT SUCCESS [  0.004 s]
01:27:09 [INFO] org.eclipse.papyrus.infra.viewpoints.policy.tests 1.2.0-SNAPSHOT SUCCESS [  0.315 s]
01:27:09 [INFO] org.eclipse.papyrus.uml.tests.releng 0.0.1-SNAPSHOT  SUCCESS [  0.002 s]
01:27:09 [INFO] org.eclipse.papyrus.uml.diagram.tests.releng 1.2.0-SNAPSHOT SUCCESS [  0.002 s]
01:27:09 [INFO] org.eclipse.papyrus.uml.diagram.tests 1.3.100-SNAPSHOT SUCCESS [  0.698 s]
01:27:09 [INFO] org.eclipse.papyrus.uml.diagram.clazz.tests 1.3.100-SNAPSHOT SUCCESS [  0.622 s]
01:27:09 [INFO] org.eclipse.papyrus.uml.diagram.activity.tests 1.2.100-SNAPSHOT SUCCESS [  0.766 s]
01:27:09 [INFO] org.eclipse.papyrus.uml.diagram.usecase.tests 4.0.100-SNAPSHOT SUCCESS [  0.592 s]
01:27:09 [INFO] org.eclipse.papyrus.uml.diagram.deployment.tests 1.2.100-SNAPSHOT SUCCESS [  0.532 s]
01:27:09 [INFO] org.eclipse.papyrus.uml.diagram.component.tests 1.2.100-SNAPSHOT SUCCESS [  0.625 s]
01:27:09 [INFO] org.eclipse.papyrus.uml.diagram.timing.tests 1.2.100-SNAPSHOT SUCCESS [  0.682 s]
01:27:09 [INFO] org.eclipse.papyrus.uml.diagram.stereotypeproperty.tests 1.2.100-SNAPSHOT SUCCESS [  0.454 s]
01:27:09 [INFO] org.eclipse.papyrus.uml.diagram.sequence.tests 1.3.100-SNAPSHOT SUCCESS [  1.060 s]
01:27:09 [INFO] org.eclipse.papyrus.uml.diagram.composite.tests 1.2.100-SNAPSHOT SUCCESS [  0.696 s]
01:27:09 [INFO] org.eclipse.papyrus.uml.diagram.profile.tests 1.2.100-SNAPSHOT SUCCESS [  0.500 s]
01:27:09 [INFO] org.eclipse.papyrus.uml.dynamic.profile.tests 1.2.0-SNAPSHOT SUCCESS [  0.030 s]
01:27:09 [INFO] org.eclipse.papyrus.uml.diagram.common.tests 1.3.100-SNAPSHOT SUCCESS [  0.728 s]
01:27:09 [INFO] org.eclipse.papyrus.uml.diagram.wizards.tests 1.3.0-SNAPSHOT SUCCESS [  0.534 s]
01:27:09 [INFO] org.eclipse.papyrus.tests.uml.diagram.feature 1.2.0-SNAPSHOT SUCCESS [  0.280 s]
01:27:09 [INFO] org.eclipse.papyrus.tests.infra.services.feature 1.2.0-SNAPSHOT SUCCESS [  0.094 s]
01:27:09 [INFO] org.eclipse.papyrus.views.tests.releng 0.0.1-SNAPSHOT SUCCESS [  0.003 s]
01:27:09 [INFO] org.eclipse.papyrus.views.modelexplorer.tests 1.2.100-SNAPSHOT SUCCESS [  0.449 s]
01:27:09 [INFO] org.eclipse.papyrus.uml.modelexplorer.tests.releng 0.0.1-SNAPSHOT SUCCESS [  0.008 s]
01:27:09 [INFO] org.eclipse.papyrus.uml.modelexplorer.tests 1.3.100-SNAPSHOT SUCCESS [  0.437 s]
01:27:09 [INFO] org.eclipse.papyrus.uml.modelrepair.tests 1.3.0-SNAPSHOT SUCCESS [  0.651 s]
01:27:09 [INFO] org.eclipse.papyrus.uml.properties.tests 1.1.0-SNAPSHOT SUCCESS [  0.537 s]
01:27:09 [INFO] org.eclipse.papyrus.uml.service.types.tests 1.3.0-SNAPSHOT SUCCESS [  0.552 s]
01:27:09 [INFO] org.eclipse.papyrus.uml.service.types.ui.tests 1.2.100-SNAPSHOT SUCCESS [  0.460 s]
01:27:09 [INFO] org.eclipse.papyrus.uml.profile.tests.releng 0.0.1-SNAPSHOT SUCCESS [  0.003 s]
01:27:09 [INFO] org.eclipse.papyrus.uml.profile.drafter.tests 1.3.0-SNAPSHOT SUCCESS [  0.426 s]
01:27:09 [INFO] org.eclipse.papyrus.uml.filters.tests 1.2.0-SNAPSHOT SUCCESS [  0.374 s]
01:27:09 [INFO] org.eclipse.papyrus.uml.profile.tests 1.2.0-SNAPSHOT SUCCESS [  0.319 s]
01:27:09 [INFO] org.eclipse.papyrus.tests.uml.feature 1.2.0-SNAPSHOT SUCCESS [  0.148 s]
01:27:09 [INFO] org.eclipse.papyrus.views.documentation.tests 1.0.0-SNAPSHOT SUCCESS [  0.542 s]
01:27:09 [INFO] org.eclipse.papyrus.tests.views.feature 1.2.0-SNAPSHOT SUCCESS [  0.055 s]
01:27:09 [INFO] org.eclipse.papyrus.tests.infra.nattable.feature 1.4.0-SNAPSHOT SUCCESS [  0.071 s]
01:27:09 [INFO] org.eclipse.papyrus.uml.nattable.main.test 1.2.0-SNAPSHOT SUCCESS [  0.002 s]
01:27:09 [INFO] org.eclipse.papyrus.uml.nattable.tests 1.2.100-SNAPSHOT SUCCESS [  0.324 s]
01:27:09 [INFO] org.eclipse.papyrus.uml.nattable.generic.tests 1.2.200-SNAPSHOT SUCCESS [  0.721 s]
01:27:09 [INFO] org.eclipse.papyrus.uml.nattable.clazz.config.tests 1.2.200-SNAPSHOT SUCCESS [  1.096 s]
01:27:09 [INFO] org.eclipse.papyrus.uml.nattable.stereotyped.elements.tests 1.0.200-SNAPSHOT SUCCESS [  0.654 s]
01:27:09 [INFO] org.eclipse.papyrus.uml.nattable.matrix.tests 1.0.100-SNAPSHOT SUCCESS [  0.472 s]
01:27:09 [INFO] org.eclipse.papyrus.tests.uml.nattable.feature 1.3.0-SNAPSHOT SUCCESS [  0.155 s]
01:27:09 [INFO] org.eclipse.papyrus.tests.infra.feature 1.2.0-SNAPSHOT SUCCESS [  0.321 s]
01:27:09 [INFO] org.eclipse.papyrus.tests.infra.core.feature 1.2.0-SNAPSHOT SUCCESS [  0.062 s]
01:27:09 [INFO] org.eclipse.papyrus.uml.tools.tests.releng 0.0.1-SNAPSHOT SUCCESS [  0.002 s]
01:27:09 [INFO] org.eclipse.papyrus.uml.tools.tests 3.1.0-SNAPSHOT . SUCCESS [  0.562 s]
01:27:09 [INFO] org.eclipse.papyrus.uml.tools.utils.tests 1.3.0-SNAPSHOT SUCCESS [  0.464 s]
01:27:09 [INFO] org.eclipse.papyrus.tests.uml.tools.feature 1.2.0-SNAPSHOT SUCCESS [  0.065 s]
01:27:09 [INFO] org.eclipse.papyrus.uml.decoratormodel.tests.releng 0.0.1-SNAPSHOT SUCCESS [  0.003 s]
01:27:09 [INFO] org.eclipse.papyrus.uml.decoratormodel.controlmode.tests 1.3.0-SNAPSHOT SUCCESS [  0.413 s]
01:27:09 [INFO] org.eclipse.papyrus.uml.decoratormodel.tests 1.3.0-SNAPSHOT SUCCESS [  0.551 s]
01:27:09 [INFO] org.eclipse.papyrus.tests.uml.decoratormodel.feature 1.2.0-SNAPSHOT SUCCESS [  0.063 s]
01:27:09 [INFO] org.eclipse.papyrus.uml.textedit.tests.releng 0.0.1-SNAPSHOT SUCCESS [  0.002 s]
01:27:09 [INFO] org.eclipse.papyrus.uml.textedit.parameter.tests 1.2.100-SNAPSHOT SUCCESS [  0.458 s]
01:27:09 [INFO] org.eclipse.papyrus.uml.textedit.port.tests 1.2.100-SNAPSHOT SUCCESS [  0.482 s]
01:27:09 [INFO] org.eclipse.papyrus.uml.textedit.property.tests 1.2.200-SNAPSHOT SUCCESS [  0.742 s]
01:27:09 [INFO] org.eclipse.papyrus.uml.textedit.tests 1.3.100-SNAPSHOT SUCCESS [  0.401 s]
01:27:09 [INFO] org.eclipse.papyrus.uml.textedit.tests.feature 1.2.0-SNAPSHOT SUCCESS [  0.085 s]
01:27:09 [INFO] org.eclipse.papyrus.uml.assistants.tests.releng 0.0.1-SNAPSHOT SUCCESS [  0.003 s]
01:27:09 [INFO] org.eclipse.papyrus.uml.profile.types.generator.tests 1.2.100-SNAPSHOT SUCCESS [  0.563 s]
01:27:09 [INFO] org.eclipse.papyrus.uml.profile.assistants.generator.tests 1.2.100-SNAPSHOT SUCCESS [  0.447 s]
01:27:09 [INFO] org.eclipse.papyrus.tests.uml.assistants.feature 1.2.0-SNAPSHOT SUCCESS [  0.056 s]
01:27:09 [INFO] org.eclipse.papyrus.toolsmiths.tests.releng 0.0.1-SNAPSHOT SUCCESS [  0.003 s]
01:27:09 [INFO] org.eclipse.papyrus.toolsmiths.profilemigration.tests 0.7.0-SNAPSHOT SUCCESS [  0.439 s]
01:27:09 [INFO] org.eclipse.papyrus.toolsmiths.validation.profile.tests 1.0.0-SNAPSHOT SUCCESS [  0.370 s]
01:27:09 [INFO] org.eclipse.papyrus.toolsmiths.validation.elementtypes.tests 1.0.0-SNAPSHOT SUCCESS [  0.373 s]
01:27:09 [INFO] org.eclipse.papyrus.tests.toolsmiths.feature 1.0.0-SNAPSHOT SUCCESS [  0.067 s]
01:27:09 [INFO] org.eclipse.papyrus.tests.feature 2.0.0-SNAPSHOT ... SUCCESS [  0.752 s]
01:27:09 [INFO] org.eclipse.papyrus.infra.emf.expressions.main.tests 0.0.1-SNAPSHOT SUCCESS [  0.003 s]
01:27:09 [INFO] org.eclipse.papyrus.infra.emf.expressions.tests 1.0.0-SNAPSHOT SUCCESS [  0.089 s]
01:27:09 [INFO] org.eclipse.papyrus.tests.infra.emf.expressions.feature 1.0.0-SNAPSHOT SUCCESS [  0.068 s]
01:27:09 [INFO] org.eclipse.papyrus.infra.internationalization.main.test 1.0.0-SNAPSHOT SUCCESS [  0.004 s]
01:27:09 [INFO] org.eclipse.papyrus.infra.internationalization.tests 1.100.0-SNAPSHOT SUCCESS [  0.390 s]
01:27:09 [INFO] org.eclipse.papyrus.tests.infra.internationalization.feature 1.0.0-SNAPSHOT SUCCESS [  0.053 s]
01:27:09 [INFO] org.eclipse.papyrus.uml.expressions.tests.releng 0.0.1-SNAPSHOT SUCCESS [  0.003 s]
01:27:09 [INFO] org.eclipse.papyrus.uml.expressions.tests 1.1.0-SNAPSHOT SUCCESS [  0.602 s]
01:27:09 [INFO] org.eclipse.papyrus.tests.uml.expressions.feature 1.0.0-SNAPSHOT SUCCESS [  0.078 s]
01:27:09 [INFO] org.eclipse.papyrus.uml.internationalization.main.test 1.0.0-SNAPSHOT SUCCESS [  0.003 s]
01:27:09 [INFO] org.eclipse.papyrus.uml.internationalization.tests 1.100.0-SNAPSHOT SUCCESS [  0.479 s]
01:27:09 [INFO] org.eclipse.papyrus.uml.internationalization.controlmode.tests 1.1.0-SNAPSHOT SUCCESS [  0.481 s]
01:27:09 [INFO] org.eclipse.papyrus.tests.uml.internationalization.feature 1.0.0-SNAPSHOT SUCCESS [  0.079 s]
01:27:09 [INFO] org.eclipse.papyrus.uml.alf.tests 1.2.0-SNAPSHOT ... SUCCESS [  7.736 s]
01:27:09 [INFO] org.eclipse.papyrus.uml.alf.tests.feature 1.2.0-SNAPSHOT SUCCESS [  0.105 s]
01:27:09 [INFO] Papyrus Tests Features 0.0.1-SNAPSHOT .............. SUCCESS [  0.005 s]
01:27:09 [INFO] org.eclipse.papyrus.developer.suite.tests 0.0.1-SNAPSHOT SUCCESS [ 31.020 s]
01:27:09 [INFO] org.eclipse.papyrus.bundles.tests 0.0.1-SNAPSHOT ... SUCCESS [  0.008 s]
01:27:09 [INFO] org.eclipse.papyrus.eclipse.project.editors.tests 2.1.0-SNAPSHOT SUCCESS [  0.790 s]
01:27:09 [INFO] org.eclipse.papyrus.editors.suite.tests 0.0.1-SNAPSHOT SUCCESS [05:33 min]
01:27:09 [INFO] org.eclipse.papyrus.infra.core.suite.tests 0.0.1-SNAPSHOT SUCCESS [ 55.272 s]
01:27:09 [INFO] org.eclipse.papyrus.infra.nattable.suite.tests 0.0.1-SNAPSHOT SUCCESS [ 51.770 s]
01:27:09 [INFO] org.eclipse.papyrus.infra.architecture.tests 1.0.0-SNAPSHOT SUCCESS [  0.396 s]
01:27:09 [INFO] org.eclipse.papyrus.infra.services.labelprovider.tests 1.2.200-SNAPSHOT SUCCESS [  0.337 s]
01:27:09 [INFO] org.eclipse.papyrus.infra.ui.architecture.tests 1.0.0-SNAPSHOT SUCCESS [  0.358 s]
01:27:09 [INFO] org.eclipse.papyrus.infra.suite.tests 0.0.1-SNAPSHOT SUCCESS [06:08 min]
01:27:09 [INFO] org.eclipse.papyrus.infra.newchild.tests 1.2.100-SNAPSHOT SUCCESS [  0.484 s]
01:27:09 [INFO] org.eclipse.papyrus.uml.diagram.communication.tests 1.2.100-SNAPSHOT SUCCESS [  0.563 s]
01:27:09 [INFO] org.eclipse.papyrus.uml.diagram.interactionoverview.tests 1.2.0-SNAPSHOT SUCCESS [  0.409 s]
01:27:09 [INFO] org.eclipse.papyrus.uml.diagram.statemachine.tests 1.2.100-SNAPSHOT SUCCESS [  0.559 s]
01:27:09 [INFO] org.eclipse.papyrus.uml.diagram.suite.tests 0.0.1-SNAPSHOT SUCCESS [13:17 min]
01:27:09 [INFO] org.eclipse.papyrus.uml.diagram.dnd.tests 1.2.100-SNAPSHOT SUCCESS [  0.366 s]
01:27:09 [INFO] org.eclipse.papyrus.uml.diagram.properties.tests 1.0.0-SNAPSHOT SUCCESS [  0.438 s]
01:27:09 [INFO] org.eclipse.papyrus.uml.nattable.stereotype.display.tests 1.2.100-SNAPSHOT SUCCESS [  0.473 s]
01:27:09 [INFO] org.eclipse.papyrus.uml.nattable.suite.tests 0.0.1-SNAPSHOT SUCCESS [14:10 min]
01:27:09 [INFO] org.eclipse.papyrus.uml.textedit.valuespecification.tests 1.2.100-SNAPSHOT SUCCESS [  0.522 s]
01:27:09 [INFO] org.eclipse.papyrus.uml.textedit.suite.tests 0.0.1-SNAPSHOT SUCCESS [ 37.824 s]
01:27:09 [INFO] org.eclipse.papyrus.uml.architecture.tests 1.1.200-SNAPSHOT SUCCESS [  0.113 s]
01:27:09 [INFO] org.eclipse.papyrus.uml.validation.tests.releng 0.0.1-SNAPSHOT SUCCESS [  0.003 s]
01:27:09 [INFO] org.eclipse.papyrus.uml.validation.tests.staticprofile 1.2.0-SNAPSHOT SUCCESS [  0.247 s]
01:27:09 [INFO] org.eclipse.papyrus.uml.validation.tests.genvalidation 1.2.0-SNAPSHOT SUCCESS [  0.366 s]
01:27:09 [INFO] org.eclipse.papyrus.uml.validation.tests 1.2.100-SNAPSHOT SUCCESS [  0.402 s]
01:27:09 [INFO] org.eclipse.papyrus.uml.suite.tests 0.0.1-SNAPSHOT . SUCCESS [05:59 min]
01:27:09 [INFO] org.eclipse.papyrus.uml.alf.tests.releng 0.0.1-SNAPSHOT SUCCESS [  0.007 s]
01:27:09 [INFO] org.eclipse.papyrus.uml.alf.backend.tests 1.1.0-SNAPSHOT SUCCESS [  1.193 s]
01:27:09 [INFO] org.eclipse.papyrus.views.properties.toolsmiths.tests 1.2.0-SNAPSHOT SUCCESS [  0.371 s]
01:27:09 [INFO] org.eclipse.papyrus.views.suite.tests 0.0.1-SNAPSHOT SUCCESS [ 44.321 s]
01:27:09 [INFO] org.eclipse.papyrus.views.documentation.tests.releng 0.0.1-SNAPSHOT SUCCESS [  0.006 s]
01:27:09 [INFO] org.eclipse.papyrus.toolsmiths.suite.tests 0.0.1-SNAPSHOT SUCCESS [ 27.059 s]
01:27:09 [INFO] org.eclipse.papyrus.tests.main.releng 1.2.0-SNAPSHOT SUCCESS [  0.005 s]
01:27:09 [INFO] org.eclipse.papyrus.main.tests.target.parent 0.0.1-SNAPSHOT SUCCESS [  0.003 s]
01:27:09 [INFO] org.eclipse.papyrus.main.tests.portable.target 0.0.1-SNAPSHOT SUCCESS [  0.004 s]
01:27:09 [INFO] ------------------------------------------------------------------------
01:27:09 [INFO] BUILD SUCCESS
01:27:09 [INFO] ------------------------------------------------------------------------
01:27:09 [INFO] Total time:  01:02 h
01:27:09 [INFO] Finished at: 2020-04-08T01:27:09-04:00
01:27:09 [INFO] ------------------------------------------------------------------------
01:27:14 Taking screenshot.
01:27:14 [workspace] $ echo $XAUTHORITY
01:27:14 /home/hudson/genie.papyrus/.jenkins/jobs/Papyrus-Master-Tests/workspace/.Xauthority-7583769727206638619
01:27:14 [workspace] $ ls -l $XAUTHORITY
01:27:14 -rw-rw-r-- 1 genie.papyrus 8303 0 Apr  8 00:24 /home/hudson/genie.papyrus/.jenkins/jobs/Papyrus-Master-Tests/workspace/.Xauthority-7583769727206638619
01:27:14 [workspace] $ import -window root -display :723 screenshot.jpg
01:27:14 Terminating xvnc.
01:27:21 Sending e-mails to: patrick.tessier@cea.fr vincent.lorenzo@cea.fr quentin.lemenez@cea.fr
01:27:21 Recording test results
01:27:22 Build step 'Publish JUnit test result report' changed build result to UNSTABLE
01:27:23 Started calculate disk usage of build
01:27:23 Finished Calculation of disk usage of build in 0 seconds
01:27:23 Started calculate disk usage of workspace
01:27:24 Finished Calculation of disk usage of workspace in  1 second
01:27:25 Finished: UNSTABLE