AbortedConsole Output

Skipping 3,687 KB.. Full Log
SemanticContentProviderFactoryTest)  Time elapsed: 0.001 s
02:46:00 getElements_Object(org.eclipse.papyrus.infra.ui.providers.SemanticContentProviderFactoryTest)  Time elapsed: 0.001 s
02:46:00 getChildren(org.eclipse.papyrus.infra.ui.providers.SemanticContentProviderFactoryTest)  Time elapsed: 0 s
02:46:00 hasChildren(org.eclipse.papyrus.infra.ui.providers.SemanticContentProviderFactoryTest)  Time elapsed: 0.001 s
02:46:00 getParent(org.eclipse.papyrus.infra.ui.providers.SemanticContentProviderFactoryTest)  Time elapsed: 0 s
02:46:00 dispose(org.eclipse.papyrus.infra.ui.providers.SemanticContentProviderFactoryTest)  Time elapsed: 0.001 s
02:46:00 getElements(org.eclipse.papyrus.infra.ui.providers.SemanticContentProviderFactoryTest)  Time elapsed: 0 s
02:46:00 isValidValue(org.eclipse.papyrus.infra.ui.providers.SemanticContentProviderFactoryTest)  Time elapsed: 0.001 s
02:46:00 testClientContextExist(org.eclipse.papyrus.infra.services.edit.tests.context.TestClientContext) skipped
02:46:00 org.eclipse.papyrus.infra.services.edit.tests.context.TestClientContext skipped
02:46:00 testGetAdapter(org.eclipse.papyrus.infra.services.edit.tests.service.TestElementEditService) skipped
02:46:00 testGetDisplayName(org.eclipse.papyrus.infra.services.edit.tests.service.TestElementEditService) skipped
02:46:00 testCanEdit(org.eclipse.papyrus.infra.services.edit.tests.service.TestElementEditService) skipped
02:46:00 testGetEditCommand(org.eclipse.papyrus.infra.services.edit.tests.service.TestElementEditService) skipped
02:46:00 org.eclipse.papyrus.infra.services.edit.tests.service.TestElementEditService skipped
02:46:00 testIsKnownElementType(org.eclipse.papyrus.infra.services.edit.tests.service.TestElementEditServiceProvider) skipped
02:46:00 testGetEditService_EObject(org.eclipse.papyrus.infra.services.edit.tests.service.TestElementEditServiceProvider) skipped
02:46:00 testGetEditService_IElementType(org.eclipse.papyrus.infra.services.edit.tests.service.TestElementEditServiceProvider) skipped
02:46:00 testGetEditService_EClass(org.eclipse.papyrus.infra.services.edit.tests.service.TestElementEditServiceProvider) skipped
02:46:00 testGetEditService_Unknown(org.eclipse.papyrus.infra.services.edit.tests.service.TestElementEditServiceProvider) skipped
02:46:00 testGetContainedTypeEditServices(org.eclipse.papyrus.infra.services.edit.tests.service.TestElementEditServiceProvider) skipped
02:46:00 org.eclipse.papyrus.infra.services.edit.tests.service.TestElementEditServiceProvider skipped
02:46:00 testCreateServiceInstance(org.eclipse.papyrus.infra.services.edit.tests.service.TestElementEditServiceProviderFactory) skipped
02:46:00 org.eclipse.papyrus.infra.services.edit.tests.service.TestElementEditServiceProviderFactory skipped
02:46:00 testGetCommandProvider(org.eclipse.papyrus.infra.services.edit.tests.service.TestElementEditServiceUtils) skipped
02:46:00 org.eclipse.papyrus.infra.services.edit.tests.service.TestElementEditServiceUtils skipped
02:46:00 testGetCommandEObjectResult(org.eclipse.papyrus.infra.services.edit.tests.utils.TestGMFCommandUtils) skipped
02:46:00 org.eclipse.papyrus.infra.services.edit.tests.utils.TestGMFCommandUtils skipped
02:46:00 testGetEditCommand(org.eclipse.papyrus.infra.services.edit.tests.commands.TestConfigureFeatureCommandFactory) skipped
02:46:00 org.eclipse.papyrus.infra.services.edit.tests.commands.TestConfigureFeatureCommandFactory skipped
02:46:00 testGetEditCommand(org.eclipse.papyrus.infra.services.edit.tests.commands.TestConfigureFeatureListCommandFactory) skipped
02:46:00 org.eclipse.papyrus.infra.services.edit.tests.commands.TestConfigureFeatureListCommandFactory skipped
02:46:00 testDeleteMarkers(org.eclipse.papyrus.infra.services.edit.tests.edit.advice.MarkerDeletionAdviceTest) skipped
02:46:00 testDeleteMarkers_relatedElements_diagram(org.eclipse.papyrus.infra.services.edit.tests.edit.advice.MarkerDeletionAdviceTest) skipped
02:46:00 testDeleteMarkers_integration(org.eclipse.papyrus.infra.services.edit.tests.edit.advice.MarkerDeletionAdviceTest) skipped
02:46:00 testDeleteMarkers_relatedElements(org.eclipse.papyrus.infra.services.edit.tests.edit.advice.MarkerDeletionAdviceTest) skipped
02:46:00 org.eclipse.papyrus.infra.services.edit.tests.edit.advice.MarkerDeletionAdviceTest skipped
02:46:00 org.eclipse.papyrus.infra.services.edit.tests.suites.AllTests skipped
02:46:00 testValidate(org.eclipse.papyrus.infra.services.edit.ui.dialogs.tests.TestElementTypeValidator) skipped
02:46:00 org.eclipse.papyrus.infra.services.edit.ui.dialogs.tests.TestElementTypeValidator skipped
02:46:00 org.eclipse.papyrus.infra.services.edit.ui.tests.AllTests skipped
02:46:00 testInvalidContext(org.eclipse.papyrus.infra.services.labelprovider.tests.LabelProviderServiceTest) skipped
02:46:00 testDefaultLabelProvider(org.eclipse.papyrus.infra.services.labelprovider.tests.LabelProviderServiceTest) skipped
02:46:00 testEMFLabelProvider(org.eclipse.papyrus.infra.services.labelprovider.tests.LabelProviderServiceTest) skipped
02:46:00 testUMLLabelProvider(org.eclipse.papyrus.infra.services.labelprovider.tests.LabelProviderServiceTest) skipped
02:46:00 testUMLLabelProviderChangeEvents(org.eclipse.papyrus.infra.services.labelprovider.tests.LabelProviderServiceTest) skipped
02:46:00 org.eclipse.papyrus.infra.services.labelprovider.tests.LabelProviderServiceTest skipped
02:46:00 org.eclipse.papyrus.infra.services.labelprovider.tests.AllTests skipped
02:46:00 getSemanticRoots(org.eclipse.papyrus.infra.services.semantic.tests.SemanticServiceTest) skipped
02:46:00 getSemanticIModels(org.eclipse.papyrus.infra.services.semantic.tests.SemanticServiceTest) skipped
02:46:00 org.eclipse.papyrus.infra.services.semantic.tests.SemanticServiceTest skipped
02:46:00 org.eclipse.papyrus.infra.services.semantic.tests.AllTests skipped
02:46:00 testReorientReferenceCommand_sourceOldReadOnly[model is writable in workspace](org.eclipse.papyrus.infra.emf.advice.ReadOnlyObjectEditAdviceTest) skipped
02:46:00 testMoveCommand_rootFromReadOnly[model is writable in workspace](org.eclipse.papyrus.infra.emf.advice.ReadOnlyObjectEditAdviceTest) skipped
02:46:00 testSetCommand_containmentOldContainerReadonly[model is writable in workspace](org.eclipse.papyrus.infra.emf.advice.ReadOnlyObjectEditAdviceTest) skipped
02:46:00 testDestroyElementCommand[model is writable in workspace](org.eclipse.papyrus.infra.emf.advice.ReadOnlyObjectEditAdviceTest) skipped
02:46:00 testReorientRelationshipCommand_sourceOldReadOnly[model is writable in workspace](org.eclipse.papyrus.infra.emf.advice.ReadOnlyObjectEditAdviceTest) skipped
02:46:00 testSetCommand_attribute[model is writable in workspace](org.eclipse.papyrus.infra.emf.advice.ReadOnlyObjectEditAdviceTest) skipped
02:46:00 testSetCommand_containmentOldContainerReadonlyMany[model is writable in workspace](org.eclipse.papyrus.infra.emf.advice.ReadOnlyObjectEditAdviceTest) skipped
02:46:00 testReorientReferenceCommand_targetNewReadonly[model is writable in workspace](org.eclipse.papyrus.infra.emf.advice.ReadOnlyObjectEditAdviceTest) skipped
02:46:00 testReorientRelationshipCommand_targetNewReadOnly[model is writable in workspace](org.eclipse.papyrus.infra.emf.advice.ReadOnlyObjectEditAdviceTest) skipped
02:46:00 testReorientReferenceCommand_targetOldReadonly[model is writable in workspace](org.eclipse.papyrus.infra.emf.advice.ReadOnlyObjectEditAdviceTest) skipped
02:46:00 testSetCommand_referenceOppositeAdd[model is writable in workspace](org.eclipse.papyrus.infra.emf.advice.ReadOnlyObjectEditAdviceTest) skipped
02:46:00 testDestroyReferenceCommand_owner[model is writable in workspace](org.eclipse.papyrus.infra.emf.advice.ReadOnlyObjectEditAdviceTest) skipped
02:46:00 testCreateCommand[model is writable in workspace](org.eclipse.papyrus.infra.emf.advice.ReadOnlyObjectEditAdviceTest) skipped
02:46:00 testReorientRelationshipCommand_targetOldReadonly[model is writable in workspace](org.eclipse.papyrus.infra.emf.advice.ReadOnlyObjectEditAdviceTest) skipped
02:46:00 testMoveCommand_fromReadOnly[model is writable in workspace](org.eclipse.papyrus.infra.emf.advice.ReadOnlyObjectEditAdviceTest) skipped
02:46:00 testReorientReferenceCommand_sourceNewReadonly[model is writable in workspace](org.eclipse.papyrus.infra.emf.advice.ReadOnlyObjectEditAdviceTest) skipped
02:46:00 testDestroyReferenceCommand_referencedOpposite[model is writable in workspace](org.eclipse.papyrus.infra.emf.advice.ReadOnlyObjectEditAdviceTest) skipped
02:46:00 testSetCommand_referenceOppositeRemove[model is writable in workspace](org.eclipse.papyrus.infra.emf.advice.ReadOnlyObjectEditAdviceTest) skipped
02:46:00 testDuplicateCommand[model is writable in workspace](org.eclipse.papyrus.infra.emf.advice.ReadOnlyObjectEditAdviceTest) skipped
02:46:00 testReorientRelationshipCommand_sourceNewReadOnly[model is writable in workspace](org.eclipse.papyrus.infra.emf.advice.ReadOnlyObjectEditAdviceTest) skipped
02:46:00 testCreateRelationshipCommand[model is writable in workspace](org.eclipse.papyrus.infra.emf.advice.ReadOnlyObjectEditAdviceTest) skipped
02:46:00 testMoveCommand_toReadOnly[model is writable in workspace](org.eclipse.papyrus.infra.emf.advice.ReadOnlyObjectEditAdviceTest) skipped
02:46:00 [model is writable in workspace] skipped
02:46:00 testReorientReferenceCommand_sourceOldReadOnly[model is read-only in workspace](org.eclipse.papyrus.infra.emf.advice.ReadOnlyObjectEditAdviceTest) skipped
02:46:00 testMoveCommand_rootFromReadOnly[model is read-only in workspace](org.eclipse.papyrus.infra.emf.advice.ReadOnlyObjectEditAdviceTest) skipped
02:46:00 testSetCommand_containmentOldContainerReadonly[model is read-only in workspace](org.eclipse.papyrus.infra.emf.advice.ReadOnlyObjectEditAdviceTest) skipped
02:46:00 testDestroyElementCommand[model is read-only in workspace](org.eclipse.papyrus.infra.emf.advice.ReadOnlyObjectEditAdviceTest) skipped
02:46:00 testReorientRelationshipCommand_sourceOldReadOnly[model is read-only in workspace](org.eclipse.papyrus.infra.emf.advice.ReadOnlyObjectEditAdviceTest) skipped
02:46:00 testSetCommand_attribute[model is read-only in workspace](org.eclipse.papyrus.infra.emf.advice.ReadOnlyObjectEditAdviceTest) skipped
02:46:00 testSetCommand_containmentOldContainerReadonlyMany[model is read-only in workspace](org.eclipse.papyrus.infra.emf.advice.ReadOnlyObjectEditAdviceTest) skipped
02:46:00 testReorientReferenceCommand_targetNewReadonly[model is read-only in workspace](org.eclipse.papyrus.infra.emf.advice.ReadOnlyObjectEditAdviceTest) skipped
02:46:00 testReorientRelationshipCommand_targetNewReadOnly[model is read-only in workspace](org.eclipse.papyrus.infra.emf.advice.ReadOnlyObjectEditAdviceTest) skipped
02:46:00 testReorientReferenceCommand_targetOldReadonly[model is read-only in workspace](org.eclipse.papyrus.infra.emf.advice.ReadOnlyObjectEditAdviceTest) skipped
02:46:00 testSetCommand_referenceOppositeAdd[model is read-only in workspace](org.eclipse.papyrus.infra.emf.advice.ReadOnlyObjectEditAdviceTest) skipped
02:46:00 testDestroyReferenceCommand_owner[model is read-only in workspace](org.eclipse.papyrus.infra.emf.advice.ReadOnlyObjectEditAdviceTest) skipped
02:46:00 testCreateCommand[model is read-only in workspace](org.eclipse.papyrus.infra.emf.advice.ReadOnlyObjectEditAdviceTest) skipped
02:46:00 testReorientRelationshipCommand_targetOldReadonly[model is read-only in workspace](org.eclipse.papyrus.infra.emf.advice.ReadOnlyObjectEditAdviceTest) skipped
02:46:00 testMoveCommand_fromReadOnly[model is read-only in workspace](org.eclipse.papyrus.infra.emf.advice.ReadOnlyObjectEditAdviceTest) skipped
02:46:00 testReorientReferenceCommand_sourceNewReadonly[model is read-only in workspace](org.eclipse.papyrus.infra.emf.advice.ReadOnlyObjectEditAdviceTest) skipped
02:46:00 testDestroyReferenceCommand_referencedOpposite[model is read-only in workspace](org.eclipse.papyrus.infra.emf.advice.ReadOnlyObjectEditAdviceTest) skipped
02:46:00 testSetCommand_referenceOppositeRemove[model is read-only in workspace](org.eclipse.papyrus.infra.emf.advice.ReadOnlyObjectEditAdviceTest) skipped
02:46:00 testDuplicateCommand[model is read-only in workspace](org.eclipse.papyrus.infra.emf.advice.ReadOnlyObjectEditAdviceTest) skipped
02:46:00 testReorientRelationshipCommand_sourceNewReadOnly[model is read-only in workspace](org.eclipse.papyrus.infra.emf.advice.ReadOnlyObjectEditAdviceTest) skipped
02:46:00 testCreateRelationshipCommand[model is read-only in workspace](org.eclipse.papyrus.infra.emf.advice.ReadOnlyObjectEditAdviceTest) skipped
02:46:00 testMoveCommand_toReadOnly[model is read-only in workspace](org.eclipse.papyrus.infra.emf.advice.ReadOnlyObjectEditAdviceTest) skipped
02:46:00 [model is read-only in workspace] skipped
02:46:00 testReorientReferenceCommand_sourceOldReadOnly[model is deployed in plug-in, advice disabled](org.eclipse.papyrus.infra.emf.advice.ReadOnlyObjectEditAdviceTest) skipped
02:46:00 testMoveCommand_rootFromReadOnly[model is deployed in plug-in, advice disabled](org.eclipse.papyrus.infra.emf.advice.ReadOnlyObjectEditAdviceTest) skipped
02:46:00 testSetCommand_containmentOldContainerReadonly[model is deployed in plug-in, advice disabled](org.eclipse.papyrus.infra.emf.advice.ReadOnlyObjectEditAdviceTest) skipped
02:46:00 testDestroyElementCommand[model is deployed in plug-in, advice disabled](org.eclipse.papyrus.infra.emf.advice.ReadOnlyObjectEditAdviceTest) skipped
02:46:00 testReorientRelationshipCommand_sourceOldReadOnly[model is deployed in plug-in, advice disabled](org.eclipse.papyrus.infra.emf.advice.ReadOnlyObjectEditAdviceTest) skipped
02:46:00 testSetCommand_attribute[model is deployed in plug-in, advice disabled](org.eclipse.papyrus.infra.emf.advice.ReadOnlyObjectEditAdviceTest) skipped
02:46:00 testSetCommand_containmentOldContainerReadonlyMany[model is deployed in plug-in, advice disabled](org.eclipse.papyrus.infra.emf.advice.ReadOnlyObjectEditAdviceTest) skipped
02:46:00 testReorientReferenceCommand_targetNewReadonly[model is deployed in plug-in, advice disabled](org.eclipse.papyrus.infra.emf.advice.ReadOnlyObjectEditAdviceTest) skipped
02:46:00 testReorientRelationshipCommand_targetNewReadOnly[model is deployed in plug-in, advice disabled](org.eclipse.papyrus.infra.emf.advice.ReadOnlyObjectEditAdviceTest) skipped
02:46:00 testReorientReferenceCommand_targetOldReadonly[model is deployed in plug-in, advice disabled](org.eclipse.papyrus.infra.emf.advice.ReadOnlyObjectEditAdviceTest) skipped
02:46:00 testSetCommand_referenceOppositeAdd[model is deployed in plug-in, advice disabled](org.eclipse.papyrus.infra.emf.advice.ReadOnlyObjectEditAdviceTest) skipped
02:46:00 testDestroyReferenceCommand_owner[model is deployed in plug-in, advice disabled](org.eclipse.papyrus.infra.emf.advice.ReadOnlyObjectEditAdviceTest) skipped
02:46:00 testCreateCommand[model is deployed in plug-in, advice disabled](org.eclipse.papyrus.infra.emf.advice.ReadOnlyObjectEditAdviceTest) skipped
02:46:00 testReorientRelationshipCommand_targetOldReadonly[model is deployed in plug-in, advice disabled](org.eclipse.papyrus.infra.emf.advice.ReadOnlyObjectEditAdviceTest) skipped
02:46:00 testMoveCommand_fromReadOnly[model is deployed in plug-in, advice disabled](org.eclipse.papyrus.infra.emf.advice.ReadOnlyObjectEditAdviceTest) skipped
02:46:00 testReorientReferenceCommand_sourceNewReadonly[model is deployed in plug-in, advice disabled](org.eclipse.papyrus.infra.emf.advice.ReadOnlyObjectEditAdviceTest) skipped
02:46:00 testDestroyReferenceCommand_referencedOpposite[model is deployed in plug-in, advice disabled](org.eclipse.papyrus.infra.emf.advice.ReadOnlyObjectEditAdviceTest) skipped
02:46:00 testSetCommand_referenceOppositeRemove[model is deployed in plug-in, advice disabled](org.eclipse.papyrus.infra.emf.advice.ReadOnlyObjectEditAdviceTest) skipped
02:46:00 testDuplicateCommand[model is deployed in plug-in, advice disabled](org.eclipse.papyrus.infra.emf.advice.ReadOnlyObjectEditAdviceTest) skipped
02:46:00 testReorientRelationshipCommand_sourceNewReadOnly[model is deployed in plug-in, advice disabled](org.eclipse.papyrus.infra.emf.advice.ReadOnlyObjectEditAdviceTest) skipped
02:46:00 testCreateRelationshipCommand[model is deployed in plug-in, advice disabled](org.eclipse.papyrus.infra.emf.advice.ReadOnlyObjectEditAdviceTest) skipped
02:46:00 testMoveCommand_toReadOnly[model is deployed in plug-in, advice disabled](org.eclipse.papyrus.infra.emf.advice.ReadOnlyObjectEditAdviceTest) skipped
02:46:00 [model is deployed in plug-in, advice disabled] skipped
02:46:00 testReorientReferenceCommand_sourceOldReadOnly[model is deployed in plug-in](org.eclipse.papyrus.infra.emf.advice.ReadOnlyObjectEditAdviceTest) skipped
02:46:00 testMoveCommand_rootFromReadOnly[model is deployed in plug-in](org.eclipse.papyrus.infra.emf.advice.ReadOnlyObjectEditAdviceTest) skipped
02:46:00 testSetCommand_containmentOldContainerReadonly[model is deployed in plug-in](org.eclipse.papyrus.infra.emf.advice.ReadOnlyObjectEditAdviceTest) skipped
02:46:00 testDestroyElementCommand[model is deployed in plug-in](org.eclipse.papyrus.infra.emf.advice.ReadOnlyObjectEditAdviceTest) skipped
02:46:00 testReorientRelationshipCommand_sourceOldReadOnly[model is deployed in plug-in](org.eclipse.papyrus.infra.emf.advice.ReadOnlyObjectEditAdviceTest) skipped
02:46:00 testSetCommand_attribute[model is deployed in plug-in](org.eclipse.papyrus.infra.emf.advice.ReadOnlyObjectEditAdviceTest) skipped
02:46:00 testSetCommand_containmentOldContainerReadonlyMany[model is deployed in plug-in](org.eclipse.papyrus.infra.emf.advice.ReadOnlyObjectEditAdviceTest) skipped
02:46:00 testReorientReferenceCommand_targetNewReadonly[model is deployed in plug-in](org.eclipse.papyrus.infra.emf.advice.ReadOnlyObjectEditAdviceTest) skipped
02:46:00 testReorientRelationshipCommand_targetNewReadOnly[model is deployed in plug-in](org.eclipse.papyrus.infra.emf.advice.ReadOnlyObjectEditAdviceTest) skipped
02:46:00 testReorientReferenceCommand_targetOldReadonly[model is deployed in plug-in](org.eclipse.papyrus.infra.emf.advice.ReadOnlyObjectEditAdviceTest) skipped
02:46:00 testSetCommand_referenceOppositeAdd[model is deployed in plug-in](org.eclipse.papyrus.infra.emf.advice.ReadOnlyObjectEditAdviceTest) skipped
02:46:00 testDestroyReferenceCommand_owner[model is deployed in plug-in](org.eclipse.papyrus.infra.emf.advice.ReadOnlyObjectEditAdviceTest) skipped
02:46:00 testCreateCommand[model is deployed in plug-in](org.eclipse.papyrus.infra.emf.advice.ReadOnlyObjectEditAdviceTest) skipped
02:46:00 testReorientRelationshipCommand_targetOldReadonly[model is deployed in plug-in](org.eclipse.papyrus.infra.emf.advice.ReadOnlyObjectEditAdviceTest) skipped
02:46:00 testMoveCommand_fromReadOnly[model is deployed in plug-in](org.eclipse.papyrus.infra.emf.advice.ReadOnlyObjectEditAdviceTest) skipped
02:46:00 testReorientReferenceCommand_sourceNewReadonly[model is deployed in plug-in](org.eclipse.papyrus.infra.emf.advice.ReadOnlyObjectEditAdviceTest) skipped
02:46:00 testDestroyReferenceCommand_referencedOpposite[model is deployed in plug-in](org.eclipse.papyrus.infra.emf.advice.ReadOnlyObjectEditAdviceTest) skipped
02:46:00 testSetCommand_referenceOppositeRemove[model is deployed in plug-in](org.eclipse.papyrus.infra.emf.advice.ReadOnlyObjectEditAdviceTest) skipped
02:46:00 testDuplicateCommand[model is deployed in plug-in](org.eclipse.papyrus.infra.emf.advice.ReadOnlyObjectEditAdviceTest) skipped
02:46:00 testReorientRelationshipCommand_sourceNewReadOnly[model is deployed in plug-in](org.eclipse.papyrus.infra.emf.advice.ReadOnlyObjectEditAdviceTest) skipped
02:46:00 testCreateRelationshipCommand[model is deployed in plug-in](org.eclipse.papyrus.infra.emf.advice.ReadOnlyObjectEditAdviceTest) skipped
02:46:00 testMoveCommand_toReadOnly[model is deployed in plug-in](org.eclipse.papyrus.infra.emf.advice.ReadOnlyObjectEditAdviceTest) skipped
02:46:00 [model is deployed in plug-in] skipped
02:46:00 org.eclipse.papyrus.infra.emf.advice.ReadOnlyObjectEditAdviceTest skipped
02:46:00 testDeleteWithCrossReferences:commands(org.eclipse.papyrus.infra.emf.edit.domain.PapyrusTransactionalEditingDomainTest) skipped
02:46:00 testDeleteWithCrossReferences:delete(org.eclipse.papyrus.infra.emf.edit.domain.PapyrusTransactionalEditingDomainTest) skipped
02:46:00 testDeleteWithCrossReferences:changes(org.eclipse.papyrus.infra.emf.edit.domain.PapyrusTransactionalEditingDomainTest) skipped
02:46:00 testDeleteWithCrossReferences skipped
02:46:00 org.eclipse.papyrus.infra.emf.edit.domain.PapyrusTransactionalEditingDomainTest skipped
02:46:00 testGetServiceRegistryResource(org.eclipse.papyrus.infra.emf.utils.ServiceUtilsForResourceTest) skipped
02:46:00 testGetInstance(org.eclipse.papyrus.infra.emf.utils.ServiceUtilsForResourceTest) skipped
02:46:00 org.eclipse.papyrus.infra.emf.utils.ServiceUtilsForResourceTest skipped
02:46:00 makeNotShardObservedByOtherHelper[0: useCommands=false](org.eclipse.papyrus.infra.emf.resource.ShardResourceHelperTest) skipped
02:46:00 makeNotShard[0: useCommands=false](org.eclipse.papyrus.infra.emf.resource.ShardResourceHelperTest) skipped
02:46:00 makeShardObservedByOtherHelper[0: useCommands=false](org.eclipse.papyrus.infra.emf.resource.ShardResourceHelperTest) skipped
02:46:00 attemptToUseClosedHelper[0: useCommands=false](org.eclipse.papyrus.infra.emf.resource.ShardResourceHelperTest) skipped
02:46:00 makeShard[0: useCommands=false](org.eclipse.papyrus.infra.emf.resource.ShardResourceHelperTest) skipped
02:46:00 [0: useCommands=false] skipped
02:46:00 makeNotShardObservedByOtherHelper[1: useCommands=true](org.eclipse.papyrus.infra.emf.resource.ShardResourceHelperTest) skipped
02:46:00 makeNotShard[1: useCommands=true](org.eclipse.papyrus.infra.emf.resource.ShardResourceHelperTest) skipped
02:46:00 makeShardObservedByOtherHelper[1: useCommands=true](org.eclipse.papyrus.infra.emf.resource.ShardResourceHelperTest) skipped
02:46:00 attemptToUseClosedHelper[1: useCommands=true](org.eclipse.papyrus.infra.emf.resource.ShardResourceHelperTest) skipped
02:46:00 makeShard[1: useCommands=true](org.eclipse.papyrus.infra.emf.resource.ShardResourceHelperTest) skipped
02:46:00 [1: useCommands=true] skipped
02:46:00 org.eclipse.papyrus.infra.emf.resource.ShardResourceHelperTest skipped
02:46:00 proxyResolutionLoadsShardFromTheTop[0: full index](org.eclipse.papyrus.infra.emf.resource.ShardResourceLocatorTest) skipped
02:46:00 shardLoadsContainersAndDoesntLoseStereotypes[0: full index](org.eclipse.papyrus.infra.emf.resource.ShardResourceLocatorTest) skipped
02:46:00 [0: full index] skipped
02:46:00 proxyResolutionLoadsShardFromTheTop[1: on-demand index](org.eclipse.papyrus.infra.emf.resource.ShardResourceLocatorTest) skipped
02:46:00 shardLoadsContainersAndDoesntLoseStereotypes[1: on-demand index](org.eclipse.papyrus.infra.emf.resource.ShardResourceLocatorTest) skipped
02:46:00 [1: on-demand index] skipped
02:46:00 org.eclipse.papyrus.infra.emf.resource.ShardResourceLocatorTest skipped
02:46:00 subunits(org.eclipse.papyrus.infra.emf.resource.CrossReferenceIndexTest$ShardsTest) skipped
02:46:00 parents(org.eclipse.papyrus.infra.emf.resource.CrossReferenceIndexTest$ShardsTest) skipped
02:46:00 outgoingReferences_givenURI(org.eclipse.papyrus.infra.emf.resource.CrossReferenceIndexTest$ShardsTest) skipped
02:46:00 incomingReferences_givenURI(org.eclipse.papyrus.infra.emf.resource.CrossReferenceIndexTest$ShardsTest) skipped
02:46:00 roots(org.eclipse.papyrus.infra.emf.resource.CrossReferenceIndexTest$ShardsTest) skipped
02:46:00 roots_alternate(org.eclipse.papyrus.infra.emf.resource.CrossReferenceIndexTest$ShardsTest) skipped
02:46:00 outgoingReferences(org.eclipse.papyrus.infra.emf.resource.CrossReferenceIndexTest$ShardsTest) skipped
02:46:00 incomingReferences(org.eclipse.papyrus.infra.emf.resource.CrossReferenceIndexTest$ShardsTest) skipped
02:46:00 isShard(org.eclipse.papyrus.infra.emf.resource.CrossReferenceIndexTest$ShardsTest) skipped
02:46:00 org.eclipse.papyrus.infra.emf.resource.CrossReferenceIndexTest$ShardsTest skipped
02:46:00 subunits(org.eclipse.papyrus.infra.emf.resource.CrossReferenceIndexTest$SubmodelsTest) skipped
02:46:00 parents(org.eclipse.papyrus.infra.emf.resource.CrossReferenceIndexTest$SubmodelsTest) skipped
02:46:00 outgoingReferences_givenURI(org.eclipse.papyrus.infra.emf.resource.CrossReferenceIndexTest$SubmodelsTest) skipped
02:46:00 incomingReferences_givenURI(org.eclipse.papyrus.infra.emf.resource.CrossReferenceIndexTest$SubmodelsTest) skipped
02:46:00 roots(org.eclipse.papyrus.infra.emf.resource.CrossReferenceIndexTest$SubmodelsTest) skipped
02:46:00 roots_alternate(org.eclipse.papyrus.infra.emf.resource.CrossReferenceIndexTest$SubmodelsTest) skipped
02:46:00 outgoingReferences(org.eclipse.papyrus.infra.emf.resource.CrossReferenceIndexTest$SubmodelsTest) skipped
02:46:00 incomingReferences(org.eclipse.papyrus.infra.emf.resource.CrossReferenceIndexTest$SubmodelsTest) skipped
02:46:00 isShard(org.eclipse.papyrus.infra.emf.resource.CrossReferenceIndexTest$SubmodelsTest) skipped
02:46:00 org.eclipse.papyrus.infra.emf.resource.CrossReferenceIndexTest$SubmodelsTest skipped
02:46:00 org.eclipse.papyrus.infra.emf.resource.CrossReferenceIndexTest skipped
02:46:00 indexRebuiltOnDeletion(org.eclipse.papyrus.infra.emf.resource.index.WorkspaceModelIndexTest) skipped
02:46:00 indexRebuiltOnProjectClose(org.eclipse.papyrus.infra.emf.resource.index.WorkspaceModelIndexTest) skipped
02:46:00 indexNotifiesOnReindex(org.eclipse.papyrus.infra.emf.resource.index.WorkspaceModelIndexTest) skipped
02:46:00 indexRefreshesIfNecessary_bug473154(org.eclipse.papyrus.infra.emf.resource.index.WorkspaceModelIndexTest) skipped
02:46:00 indexBuilt(org.eclipse.papyrus.infra.emf.resource.index.WorkspaceModelIndexTest) skipped
02:46:00 indexRebuiltOnChanges(org.eclipse.papyrus.infra.emf.resource.index.WorkspaceModelIndexTest) skipped
02:46:00 indexRebuiltOnProjectDelete(org.eclipse.papyrus.infra.emf.resource.index.WorkspaceModelIndexTest) skipped
02:46:00 indexRecoversFromCancel(org.eclipse.papyrus.infra.emf.resource.index.WorkspaceModelIndexTest) skipped
02:46:00 org.eclipse.papyrus.infra.emf.resource.index.WorkspaceModelIndexTest skipped
02:46:00 org.eclipse.papyrus.infra.emf.tests.AllTests skipped
02:46:00 AndExpression_Test1(org.eclipse.papyrus.infra.emf.expressions.tests.AndExpressionTests) skipped
02:46:00 AndExpression_Test2(org.eclipse.papyrus.infra.emf.expressions.tests.AndExpressionTests) skipped
02:46:00 AndExpression_Test3(org.eclipse.papyrus.infra.emf.expressions.tests.AndExpressionTests) skipped
02:46:00 AndExpression_Test4(org.eclipse.papyrus.infra.emf.expressions.tests.AndExpressionTests) skipped
02:46:00 AndExpression_Test5(org.eclipse.papyrus.infra.emf.expressions.tests.AndExpressionTests) skipped
02:46:00 AndExpression_Test6(org.eclipse.papyrus.infra.emf.expressions.tests.AndExpressionTests) skipped
02:46:00 AndExpression_Test7(org.eclipse.papyrus.infra.emf.expressions.tests.AndExpressionTests) skipped
02:46:00 AndExpression_Test8(org.eclipse.papyrus.infra.emf.expressions.tests.AndExpressionTests) skipped
02:46:00 AndExpression_Test9(org.eclipse.papyrus.infra.emf.expressions.tests.AndExpressionTests) skipped
02:46:00 AndExpression_Test10(org.eclipse.papyrus.infra.emf.expressions.tests.AndExpressionTests) skipped
02:46:00 AndExpression_Test11(org.eclipse.papyrus.infra.emf.expressions.tests.AndExpressionTests) skipped
02:46:00 AndExpression_Test12(org.eclipse.papyrus.infra.emf.expressions.tests.AndExpressionTests) skipped
02:46:00 AndExpression_Test13(org.eclipse.papyrus.infra.emf.expressions.tests.AndExpressionTests) skipped
02:46:00 AndExpression_Test14(org.eclipse.papyrus.infra.emf.expressions.tests.AndExpressionTests) skipped
02:46:00 AndExpression_Test15(org.eclipse.papyrus.infra.emf.expressions.tests.AndExpressionTests) skipped
02:46:00 AndExpression_Test16(org.eclipse.papyrus.infra.emf.expressions.tests.AndExpressionTests) skipped
02:46:00 AndExpression_Test17(org.eclipse.papyrus.infra.emf.expressions.tests.AndExpressionTests) skipped
02:46:00 AndExpression_Test18(org.eclipse.papyrus.infra.emf.expressions.tests.AndExpressionTests) skipped
02:46:00 AndExpression_Test19(org.eclipse.papyrus.infra.emf.expressions.tests.AndExpressionTests) skipped
02:46:00 AndExpression_Test20(org.eclipse.papyrus.infra.emf.expressions.tests.AndExpressionTests) skipped
02:46:00 AndExpression_Test21(org.eclipse.papyrus.infra.emf.expressions.tests.AndExpressionTests) skipped
02:46:00 AndExpression_Test22(org.eclipse.papyrus.infra.emf.expressions.tests.AndExpressionTests) skipped
02:46:00 AndExpression_Test23(org.eclipse.papyrus.infra.emf.expressions.tests.AndExpressionTests) skipped
02:46:00 AndExpression_Test24(org.eclipse.papyrus.infra.emf.expressions.tests.AndExpressionTests) skipped
02:46:00 AndExpression_Test25(org.eclipse.papyrus.infra.emf.expressions.tests.AndExpressionTests) skipped
02:46:00 AndExpression_Test26(org.eclipse.papyrus.infra.emf.expressions.tests.AndExpressionTests) skipped
02:46:00 org.eclipse.papyrus.infra.emf.expressions.tests.AndExpressionTests skipped
02:46:00 LiteralFalseExpression_Test1(org.eclipse.papyrus.infra.emf.expressions.tests.LiteralFalseExpressionTests) skipped
02:46:00 LiteralFalseExpression_Test2(org.eclipse.papyrus.infra.emf.expressions.tests.LiteralFalseExpressionTests) skipped
02:46:00 org.eclipse.papyrus.infra.emf.expressions.tests.LiteralFalseExpressionTests skipped
02:46:00 LiteralTrueExpression_Test1(org.eclipse.papyrus.infra.emf.expressions.tests.LiteralTrueExpressionTests) skipped
02:46:00 LiteralTrueExpression_Test2(org.eclipse.papyrus.infra.emf.expressions.tests.LiteralTrueExpressionTests) skipped
02:46:00 org.eclipse.papyrus.infra.emf.expressions.tests.LiteralTrueExpressionTests skipped
02:46:00 NotExpression_Test1_1(org.eclipse.papyrus.infra.emf.expressions.tests.NotExpressionTests) skipped
02:46:00 NotExpression_Test1_2(org.eclipse.papyrus.infra.emf.expressions.tests.NotExpressionTests) skipped
02:46:00 NotExpression_Test2_1(org.eclipse.papyrus.infra.emf.expressions.tests.NotExpressionTests) skipped
02:46:00 NotExpression_Test2_2(org.eclipse.papyrus.infra.emf.expressions.tests.NotExpressionTests) skipped
02:46:00 NotExpression_Test3_1(org.eclipse.papyrus.infra.emf.expressions.tests.NotExpressionTests) skipped
02:46:00 NotExpression_Test3_2(org.eclipse.papyrus.infra.emf.expressions.tests.NotExpressionTests) skipped
02:46:00 NotExpression_Test4_1(org.eclipse.papyrus.infra.emf.expressions.tests.NotExpressionTests) skipped
02:46:00 NotExpression_Test4_2(org.eclipse.papyrus.infra.emf.expressions.tests.NotExpressionTests) skipped
02:46:00 NotExpression_Test4_3(org.eclipse.papyrus.infra.emf.expressions.tests.NotExpressionTests) skipped
02:46:00 NotExpression_Test4_4(org.eclipse.papyrus.infra.emf.expressions.tests.NotExpressionTests) skipped
02:46:00 org.eclipse.papyrus.infra.emf.expressions.tests.NotExpressionTests skipped
02:46:00 OrExpression_Test10(org.eclipse.papyrus.infra.emf.expressions.tests.OrExpressionTests) skipped
02:46:00 OrExpression_Test11(org.eclipse.papyrus.infra.emf.expressions.tests.OrExpressionTests) skipped
02:46:00 OrExpression_Test12(org.eclipse.papyrus.infra.emf.expressions.tests.OrExpressionTests) skipped
02:46:00 OrExpression_Test13(org.eclipse.papyrus.infra.emf.expressions.tests.OrExpressionTests) skipped
02:46:00 OrExpression_Test14(org.eclipse.papyrus.infra.emf.expressions.tests.OrExpressionTests) skipped
02:46:00 OrExpression_Test15(org.eclipse.papyrus.infra.emf.expressions.tests.OrExpressionTests) skipped
02:46:00 OrExpression_Test16(org.eclipse.papyrus.infra.emf.expressions.tests.OrExpressionTests) skipped
02:46:00 OrExpression_Test17(org.eclipse.papyrus.infra.emf.expressions.tests.OrExpressionTests) skipped
02:46:00 OrExpression_Test18(org.eclipse.papyrus.infra.emf.expressions.tests.OrExpressionTests) skipped
02:46:00 OrExpression_Test19(org.eclipse.papyrus.infra.emf.expressions.tests.OrExpressionTests) skipped
02:46:00 OrExpression_Test20(org.eclipse.papyrus.infra.emf.expressions.tests.OrExpressionTests) skipped
02:46:00 OrExpression_Test21(org.eclipse.papyrus.infra.emf.expressions.tests.OrExpressionTests) skipped
02:46:00 OrExpression_Test22(org.eclipse.papyrus.infra.emf.expressions.tests.OrExpressionTests) skipped
02:46:00 OrExpression_Test23(org.eclipse.papyrus.infra.emf.expressions.tests.OrExpressionTests) skipped
02:46:00 OrExpression_Test24(org.eclipse.papyrus.infra.emf.expressions.tests.OrExpressionTests) skipped
02:46:00 OrExpression_Test25(org.eclipse.papyrus.infra.emf.expressions.tests.OrExpressionTests) skipped
02:46:00 OrExpression_Test26(org.eclipse.papyrus.infra.emf.expressions.tests.OrExpressionTests) skipped
02:46:00 OrExpression_Test1(org.eclipse.papyrus.infra.emf.expressions.tests.OrExpressionTests) skipped
02:46:00 OrExpression_Test2(org.eclipse.papyrus.infra.emf.expressions.tests.OrExpressionTests) skipped
02:46:00 OrExpression_Test3(org.eclipse.papyrus.infra.emf.expressions.tests.OrExpressionTests) skipped
02:46:00 OrExpression_Test4(org.eclipse.papyrus.infra.emf.expressions.tests.OrExpressionTests) skipped
02:46:00 OrExpression_Test5(org.eclipse.papyrus.infra.emf.expressions.tests.OrExpressionTests) skipped
02:46:00 OrExpression_Test6(org.eclipse.papyrus.infra.emf.expressions.tests.OrExpressionTests) skipped
02:46:00 OrExpression_Test7(org.eclipse.papyrus.infra.emf.expressions.tests.OrExpressionTests) skipped
02:46:00 OrExpression_Test8(org.eclipse.papyrus.infra.emf.expressions.tests.OrExpressionTests) skipped
02:46:00 OrExpression_Test9(org.eclipse.papyrus.infra.emf.expressions.tests.OrExpressionTests) skipped
02:46:00 org.eclipse.papyrus.infra.emf.expressions.tests.OrExpressionTests skipped
02:46:00 ReferenceExpression_Test1(org.eclipse.papyrus.infra.emf.expressions.tests.ReferenceExpressionTests) skipped
02:46:00 ReferenceExpression_Test2(org.eclipse.papyrus.infra.emf.expressions.tests.ReferenceExpressionTests) skipped
02:46:00 ReferenceExpression_Test3(org.eclipse.papyrus.infra.emf.expressions.tests.ReferenceExpressionTests) skipped
02:46:00 ReferenceExpression_Test4(org.eclipse.papyrus.infra.emf.expressions.tests.ReferenceExpressionTests) skipped
02:46:00 ReferenceExpression_Test5(org.eclipse.papyrus.infra.emf.expressions.tests.ReferenceExpressionTests) skipped
02:46:00 org.eclipse.papyrus.infra.emf.expressions.tests.ReferenceExpressionTests skipped
02:46:00 singleEAttributeEqualityExpression_Test1(org.eclipse.papyrus.infra.emf.expressions.tests.SingleEAttributeValueEqualityExpressionTests) skipped
02:46:00 singleEAttributeEqualityExpression_Test2(org.eclipse.papyrus.infra.emf.expressions.tests.SingleEAttributeValueEqualityExpressionTests) skipped
02:46:00 singleEAttributeEqualityExpression_Test3(org.eclipse.papyrus.infra.emf.expressions.tests.SingleEAttributeValueEqualityExpressionTests) skipped
02:46:00 singleEAttributeEqualityExpression_Test4(org.eclipse.papyrus.infra.emf.expressions.tests.SingleEAttributeValueEqualityExpressionTests) skipped
02:46:00 singleEAttributeEqualityExpression_Test5(org.eclipse.papyrus.infra.emf.expressions.tests.SingleEAttributeValueEqualityExpressionTests) skipped
02:46:00 singleEAttributeEqualityExpression_Test6(org.eclipse.papyrus.infra.emf.expressions.tests.SingleEAttributeValueEqualityExpressionTests) skipped
02:46:00 singleEAttributeEqualityExpression_Test7(org.eclipse.papyrus.infra.emf.expressions.tests.SingleEAttributeValueEqualityExpressionTests) skipped
02:46:00 singleEAttributeEqualityExpression_Test8(org.eclipse.papyrus.infra.emf.expressions.tests.SingleEAttributeValueEqualityExpressionTests) skipped
02:46:00 org.eclipse.papyrus.infra.emf.expressions.tests.SingleEAttributeValueEqualityExpressionTests skipped
02:46:00 org.eclipse.papyrus.infra.emf.expressions.tests.AllTests skipped
02:46:00 handlesWrapperChains(org.eclipse.papyrus.infra.emf.gmf.util.tests.CommandTreeIteratorTest) skipped
02:46:00 org.eclipse.papyrus.infra.emf.gmf.util.tests.CommandTreeIteratorTest skipped
02:46:00 org.eclipse.papyrus.infra.emf.gmf.tests.AllTests skipped
02:46:00 testMainModelElementsAreUnhandled(org.eclipse.papyrus.infra.ui.internal.emf.readonly.handlers.ReferencedModelReadOnlyHandlerTest) skipped
02:46:00 testNonExistentResourceIsUnhandled(org.eclipse.papyrus.infra.ui.internal.emf.readonly.handlers.ReferencedModelReadOnlyHandlerTest) skipped
02:46:00 testCrossReferencedPluginModelElementsAreUnhandled(org.eclipse.papyrus.infra.ui.internal.emf.readonly.handlers.ReferencedModelReadOnlyHandlerTest) skipped
02:46:00 testCrossReferencedWorkspaceModelElementsMadeWritable(org.eclipse.papyrus.infra.ui.internal.emf.readonly.handlers.ReferencedModelReadOnlyHandlerTest) skipped
02:46:00 testSubModelElementsAreUnhandled(org.eclipse.papyrus.infra.ui.internal.emf.readonly.handlers.ReferencedModelReadOnlyHandlerTest) skipped
02:46:00 testObjectURIsWithFragment(org.eclipse.papyrus.infra.ui.internal.emf.readonly.handlers.ReferencedModelReadOnlyHandlerTest) skipped
02:46:00 testCrossReferencedWorkspaceModelElementsAreReadOnly(org.eclipse.papyrus.infra.ui.internal.emf.readonly.handlers.ReferencedModelReadOnlyHandlerTest) skipped
02:46:00 org.eclipse.papyrus.infra.ui.internal.emf.readonly.handlers.ReferencedModelReadOnlyHandlerTest skipped
02:46:00 labelProviderChangeNotifications(org.eclipse.papyrus.infra.ui.emf.providers.tests.EMFLabelProviderTest) skipped
02:46:00 getText(org.eclipse.papyrus.infra.ui.emf.providers.tests.EMFLabelProviderTest) skipped
02:46:00 org.eclipse.papyrus.infra.ui.emf.providers.tests.EMFLabelProviderTest skipped
02:46:00 notificationsOnDependentWhenItChanges(org.eclipse.papyrus.infra.ui.emf.providers.tests.DependentEMFLabelProviderTest) skipped
02:46:00 getText(org.eclipse.papyrus.infra.ui.emf.providers.tests.DependentEMFLabelProviderTest) skipped
02:46:00 safeSubscriptionRemovalOnDestroy_bug507241(org.eclipse.papyrus.infra.ui.emf.providers.tests.DependentEMFLabelProviderTest) skipped
02:46:00 notificationsOnDependentWhenDependencyChanges(org.eclipse.papyrus.infra.ui.emf.providers.tests.DependentEMFLabelProviderTest) skipped
02:46:00 org.eclipse.papyrus.infra.ui.emf.providers.tests.DependentEMFLabelProviderTest skipped
02:46:00 org.eclipse.papyrus.infra.ui.emf.tests.AllTests skipped
02:46:00 testGetTypeRegisteredInplugin(org.eclipse.papyrus.infra.types.tests.ElementTypesRegistryTests) skipped
02:46:00 org.eclipse.papyrus.infra.types.tests.ElementTypesRegistryTests skipped
02:46:00 testPACKAGE_WITH_COMPONENTSType(org.eclipse.papyrus.infra.types.tests.ElementEditHelperAdviceTests) skipped
02:46:00 testSemanticMoveComponentFromWrongPackageToWrongPackage(org.eclipse.papyrus.infra.types.tests.ElementEditHelperAdviceTests) skipped
02:46:00 testDeleteComponentFromGoodPackage(org.eclipse.papyrus.infra.types.tests.ElementEditHelperAdviceTests) skipped
02:46:00 testSemanticCreateComponentInWrongPackage(org.eclipse.papyrus.infra.types.tests.ElementEditHelperAdviceTests) skipped
02:46:00 testCyclicAdvices(org.eclipse.papyrus.infra.types.tests.ElementEditHelperAdviceTests) skipped
02:46:00 testDeleteComponentFromWrongPackage(org.eclipse.papyrus.infra.types.tests.ElementEditHelperAdviceTests) skipped
02:46:00 testSemanticMoveComponentFromWrongPackageToGoodPackage(org.eclipse.papyrus.infra.types.tests.ElementEditHelperAdviceTests) skipped
02:46:00 testSemanticCreateComponentInGoodPackage(org.eclipse.papyrus.infra.types.tests.ElementEditHelperAdviceTests) skipped
02:46:00 testValidAdvicesOrder(org.eclipse.papyrus.infra.types.tests.ElementEditHelperAdviceTests) skipped
02:46:00 testSemanticMoveComponentFromGoodPackageToWrongPackage(org.eclipse.papyrus.infra.types.tests.ElementEditHelperAdviceTests) skipped
02:46:00 testPACKAGE_WITH_ALL_ELEMENTSType(org.eclipse.papyrus.infra.types.tests.ElementEditHelperAdviceTests) skipped
02:46:00 testSemanticMoveComponentFromGoodPackageToGoodPackage(org.eclipse.papyrus.infra.types.tests.ElementEditHelperAdviceTests) skipped
02:46:00 org.eclipse.papyrus.infra.types.tests.ElementEditHelperAdviceTests skipped
02:46:00 org.eclipse.papyrus.infra.types.tests.AllTests skipped
02:46:00 testGetTypeRegisteredInplugin(org.eclipse.papyrus.infra.types.tests.ElementTypesRegistryTests) skipped
02:46:00 org.eclipse.papyrus.infra.types.tests.ElementTypesRegistryTests skipped
02:46:00 org.eclipse.papyrus.infra.types.ui.tests.AllTests skipped
02:46:00 notDirtyAfterExecute_save_execute_undo_undo_redo(org.eclipse.papyrus.commands.NotifyingWorkspaceCommandStackTest) skipped
02:46:00 notDirtyAfterExecute_save_executeNonDirtying_undo_undo_redo_redo(org.eclipse.papyrus.commands.NotifyingWorkspaceCommandStackTest) skipped
02:46:00 notDirtyAfterExecuteNonDirtying_undo(org.eclipse.papyrus.commands.NotifyingWorkspaceCommandStackTest) skipped
02:46:00 dirtyAfterExecute(org.eclipse.papyrus.commands.NotifyingWorkspaceCommandStackTest) skipped
02:46:00 notDirtyAfterExecute_save(org.eclipse.papyrus.commands.NotifyingWorkspaceCommandStackTest) skipped
02:46:00 notDirtyAfterExecute_undo(org.eclipse.papyrus.commands.NotifyingWorkspaceCommandStackTest) skipped
02:46:00 dirtyAfterExecute_save_undo_save_redo(org.eclipse.papyrus.commands.NotifyingWorkspaceCommandStackTest) skipped
02:46:00 dirtyAfterExecute_save_undo(org.eclipse.papyrus.commands.NotifyingWorkspaceCommandStackTest) skipped
02:46:00 notDirtyAfterExecuteNonDirtying(org.eclipse.papyrus.commands.NotifyingWorkspaceCommandStackTest) skipped
02:46:00 notDirtyAfterExecute_save_undo_save(org.eclipse.papyrus.commands.NotifyingWorkspaceCommandStackTest) skipped
02:46:00 dirtyAfterExecute_save_execute_undo_undo_save_redo(org.eclipse.papyrus.commands.NotifyingWorkspaceCommandStackTest) skipped
02:46:00 org.eclipse.papyrus.commands.NotifyingWorkspaceCommandStackTest skipped
02:46:00 testCancelUnnestedCommand(org.eclipse.papyrus.commands.NestingNotifyingWorkspaceCommandStackTest) skipped
02:46:00 testCompleteNestedCommand(org.eclipse.papyrus.commands.NestingNotifyingWorkspaceCommandStackTest) skipped
02:46:00 testCancelTripleNestedCommand(org.eclipse.papyrus.commands.NestingNotifyingWorkspaceCommandStackTest) skipped
02:46:00 testCompleteTripleNestedCommand(org.eclipse.papyrus.commands.NestingNotifyingWorkspaceCommandStackTest) skipped
02:46:00 testCancelNestedCommand(org.eclipse.papyrus.commands.NestingNotifyingWorkspaceCommandStackTest) skipped
02:46:00 testCompleteUnnestedCommand(org.eclipse.papyrus.commands.NestingNotifyingWorkspaceCommandStackTest) skipped
02:46:00 org.eclipse.papyrus.commands.NestingNotifyingWorkspaceCommandStackTest skipped
02:46:00 genericCompoundsAndWrappers(org.eclipse.papyrus.commands.util.CommandTreeIteratorTest) skipped
02:46:00 gmfCompoundsAndWrappers(org.eclipse.papyrus.commands.util.CommandTreeIteratorTest) skipped
02:46:00 emfCompoundsAndWrappers(org.eclipse.papyrus.commands.util.CommandTreeIteratorTest) skipped
02:46:00 gefCompoundsAndWrappers(org.eclipse.papyrus.commands.util.CommandTreeIteratorTest) skipped
02:46:00 org.eclipse.papyrus.commands.util.CommandTreeIteratorTest skipped
02:46:00 undoChangesFromDiagramCommandStack(org.eclipse.papyrus.commands.CheckedDiagramCommandStackTest) skipped
02:46:00 undoChangesFromOperationHistory(org.eclipse.papyrus.commands.CheckedDiagramCommandStackTest) skipped
02:46:00 undoChangesFromEMFCommandStack(org.eclipse.papyrus.commands.CheckedDiagramCommandStackTest) skipped
02:46:00 org.eclipse.papyrus.commands.CheckedDiagramCommandStackTest skipped
02:46:00 org.eclipse.papyrus.infra.gmfdiag.commands.tests.AllTests skipped
02:46:00 load_BadelementTypeDiagramExpansion(org.eclipse.papyrus.infra.gmfdiag.common.tests.LoadExpansionModel) skipped
02:46:00 load_BadProviderDiagramExpansion(org.eclipse.papyrus.infra.gmfdiag.common.tests.LoadExpansionModel) skipped
02:46:00 init_DiagramExpansionRegistry(org.eclipse.papyrus.infra.gmfdiag.common.tests.LoadExpansionModel) skipped
02:46:00 load_BadDiagramExpansion(org.eclipse.papyrus.infra.gmfdiag.common.tests.LoadExpansionModel) skipped
02:46:00 load_DiagramExpansion(org.eclipse.papyrus.infra.gmfdiag.common.tests.LoadExpansionModel) skipped
02:46:00 org.eclipse.papyrus.infra.gmfdiag.common.tests.LoadExpansionModel skipped
02:46:00 verifyMetaclassCreationWithCompartment(org.eclipse.papyrus.infra.gmfdiag.common.tests.ExpansionAddCompartment) skipped
02:46:00 verifyClassCreationWithCompartment(org.eclipse.papyrus.infra.gmfdiag.common.tests.ExpansionAddCompartment) skipped
02:46:00 load_DiagramExpansion(org.eclipse.papyrus.infra.gmfdiag.common.tests.ExpansionAddCompartment) skipped
02:46:00 org.eclipse.papyrus.infra.gmfdiag.common.tests.ExpansionAddCompartment skipped
02:46:00 load_DiagramExpansion(org.eclipse.papyrus.infra.gmfdiag.common.tests.ExpansionAddChildLabel) skipped
02:46:00 org.eclipse.papyrus.infra.gmfdiag.common.tests.ExpansionAddChildLabel skipped
02:46:00 load_DiagramExpansion(org.eclipse.papyrus.infra.gmfdiag.common.tests.ExpansionAddBorderItem) skipped
02:46:00 org.eclipse.papyrus.infra.gmfdiag.common.tests.ExpansionAddBorderItem skipped
02:46:00 load_DiagramExpansion(org.eclipse.papyrus.infra.gmfdiag.common.tests.ExpansionAddCompartmentWithKind) skipped
02:46:00 org.eclipse.papyrus.infra.gmfdiag.common.tests.ExpansionAddCompartmentWithKind skipped
02:46:00 load_DiagramExpansion(org.eclipse.papyrus.infra.gmfdiag.common.tests.ExpansionAddLink) skipped
02:46:00 org.eclipse.papyrus.infra.gmfdiag.common.tests.ExpansionAddLink skipped
02:46:00 testDropInsideBadcontainer(org.eclipse.papyrus.infra.gmfdiag.common.tests.ExpansionDropElements) skipped
02:46:00 testDropInsidecontainer(org.eclipse.papyrus.infra.gmfdiag.common.tests.ExpansionDropElements) skipped
02:46:00 org.eclipse.papyrus.infra.gmfdiag.common.tests.ExpansionDropElements skipped
02:46:00 testAssistantForLabelNode(org.eclipse.papyrus.infra.gmfdiag.common.tests.AssistantUsage) skipped
02:46:00 org.eclipse.papyrus.infra.gmfdiag.common.tests.AssistantUsage skipped
02:46:00 testWrap(org.eclipse.papyrus.infra.gmfdiag.common.utils.GMFUnsafeTest) skipped
02:46:00 testWrite_command(org.eclipse.papyrus.infra.gmfdiag.common.utils.GMFUnsafeTest) skipped
02:46:00 testWrite_gmfCommand(org.eclipse.papyrus.infra.gmfdiag.common.utils.GMFUnsafeTest) skipped
02:46:00 testWrite_runnable(org.eclipse.papyrus.infra.gmfdiag.common.utils.GMFUnsafeTest) skipped
02:46:00 org.eclipse.papyrus.infra.gmfdiag.common.utils.GMFUnsafeTest skipped
02:46:00 initialSyncOfEmptyDiagram(org.eclipse.papyrus.infra.gmfdiag.common.sync.tests.MasterSlaveNotationSyncTest) skipped
02:46:00 newNodeOfWrongMetaclassNotSynchronized(org.eclipse.papyrus.infra.gmfdiag.common.sync.tests.MasterSlaveNotationSyncTest) skipped
02:46:00 createNewNode:create(org.eclipse.papyrus.infra.gmfdiag.common.sync.tests.MasterSlaveNotationSyncTest) skipped
02:46:00 createNewNode:undo(org.eclipse.papyrus.infra.gmfdiag.common.sync.tests.MasterSlaveNotationSyncTest) skipped
02:46:00 createNewNode:redo(org.eclipse.papyrus.infra.gmfdiag.common.sync.tests.MasterSlaveNotationSyncTest) skipped
02:46:00 createNewNode skipped
02:46:00 syncNodeLocation:move(org.eclipse.papyrus.infra.gmfdiag.common.sync.tests.MasterSlaveNotationSyncTest) skipped
02:46:00 syncNodeLocation:undo(org.eclipse.papyrus.infra.gmfdiag.common.sync.tests.MasterSlaveNotationSyncTest) skipped
02:46:00 syncNodeLocation:redo(org.eclipse.papyrus.infra.gmfdiag.common.sync.tests.MasterSlaveNotationSyncTest) skipped
02:46:00 syncNodeLocation skipped
02:46:00 deleteNode:deleteView(org.eclipse.papyrus.infra.gmfdiag.common.sync.tests.MasterSlaveNotationSyncTest) skipped
02:46:00 deleteNode:undo(org.eclipse.papyrus.infra.gmfdiag.common.sync.tests.MasterSlaveNotationSyncTest) skipped
02:46:00 deleteNode:redo(org.eclipse.papyrus.infra.gmfdiag.common.sync.tests.MasterSlaveNotationSyncTest) skipped
02:46:00 deleteNode skipped
02:46:00 syncNodeSize:resize(org.eclipse.papyrus.infra.gmfdiag.common.sync.tests.MasterSlaveNotationSyncTest) skipped
02:46:00 syncNodeSize:undo(org.eclipse.papyrus.infra.gmfdiag.common.sync.tests.MasterSlaveNotationSyncTest) skipped
02:46:00 syncNodeSize:redo(org.eclipse.papyrus.infra.gmfdiag.common.sync.tests.MasterSlaveNotationSyncTest) skipped
02:46:00 syncNodeSize skipped
02:46:00 org.eclipse.papyrus.infra.gmfdiag.common.sync.tests.MasterSlaveNotationSyncTest skipped
02:46:00 overrideSyncNodeSize:move(org.eclipse.papyrus.infra.gmfdiag.common.sync.tests.NotationSyncOverrideTest) skipped
02:46:00 overrideSyncNodeSize:override(org.eclipse.papyrus.infra.gmfdiag.common.sync.tests.NotationSyncOverrideTest) skipped
02:46:00 overrideSyncNodeSize:undo(org.eclipse.papyrus.infra.gmfdiag.common.sync.tests.NotationSyncOverrideTest) skipped
02:46:00 overrideSyncNodeSize:redo(org.eclipse.papyrus.infra.gmfdiag.common.sync.tests.NotationSyncOverrideTest) skipped
02:46:00 overrideSyncNodeSize skipped
02:46:00 overrideSyncNodeLocation:move(org.eclipse.papyrus.infra.gmfdiag.common.sync.tests.NotationSyncOverrideTest) skipped
02:46:00 overrideSyncNodeLocation:override(org.eclipse.papyrus.infra.gmfdiag.common.sync.tests.NotationSyncOverrideTest) skipped
02:46:00 overrideSyncNodeLocation:undo(org.eclipse.papyrus.infra.gmfdiag.common.sync.tests.NotationSyncOverrideTest) skipped
02:46:00 overrideSyncNodeLocation:redo(org.eclipse.papyrus.infra.gmfdiag.common.sync.tests.NotationSyncOverrideTest) skipped
02:46:00 overrideSyncNodeLocation skipped
02:46:00 org.eclipse.papyrus.infra.gmfdiag.common.sync.tests.NotationSyncOverrideTest skipped
02:46:00 org.eclipse.papyrus.infra.gmfdiag.common.sync.tests.SyncTests skipped
02:46:00 getText_unnamedDiagramNotifications(org.eclipse.papyrus.infra.gmfdiag.common.providers.tests.NotationLabelProviderTest) skipped
02:46:00 getText_namedDiagramNotifications(org.eclipse.papyrus.infra.gmfdiag.common.providers.tests.NotationLabelProviderTest) skipped
02:46:00 getText_unnamedDiagram(org.eclipse.papyrus.infra.gmfdiag.common.providers.tests.NotationLabelProviderTest) skipped
02:46:00 getText_unnamedDiagramChangeContextName(org.eclipse.papyrus.infra.gmfdiag.common.providers.tests.NotationLabelProviderTest) skipped
02:46:00 getText_namedDiagram(org.eclipse.papyrus.infra.gmfdiag.common.providers.tests.NotationLabelProviderTest) skipped
02:46:00 org.eclipse.papyrus.infra.gmfdiag.common.providers.tests.NotationLabelProviderTest skipped
02:46:00 createElement(org.eclipse.papyrus.infra.gmfdiag.common.commands.tests.CreateEditBasedElementCommandTest) skipped
02:46:00 org.eclipse.papyrus.infra.gmfdiag.common.commands.tests.CreateEditBasedElementCommandTest skipped
02:46:00 copyElement(org.eclipse.papyrus.infra.gmfdiag.common.commands.tests.DefaultCopyCommandTest) skipped
02:46:00 org.eclipse.papyrus.infra.gmfdiag.common.commands.tests.DefaultCopyCommandTest skipped
02:46:00 pasteElement(org.eclipse.papyrus.infra.gmfdiag.common.commands.tests.DefaultPasteCommandTest) skipped
02:46:00 org.eclipse.papyrus.infra.gmfdiag.common.commands.tests.DefaultPasteCommandTest skipped
02:46:00 copyElement(org.eclipse.papyrus.infra.gmfdiag.common.commands.tests.DefaultDiagramCopyCommandTest) skipped
02:46:00 org.eclipse.papyrus.infra.gmfdiag.common.commands.tests.DefaultDiagramCopyCommandTest skipped
02:46:00 pasteElement(org.eclipse.papyrus.infra.gmfdiag.common.commands.tests.DefaultDiagramPasteCommandTest) skipped
02:46:00 pasteProperty(org.eclipse.papyrus.infra.gmfdiag.common.commands.tests.DefaultDiagramPasteCommandTest) skipped
02:46:00 org.eclipse.papyrus.infra.gmfdiag.common.commands.tests.DefaultDiagramPasteCommandTest skipped
02:46:00 validateModel[0](org.eclipse.papyrus.infra.gmfdiag.common.tests.resources.ModelValidationTest) skipped
02:46:00 [0] skipped
02:46:00 validateModel[1](org.eclipse.papyrus.infra.gmfdiag.common.tests.resources.ModelValidationTest) skipped
02:46:00 [1] skipped
02:46:00 org.eclipse.papyrus.infra.gmfdiag.common.tests.resources.ModelValidationTest skipped
02:46:00 validateModel[0](org.eclipse.papyrus.infra.gmfdiag.common.tests.resources.TestModelValidationTest) skipped
02:46:00 [0] skipped
02:46:00 validateModel[1](org.eclipse.papyrus.infra.gmfdiag.common.tests.resources.TestModelValidationTest) skipped
02:46:00 [1] skipped
02:46:00 validateModel[2](org.eclipse.papyrus.infra.gmfdiag.common.tests.resources.TestModelValidationTest) skipped
02:46:00 [2] skipped
02:46:00 validateModel[3](org.eclipse.papyrus.infra.gmfdiag.common.tests.resources.TestModelValidationTest) skipped
02:46:00 [3] skipped
02:46:00 validateModel[4](org.eclipse.papyrus.infra.gmfdiag.common.tests.resources.TestModelValidationTest) skipped
02:46:00 [4] skipped
02:46:00 validateModel[5](org.eclipse.papyrus.infra.gmfdiag.common.tests.resources.TestModelValidationTest) skipped
02:46:00 [5] skipped
02:46:00 validateModel[6](org.eclipse.papyrus.infra.gmfdiag.common.tests.resources.TestModelValidationTest) skipped
02:46:00 [6] skipped
02:46:00 validateModel[7](org.eclipse.papyrus.infra.gmfdiag.common.tests.resources.TestModelValidationTest) skipped
02:46:00 [7] skipped
02:46:00 org.eclipse.papyrus.infra.gmfdiag.common.tests.resources.TestModelValidationTest skipped
02:46:00 org.eclipse.papyrus.infra.gmfdiag.common.tests.AllTests skipped
02:46:00 canonicalEdgesInClassDiagram(org.eclipse.papyrus.infra.gmfdiag.canonical.tests.BasicCanonicalClassDiagramTest) skipped
02:46:00 noCanonicalViewInCanonicalView(org.eclipse.papyrus.infra.gmfdiag.canonical.tests.BasicCanonicalClassDiagramTest) skipped
02:46:00 canonicalNodesInClassDiagram(org.eclipse.papyrus.infra.gmfdiag.canonical.tests.BasicCanonicalClassDiagramTest) skipped
02:46:00 noCanonicalEdgeOnCanonicalView(org.eclipse.papyrus.infra.gmfdiag.canonical.tests.BasicCanonicalClassDiagramTest) skipped
02:46:00 controlTestForNothingCanonical(org.eclipse.papyrus.infra.gmfdiag.canonical.tests.CanonicalStateInClassDiagramTest) skipped
02:46:00 toggleCanonicalOn:execute(org.eclipse.papyrus.infra.gmfdiag.canonical.tests.CanonicalStateInClassDiagramTest) skipped
02:46:00 toggleCanonicalOn:undo(org.eclipse.papyrus.infra.gmfdiag.canonical.tests.CanonicalStateInClassDiagramTest) skipped
02:46:00 toggleCanonicalOn:redo(org.eclipse.papyrus.infra.gmfdiag.canonical.tests.CanonicalStateInClassDiagramTest) skipped
02:46:00 toggleCanonicalInCanonicalNestedViews:on(org.eclipse.papyrus.infra.gmfdiag.canonical.tests.CanonicalStateInClassDiagramTest) skipped
02:46:00 toggleCanonicalInCanonicalNestedViews:off(org.eclipse.papyrus.infra.gmfdiag.canonical.tests.CanonicalStateInClassDiagramTest) skipped
02:46:00 toggleCanonicalOff:execute(org.eclipse.papyrus.infra.gmfdiag.canonical.tests.CanonicalStateInClassDiagramTest) skipped
02:46:00 toggleCanonicalOff:undo(org.eclipse.papyrus.infra.gmfdiag.canonical.tests.CanonicalStateInClassDiagramTest) skipped
02:46:00 toggleCanonicalOff:redo(org.eclipse.papyrus.infra.gmfdiag.canonical.tests.CanonicalStateInClassDiagramTest) skipped
02:46:00 reorderPropertiesInClass_bug420549:execute(org.eclipse.papyrus.infra.gmfdiag.canonical.tests.EditingInModelInClassDiagramTest) skipped
02:46:00 reorderPropertiesInClass_bug420549:undo(org.eclipse.papyrus.infra.gmfdiag.canonical.tests.EditingInModelInClassDiagramTest) skipped
02:46:00 reorderPropertiesInClass_bug420549:redo(org.eclipse.papyrus.infra.gmfdiag.canonical.tests.EditingInModelInClassDiagramTest) skipped
02:46:00 removeGeneralizationFromClass:execute(org.eclipse.papyrus.infra.gmfdiag.canonical.tests.EditingInModelInClassDiagramTest) skipped
02:46:00 removeGeneralizationFromClass:undo(org.eclipse.papyrus.infra.gmfdiag.canonical.tests.EditingInModelInClassDiagramTest) skipped
02:46:00 removeGeneralizationFromClass:redo(org.eclipse.papyrus.infra.gmfdiag.canonical.tests.EditingInModelInClassDiagramTest) skipped
02:46:00 addAssociationToClass:execute(org.eclipse.papyrus.infra.gmfdiag.canonical.tests.EditingInModelInClassDiagramTest) skipped
02:46:00 addAssociationToClass:undo(org.eclipse.papyrus.infra.gmfdiag.canonical.tests.EditingInModelInClassDiagramTest) skipped
02:46:00 addAssociationToClass:redo(org.eclipse.papyrus.infra.gmfdiag.canonical.tests.EditingInModelInClassDiagramTest) skipped
02:46:00 addElementImportToPackage:execute(org.eclipse.papyrus.infra.gmfdiag.canonical.tests.EditingInModelInClassDiagramTest) skipped
02:46:00 addElementImportToPackage:undo(org.eclipse.papyrus.infra.gmfdiag.canonical.tests.EditingInModelInClassDiagramTest) skipped
02:46:00 addElementImportToPackage:redo(org.eclipse.papyrus.infra.gmfdiag.canonical.tests.EditingInModelInClassDiagramTest) skipped
02:46:00 removeOperationFromClass:execute(org.eclipse.papyrus.infra.gmfdiag.canonical.tests.EditingInModelInClassDiagramTest) skipped
02:46:00 removeOperationFromClass:undo(org.eclipse.papyrus.infra.gmfdiag.canonical.tests.EditingInModelInClassDiagramTest) skipped
02:46:00 removeOperationFromClass:redo(org.eclipse.papyrus.infra.gmfdiag.canonical.tests.EditingInModelInClassDiagramTest) skipped
02:46:00 addInterfaceToPackage:execute(org.eclipse.papyrus.infra.gmfdiag.canonical.tests.EditingInModelInClassDiagramTest) skipped
02:46:00 addInterfaceToPackage:undo(org.eclipse.papyrus.infra.gmfdiag.canonical.tests.EditingInModelInClassDiagramTest) skipped
02:46:00 addInterfaceToPackage:redo(org.eclipse.papyrus.infra.gmfdiag.canonical.tests.EditingInModelInClassDiagramTest) skipped
02:46:00 removeClassFromPackage:execute(org.eclipse.papyrus.infra.gmfdiag.canonical.tests.EditingInModelInClassDiagramTest) skipped
02:46:00 removeClassFromPackage:undo(org.eclipse.papyrus.infra.gmfdiag.canonical.tests.EditingInModelInClassDiagramTest) skipped
02:46:00 removeClassFromPackage:redo(org.eclipse.papyrus.infra.gmfdiag.canonical.tests.EditingInModelInClassDiagramTest) skipped
02:46:00 addPropertyToClass:execute(org.eclipse.papyrus.infra.gmfdiag.canonical.tests.EditingInModelInClassDiagramTest) skipped
02:46:00 addPropertyToClass:undo(org.eclipse.papyrus.infra.gmfdiag.canonical.tests.EditingInModelInClassDiagramTest) skipped
02:46:00 addPropertyToClass:redo(org.eclipse.papyrus.infra.gmfdiag.canonical.tests.EditingInModelInClassDiagramTest) skipped
02:46:00 addDependencyToClass:execute(org.eclipse.papyrus.infra.gmfdiag.canonical.tests.EditingInModelInClassDiagramTest) skipped
02:46:00 addDependencyToClass:undo(org.eclipse.papyrus.infra.gmfdiag.canonical.tests.EditingInModelInClassDiagramTest) skipped
02:46:00 addDependencyToClass:redo(org.eclipse.papyrus.infra.gmfdiag.canonical.tests.EditingInModelInClassDiagramTest) skipped
02:46:00 deleteGeneralizationViewFromClass:execute(org.eclipse.papyrus.infra.gmfdiag.canonical.tests.CanonicalViewDeletionInClassDiagramTest) skipped
02:46:00 deleteGeneralizationViewFromClass:undo(org.eclipse.papyrus.infra.gmfdiag.canonical.tests.CanonicalViewDeletionInClassDiagramTest) skipped
02:46:00 deleteGeneralizationViewFromClass:redo(org.eclipse.papyrus.infra.gmfdiag.canonical.tests.CanonicalViewDeletionInClassDiagramTest) skipped
02:46:00 deleteAssociationViewFromClass:execute(org.eclipse.papyrus.infra.gmfdiag.canonical.tests.CanonicalViewDeletionInClassDiagramTest) skipped
02:46:00 deleteAssociationViewFromClass:undo(org.eclipse.papyrus.infra.gmfdiag.canonical.tests.CanonicalViewDeletionInClassDiagramTest) skipped
02:46:00 deleteAssociationViewFromClass:redo(org.eclipse.papyrus.infra.gmfdiag.canonical.tests.CanonicalViewDeletionInClassDiagramTest) skipped
02:46:00 deleteClassViewFromPackage:execute(org.eclipse.papyrus.infra.gmfdiag.canonical.tests.CanonicalViewDeletionInClassDiagramTest) skipped
02:46:00 deleteClassViewFromPackage:undo(org.eclipse.papyrus.infra.gmfdiag.canonical.tests.CanonicalViewDeletionInClassDiagramTest) skipped
02:46:00 deleteClassViewFromPackage:redo(org.eclipse.papyrus.infra.gmfdiag.canonical.tests.CanonicalViewDeletionInClassDiagramTest) skipped
02:46:00 deleteOperationViewFromClass:execute(org.eclipse.papyrus.infra.gmfdiag.canonical.tests.CanonicalViewDeletionInClassDiagramTest) skipped
02:46:00 deleteOperationViewFromClass:undo(org.eclipse.papyrus.infra.gmfdiag.canonical.tests.CanonicalViewDeletionInClassDiagramTest) skipped
02:46:00 deleteOperationViewFromClass:redo(org.eclipse.papyrus.infra.gmfdiag.canonical.tests.CanonicalViewDeletionInClassDiagramTest) skipped
02:46:00 deleteDataTypeFromPackage:execute(org.eclipse.papyrus.infra.gmfdiag.canonical.tests.EditingInClassDiagramRegressionTest) skipped
02:46:00 deleteDataTypeFromPackage:undo(org.eclipse.papyrus.infra.gmfdiag.canonical.tests.EditingInClassDiagramRegressionTest) skipped
02:46:00 deleteDataTypeFromPackage:redo(org.eclipse.papyrus.infra.gmfdiag.canonical.tests.EditingInClassDiagramRegressionTest) skipped
02:46:00 deleteAssociationFromClass:execute(org.eclipse.papyrus.infra.gmfdiag.canonical.tests.EditingInClassDiagramRegressionTest) skipped
02:46:00 deleteAssociationFromClass:undo(org.eclipse.papyrus.infra.gmfdiag.canonical.tests.EditingInClassDiagramRegressionTest) skipped
02:46:00 deleteAssociationFromClass:redo(org.eclipse.papyrus.infra.gmfdiag.canonical.tests.EditingInClassDiagramRegressionTest) skipped
02:46:00 deleteLiteralInEnumeration:execute(org.eclipse.papyrus.infra.gmfdiag.canonical.tests.EditingInClassDiagramRegressionTest) skipped
02:46:00 deleteLiteralInEnumeration:undo(org.eclipse.papyrus.infra.gmfdiag.canonical.tests.EditingInClassDiagramRegressionTest) skipped
02:46:00 deleteLiteralInEnumeration:redo(org.eclipse.papyrus.infra.gmfdiag.canonical.tests.EditingInClassDiagramRegressionTest) skipped
02:46:00 createPropertyInClass:execute(org.eclipse.papyrus.infra.gmfdiag.canonical.tests.EditingInClassDiagramRegressionTest) skipped
02:46:00 createPropertyInClass:undo(org.eclipse.papyrus.infra.gmfdiag.canonical.tests.EditingInClassDiagramRegressionTest) skipped
02:46:00 createPropertyInClass:redo(org.eclipse.papyrus.infra.gmfdiag.canonical.tests.EditingInClassDiagramRegressionTest) skipped
02:46:00 createDependencyInClass:execute(org.eclipse.papyrus.infra.gmfdiag.canonical.tests.EditingInClassDiagramRegressionTest) skipped
02:46:00 createDependencyInClass:undo(org.eclipse.papyrus.infra.gmfdiag.canonical.tests.EditingInClassDiagramRegressionTest) skipped
02:46:00 createDependencyInClass:redo(org.eclipse.papyrus.infra.gmfdiag.canonical.tests.EditingInClassDiagramRegressionTest) skipped
02:46:00 createInterfaceInPackage:execute(org.eclipse.papyrus.infra.gmfdiag.canonical.tests.EditingInClassDiagramRegressionTest) skipped
02:46:00 createInterfaceInPackage:undo(org.eclipse.papyrus.infra.gmfdiag.canonical.tests.EditingInClassDiagramRegressionTest) skipped
02:46:00 createInterfaceInPackage:redo(org.eclipse.papyrus.infra.gmfdiag.canonical.tests.EditingInClassDiagramRegressionTest) skipped
02:46:00 canonicalEdgesInClassDiagram(org.eclipse.papyrus.infra.gmfdiag.canonical.tests.CSSCanonicalClassDiagramTest) skipped
02:46:00 nestedCanonicalNodesByMetaclassSelectorInCanonicalView(org.eclipse.papyrus.infra.gmfdiag.canonical.tests.CSSCanonicalClassDiagramTest) skipped
02:46:00 nestedCanonicalEdgesInCanonicalView(org.eclipse.papyrus.infra.gmfdiag.canonical.tests.CSSCanonicalClassDiagramTest) skipped
02:46:00 canonicalNodesByMetaclassSelectorInClassDiagram(org.eclipse.papyrus.infra.gmfdiag.canonical.tests.CSSCanonicalClassDiagramTest) skipped
02:46:00 canonicalNodesByExplicitStyleClassInClassDiagram(org.eclipse.papyrus.infra.gmfdiag.canonical.tests.CSSCanonicalClassDiagramTest) skipped
02:46:00 controlTestForNothingCanonical(org.eclipse.papyrus.infra.gmfdiag.canonical.tests.CSSCanonicalStateInClassDiagramTest) skipped
02:46:00 overrideSelectorRule(org.eclipse.papyrus.infra.gmfdiag.canonical.tests.CSSCanonicalStateInClassDiagramTest) skipped
02:46:00 overrideExplicitClassRule(org.eclipse.papyrus.infra.gmfdiag.canonical.tests.CSSCanonicalStateInClassDiagramTest) skipped
02:46:00 addStyleClass:execute(org.eclipse.papyrus.infra.gmfdiag.canonical.tests.CSSCanonicalStateInClassDiagramTest) skipped
02:46:00 addStyleClass:undo(org.eclipse.papyrus.infra.gmfdiag.canonical.tests.CSSCanonicalStateInClassDiagramTest) skipped
02:46:00 addStyleClass:redo(org.eclipse.papyrus.infra.gmfdiag.canonical.tests.CSSCanonicalStateInClassDiagramTest) skipped
02:46:00 addStylesheet:execute(org.eclipse.papyrus.infra.gmfdiag.canonical.tests.CSSCanonicalStateInClassDiagramTest) skipped
02:46:00 addStylesheet:undo(org.eclipse.papyrus.infra.gmfdiag.canonical.tests.CSSCanonicalStateInClassDiagramTest) skipped
02:46:00 addStylesheet:redo(org.eclipse.papyrus.infra.gmfdiag.canonical.tests.CSSCanonicalStateInClassDiagramTest) skipped
02:46:00 editStylesheetRefresh:initial(org.eclipse.papyrus.infra.gmfdiag.canonical.tests.CSSExternalStylesheetInClassDiagramTest) skipped
02:46:00 editStylesheetRefresh:non-canonical(org.eclipse.papyrus.infra.gmfdiag.canonical.tests.CSSExternalStylesheetInClassDiagramTest) skipped
02:46:00 editStylesheetRefresh:canonical(org.eclipse.papyrus.infra.gmfdiag.canonical.tests.CSSExternalStylesheetInClassDiagramTest) skipped
02:46:00 editStylesheetRefresh:undo(org.eclipse.papyrus.infra.gmfdiag.canonical.tests.CSSExternalStylesheetInClassDiagramTest) skipped
02:46:00 editStylesheetRefresh:redo(org.eclipse.papyrus.infra.gmfdiag.canonical.tests.CSSExternalStylesheetInClassDiagramTest) skipped
02:46:00 editStylesheetRefresh_closeReopenDiagram_undo:initial(org.eclipse.papyrus.infra.gmfdiag.canonical.tests.CSSExternalStylesheetInClassDiagramTest) skipped
02:46:00 editStylesheetRefresh_closeReopenDiagram_undo:close-reopen(org.eclipse.papyrus.infra.gmfdiag.canonical.tests.CSSExternalStylesheetInClassDiagramTest) skipped
02:46:00 editStylesheetRefresh_closeReopenDiagram_undo:undo(org.eclipse.papyrus.infra.gmfdiag.canonical.tests.CSSExternalStylesheetInClassDiagramTest) skipped
02:46:00 associationEndWhenNoAssociationEdge_bug473148(org.eclipse.papyrus.infra.gmfdiag.canonical.tests.RegressionTest)  Time elapsed: 10.78 s
02:46:00 nestedClassifiersDontCauseLoopInCompositeDiagram_bug474489(org.eclipse.papyrus.infra.gmfdiag.canonical.tests.RegressionTest) skipped
02:46:00 associationEndCanonicalPresentation_bug473148(org.eclipse.papyrus.infra.gmfdiag.canonical.tests.RegressionTest) skipped
02:46:00 referenceConnectionNotDeleted_bug472155:initial(org.eclipse.papyrus.infra.gmfdiag.canonical.tests.RegressionTest) skipped
02:46:00 referenceConnectionNotDeleted_bug472155:synch(org.eclipse.papyrus.infra.gmfdiag.canonical.tests.RegressionTest) skipped
02:46:00 referenceConnectionNotDeleted_bug472155:undo(org.eclipse.papyrus.infra.gmfdiag.canonical.tests.RegressionTest) skipped
02:46:00 referenceConnectionNotDeleted_bug472155:redo(org.eclipse.papyrus.infra.gmfdiag.canonical.tests.RegressionTest) skipped
02:46:00 testReadOnlyAxisTransactionOption(org.eclipse.papyrus.infra.emf.readonly.PapyrusROTransactionalEditingDomainTest) skipped
02:46:00 testReferenceToReadOnlyObjectWithOppositeRolledBackCommand(org.eclipse.papyrus.infra.emf.readonly.PapyrusROTransactionalEditingDomainTest) skipped
02:46:00 testReferenceToReadOnlyObjectWithOppositeRolledBackOperation(org.eclipse.papyrus.infra.emf.readonly.PapyrusROTransactionalEditingDomainTest) skipped
02:46:00 org.eclipse.papyrus.infra.emf.readonly.PapyrusROTransactionalEditingDomainTest skipped
02:46:00 testIsReadOnlyEObject(org.eclipse.papyrus.infra.emf.readonly.ReadOnlyManagerTest) skipped
02:46:00 testSashModelReadOnlyIfPermissionReadOnly(org.eclipse.papyrus.infra.emf.readonly.ReadOnlyManagerTest) skipped
02:46:00 testAnyReadOnlyURIs(org.eclipse.papyrus.infra.emf.readonly.ReadOnlyManagerTest) skipped
02:46:00 testCanMakeWritableEObject(org.eclipse.papyrus.infra.emf.readonly.ReadOnlyManagerTest) skipped
02:46:00 testCanMakeWritableURIs(org.eclipse.papyrus.infra.emf.readonly.ReadOnlyManagerTest) skipped
02:46:00 org.eclipse.papyrus.infra.emf.readonly.ReadOnlyManagerTest skipped
02:46:00 testCanMakeWritable(org.eclipse.papyrus.infra.emf.readonly.ReadOnlyTesterTest) skipped
02:46:00 testAsBoolean(org.eclipse.papyrus.infra.emf.readonly.ReadOnlyTesterTest) skipped
02:46:00 testIsReadOnly(org.eclipse.papyrus.infra.emf.readonly.ReadOnlyTesterTest) skipped
02:46:00 org.eclipse.papyrus.infra.emf.readonly.ReadOnlyTesterTest skipped
02:46:00 org.eclipse.papyrus.infra.emf.readonly.tests.AllTests skipped
02:46:00 testGetSashRow__int_int(org.eclipse.papyrus.infra.editor.welcome.tests.WelcomePageTest) skipped
02:46:00 testGetVisibleSections(org.eclipse.papyrus.infra.editor.welcome.tests.WelcomePageTest) skipped
02:46:00 testGetSashColumn__int(org.eclipse.papyrus.infra.editor.welcome.tests.WelcomePageTest) skipped
02:46:00 testGetSection__String(org.eclipse.papyrus.infra.editor.welcome.tests.WelcomePageTest) skipped
02:46:00 org.eclipse.papyrus.infra.editor.welcome.tests.WelcomePageTest skipped
02:46:00 testIsIdentifiedBy__String(org.eclipse.papyrus.infra.editor.welcome.tests.WelcomeSectionTest) skipped
02:46:00 org.eclipse.papyrus.infra.editor.welcome.tests.WelcomeSectionTest skipped
02:46:00 testGetSashRow__int(org.eclipse.papyrus.infra.editor.welcome.tests.SashColumnTest) skipped
02:46:00 org.eclipse.papyrus.infra.editor.welcome.tests.SashColumnTest skipped
02:46:00 welcome Tests skipped
02:46:00 Welcome Tests skipped
02:46:00 openWelcomePage(org.eclipse.papyrus.infra.editor.welcome.tests.WelcomePageServiceTest) skipped
02:46:00 closeWelcomePage(org.eclipse.papyrus.infra.editor.welcome.tests.WelcomePageServiceTest) skipped
02:46:00 pageRemovalValidator(org.eclipse.papyrus.infra.editor.welcome.tests.WelcomePageServiceTest) skipped
02:46:00 emptyModelShowsWelcomePage(org.eclipse.papyrus.infra.editor.welcome.tests.WelcomePageServiceTest) skipped
02:46:00 emptyModelCannotCloseWelcomePage(org.eclipse.papyrus.infra.editor.welcome.tests.WelcomePageServiceTest) skipped
02:46:00 canCloseWelcomePage(org.eclipse.papyrus.infra.editor.welcome.tests.WelcomePageServiceTest) skipped
02:46:00 welcomeModelResource(org.eclipse.papyrus.infra.editor.welcome.tests.WelcomePageServiceTest) skipped
02:46:00 welcomeModelElement(org.eclipse.papyrus.infra.editor.welcome.tests.WelcomePageServiceTest) skipped
02:46:00 getOwner(org.eclipse.papyrus.infra.editor.welcome.tests.WelcomePageServiceTest) skipped
02:46:00 org.eclipse.papyrus.infra.editor.welcome.tests.WelcomePageServiceTest skipped
02:46:00 languagesProperty(org.eclipse.papyrus.infra.editor.welcome.tests.WelcomeModelElementTest) skipped
02:46:00 isEditableRestoreActivePage(org.eclipse.papyrus.infra.editor.welcome.tests.WelcomeModelElementTest) skipped
02:46:00 privateLayoutProperty(org.eclipse.papyrus.infra.editor.welcome.tests.WelcomeModelElementTest) skipped
02:46:00 restoreActivePageProperty(org.eclipse.papyrus.infra.editor.welcome.tests.WelcomeModelElementTest) skipped
02:46:00 isEditable(org.eclipse.papyrus.infra.editor.welcome.tests.WelcomeModelElementTest) skipped
02:46:00 dispose_bug487027(org.eclipse.papyrus.infra.editor.welcome.tests.WelcomeModelElementTest) skipped
02:46:00 org.eclipse.papyrus.infra.editor.welcome.tests.WelcomeModelElementTest skipped
02:46:00 org.eclipse.papyrus.infra.editor.welcome.tests.AllTests skipped
02:46:00 viewsProperty(org.eclipse.papyrus.infra.gmfdiag.welcome.tests.WelcomeModelElementTest) skipped
02:46:00 isEditable(org.eclipse.papyrus.infra.gmfdiag.welcome.tests.WelcomeModelElementTest) skipped
02:46:00 createView(org.eclipse.papyrus.infra.gmfdiag.welcome.tests.WelcomeModelElementTest) skipped
02:46:00 dispose_bug487027(org.eclipse.papyrus.infra.gmfdiag.welcome.tests.WelcomeModelElementTest) skipped
02:46:00 deleteView(org.eclipse.papyrus.infra.gmfdiag.welcome.tests.WelcomeModelElementTest) skipped
02:46:00 org.eclipse.papyrus.infra.gmfdiag.welcome.tests.WelcomeModelElementTest skipped
02:46:00 viewsPropertyExcludesPluginDeployedModels_bug493668(org.eclipse.papyrus.infra.gmfdiag.welcome.tests.NotationObservablePropertyTest) skipped
02:46:00 org.eclipse.papyrus.infra.gmfdiag.welcome.tests.NotationObservablePropertyTest skipped
02:46:00 org.eclipse.papyrus.infra.gmfdiag.welcome.tests.AllTests skipped
02:46:00 labelProviderChange(org.eclipse.papyrus.infra.properties.ui.providers.tests.PropertiesHeaderLabelProviderTest) skipped
02:46:00 org.eclipse.papyrus.infra.properties.ui.providers.tests.PropertiesHeaderLabelProviderTest skipped
02:46:00 createWithLocalFactory(org.eclipse.papyrus.infra.properties.ui.tests.EcorePropertyEditorFactoryTest) skipped
02:46:00 org.eclipse.papyrus.infra.properties.ui.tests.EcorePropertyEditorFactoryTest skipped
02:46:00 org.eclipse.papyrus.infra.properties.ui.tests.AllTests skipped
02:46:00 testMatches__Object_not(org.eclipse.papyrus.infra.filters.tests.CompoundFilterTest) skipped
02:46:00 testMatches__Object_xor(org.eclipse.papyrus.infra.filters.tests.CompoundFilterTest) skipped
02:46:00 testMatches__Object(org.eclipse.papyrus.infra.filters.tests.CompoundFilterTest) skipped
02:46:00 testMatches__Object_or(org.eclipse.papyrus.infra.filters.tests.CompoundFilterTest) skipped
02:46:00 testValidateAcyclic__DiagnosticChain_Map(org.eclipse.papyrus.infra.filters.tests.CompoundFilterTest) skipped
02:46:00 org.eclipse.papyrus.infra.filters.tests.CompoundFilterTest skipped
02:46:00 testMatches__Object(org.eclipse.papyrus.infra.filters.tests.EqualsTest) skipped
02:46:00 org.eclipse.papyrus.infra.filters.tests.EqualsTest skipped
02:46:00 filters Tests skipped
02:46:00 Filters Tests skipped
02:46:00 org.eclipse.papyrus.infra.filters.tests.AllTests skipped
02:46:00 testMatches__Object(org.eclipse.papyrus.infra.gmfdiag.assistant.tests.AssistedElementTypeFilterTest) skipped
02:46:00 testGetProvider(org.eclipse.papyrus.infra.gmfdiag.assistant.tests.AssistedElementTypeFilterTest) skipped
02:46:00 org.eclipse.papyrus.infra.gmfdiag.assistant.tests.AssistedElementTypeFilterTest skipped
02:46:00 testGetRelTypesOnSourceAndTarget__IAdaptable_IAdaptable(org.eclipse.papyrus.infra.gmfdiag.assistant.tests.ModelingAssistantProviderTest) skipped
02:46:00 testGetRelTypesForSREOnSource__IAdaptable(org.eclipse.papyrus.infra.gmfdiag.assistant.tests.ModelingAssistantProviderTest) skipped
02:46:00 testRemoveProviderChangeListener__IProviderChangeListener(org.eclipse.papyrus.infra.gmfdiag.assistant.tests.ModelingAssistantProviderTest) skipped
02:46:00 testGetTypesForTarget__IAdaptable_IElementType(org.eclipse.papyrus.infra.gmfdiag.assistant.tests.ModelingAssistantProviderTest) skipped
02:46:00 testGetClientContext(org.eclipse.papyrus.infra.gmfdiag.assistant.tests.ModelingAssistantProviderTest) skipped
02:46:00 testAddProviderChangeListener__IProviderChangeListener(org.eclipse.papyrus.infra.gmfdiag.assistant.tests.ModelingAssistantProviderTest) skipped
02:46:00 testSelectExistingElementForTarget__IAdaptable_IElementType(org.eclipse.papyrus.infra.gmfdiag.assistant.tests.ModelingAssistantProviderTest) skipped
02:46:00 testGetRelTypesOnSource__IAdaptable(org.eclipse.papyrus.infra.gmfdiag.assistant.tests.ModelingAssistantProviderTest) skipped
02:46:00 testGetElementType__String(org.eclipse.papyrus.infra.gmfdiag.assistant.tests.ModelingAssistantProviderTest) skipped
02:46:00 testGetExcludedElementTypes(org.eclipse.papyrus.infra.gmfdiag.assistant.tests.ModelingAssistantProviderTest) skipped
02:46:00 testGetTypesForSource__IAdaptable_IElementType(org.eclipse.papyrus.infra.gmfdiag.assistant.tests.ModelingAssistantProviderTest) skipped
02:46:00 testSelectExistingElementForSource__IAdaptable_IElementType(org.eclipse.papyrus.infra.gmfdiag.assistant.tests.ModelingAssistantProviderTest) skipped
02:46:00 testGetTypesForPopupBar__IAdaptable(org.eclipse.papyrus.infra.gmfdiag.assistant.tests.ModelingAssistantProviderTest) skipped
02:46:00 testGetRelTypesForSREOnTarget__IAdaptable(org.eclipse.papyrus.infra.gmfdiag.assistant.tests.ModelingAssistantProviderTest) skipped
02:46:00 testGetElementTypes(org.eclipse.papyrus.infra.gmfdiag.assistant.tests.ModelingAssistantProviderTest) skipped
02:46:00 testIsRelationshipType__IElementType(org.eclipse.papyrus.infra.gmfdiag.assistant.tests.ModelingAssistantProviderTest) skipped
02:46:00 testGetTypes__String_IAdaptable(org.eclipse.papyrus.infra.gmfdiag.assistant.tests.ModelingAssistantProviderTest) skipped
02:46:00 testGetRelationshipTypes(org.eclipse.papyrus.infra.gmfdiag.assistant.tests.ModelingAssistantProviderTest) skipped
02:46:00 testGetRelTypesOnTarget__IAdaptable(org.eclipse.papyrus.infra.gmfdiag.assistant.tests.ModelingAssistantProviderTest) skipped
02:46:00 testProvides__IOperation(org.eclipse.papyrus.infra.gmfdiag.assistant.tests.ModelingAssistantProviderTest) skipped
02:46:00 org.eclipse.papyrus.infra.gmfdiag.assistant.tests.ModelingAssistantProviderTest skipped
02:46:00 testGetElementType(org.eclipse.papyrus.infra.gmfdiag.assistant.tests.PopupAssistantTest) skipped
02:46:00 org.eclipse.papyrus.infra.gmfdiag.assistant.tests.PopupAssistantTest skipped
02:46:00 testGetElementType(org.eclipse.papyrus.infra.gmfdiag.assistant.tests.ConnectionAssistantTest) skipped
02:46:00 org.eclipse.papyrus.infra.gmfdiag.assistant.tests.ConnectionAssistantTest skipped
02:46:00 testGetElementType(org.eclipse.papyrus.infra.gmfdiag.assistant.tests.ElementTypeFilterTest) skipped
02:46:00 testMatches__Object(org.eclipse.papyrus.infra.gmfdiag.assistant.tests.ElementTypeFilterTest) skipped
02:46:00 testGetProvider(org.eclipse.papyrus.infra.gmfdiag.assistant.tests.ElementTypeFilterTest) skipped
02:46:00 org.eclipse.papyrus.infra.gmfdiag.assistant.tests.ElementTypeFilterTest skipped
02:46:00 assistant Tests skipped
02:46:00 Assistant Tests skipped
02:46:00 sourceForConnectionToTarget(org.eclipse.papyrus.infra.gmfdiag.assistant.tests.GenericModelingAssistantIntegrationTest) skipped
02:46:00 excludedConnectionFromSource(org.eclipse.papyrus.infra.gmfdiag.assistant.tests.GenericModelingAssistantIntegrationTest) skipped
02:46:00 connectionToTarget(org.eclipse.papyrus.infra.gmfdiag.assistant.tests.GenericModelingAssistantIntegrationTest) skipped
02:46:00 excludedConnectionToTarget(org.eclipse.papyrus.infra.gmfdiag.assistant.tests.GenericModelingAssistantIntegrationTest) skipped
02:46:00 excludedTargetForConnectionFromSource(org.eclipse.papyrus.infra.gmfdiag.assistant.tests.GenericModelingAssistantIntegrationTest) skipped
02:46:00 excludedSourceForConnectionToTarget(org.eclipse.papyrus.infra.gmfdiag.assistant.tests.GenericModelingAssistantIntegrationTest) skipped
02:46:00 excludedConnectionFromSourceToTarget(org.eclipse.papyrus.infra.gmfdiag.assistant.tests.GenericModelingAssistantIntegrationTest) skipped
02:46:00 targetForConnectionFromSource(org.eclipse.papyrus.infra.gmfdiag.assistant.tests.GenericModelingAssistantIntegrationTest) skipped
02:46:00 popupOnDiagramSurface(org.eclipse.papyrus.infra.gmfdiag.assistant.tests.GenericModelingAssistantIntegrationTest) skipped
02:46:00 connectionFromSource(org.eclipse.papyrus.infra.gmfdiag.assistant.tests.GenericModelingAssistantIntegrationTest) skipped
02:46:00 popupOnShape(org.eclipse.papyrus.infra.gmfdiag.assistant.tests.GenericModelingAssistantIntegrationTest) skipped
02:46:00 excludedPopupOnDiagramSurface(org.eclipse.papyrus.infra.gmfdiag.assistant.tests.GenericModelingAssistantIntegrationTest) skipped
02:46:00 connectionFromSourceToTarget(org.eclipse.papyrus.infra.gmfdiag.assistant.tests.GenericModelingAssistantIntegrationTest) skipped
02:46:00 org.eclipse.papyrus.infra.gmfdiag.assistant.tests.GenericModelingAssistantIntegrationTest skipped
02:46:00 sourceForConnectionToTarget(org.eclipse.papyrus.infra.gmfdiag.assistant.tests.DiagramSpecificModelingAssistantIntegrationTest) skipped
02:46:00 connectionToTarget(org.eclipse.papyrus.infra.gmfdiag.assistant.tests.DiagramSpecificModelingAssistantIntegrationTest) skipped
02:46:00 targetForConnectionFromSource(org.eclipse.papyrus.infra.gmfdiag.assistant.tests.DiagramSpecificModelingAssistantIntegrationTest) skipped
02:46:00 popupOnDiagramSurface(org.eclipse.papyrus.infra.gmfdiag.assistant.tests.DiagramSpecificModelingAssistantIntegrationTest) skipped
02:46:00 connectionFromSource(org.eclipse.papyrus.infra.gmfdiag.assistant.tests.DiagramSpecificModelingAssistantIntegrationTest) skipped
02:46:00 popupOnShape(org.eclipse.papyrus.infra.gmfdiag.assistant.tests.DiagramSpecificModelingAssistantIntegrationTest) skipped
02:46:00 connectionFromSourceToTarget(org.eclipse.papyrus.infra.gmfdiag.assistant.tests.DiagramSpecificModelingAssistantIntegrationTest) skipped
02:46:00 org.eclipse.papyrus.infra.gmfdiag.assistant.tests.DiagramSpecificModelingAssistantIntegrationTest skipped
02:46:00 org.eclipse.papyrus.infra.gmfdiag.assistant.tests.AllTests skipped
02:46:00 testGetObjectOfPathmapResource(org.eclipse.papyrus.infra.services.resourceloading.tests.testModel1.Strategy1TestModel1) skipped
02:46:00 testGetObjectOfProfileResource(org.eclipse.papyrus.infra.services.resourceloading.tests.testModel1.Strategy1TestModel1) skipped
02:46:00 testGetDanglingReferenceFromAControlledResource(org.eclipse.papyrus.infra.services.resourceloading.tests.testModel1.Strategy1TestModel1) skipped
02:46:00 testGetObjectOfControlledResource(org.eclipse.papyrus.infra.services.resourceloading.tests.testModel1.Strategy1TestModel1) skipped
02:46:00 testGetDiagramOfControlledResource(org.eclipse.papyrus.infra.services.resourceloading.tests.testModel1.Strategy1TestModel1) skipped
02:46:00 org.eclipse.papyrus.infra.services.resourceloading.tests.testModel1.Strategy1TestModel1 skipped
02:46:00 testGetObjectOfPathmapResource(org.eclipse.papyrus.infra.services.resourceloading.tests.testModel1.Strategy2TestModel1) skipped
02:46:00 testGetObjectOfProfileResource(org.eclipse.papyrus.infra.services.resourceloading.tests.testModel1.Strategy2TestModel1) skipped
02:46:00 testGetDanglingReferenceFromAControlledResource(org.eclipse.papyrus.infra.services.resourceloading.tests.testModel1.Strategy2TestModel1) skipped
02:46:00 testGetObjectOfControlledResource(org.eclipse.papyrus.infra.services.resourceloading.tests.testModel1.Strategy2TestModel1) skipped
02:46:00 testGetDiagramOfControlledResource(org.eclipse.papyrus.infra.services.resourceloading.tests.testModel1.Strategy2TestModel1) skipped
02:46:00 org.eclipse.papyrus.infra.services.resourceloading.tests.testModel1.Strategy2TestModel1 skipped
02:46:00 testGetObjectOfPathmapResource(org.eclipse.papyrus.infra.services.resourceloading.tests.testModel1.Strategy0TestModel1) skipped
02:46:00 testGetObjectOfProfileResource(org.eclipse.papyrus.infra.services.resourceloading.tests.testModel1.Strategy0TestModel1) skipped
02:46:00 testGetDanglingReferenceFromAControlledResource(org.eclipse.papyrus.infra.services.resourceloading.tests.testModel1.Strategy0TestModel1) skipped
02:46:00 testGetObjectOfControlledResource(org.eclipse.papyrus.infra.services.resourceloading.tests.testModel1.Strategy0TestModel1) skipped
02:46:00 testGetDiagramOfControlledResource(org.eclipse.papyrus.infra.services.resourceloading.tests.testModel1.Strategy0TestModel1) skipped
02:46:00 org.eclipse.papyrus.infra.services.resourceloading.tests.testModel1.Strategy0TestModel1 skipped
02:46:00 testGetFigureInControlledRessource(org.eclipse.papyrus.infra.services.resourceloading.tests.testModel2.Strategy0TestModel2WithModel1) skipped
02:46:00 testGetReferenceInControlledRessource(org.eclipse.papyrus.infra.services.resourceloading.tests.testModel2.Strategy0TestModel2WithModel1) skipped
02:46:00 org.eclipse.papyrus.infra.services.resourceloading.tests.testModel2.Strategy0TestModel2WithModel1 skipped
02:46:00 testGetFigureInControlledRessource(org.eclipse.papyrus.infra.services.resourceloading.tests.testModel2.Strategy0TestModel2WithPackage0) skipped
02:46:00 testGetReferenceInControlledRessource(org.eclipse.papyrus.infra.services.resourceloading.tests.testModel2.Strategy0TestModel2WithPackage0) skipped
02:46:00 org.eclipse.papyrus.infra.services.resourceloading.tests.testModel2.Strategy0TestModel2WithPackage0 skipped
02:46:00 testGetFigureInControlledRessource(org.eclipse.papyrus.infra.services.resourceloading.tests.testModel2.Strategy1TestModel2WithModel1) skipped
02:46:00 testGetReferenceInControlledRessource(org.eclipse.papyrus.infra.services.resourceloading.tests.testModel2.Strategy1TestModel2WithModel1) skipped
02:46:00 org.eclipse.papyrus.infra.services.resourceloading.tests.testModel2.Strategy1TestModel2WithModel1 skipped
02:46:00 testGetFigureInControlledRessource(org.eclipse.papyrus.infra.services.resourceloading.tests.testModel2.Strategy1TestModel2WithPackage0) skipped
02:46:00 testGetReferenceInControlledRessource(org.eclipse.papyrus.infra.services.resourceloading.tests.testModel2.Strategy1TestModel2WithPackage0) skipped
02:46:00 org.eclipse.papyrus.infra.services.resourceloading.tests.testModel2.Strategy1TestModel2WithPackage0 skipped
02:46:00 testGetFigureInControlledRessource(org.eclipse.papyrus.infra.services.resourceloading.tests.testModel2.Strategy2TestModel2WithModel1) skipped
02:46:00 testGetReferenceInControlledRessource(org.eclipse.papyrus.infra.services.resourceloading.tests.testModel2.Strategy2TestModel2WithModel1) skipped
02:46:00 org.eclipse.papyrus.infra.services.resourceloading.tests.testModel2.Strategy2TestModel2WithModel1 skipped
02:46:00 testGetFigureInControlledRessource(org.eclipse.papyrus.infra.services.resourceloading.tests.testModel2.Strategy2TestModel2WithPackage0) skipped
02:46:00 testGetReferenceInControlledRessource(org.eclipse.papyrus.infra.services.resourceloading.tests.testModel2.Strategy2TestModel2WithPackage0) skipped
02:46:00 org.eclipse.papyrus.infra.services.resourceloading.tests.testModel2.Strategy2TestModel2WithPackage0 skipped
02:46:00 org.eclipse.papyrus.infra.services.resourceloading.tests.AllTests skipped
02:46:00 testControlSeveralModelsWithProfile(org.eclipse.papyrus.infra.services.controlmode.tests.control.ControlModelWithProfileTest) skipped
02:46:00 testUndoControlSeveralModelsWithProfileInSameResource(org.eclipse.papyrus.infra.services.controlmode.tests.control.ControlModelWithProfileTest) skipped
02:46:00 testUndoControlModelWithProfile(org.eclipse.papyrus.infra.services.controlmode.tests.control.ControlModelWithProfileTest) skipped
02:46:00 testControlSeveralModelsWithProfileInSameResource(org.eclipse.papyrus.infra.services.controlmode.tests.control.ControlModelWithProfileTest) skipped
02:46:00 testControlModelWithProfile(org.eclipse.papyrus.infra.services.controlmode.tests.control.ControlModelWithProfileTest) skipped
02:46:00 testUndoControlSeveralModelsWithProfile(org.eclipse.papyrus.infra.services.controlmode.tests.control.ControlModelWithProfileTest) skipped
02:46:00 org.eclipse.papyrus.infra.services.controlmode.tests.control.ControlModelWithProfileTest skipped
02:46:00 testUncontrolShardSubunit(org.eclipse.papyrus.infra.services.controlmode.tests.uncontrol.UncontrolModelTest) skipped
02:46:00 testUncontrolOneSubmodel(org.eclipse.papyrus.infra.services.controlmode.tests.uncontrol.UncontrolModelTest) skipped
02:46:00 testUncontrolSeveralSubmodelsInSameResource(org.eclipse.papyrus.infra.services.controlmode.tests.uncontrol.UncontrolModelTest) skipped
02:46:00 testDeleteSubmodel(org.eclipse.papyrus.infra.services.controlmode.tests.uncontrol.UncontrolModelTest) skipped
02:46:00 testUncontrolSeveralSubmodels(org.eclipse.papyrus.infra.services.controlmode.tests.uncontrol.UncontrolModelTest) skipped
02:46:00 testUndoUncontrolOneSubmodel(org.eclipse.papyrus.infra.services.controlmode.tests.uncontrol.UncontrolModelTest) skipped
02:46:00 testUndoUncontrolSeveralSubmodelsWithoutSave(org.eclipse.papyrus.infra.services.controlmode.tests.uncontrol.UncontrolModelTest) skipped
02:46:00 testUndoUncontrolSeveralSubmodelsInSameResource(org.eclipse.papyrus.infra.services.controlmode.tests.uncontrol.UncontrolModelTest) skipped
02:46:00 testUncontrolUpdatesReferencesToRootObject_bug480209(org.eclipse.papyrus.infra.services.controlmode.tests.uncontrol.UncontrolModelTest) skipped
02:46:00 testUndoUncontrolSeveralSubmodels(org.eclipse.papyrus.infra.services.controlmode.tests.uncontrol.UncontrolModelTest) skipped
02:46:00 org.eclipse.papyrus.infra.services.controlmode.tests.uncontrol.UncontrolModelTest skipped
02:46:00 testControlModeUseCase1(org.eclipse.papyrus.infra.services.controlmode.tests.control.ControlModelTest) skipped
02:46:00 testControlModeUseCase2(org.eclipse.papyrus.infra.services.controlmode.tests.control.ControlModelTest) skipped
02:46:00 testControlModeUseCase3(org.eclipse.papyrus.infra.services.controlmode.tests.control.ControlModelTest) skipped
02:46:00 testControlSeveralModels(org.eclipse.papyrus.infra.services.controlmode.tests.control.ControlModelTest) skipped
02:46:00 testUndoControlOneSubmodel(org.eclipse.papyrus.infra.services.controlmode.tests.control.ControlModelTest) skipped
02:46:00 testUndoControlSeveralModels(org.eclipse.papyrus.infra.services.controlmode.tests.control.ControlModelTest) skipped
02:46:00 testControlSeveralModelsInSameResource(org.eclipse.papyrus.infra.services.controlmode.tests.control.ControlModelTest) skipped
02:46:00 testUndoControlSeveralModelsInSameResource(org.eclipse.papyrus.infra.services.controlmode.tests.control.ControlModelTest) skipped
02:46:00 testControlOneSubmodel(org.eclipse.papyrus.infra.services.controlmode.tests.control.ControlModelTest) skipped
02:46:00 org.eclipse.papyrus.infra.services.controlmode.tests.control.ControlModelTest skipped
02:46:00 testUncontrolModelWithProfile(org.eclipse.papyrus.infra.services.controlmode.tests.uncontrol.UncontrolModelWithProfileTest) skipped
02:46:00 testUncontrolSeveralModelsWithProfileInSameResource(org.eclipse.papyrus.infra.services.controlmode.tests.uncontrol.UncontrolModelWithProfileTest) skipped
02:46:00 testUndoUncontrolSeveralModelsWithProfile(org.eclipse.papyrus.infra.services.controlmode.tests.uncontrol.UncontrolModelWithProfileTest) skipped
02:46:00 testUndoUncontrolSeveralModelsWithProfileInSameResource(org.eclipse.papyrus.infra.services.controlmode.tests.uncontrol.UncontrolModelWithProfileTest) skipped
02:46:00 testUncontrolSeveralModelsWithProfile(org.eclipse.papyrus.infra.services.controlmode.tests.uncontrol.UncontrolModelWithProfileTest) skipped
02:46:00 testUndoUncontrolModelWithProfile(org.eclipse.papyrus.infra.services.controlmode.tests.uncontrol.UncontrolModelWithProfileTest) skipped
02:46:00 org.eclipse.papyrus.infra.services.controlmode.tests.uncontrol.UncontrolModelWithProfileTest skipped
02:46:00 testControlLegacyModel(org.eclipse.papyrus.infra.services.controlmode.tests.control.ControlLegacyModelTest) skipped
02:46:00 org.eclipse.papyrus.infra.services.controlmode.tests.control.ControlLegacyModelTest skipped
02:46:00 canCreateSubModel(org.eclipse.papyrus.infra.services.controlmode.tests.control.ControlModeManagerTest) skipped
02:46:00 approveUncontrolRequest(org.eclipse.papyrus.infra.services.controlmode.tests.control.ControlModeManagerTest) skipped
02:46:00 approveControlRequest(org.eclipse.papyrus.infra.services.controlmode.tests.control.ControlModeManagerTest) skipped
02:46:00 disapproveUncontrolRequest(org.eclipse.papyrus.infra.services.controlmode.tests.control.ControlModeManagerTest) skipped
02:46:00 disapproveControlRequest(org.eclipse.papyrus.infra.services.controlmode.tests.control.ControlModeManagerTest) skipped
02:46:00 org.eclipse.papyrus.infra.services.controlmode.tests.control.ControlModeManagerTest skipped
02:46:00 convertSubmodelToShard(org.eclipse.papyrus.infra.services.controlmode.tests.control.ShardModeTest) skipped
02:46:00 convertShardToSubmodel(org.eclipse.papyrus.infra.services.controlmode.tests.control.ShardModeTest) skipped
02:46:00 org.eclipse.papyrus.infra.services.controlmode.tests.control.ShardModeTest skipped
02:46:00 org.eclipse.papyrus.infra.services.controlmode.tests.AllTests skipped
02:46:00 testIsCanonicalWithNote(org.eclipse.papyrus.infra.gmfdiag.menu.utils.DeleteActionUtilTest) skipped
02:46:00 testDeleteNotOrphanElement(org.eclipse.papyrus.infra.gmfdiag.menu.utils.DeleteActionUtilTest) skipped
02:46:00 testIsCanonicalViewWithNotOrphan(org.eclipse.papyrus.infra.gmfdiag.menu.utils.DeleteActionUtilTest) skipped
02:46:00 testIsSupportViewWithOrphan(org.eclipse.papyrus.infra.gmfdiag.menu.utils.DeleteActionUtilTest) skipped
02:46:00 testIsCanonicalWithConnection(org.eclipse.papyrus.infra.gmfdiag.menu.utils.DeleteActionUtilTest) skipped
02:46:00 testIsCanonicalViewWithOrphan(org.eclipse.papyrus.infra.gmfdiag.menu.utils.DeleteActionUtilTest) skipped
02:46:00 testDeleteTextNode(org.eclipse.papyrus.infra.gmfdiag.menu.utils.DeleteActionUtilTest) skipped
02:46:00 testDeleteOrphan(org.eclipse.papyrus.infra.gmfdiag.menu.utils.DeleteActionUtilTest) skipped
02:46:00 testIsCanonicalWithNotOrphan(org.eclipse.papyrus.infra.gmfdiag.menu.utils.DeleteActionUtilTest) skipped
02:46:00 testIsSupportViewWithNote(org.eclipse.papyrus.infra.gmfdiag.menu.utils.DeleteActionUtilTest) skipped
02:46:00 testIsSupportViews(org.eclipse.papyrus.infra.gmfdiag.menu.utils.DeleteActionUtilTest) skipped
02:46:00 testIsCanonicalWithOrphan(org.eclipse.papyrus.infra.gmfdiag.menu.utils.DeleteActionUtilTest) skipped
02:46:00 testIsCanonical(org.eclipse.papyrus.infra.gmfdiag.menu.utils.DeleteActionUtilTest) skipped
02:46:00 testIsCanonicalViewWithNote(org.eclipse.papyrus.infra.gmfdiag.menu.utils.DeleteActionUtilTest) skipped
02:46:00 testIsSupportViewWithNotOrphan(org.eclipse.papyrus.infra.gmfdiag.menu.utils.DeleteActionUtilTest) skipped
02:46:00 org.eclipse.papyrus.infra.gmfdiag.menu.utils.DeleteActionUtilTest skipped
02:46:00 org.eclipse.papyrus.infra.gmfdiag.menu.tests.tests.AllTests skipped
02:46:00 testCSSClassContentProvider(org.eclipse.papyrus.infra.gmfdiag.css.tests.tests.CSSClassProviderTest) skipped
02:46:00 testPackage(org.eclipse.papyrus.infra.gmfdiag.css.tests.tests.CSSStylesheetTest) skipped
02:46:00 testClassStyle(org.eclipse.papyrus.infra.gmfdiag.css.tests.tests.CSSStylesheetTest) skipped
02:46:00 testCSSClassStyle(org.eclipse.papyrus.infra.gmfdiag.css.tests.tests.CSSStylesheetTest) skipped
02:46:00 testPriorities(org.eclipse.papyrus.infra.gmfdiag.css.tests.tests.CSSStylesheetTest) skipped
02:46:00 testInterfaceStyle(org.eclipse.papyrus.infra.gmfdiag.css.tests.tests.CSSStylesheetTest) skipped
02:46:00 testStyleSheetsPriorities(org.eclipse.papyrus.infra.gmfdiag.css.tests.tests.CSSModelStylesheetTest) skipped
02:46:00 testPackage(org.eclipse.papyrus.infra.gmfdiag.css.tests.tests.CSSModelStylesheetTest) skipped
02:46:00 testClassStyle(org.eclipse.papyrus.infra.gmfdiag.css.tests.tests.CSSModelStylesheetTest) skipped
02:46:00 testCSSClassStyle(org.eclipse.papyrus.infra.gmfdiag.css.tests.tests.CSSModelStylesheetTest) skipped
02:46:00 testPriorities(org.eclipse.papyrus.infra.gmfdiag.css.tests.tests.CSSModelStylesheetTest) skipped
02:46:00 testInterfaceStyle(org.eclipse.papyrus.infra.gmfdiag.css.tests.tests.CSSModelStylesheetTest) skipped
02:46:00 testStylesDisabled(org.eclipse.papyrus.infra.gmfdiag.css.tests.tests.CSSNamedStyleTest) skipped
02:46:00 testShowAllCompartmentsTitles(org.eclipse.papyrus.infra.gmfdiag.css.tests.tests.CSSCompartmentsTests) skipped
02:46:00 testCaseInsensitiveForEnumeration(org.eclipse.papyrus.infra.gmfdiag.css.tests.tests.CSSCompartmentsTests)  Time elapsed: 0.03 s  <<< FAILURE!
02:46:00 java.lang.AssertionError: EnumerationLiteral Compartment should not be collapsed
02:46:00 	at org.eclipse.papyrus.infra.gmfdiag.css.tests.tests.CSSCompartmentsTests.testCaseInsensitiveForEnumeration(CSSCompartmentsTests.java:138)
02:46:00 
02:46:00 testAttributeCompartment(org.eclipse.papyrus.infra.gmfdiag.css.tests.tests.CSSCompartmentsTests) skipped
02:46:00 testCompartmentForceValue(org.eclipse.papyrus.infra.gmfdiag.css.tests.tests.CSSCompartmentsTests) skipped
02:46:00 testAttributeCompartmentForInterface(org.eclipse.papyrus.infra.gmfdiag.css.tests.tests.CSSCompartmentsTests) skipped
02:46:00 testWithoutCSSSupport(org.eclipse.papyrus.infra.gmfdiag.css.tests.tests.CSSSupportTest) skipped
02:46:00 testCSSSupport(org.eclipse.papyrus.infra.gmfdiag.css.tests.tests.CSSSupportTest) skipped
02:46:00 testProjectStylesheets(org.eclipse.papyrus.infra.gmfdiag.css.tests.tests.CSSProjectStylesheetsTest) skipped
02:46:00 testPackage(org.eclipse.papyrus.infra.gmfdiag.css.tests.tests.CSSProjectStylesheetsTest) skipped
02:46:00 testClassStyle(org.eclipse.papyrus.infra.gmfdiag.css.tests.tests.CSSProjectStylesheetsTest) skipped
02:46:00 testCSSClassStyle(org.eclipse.papyrus.infra.gmfdiag.css.tests.tests.CSSProjectStylesheetsTest) skipped
02:46:00 testPriorities(org.eclipse.papyrus.infra.gmfdiag.css.tests.tests.CSSProjectStylesheetsTest) skipped
02:46:00 testInterfaceStyle(org.eclipse.papyrus.infra.gmfdiag.css.tests.tests.CSSProjectStylesheetsTest) skipped
02:46:00 testWorkspaceTheme(org.eclipse.papyrus.infra.gmfdiag.css.tests.tests.CSSWorkspaceThemeTest) skipped
02:46:00 testPackage(org.eclipse.papyrus.infra.gmfdiag.css.tests.tests.CSSWorkspaceThemeTest) skipped
02:46:00 testClassStyle(org.eclipse.papyrus.infra.gmfdiag.css.tests.tests.CSSWorkspaceThemeTest) skipped
02:46:00 testCSSClassStyle(org.eclipse.papyrus.infra.gmfdiag.css.tests.tests.CSSWorkspaceThemeTest) skipped
02:46:00 testPriorities(org.eclipse.papyrus.infra.gmfdiag.css.tests.tests.CSSWorkspaceThemeTest) skipped
02:46:00 testInterfaceStyle(org.eclipse.papyrus.infra.gmfdiag.css.tests.tests.CSSWorkspaceThemeTest) skipped
02:46:00 canonicalStyleNotInferred(org.eclipse.papyrus.infra.gmfdiag.css.tests.tests.InferredNotationStylesTest) skipped
02:46:00 canonicalStyleInferred(org.eclipse.papyrus.infra.gmfdiag.css.tests.tests.InferredNotationStylesTest) skipped
02:46:00 overrideInferredStyle(org.eclipse.papyrus.infra.gmfdiag.css.tests.tests.InferredNotationStylesTest) skipped
02:46:00 testUnnamedReference(org.eclipse.papyrus.infra.gmfdiag.css.tests.tests.CSSNamedElementsTest) skipped
02:46:00 testNamedReference(org.eclipse.papyrus.infra.gmfdiag.css.tests.tests.CSSNamedElementsTest) skipped
02:46:00 testEmptyNameReference(org.eclipse.papyrus.infra.gmfdiag.css.tests.tests.CSSNamedElementsTest) skipped
02:46:00 testUntypedReference(org.eclipse.papyrus.infra.gmfdiag.css.tests.tests.CSSNamedElementsTest) skipped
02:46:00 testKindSelectorForCompartment(org.eclipse.papyrus.infra.gmfdiag.css.tests.tests.CSSKindSelectorTest) skipped
02:46:00 testKindSelectorForLabel(org.eclipse.papyrus.infra.gmfdiag.css.tests.tests.CSSKindSelectorTest) skipped
02:46:00 testLabels(org.eclipse.papyrus.infra.internationalization.tests.tests.InternationalizationLabelProviderTest) skipped
02:46:00 org.eclipse.papyrus.infra.internationalization.tests.tests.InternationalizationLabelProviderTest skipped
02:46:00 testUseInternationalizationModification(org.eclipse.papyrus.infra.internationalization.tests.tests.InternationalizationChangePreferencesTest) skipped
02:46:00 testLanguageModification(org.eclipse.papyrus.infra.internationalization.tests.tests.InternationalizationChangePreferencesTest) skipped
02:46:00 org.eclipse.papyrus.infra.internationalization.tests.tests.InternationalizationChangePreferencesTest skipped
02:46:00 enablementNotification(org.eclipse.papyrus.infra.internationalization.tests.tests.InternationalizationPreferenceChangeEventTest) skipped
02:46:00 localeNotificationByPreferences(org.eclipse.papyrus.infra.internationalization.tests.tests.InternationalizationPreferenceChangeEventTest) skipped
02:46:00 localeNotification(org.eclipse.papyrus.infra.internationalization.tests.tests.InternationalizationPreferenceChangeEventTest) skipped
02:46:00 removePreferenceListener(org.eclipse.papyrus.infra.internationalization.tests.tests.InternationalizationPreferenceChangeEventTest) skipped
02:46:00 enablementNotificationByPreferences(org.eclipse.papyrus.infra.internationalization.tests.tests.InternationalizationPreferenceChangeEventTest) skipped
02:46:00 org.eclipse.papyrus.infra.internationalization.tests.tests.InternationalizationPreferenceChangeEventTest skipped
02:46:00 org.eclipse.papyrus.infra.internationalization.tests.tests.AllTests skipped
02:46:00 getViewCountOn(org.eclipse.papyrus.infra.viewpoints.policy.tests.ViewPrototypeTest) skipped
02:46:00 getOwnedViewCount(org.eclipse.papyrus.infra.viewpoints.policy.tests.ViewPrototypeTest) skipped
02:46:00 org.eclipse.papyrus.infra.viewpoints.policy.tests.ViewPrototypeTest skipped
02:46:00 testIsInViewpoint(org.eclipse.papyrus.infra.viewpoints.policy.tests.PolicyCheckerTest) skipped
02:46:00 org.eclipse.papyrus.infra.viewpoints.policy.tests.PolicyCheckerTest skipped
02:46:00 org.eclipse.papyrus.infra.viewpoints.policy.tests.AllTests skipped
02:46:00 testMergeContextSameName(org.eclipse.papyrus.infra.architecture.tests.merged.MergedArchitectureDomainTest) skipped
02:46:00 testMergeContextDifferentName(org.eclipse.papyrus.infra.architecture.tests.merged.MergedArchitectureDomainTest) skipped
02:46:00 org.eclipse.papyrus.infra.architecture.tests.merged.MergedArchitectureDomainTest skipped
02:46:00 org.eclipse.papyrus.infra.architecture.tests.AllTests skipped
02:46:00 switchViewpoints(org.eclipse.papyrus.infra.ui.architecture.tests.editors.SwitchViewpointsTest) skipped
02:46:00 org.eclipse.papyrus.infra.ui.architecture.tests.editors.SwitchViewpointsTest skipped
02:46:00 revealDiagramsAndTables(org.eclipse.papyrus.infra.ui.architecture.tests.editors.ModelExplorerViewpointFilterTest) skipped
02:46:00 org.eclipse.papyrus.infra.ui.architecture.tests.editors.ModelExplorerViewpointFilterTest skipped
02:46:00 checkIcons(org.eclipse.papyrus.infra.ui.architecture.tests.editors.GrayedIconTest) skipped
02:46:00 org.eclipse.papyrus.infra.ui.architecture.tests.editors.GrayedIconTest skipped
02:46:00 org.eclipse.papyrus.infra.ui.architecture.tests.AllTests skipped
02:46:00 
02:46:00 Results:
02:46:00 
02:46:00 Failures: 
02:46:00   CSSCompartmentsTests.testCaseInsensitiveForEnumeration:138 EnumerationLiteral Compartment should not be collapsed
02:46:00   SaveAndDirtyServiceTest.testDoSave:54 Not yet implemented
02:46:00   SaveAndDirtyServiceTest.testDoSaveAs:62 Not yet implemented
02:46:00   SaveAndDirtyServiceTest.testIsDirty:70 Not yet implemented
02:46:00   SaveAndDirtyServiceTest.testIsSaveAsAllowed:78 Not yet implemented
02:46:00   SaveAndDirtyServiceTest.testIsSaveOnCloseNeeded:86 Not yet implemented
02:46:00   SaveAndDirtyServiceTest.testRegisterIsaveablePart:94 Not yet implemented
02:46:00   SaveAndDirtyServiceTest.testRemoveIsaveablePart:102 Not yet implemented
02:46:00 
02:46:00 Tests run: 1093, Failures: 8, Errors: 0, Skipped: 1067
02:46:00 
02:46:03 [ERROR] There are test failures.
02:46:03 
02:46:03 Please refer to /jobs/genie.papyrus/Papyrus-Master-Tests-Failures/workspace/source/tests/junit/plugins/infra/org.eclipse.papyrus.infra.suite.tests/target/surefire-reports for the individual test results.
02:46:03 [INFO] 
02:46:03 [INFO] --- jacoco-maven-plugin:0.8.2:report (default-report) @ org.eclipse.papyrus.infra.suite.tests ---
02:46:03 [INFO] Loading execution data file /jobs/genie.papyrus/Papyrus-Master-Tests-Failures/workspace/source/tests/junit/plugins/infra/org.eclipse.papyrus.infra.suite.tests/target/jacoco.exec
02:46:03 [INFO] Analyzed bundle 'org.eclipse.papyrus.infra.suite.tests' with 0 classes
02:46:03 [INFO] 
02:46:03 [INFO] --< org.eclipse.papyrus.tests:org.eclipse.papyrus.infra.newchild.tests >--
02:46:03 [INFO] Building org.eclipse.papyrus.infra.newchild.tests 1.2.100-SNAPSHOT [142/167]
02:46:03 [INFO] ---------------------------[ eclipse-plugin ]---------------------------
02:46:03 [INFO] 
02:46:03 [INFO] --- maven-clean-plugin:3.1.0:clean (default-clean) @ org.eclipse.papyrus.infra.newchild.tests ---
02:46:03 [INFO] 
02:46:03 [INFO] --- tycho-packaging-plugin:1.3.0:build-qualifier (default-build-qualifier) @ org.eclipse.papyrus.infra.newchild.tests ---
02:46:03 [INFO] The project's OSGi version is 1.2.100.201912010720
02:46:03 [INFO] 
02:46:03 [INFO] --- tycho-packaging-plugin:1.3.0:validate-id (default-validate-id) @ org.eclipse.papyrus.infra.newchild.tests ---
02:46:03 [INFO] 
02:46:03 [INFO] --- tycho-packaging-plugin:1.3.0:validate-version (default-validate-version) @ org.eclipse.papyrus.infra.newchild.tests ---
02:46:03 [INFO] 
02:46:03 [INFO] --- jacoco-maven-plugin:0.8.2:prepare-agent (default-prepare-agent) @ org.eclipse.papyrus.infra.newchild.tests ---
02:46:03 [INFO] argLine set to -javaagent:/home/hudson/genie.papyrus/.jenkins/jobs/Papyrus-Master-Tests-Failures/workspace/.repository/org/jacoco/org.jacoco.agent/0.8.2/org.jacoco.agent-0.8.2-runtime.jar=destfile=/jobs/genie.papyrus/Papyrus-Master-Tests-Failures/workspace/source/tests/junit/plugins/infra/org.eclipse.papyrus.infra.newchild.tests/target/jacoco.exec,includes=org.eclipse.papyrus.*,excludes=org.eclipse.uml2
02:46:03 [INFO] 
02:46:03 [INFO] --- maven-resources-plugin:3.1.0:resources (default-resources) @ org.eclipse.papyrus.infra.newchild.tests ---
02:46:03 [INFO] Using 'UTF-8' encoding to copy filtered resources.
02:46:03 [INFO] skip non existing resourceDirectory /jobs/genie.papyrus/Papyrus-Master-Tests-Failures/workspace/source/tests/junit/plugins/infra/org.eclipse.papyrus.infra.newchild.tests/src/main/resources
02:46:03 [INFO] 
02:46:03 [INFO] --- tycho-compiler-plugin:1.3.0:compile (default-compile) @ org.eclipse.papyrus.infra.newchild.tests ---
02:46:03 [INFO] Compiling 3 source files to /jobs/genie.papyrus/Papyrus-Master-Tests-Failures/workspace/source/tests/junit/plugins/infra/org.eclipse.papyrus.infra.newchild.tests/bin
02:46:03 [INFO] 
02:46:03 [INFO] --- maven-resources-plugin:3.1.0:testResources (default-testResources) @ org.eclipse.papyrus.infra.newchild.tests ---
02:46:03 [INFO] Using 'UTF-8' encoding to copy filtered resources.
02:46:03 [INFO] skip non existing resourceDirectory /jobs/genie.papyrus/Papyrus-Master-Tests-Failures/workspace/source/tests/junit/plugins/infra/org.eclipse.papyrus.infra.newchild.tests/src/test/resources
02:46:03 [INFO] 
02:46:03 [INFO] --- target-platform-configuration:1.3.0:target-platform (default-target-platform) @ org.eclipse.papyrus.infra.newchild.tests ---
02:46:03 [INFO] 
02:46:03 [INFO] --- tycho-packaging-plugin:1.3.0:package-plugin (default-package-plugin) @ org.eclipse.papyrus.infra.newchild.tests ---
02:46:03 [INFO] Building jar: /jobs/genie.papyrus/Papyrus-Master-Tests-Failures/workspace/source/tests/junit/plugins/infra/org.eclipse.papyrus.infra.newchild.tests/target/org.eclipse.papyrus.infra.newchild.tests-1.2.100-SNAPSHOT.jar
02:46:03 [INFO] 
02:46:03 [INFO] --- tycho-p2-plugin:1.3.0:p2-metadata-default (default-p2-metadata-default) @ org.eclipse.papyrus.infra.newchild.tests ---
02:46:03 [INFO] 
02:46:03 [INFO] --- jacoco-maven-plugin:0.8.2:report (default-report) @ org.eclipse.papyrus.infra.newchild.tests ---
02:46:03 [INFO] Skipping JaCoCo execution due to missing execution data file.
02:46:03 [INFO] 
02:46:03 [INFO] --< org.eclipse.papyrus.tests:org.eclipse.papyrus.uml.diagram.communication.tests >--
02:46:03 [INFO] Building org.eclipse.papyrus.uml.diagram.communication.tests 1.2.100-SNAPSHOT [143/167]
02:46:03 [INFO] ------------------------[ eclipse-test-plugin ]-------------------------
02:46:03 [INFO] 
02:46:03 [INFO] --- maven-clean-plugin:3.1.0:clean (default-clean) @ org.eclipse.papyrus.uml.diagram.communication.tests ---
02:46:03 [INFO] 
02:46:03 [INFO] --- tycho-packaging-plugin:1.3.0:build-qualifier (default-build-qualifier) @ org.eclipse.papyrus.uml.diagram.communication.tests ---
02:46:03 [INFO] The project's OSGi version is 1.2.100.201912010720
02:46:03 [INFO] 
02:46:03 [INFO] --- tycho-packaging-plugin:1.3.0:validate-id (default-validate-id) @ org.eclipse.papyrus.uml.diagram.communication.tests ---
02:46:03 [INFO] 
02:46:03 [INFO] --- tycho-packaging-plugin:1.3.0:validate-version (default-validate-version) @ org.eclipse.papyrus.uml.diagram.communication.tests ---
02:46:03 [INFO] 
02:46:03 [INFO] --- jacoco-maven-plugin:0.8.2:prepare-agent (default-prepare-agent) @ org.eclipse.papyrus.uml.diagram.communication.tests ---
02:46:03 [INFO] tycho.testArgLine set to -javaagent:/home/hudson/genie.papyrus/.jenkins/jobs/Papyrus-Master-Tests-Failures/workspace/.repository/org/jacoco/org.jacoco.agent/0.8.2/org.jacoco.agent-0.8.2-runtime.jar=destfile=/jobs/genie.papyrus/Papyrus-Master-Tests-Failures/workspace/source/tests/junit/plugins/uml/diagram/org.eclipse.papyrus.uml.diagram.communication.tests/target/jacoco.exec,includes=org.eclipse.papyrus.*,excludes=org.eclipse.uml2
02:46:03 [INFO] 
02:46:03 [INFO] --- maven-resources-plugin:3.1.0:resources (default-resources) @ org.eclipse.papyrus.uml.diagram.communication.tests ---
02:46:03 [INFO] Using 'UTF-8' encoding to copy filtered resources.
02:46:03 [INFO] skip non existing resourceDirectory /jobs/genie.papyrus/Papyrus-Master-Tests-Failures/workspace/source/tests/junit/plugins/uml/diagram/org.eclipse.papyrus.uml.diagram.communication.tests/src/main/resources
02:46:03 [INFO] 
02:46:03 [INFO] --- tycho-compiler-plugin:1.3.0:compile (default-compile) @ org.eclipse.papyrus.uml.diagram.communication.tests ---
02:46:03 [WARNING] The effective compiler target level 1.8 is incompatible with the following OSGi execution environments: [JavaSE-1.7 (assumes 1.7)] @ MavenProject: org.eclipse.papyrus.tests:org.eclipse.papyrus.uml.diagram.communication.tests:1.2.100-SNAPSHOT @ /jobs/genie.papyrus/Papyrus-Master-Tests-Failures/workspace/source/tests/junit/plugins/uml/diagram/org.eclipse.papyrus.uml.diagram.communication.tests/pom.xml
02:46:03 [INFO] Compiling 7 source files to /jobs/genie.papyrus/Papyrus-Master-Tests-Failures/workspace/source/tests/junit/plugins/uml/diagram/org.eclipse.papyrus.uml.diagram.communication.tests/bin
02:46:04 [INFO] 
02:46:04 [INFO] --- maven-resources-plugin:3.1.0:testResources (default-testResources) @ org.eclipse.papyrus.uml.diagram.communication.tests ---
02:46:04 [INFO] Using 'UTF-8' encoding to copy filtered resources.
02:46:04 [INFO] skip non existing resourceDirectory /jobs/genie.papyrus/Papyrus-Master-Tests-Failures/workspace/source/tests/junit/plugins/uml/diagram/org.eclipse.papyrus.uml.diagram.communication.tests/src/test/resources
02:46:04 [INFO] 
02:46:04 [INFO] --- target-platform-configuration:1.3.0:target-platform (default-target-platform) @ org.eclipse.papyrus.uml.diagram.communication.tests ---
02:46:04 [INFO] 
02:46:04 [INFO] --- tycho-packaging-plugin:1.3.0:package-plugin (default-package-plugin) @ org.eclipse.papyrus.uml.diagram.communication.tests ---
02:46:04 [INFO] Building jar: /jobs/genie.papyrus/Papyrus-Master-Tests-Failures/workspace/source/tests/junit/plugins/uml/diagram/org.eclipse.papyrus.uml.diagram.communication.tests/target/org.eclipse.papyrus.uml.diagram.communication.tests-1.2.100-SNAPSHOT.jar
02:46:04 [INFO] 
02:46:04 [INFO] --- tycho-p2-plugin:1.3.0:p2-metadata-default (default-p2-metadata-default) @ org.eclipse.papyrus.uml.diagram.communication.tests ---
02:46:04 [INFO] 
02:46:04 [INFO] --- tycho-surefire-plugin:1.3.0:test (default-test) @ org.eclipse.papyrus.uml.diagram.communication.tests ---
02:46:04 [INFO] Skipping tests
02:46:04 [INFO] 
02:46:04 [INFO] --- jacoco-maven-plugin:0.8.2:report (default-report) @ org.eclipse.papyrus.uml.diagram.communication.tests ---
02:46:04 [INFO] Skipping JaCoCo execution due to missing execution data file.
02:46:04 [INFO] 
02:46:04 [INFO] --< org.eclipse.papyrus.tests:org.eclipse.papyrus.uml.diagram.interactionoverview.tests >--
02:46:04 [INFO] Building org.eclipse.papyrus.uml.diagram.interactionoverview.tests 1.2.0-SNAPSHOT [144/167]
02:46:04 [INFO] ------------------------[ eclipse-test-plugin ]-------------------------
02:46:04 [INFO] 
02:46:04 [INFO] --- maven-clean-plugin:3.1.0:clean (default-clean) @ org.eclipse.papyrus.uml.diagram.interactionoverview.tests ---
02:46:04 [INFO] 
02:46:04 [INFO] --- tycho-packaging-plugin:1.3.0:build-qualifier (default-build-qualifier) @ org.eclipse.papyrus.uml.diagram.interactionoverview.tests ---
02:46:04 [INFO] The project's OSGi version is 1.2.0.201912010720
02:46:04 [INFO] 
02:46:04 [INFO] --- tycho-packaging-plugin:1.3.0:validate-id (default-validate-id) @ org.eclipse.papyrus.uml.diagram.interactionoverview.tests ---
02:46:04 [INFO] 
02:46:04 [INFO] --- tycho-packaging-plugin:1.3.0:validate-version (default-validate-version) @ org.eclipse.papyrus.uml.diagram.interactionoverview.tests ---
02:46:04 [INFO] 
02:46:04 [INFO] --- jacoco-maven-plugin:0.8.2:prepare-agent (default-prepare-agent) @ org.eclipse.papyrus.uml.diagram.interactionoverview.tests ---
02:46:04 [INFO] tycho.testArgLine set to -javaagent:/home/hudson/genie.papyrus/.jenkins/jobs/Papyrus-Master-Tests-Failures/workspace/.repository/org/jacoco/org.jacoco.agent/0.8.2/org.jacoco.agent-0.8.2-runtime.jar=destfile=/jobs/genie.papyrus/Papyrus-Master-Tests-Failures/workspace/source/tests/junit/plugins/uml/diagram/org.eclipse.papyrus.uml.diagram.interactionoverview.tests/target/jacoco.exec,includes=org.eclipse.papyrus.*,excludes=org.eclipse.uml2
02:46:04 [INFO] 
02:46:04 [INFO] --- maven-resources-plugin:3.1.0:resources (default-resources) @ org.eclipse.papyrus.uml.diagram.interactionoverview.tests ---
02:46:04 [INFO] Using 'UTF-8' encoding to copy filtered resources.
02:46:04 [INFO] skip non existing resourceDirectory /jobs/genie.papyrus/Papyrus-Master-Tests-Failures/workspace/source/tests/junit/plugins/uml/diagram/org.eclipse.papyrus.uml.diagram.interactionoverview.tests/src/main/resources
02:46:04 [INFO] 
02:46:04 [INFO] --- tycho-compiler-plugin:1.3.0:compile (default-compile) @ org.eclipse.papyrus.uml.diagram.interactionoverview.tests ---
02:46:04 [WARNING] The effective compiler target level 1.8 is incompatible with the following OSGi execution environments: [J2SE-1.5 (assumes 1.5)] @ MavenProject: org.eclipse.papyrus.tests:org.eclipse.papyrus.uml.diagram.interactionoverview.tests:1.2.0-SNAPSHOT @ /jobs/genie.papyrus/Papyrus-Master-Tests-Failures/workspace/source/tests/junit/plugins/uml/diagram/org.eclipse.papyrus.uml.diagram.interactionoverview.tests/pom.xml
02:46:04 [INFO] Compiling 10 source files to /jobs/genie.papyrus/Papyrus-Master-Tests-Failures/workspace/source/tests/junit/plugins/uml/diagram/org.eclipse.papyrus.uml.diagram.interactionoverview.tests/bin
02:46:04 [WARNING] /jobs/genie.papyrus/Papyrus-Master-Tests-Failures/workspace/source/tests/junit/plugins/uml/diagram/org.eclipse.papyrus.uml.diagram.interactionoverview.tests/src/org/eclipse/papyrus/uml/diagram/interactionoverview/tests/canonical/TestInteractionUse.java:[25] 
02:46:04 	import org.eclipse.papyrus.uml.diagram.timing.custom.utils.EditPartUtils;
02:46:04 	       ^^^^^^^^^^^^^^^^^^^^^^^^^^^^^^^^^^^^^^^^^^^^^^^^^^^^^^^^^^^^^^^^^
02:46:04 Discouraged access: The type 'EditPartUtils' is not API (restriction on classpath entry '/home/hudson/genie.papyrus/.jenkins/jobs/Papyrus-Master-Tests-Failures/workspace/.repository/p2/osgi/bundle/org.eclipse.papyrus.uml.diagram.timing/1.4.200.201912010357/org.eclipse.papyrus.uml.diagram.timing-1.4.200.201912010357.jar')
02:46:04 [WARNING] /jobs/genie.papyrus/Papyrus-Master-Tests-Failures/workspace/source/tests/junit/plugins/uml/diagram/org.eclipse.papyrus.uml.diagram.interactionoverview.tests/src/org/eclipse/papyrus/uml/diagram/interactionoverview/tests/canonical/TestInteractionUse.java:[79] 
02:46:04 	final CustomInteractionUseNameEditPart callBehaviorNameEditPart = (CustomInteractionUseNameEditPart)EditPartUtils.findFirstChildEditPartWithId(interactionUse, CustomInteractionUseNameEditPart.VISUAL_ID);
02:46:04 	                                                                                                    ^^^^^^^^^^^^^
02:46:04 Discouraged access: The type 'EditPartUtils' is not API (restriction on classpath entry '/home/hudson/genie.papyrus/.jenkins/jobs/Papyrus-Master-Tests-Failures/workspace/.repository/p2/osgi/bundle/org.eclipse.papyrus.uml.diagram.timing/1.4.200.201912010357/org.eclipse.papyrus.uml.diagram.timing-1.4.200.201912010357.jar')
02:46:04 [WARNING] /jobs/genie.papyrus/Papyrus-Master-Tests-Failures/workspace/source/tests/junit/plugins/uml/diagram/org.eclipse.papyrus.uml.diagram.interactionoverview.tests/src/org/eclipse/papyrus/uml/diagram/interactionoverview/tests/canonical/TestInteractionUse.java:[79] 
02:46:04 	final CustomInteractionUseNameEditPart callBehaviorNameEditPart = (CustomInteractionUseNameEditPart)EditPartUtils.findFirstChildEditPartWithId(interactionUse, CustomInteractionUseNameEditPart.VISUAL_ID);
02:46:04 	                                                                                                    ^^^^^^^^^^^^^^^^^^^^^^^^^^^^^^^^^^^^^^^^^^^^^^^^^^^^^^^^^^^^^^^^^^^^^^^^^^^^^^^^^^^^^^^^^^^^^^^^^^^^^^
02:46:04 Discouraged access: The method 'EditPartUtils.findFirstChildEditPartWithId(EditPart, String)' is not API (restriction on classpath entry '/home/hudson/genie.papyrus/.jenkins/jobs/Papyrus-Master-Tests-Failures/workspace/.repository/p2/osgi/bundle/org.eclipse.papyrus.uml.diagram.timing/1.4.200.201912010357/org.eclipse.papyrus.uml.diagram.timing-1.4.200.201912010357.jar')
02:46:04 [WARNING] /jobs/genie.papyrus/Papyrus-Master-Tests-Failures/workspace/source/tests/junit/plugins/uml/diagram/org.eclipse.papyrus.uml.diagram.interactionoverview.tests/src/org/eclipse/papyrus/uml/diagram/interactionoverview/tests/canonical/TestInteractionOverviewDiagramActivityTN.java:[31] 
02:46:04 	import org.eclipse.papyrus.uml.diagram.timing.custom.utils.EditPartUtils;
02:46:04 	       ^^^^^^^^^^^^^^^^^^^^^^^^^^^^^^^^^^^^^^^^^^^^^^^^^^^^^^^^^^^^^^^^^
02:46:04 Discouraged access: The type 'EditPartUtils' is not API (restriction on classpath entry '/home/hudson/genie.papyrus/.jenkins/jobs/Papyrus-Master-Tests-Failures/workspace/.repository/p2/osgi/bundle/org.eclipse.papyrus.uml.diagram.timing/1.4.200.201912010357/org.eclipse.papyrus.uml.diagram.timing-1.4.200.201912010357.jar')
02:46:04 [WARNING] /jobs/genie.papyrus/Papyrus-Master-Tests-Failures/workspace/source/tests/junit/plugins/uml/diagram/org.eclipse.papyrus.uml.diagram.interactionoverview.tests/src/org/eclipse/papyrus/uml/diagram/interactionoverview/tests/canonical/TestInteractionOverviewDiagramActivityTN.java:[101] 
02:46:04 	final ActivityNameEditPart activityNameEditPart = (ActivityNameEditPart) EditPartUtils.findFirstChildEditPartWithId(activityEditPart, ActivityNameEditPart.VISUAL_ID);
02:46:04 	                                                                         ^^^^^^^^^^^^^
02:46:04 Discouraged access: The type 'EditPartUtils' is not API (restriction on classpath entry '/home/hudson/genie.papyrus/.jenkins/jobs/Papyrus-Master-Tests-Failures/workspace/.repository/p2/osgi/bundle/org.eclipse.papyrus.uml.diagram.timing/1.4.200.201912010357/org.eclipse.papyrus.uml.diagram.timing-1.4.200.201912010357.jar')
02:46:04 [WARNING] /jobs/genie.papyrus/Papyrus-Master-Tests-Failures/workspace/source/tests/junit/plugins/uml/diagram/org.eclipse.papyrus.uml.diagram.interactionoverview.tests/src/org/eclipse/papyrus/uml/diagram/interactionoverview/tests/canonical/TestInteractionOverviewDiagramActivityTN.java:[101] 
02:46:04 	final ActivityNameEditPart activityNameEditPart = (ActivityNameEditPart) EditPartUtils.findFirstChildEditPartWithId(activityEditPart, ActivityNameEditPart.VISUAL_ID);
02:46:04 	                                                                         ^^^^^^^^^^^^^^^^^^^^^^^^^^^^^^^^^^^^^^^^^^^^^^^^^^^^^^^^^^^^^^^^^^^^^^^^^^^^^^^^^^^^^^^^^^^^
02:46:04 Discouraged access: The method 'EditPartUtils.findFirstChildEditPartWithId(EditPart, String)' is not API (restriction on classpath entry '/home/hudson/genie.papyrus/.jenkins/jobs/Papyrus-Master-Tests-Failures/workspace/.repository/p2/osgi/bundle/org.eclipse.papyrus.uml.diagram.timing/1.4.200.201912010357/org.eclipse.papyrus.uml.diagram.timing-1.4.200.201912010357.jar')
02:46:04 6 problems (6 warnings)
02:46:04 [INFO] 
02:46:04 [INFO] --- maven-resources-plugin:3.1.0:testResources (default-testResources) @ org.eclipse.papyrus.uml.diagram.interactionoverview.tests ---
02:46:04 [INFO] Using 'UTF-8' encoding to copy filtered resources.
02:46:04 [INFO] skip non existing resourceDirectory /jobs/genie.papyrus/Papyrus-Master-Tests-Failures/workspace/source/tests/junit/plugins/uml/diagram/org.eclipse.papyrus.uml.diagram.interactionoverview.tests/src/test/resources
02:46:04 [INFO] 
02:46:04 [INFO] --- target-platform-configuration:1.3.0:target-platform (default-target-platform) @ org.eclipse.papyrus.uml.diagram.interactionoverview.tests ---
02:46:04 [INFO] 
02:46:04 [INFO] --- tycho-packaging-plugin:1.3.0:package-plugin (default-package-plugin) @ org.eclipse.papyrus.uml.diagram.interactionoverview.tests ---
02:46:04 [INFO] Building jar: /jobs/genie.papyrus/Papyrus-Master-Tests-Failures/workspace/source/tests/junit/plugins/uml/diagram/org.eclipse.papyrus.uml.diagram.interactionoverview.tests/target/org.eclipse.papyrus.uml.diagram.interactionoverview.tests-1.2.0-SNAPSHOT.jar
02:46:04 [INFO] 
02:46:04 [INFO] --- tycho-p2-plugin:1.3.0:p2-metadata-default (default-p2-metadata-default) @ org.eclipse.papyrus.uml.diagram.interactionoverview.tests ---
02:46:04 [INFO] 
02:46:04 [INFO] --- tycho-surefire-plugin:1.3.0:test (default-test) @ org.eclipse.papyrus.uml.diagram.interactionoverview.tests ---
02:46:04 [INFO] Skipping tests
02:46:04 [INFO] 
02:46:04 [INFO] --- jacoco-maven-plugin:0.8.2:report (default-report) @ org.eclipse.papyrus.uml.diagram.interactionoverview.tests ---
02:46:04 [INFO] Skipping JaCoCo execution due to missing execution data file.
02:46:04 [INFO] 
02:46:04 [INFO] --< org.eclipse.papyrus.tests:org.eclipse.papyrus.uml.diagram.statemachine.tests >--
02:46:04 [INFO] Building org.eclipse.papyrus.uml.diagram.statemachine.tests 1.2.100-SNAPSHOT [145/167]
02:46:04 [INFO] ------------------------[ eclipse-test-plugin ]-------------------------
02:46:04 [INFO] 
02:46:04 [INFO] --- maven-clean-plugin:3.1.0:clean (default-clean) @ org.eclipse.papyrus.uml.diagram.statemachine.tests ---
02:46:04 [INFO] 
02:46:04 [INFO] --- tycho-packaging-plugin:1.3.0:build-qualifier (default-build-qualifier) @ org.eclipse.papyrus.uml.diagram.statemachine.tests ---
02:46:04 [INFO] The project's OSGi version is 1.2.100.201912010720
02:46:04 [INFO] 
02:46:04 [INFO] --- tycho-packaging-plugin:1.3.0:validate-id (default-validate-id) @ org.eclipse.papyrus.uml.diagram.statemachine.tests ---
02:46:04 [INFO] 
02:46:04 [INFO] --- tycho-packaging-plugin:1.3.0:validate-version (default-validate-version) @ org.eclipse.papyrus.uml.diagram.statemachine.tests ---
02:46:04 [INFO] 
02:46:04 [INFO] --- jacoco-maven-plugin:0.8.2:prepare-agent (default-prepare-agent) @ org.eclipse.papyrus.uml.diagram.statemachine.tests ---
02:46:04 [INFO] tycho.testArgLine set to -javaagent:/home/hudson/genie.papyrus/.jenkins/jobs/Papyrus-Master-Tests-Failures/workspace/.repository/org/jacoco/org.jacoco.agent/0.8.2/org.jacoco.agent-0.8.2-runtime.jar=destfile=/jobs/genie.papyrus/Papyrus-Master-Tests-Failures/workspace/source/tests/junit/plugins/uml/diagram/org.eclipse.papyrus.uml.diagram.statemachine.tests/target/jacoco.exec,includes=org.eclipse.papyrus.*,excludes=org.eclipse.uml2
02:46:04 [INFO] 
02:46:04 [INFO] --- maven-resources-plugin:3.1.0:resources (default-resources) @ org.eclipse.papyrus.uml.diagram.statemachine.tests ---
02:46:04 [INFO] Using 'UTF-8' encoding to copy filtered resources.
02:46:04 [INFO] skip non existing resourceDirectory /jobs/genie.papyrus/Papyrus-Master-Tests-Failures/workspace/source/tests/junit/plugins/uml/diagram/org.eclipse.papyrus.uml.diagram.statemachine.tests/src/main/resources
02:46:04 [INFO] 
02:46:04 [INFO] --- tycho-compiler-plugin:1.3.0:compile (default-compile) @ org.eclipse.papyrus.uml.diagram.statemachine.tests ---
02:46:04 [WARNING] The effective compiler target level 1.8 is incompatible with the following OSGi execution environments: [JavaSE-1.7 (assumes 1.7)] @ MavenProject: org.eclipse.papyrus.tests:org.eclipse.papyrus.uml.diagram.statemachine.tests:1.2.100-SNAPSHOT @ /jobs/genie.papyrus/Papyrus-Master-Tests-Failures/workspace/source/tests/junit/plugins/uml/diagram/org.eclipse.papyrus.uml.diagram.statemachine.tests/pom.xml
02:46:04 [INFO] Compiling 17 source files to /jobs/genie.papyrus/Papyrus-Master-Tests-Failures/workspace/source/tests/junit/plugins/uml/diagram/org.eclipse.papyrus.uml.diagram.statemachine.tests/bin
02:46:06 [INFO] 
02:46:06 [INFO] --- maven-resources-plugin:3.1.0:testResources (default-testResources) @ org.eclipse.papyrus.uml.diagram.statemachine.tests ---
02:46:06 [INFO] Using 'UTF-8' encoding to copy filtered resources.
02:46:06 [INFO] skip non existing resourceDirectory /jobs/genie.papyrus/Papyrus-Master-Tests-Failures/workspace/source/tests/junit/plugins/uml/diagram/org.eclipse.papyrus.uml.diagram.statemachine.tests/src/test/resources
02:46:06 [INFO] 
02:46:06 [INFO] --- target-platform-configuration:1.3.0:target-platform (default-target-platform) @ org.eclipse.papyrus.uml.diagram.statemachine.tests ---
02:46:06 [INFO] 
02:46:06 [INFO] --- tycho-packaging-plugin:1.3.0:package-plugin (default-package-plugin) @ org.eclipse.papyrus.uml.diagram.statemachine.tests ---
02:46:06 [INFO] Building jar: /jobs/genie.papyrus/Papyrus-Master-Tests-Failures/workspace/source/tests/junit/plugins/uml/diagram/org.eclipse.papyrus.uml.diagram.statemachine.tests/target/org.eclipse.papyrus.uml.diagram.statemachine.tests-1.2.100-SNAPSHOT.jar
02:46:06 [INFO] 
02:46:06 [INFO] --- tycho-p2-plugin:1.3.0:p2-metadata-default (default-p2-metadata-default) @ org.eclipse.papyrus.uml.diagram.statemachine.tests ---
02:46:06 [INFO] 
02:46:06 [INFO] --- tycho-surefire-plugin:1.3.0:test (default-test) @ org.eclipse.papyrus.uml.diagram.statemachine.tests ---
02:46:06 [INFO] Skipping tests
02:46:06 [INFO] 
02:46:06 [INFO] --- jacoco-maven-plugin:0.8.2:report (default-report) @ org.eclipse.papyrus.uml.diagram.statemachine.tests ---
02:46:06 [INFO] Skipping JaCoCo execution due to missing execution data file.
02:46:06 [INFO] 
02:46:06 [INFO] --< org.eclipse.papyrus.tests:org.eclipse.papyrus.uml.diagram.suite.tests >--
02:46:06 [INFO] Building org.eclipse.papyrus.uml.diagram.suite.tests 0.0.1-SNAPSHOT [146/167]
02:46:06 [INFO] ------------------------[ eclipse-test-plugin ]-------------------------
02:46:06 [INFO] 
02:46:06 [INFO] --- maven-clean-plugin:3.1.0:clean (default-clean) @ org.eclipse.papyrus.uml.diagram.suite.tests ---
02:46:06 [INFO] 
02:46:06 [INFO] --- tycho-packaging-plugin:1.3.0:build-qualifier (default-build-qualifier) @ org.eclipse.papyrus.uml.diagram.suite.tests ---
02:46:06 [INFO] The project's OSGi version is 0.0.1.201912010720
02:46:06 [INFO] 
02:46:06 [INFO] --- tycho-packaging-plugin:1.3.0:validate-id (default-validate-id) @ org.eclipse.papyrus.uml.diagram.suite.tests ---
02:46:06 [INFO] 
02:46:06 [INFO] --- tycho-packaging-plugin:1.3.0:validate-version (default-validate-version) @ org.eclipse.papyrus.uml.diagram.suite.tests ---
02:46:06 [INFO] 
02:46:06 [INFO] --- jacoco-maven-plugin:0.8.2:prepare-agent (default-prepare-agent) @ org.eclipse.papyrus.uml.diagram.suite.tests ---
02:46:06 [INFO] tycho.testArgLine set to -javaagent:/home/hudson/genie.papyrus/.jenkins/jobs/Papyrus-Master-Tests-Failures/workspace/.repository/org/jacoco/org.jacoco.agent/0.8.2/org.jacoco.agent-0.8.2-runtime.jar=destfile=/jobs/genie.papyrus/Papyrus-Master-Tests-Failures/workspace/source/tests/junit/plugins/uml/diagram/org.eclipse.papyrus.uml.diagram.suite.tests/target/jacoco.exec,includes=org.eclipse.papyrus.*,excludes=org.eclipse.uml2
02:46:06 [INFO] 
02:46:06 [INFO] --- maven-resources-plugin:3.1.0:resources (default-resources) @ org.eclipse.papyrus.uml.diagram.suite.tests ---
02:46:06 [INFO] Using 'UTF-8' encoding to copy filtered resources.
02:46:06 [INFO] skip non existing resourceDirectory /jobs/genie.papyrus/Papyrus-Master-Tests-Failures/workspace/source/tests/junit/plugins/uml/diagram/org.eclipse.papyrus.uml.diagram.suite.tests/src/main/resources
02:46:06 [INFO] 
02:46:06 [INFO] --- tycho-compiler-plugin:1.3.0:compile (default-compile) @ org.eclipse.papyrus.uml.diagram.suite.tests ---
02:46:06 [INFO] Compiling 2 source files to /jobs/genie.papyrus/Papyrus-Master-Tests-Failures/workspace/source/tests/junit/plugins/uml/diagram/org.eclipse.papyrus.uml.diagram.suite.tests/bin
02:46:07 [INFO] 
02:46:07 [INFO] --- maven-resources-plugin:3.1.0:testResources (default-testResources) @ org.eclipse.papyrus.uml.diagram.suite.tests ---
02:46:07 [INFO] Using 'UTF-8' encoding to copy filtered resources.
02:46:07 [INFO] skip non existing resourceDirectory /jobs/genie.papyrus/Papyrus-Master-Tests-Failures/workspace/source/tests/junit/plugins/uml/diagram/org.eclipse.papyrus.uml.diagram.suite.tests/src/test/resources
02:46:07 [INFO] 
02:46:07 [INFO] --- target-platform-configuration:1.3.0:target-platform (default-target-platform) @ org.eclipse.papyrus.uml.diagram.suite.tests ---
02:46:07 [INFO] 
02:46:07 [INFO] --- tycho-packaging-plugin:1.3.0:package-plugin (default-package-plugin) @ org.eclipse.papyrus.uml.diagram.suite.tests ---
02:46:07 [INFO] Building jar: /jobs/genie.papyrus/Papyrus-Master-Tests-Failures/workspace/source/tests/junit/plugins/uml/diagram/org.eclipse.papyrus.uml.diagram.suite.tests/target/org.eclipse.papyrus.uml.diagram.suite.tests-0.0.1-SNAPSHOT.jar
02:46:07 [INFO] 
02:46:07 [INFO] --- tycho-p2-plugin:1.3.0:p2-metadata-default (default-p2-metadata-default) @ org.eclipse.papyrus.uml.diagram.suite.tests ---
02:46:07 [INFO] 
02:46:07 [INFO] --- tycho-surefire-plugin:1.3.0:test (default-test) @ org.eclipse.papyrus.uml.diagram.suite.tests ---
02:46:17 [INFO] Expected eclipse log file: /jobs/genie.papyrus/Papyrus-Master-Tests-Failures/workspace/source/tests/junit/plugins/uml/diagram/org.eclipse.papyrus.uml.diagram.suite.tests/target/work/data/.metadata/.log
02:46:17 [INFO] Command line:
02:46:17 	[/opt/public/common/java/oracle/jdk1.8.0_192_x64/jre/bin/java, -Dosgi.noShutdown=false, -Dosgi.os=linux, -Dosgi.ws=gtk, -Dosgi.arch=x86_64, -javaagent:/home/hudson/genie.papyrus/.jenkins/jobs/Papyrus-Master-Tests-Failures/workspace/.repository/org/jacoco/org.jacoco.agent/0.8.2/org.jacoco.agent-0.8.2-runtime.jar=destfile=/jobs/genie.papyrus/Papyrus-Master-Tests-Failures/workspace/source/tests/junit/plugins/uml/diagram/org.eclipse.papyrus.uml.diagram.suite.tests/target/jacoco.exec,includes=org.eclipse.papyrus.*,excludes=org.eclipse.uml2, -Xms512m, -Xmx2048m, -XX:SoftRefLRUPolicyMSPerMB=100, -Dosgi.clean=true, -jar, /jobs/genie.papyrus/Papyrus-Master-Tests-Failures/workspace/.repository/p2/osgi/bundle/org.eclipse.equinox.launcher/1.5.600.v20191014-2022/org.eclipse.equinox.launcher-1.5.600.v20191014-2022.jar, -data, /jobs/genie.papyrus/Papyrus-Master-Tests-Failures/workspace/source/tests/junit/plugins/uml/diagram/org.eclipse.papyrus.uml.diagram.suite.tests/target/work/data, -install, /jobs/genie.papyrus/Papyrus-Master-Tests-Failures/workspace/source/tests/junit/plugins/uml/diagram/org.eclipse.papyrus.uml.diagram.suite.tests/target/work, -configuration, /jobs/genie.papyrus/Papyrus-Master-Tests-Failures/workspace/source/tests/junit/plugins/uml/diagram/org.eclipse.papyrus.uml.diagram.suite.tests/target/work/configuration, -application, org.eclipse.tycho.surefire.osgibooter.uitest, -testproperties, /jobs/genie.papyrus/Papyrus-Master-Tests-Failures/workspace/source/tests/junit/plugins/uml/diagram/org.eclipse.papyrus.uml.diagram.suite.tests/target/surefire.properties, -product, org.eclipse.sdk.ide, -testConfig=FAILING_TESTS_CONFIG]
02:46:17 Picked up JAVA_TOOL_OPTIONS: -Xmx2G -Djava.io.tmpdir=/tmp/genie.papyrus -DforkCount=1
02:46:27 Running org.eclipse.papyrus.uml.diagram.suite.tests.AllTests
02:46:36 No JFaces support for org.eclipse.jface.viewers.TableTreeViewer
03:19:52 Build timed out (after 60 minutes). Marking the build as aborted.
03:19:52 [INFO] ------------------------------------------------------------------------
03:19:52 [INFO] Reactor Summary:
03:19:52 [INFO] 
03:19:52 [INFO] org.eclipse.papyrus.tests.releng 0.0.1-SNAPSHOT .... SUCCESS [01:58 min]
03:19:52 [INFO] org.eclipse.papyrus.plugins.tests.releng 0.0.1-SNAPSHOT SUCCESS [  0.005 s]
03:19:52 [INFO] org.eclipse.papyrus.editor.tests.releng 0.0.1-SNAPSHOT SUCCESS [  0.004 s]
03:19:52 [INFO] org.eclipse.papyrus.editor.integration.tests 1.4.0-SNAPSHOT SUCCESS [ 11.735 s]
03:19:52 [INFO] org.eclipse.papyrus.infra.tests.releng 0.0.1-SNAPSHOT SUCCESS [  0.005 s]
03:19:52 [INFO] org.eclipse.papyrus.infra.core.tests.releng 0.0.1-SNAPSHOT SUCCESS [  0.003 s]
03:19:52 [INFO] org.eclipse.papyrus.infra.core.clipboard.tests 1.3.0-SNAPSHOT SUCCESS [  0.538 s]
03:19:52 [INFO] org.eclipse.papyrus.infra.core.sasheditor.tests 1.2.0-SNAPSHOT SUCCESS [  0.979 s]
03:19:52 [INFO] org.eclipse.papyrus.infra.core.sasheditor.di.tests 1.2.0-SNAPSHOT SUCCESS [  0.375 s]
03:19:52 [INFO] org.eclipse.papyrus.infra.core.tests 3.1.0-SNAPSHOT  SUCCESS [  0.847 s]
03:19:52 [INFO] org.eclipse.papyrus.infra.editor.tests.releng 0.0.1-SNAPSHOT SUCCESS [  0.005 s]
03:19:52 [INFO] org.eclipse.papyrus.infra.editor.welcome.tests 1.2.0-SNAPSHOT SUCCESS [  0.548 s]
03:19:52 [INFO] org.eclipse.papyrus.infra.emf.tests.releng 0.0.1-SNAPSHOT SUCCESS [  0.004 s]
03:19:52 [INFO] org.eclipse.papyrus.infra.emf.gmf.tests 1.2.100-SNAPSHOT SUCCESS [  0.395 s]
03:19:52 [INFO] org.eclipse.papyrus.infra.emf.readonly.tests 1.3.0-SNAPSHOT SUCCESS [  0.331 s]
03:19:52 [INFO] org.eclipse.papyrus.infra.emf.tests 1.5.0-SNAPSHOT . SUCCESS [  0.647 s]
03:19:52 [INFO] org.eclipse.papyrus.infra.filters.tests 1.2.0-SNAPSHOT SUCCESS [  0.143 s]
03:19:52 [INFO] org.eclipse.papyrus.infra.gmfdiag.tests.releng 0.0.1-SNAPSHOT SUCCESS [  0.004 s]
03:19:52 [INFO] org.eclipse.papyrus.infra.gmfdiag.assistant.tests.releng 0.0.1-SNAPSHOT SUCCESS [  0.004 s]
03:19:52 [INFO] org.eclipse.papyrus.infra.gmfdiag.assistant.tests 1.3.0-SNAPSHOT SUCCESS [  0.606 s]
03:19:52 [INFO] org.eclipse.papyrus.infra.gmfdiag.canonical.tests 1.3.0-SNAPSHOT SUCCESS [  0.687 s]
03:19:52 [INFO] org.eclipse.papyrus.infra.gmfdiag.commands.tests 1.3.0-SNAPSHOT SUCCESS [  0.531 s]
03:19:52 [INFO] org.eclipse.papyrus.infra.gmfdiag.common.tests 3.1.0-SNAPSHOT SUCCESS [  0.746 s]
03:19:52 [INFO] org.eclipse.papyrus.infra.gmfdiag.css.tests 1.2.0-SNAPSHOT SUCCESS [  0.482 s]
03:19:52 [INFO] org.eclipse.papyrus.infra.gmfdiag.menu.tests 1.2.100-SNAPSHOT SUCCESS [  0.470 s]
03:19:52 [INFO] org.eclipse.papyrus.infra.gmfdiag.paletteconfiguration.tests 1.3.0-SNAPSHOT SUCCESS [  0.403 s]
03:19:52 [INFO] org.eclipse.papyrus.infra.gmfdiag.welcome.tests 1.2.0-SNAPSHOT SUCCESS [  0.445 s]
03:19:52 [INFO] org.eclipse.papyrus.infra.nattable.main.test 1.2.0-SNAPSHOT SUCCESS [  0.005 s]
03:19:52 [INFO] org.eclipse.papyrus.infra.nattable.common.tests 1.2.200-SNAPSHOT SUCCESS [  0.372 s]
03:19:52 [INFO] org.eclipse.papyrus.infra.nattable.model.tests 1.2.100-SNAPSHOT SUCCESS [  0.375 s]
03:19:52 [INFO] org.eclipse.papyrus.infra.nattable.tests 1.2.200-SNAPSHOT SUCCESS [  0.399 s]
03:19:52 [INFO] org.eclipse.papyrus.infra.nattable.views.tests 1.2.100-SNAPSHOT SUCCESS [  0.416 s]
03:19:52 [INFO] org.eclipse.papyrus.infra.properties.tests.releng 0.0.1-SNAPSHOT SUCCESS [  0.004 s]
03:19:52 [INFO] org.eclipse.papyrus.infra.properties.ui.tests 2.0.0-SNAPSHOT SUCCESS [  0.421 s]
03:19:52 [INFO] org.eclipse.papyrus.infra.services.tests.releng 0.0.1-SNAPSHOT SUCCESS [  0.004 s]
03:19:52 [INFO] org.eclipse.papyrus.infra.services.controlmode.tests 1.5.0-SNAPSHOT SUCCESS [  0.497 s]
03:19:52 [INFO] org.eclipse.papyrus.infra.services.edit.tests 1.2.0-SNAPSHOT SUCCESS [  0.377 s]
03:19:52 [INFO] org.eclipse.papyrus.infra.services.edit.ui.tests 1.2.0-SNAPSHOT SUCCESS [  0.346 s]
03:19:52 [INFO] org.eclipse.papyrus.infra.services.resourceloading.tests 1.2.0-SNAPSHOT SUCCESS [  0.393 s]
03:19:52 [INFO] org.eclipse.papyrus.infra.services.semantic.tests 1.2.100-SNAPSHOT SUCCESS [  0.421 s]
03:19:52 [INFO] org.eclipse.papyrus.infra.tools.tests 1.3.0-SNAPSHOT SUCCESS [  0.648 s]
03:19:52 [INFO] org.eclipse.papyrus.infra.types.tests.releng 0.0.1-SNAPSHOT SUCCESS [  0.004 s]
03:19:52 [INFO] org.eclipse.papyrus.infra.types.tests 3.0.100-SNAPSHOT SUCCESS [  0.506 s]
03:19:52 [INFO] org.eclipse.papyrus.infra.types.ui.tests 3.0.100-SNAPSHOT SUCCESS [  0.478 s]
03:19:52 [INFO] org.eclipse.papyrus.infra.ui.emf.tests 1.3.0-SNAPSHOT SUCCESS [  0.472 s]
03:19:52 [INFO] org.eclipse.papyrus.infra.ui.tests 1.2.0-SNAPSHOT .. SUCCESS [  0.496 s]
03:19:52 [INFO] org.eclipse.papyrus.infra.viewpoints.tests.releng 1.2.0-SNAPSHOT SUCCESS [  0.003 s]
03:19:52 [INFO] org.eclipse.papyrus.infra.viewpoints.policy.tests 1.2.0-SNAPSHOT SUCCESS [  0.374 s]
03:19:52 [INFO] org.eclipse.papyrus.uml.tests.releng 0.0.1-SNAPSHOT  SUCCESS [  0.003 s]
03:19:52 [INFO] org.eclipse.papyrus.uml.diagram.tests.releng 1.2.0-SNAPSHOT SUCCESS [  0.006 s]
03:19:52 [INFO] org.eclipse.papyrus.uml.diagram.tests 1.3.100-SNAPSHOT SUCCESS [  0.713 s]
03:19:52 [INFO] org.eclipse.papyrus.uml.diagram.clazz.tests 1.3.100-SNAPSHOT SUCCESS [  1.021 s]
03:19:52 [INFO] org.eclipse.papyrus.uml.diagram.activity.tests 1.2.100-SNAPSHOT SUCCESS [  0.944 s]
03:19:52 [INFO] org.eclipse.papyrus.uml.diagram.usecase.tests 4.0.100-SNAPSHOT SUCCESS [  0.709 s]
03:19:52 [INFO] org.eclipse.papyrus.uml.diagram.deployment.tests 1.2.100-SNAPSHOT SUCCESS [  0.634 s]
03:19:52 [INFO] org.eclipse.papyrus.uml.diagram.component.tests 1.2.100-SNAPSHOT SUCCESS [  0.589 s]
03:19:52 [INFO] org.eclipse.papyrus.uml.diagram.timing.tests 1.2.100-SNAPSHOT SUCCESS [  0.682 s]
03:19:52 [INFO] org.eclipse.papyrus.uml.diagram.stereotypeproperty.tests 1.2.100-SNAPSHOT SUCCESS [  0.429 s]
03:19:52 [INFO] org.eclipse.papyrus.uml.diagram.sequence.tests 1.3.100-SNAPSHOT SUCCESS [  0.956 s]
03:19:52 [INFO] org.eclipse.papyrus.uml.diagram.composite.tests 1.2.100-SNAPSHOT SUCCESS [  0.631 s]
03:19:52 [INFO] org.eclipse.papyrus.uml.diagram.profile.tests 1.2.100-SNAPSHOT SUCCESS [  0.832 s]
03:19:52 [INFO] org.eclipse.papyrus.uml.dynamic.profile.tests 1.2.0-SNAPSHOT SUCCESS [  0.052 s]
03:19:52 [INFO] org.eclipse.papyrus.uml.diagram.common.tests 1.3.100-SNAPSHOT SUCCESS [  3.924 s]
03:19:52 [INFO] org.eclipse.papyrus.uml.diagram.wizards.tests 1.3.0-SNAPSHOT SUCCESS [  0.568 s]
03:19:52 [INFO] org.eclipse.papyrus.tests.uml.diagram.feature 1.2.0-SNAPSHOT SUCCESS [  0.314 s]
03:19:52 [INFO] org.eclipse.papyrus.tests.infra.services.feature 1.2.0-SNAPSHOT SUCCESS [  0.087 s]
03:19:52 [INFO] org.eclipse.papyrus.views.tests.releng 0.0.1-SNAPSHOT SUCCESS [  0.003 s]
03:19:52 [INFO] org.eclipse.papyrus.views.modelexplorer.tests 1.2.100-SNAPSHOT SUCCESS [  0.292 s]
03:19:52 [INFO] org.eclipse.papyrus.uml.modelexplorer.tests.releng 0.0.1-SNAPSHOT SUCCESS [  0.005 s]
03:19:52 [INFO] org.eclipse.papyrus.uml.modelexplorer.tests 1.3.100-SNAPSHOT SUCCESS [  0.379 s]
03:19:52 [INFO] org.eclipse.papyrus.uml.modelrepair.tests 1.3.0-SNAPSHOT SUCCESS [  0.561 s]
03:19:52 [INFO] org.eclipse.papyrus.uml.properties.tests 1.1.0-SNAPSHOT SUCCESS [  0.618 s]
03:19:52 [INFO] org.eclipse.papyrus.uml.service.types.tests 1.3.0-SNAPSHOT SUCCESS [  0.552 s]
03:19:52 [INFO] org.eclipse.papyrus.uml.service.types.ui.tests 1.2.100-SNAPSHOT SUCCESS [  0.573 s]
03:19:52 [INFO] org.eclipse.papyrus.uml.profile.tests.releng 0.0.1-SNAPSHOT SUCCESS [  0.005 s]
03:19:52 [INFO] org.eclipse.papyrus.uml.profile.drafter.tests 1.3.0-SNAPSHOT SUCCESS [  0.504 s]
03:19:52 [INFO] org.eclipse.papyrus.uml.filters.tests 1.2.0-SNAPSHOT SUCCESS [  0.430 s]
03:19:52 [INFO] org.eclipse.papyrus.uml.profile.tests 1.2.0-SNAPSHOT SUCCESS [  0.494 s]
03:19:52 [INFO] org.eclipse.papyrus.tests.uml.feature 1.2.0-SNAPSHOT SUCCESS [  0.131 s]
03:19:52 [INFO] org.eclipse.papyrus.views.documentation.tests 1.0.0-SNAPSHOT SUCCESS [  0.401 s]
03:19:52 [INFO] org.eclipse.papyrus.tests.views.feature 1.2.0-SNAPSHOT SUCCESS [  0.090 s]
03:19:52 [INFO] org.eclipse.papyrus.tests.infra.nattable.feature 1.4.0-SNAPSHOT SUCCESS [  0.084 s]
03:19:52 [INFO] org.eclipse.papyrus.uml.nattable.main.test 1.2.0-SNAPSHOT SUCCESS [  0.004 s]
03:19:52 [INFO] org.eclipse.papyrus.uml.nattable.tests 1.2.100-SNAPSHOT SUCCESS [  0.331 s]
03:19:52 [INFO] org.eclipse.papyrus.uml.nattable.generic.tests 1.2.200-SNAPSHOT SUCCESS [  0.609 s]
03:19:52 [INFO] org.eclipse.papyrus.uml.nattable.clazz.config.tests 1.2.200-SNAPSHOT SUCCESS [  0.933 s]
03:19:52 [INFO] org.eclipse.papyrus.uml.nattable.stereotyped.elements.tests 1.0.200-SNAPSHOT SUCCESS [  0.761 s]
03:19:52 [INFO] org.eclipse.papyrus.uml.nattable.matrix.tests 1.0.100-SNAPSHOT SUCCESS [  0.545 s]
03:19:52 [INFO] org.eclipse.papyrus.tests.uml.nattable.feature 1.3.0-SNAPSHOT SUCCESS [  0.109 s]
03:19:52 [INFO] org.eclipse.papyrus.tests.infra.feature 1.2.0-SNAPSHOT SUCCESS [  0.218 s]
03:19:52 [INFO] org.eclipse.papyrus.tests.infra.core.feature 1.2.0-SNAPSHOT SUCCESS [  0.055 s]
03:19:52 [INFO] org.eclipse.papyrus.uml.tools.tests.releng 0.0.1-SNAPSHOT SUCCESS [  0.003 s]
03:19:52 [INFO] org.eclipse.papyrus.uml.tools.tests 3.1.0-SNAPSHOT . SUCCESS [  0.730 s]
03:19:52 [INFO] org.eclipse.papyrus.uml.tools.utils.tests 1.3.0-SNAPSHOT SUCCESS [  0.444 s]
03:19:52 [INFO] org.eclipse.papyrus.tests.uml.tools.feature 1.2.0-SNAPSHOT SUCCESS [  0.064 s]
03:19:52 [INFO] org.eclipse.papyrus.uml.decoratormodel.tests.releng 0.0.1-SNAPSHOT SUCCESS [  0.003 s]
03:19:52 [INFO] org.eclipse.papyrus.uml.decoratormodel.controlmode.tests 1.3.0-SNAPSHOT SUCCESS [  0.553 s]
03:19:52 [INFO] org.eclipse.papyrus.uml.decoratormodel.tests 1.3.0-SNAPSHOT SUCCESS [  0.480 s]
03:19:52 [INFO] org.eclipse.papyrus.tests.uml.decoratormodel.feature 1.2.0-SNAPSHOT SUCCESS [  0.063 s]
03:19:52 [INFO] org.eclipse.papyrus.uml.textedit.tests.releng 0.0.1-SNAPSHOT SUCCESS [  0.004 s]
03:19:52 [INFO] org.eclipse.papyrus.uml.textedit.parameter.tests 1.2.100-SNAPSHOT SUCCESS [  0.467 s]
03:19:52 [INFO] org.eclipse.papyrus.uml.textedit.port.tests 1.2.100-SNAPSHOT SUCCESS [  0.368 s]
03:19:52 [INFO] org.eclipse.papyrus.uml.textedit.property.tests 1.2.200-SNAPSHOT SUCCESS [  0.382 s]
03:19:52 [INFO] org.eclipse.papyrus.uml.textedit.tests 1.3.100-SNAPSHOT SUCCESS [  0.358 s]
03:19:52 [INFO] org.eclipse.papyrus.uml.textedit.tests.feature 1.2.0-SNAPSHOT SUCCESS [  0.119 s]
03:19:52 [INFO] org.eclipse.papyrus.uml.assistants.tests.releng 0.0.1-SNAPSHOT SUCCESS [  0.005 s]
03:19:52 [INFO] org.eclipse.papyrus.uml.profile.types.generator.tests 1.2.100-SNAPSHOT SUCCESS [  0.504 s]
03:19:52 [INFO] org.eclipse.papyrus.uml.profile.assistants.generator.tests 1.2.100-SNAPSHOT SUCCESS [  0.393 s]
03:19:52 [INFO] org.eclipse.papyrus.tests.uml.assistants.feature 1.2.0-SNAPSHOT SUCCESS [  0.052 s]
03:19:52 [INFO] org.eclipse.papyrus.toolsmiths.tests.releng 0.0.1-SNAPSHOT SUCCESS [  0.002 s]
03:19:52 [INFO] org.eclipse.papyrus.toolsmiths.profilemigration.tests 0.7.0-SNAPSHOT SUCCESS [  0.396 s]
03:19:52 [INFO] org.eclipse.papyrus.toolsmiths.validation.profile.tests 1.0.0-SNAPSHOT SUCCESS [  0.407 s]
03:19:52 [INFO] org.eclipse.papyrus.toolsmiths.validation.elementtypes.tests 1.0.0-SNAPSHOT SUCCESS [  0.357 s]
03:19:52 [INFO] org.eclipse.papyrus.tests.toolsmiths.feature 1.0.0-SNAPSHOT SUCCESS [  0.064 s]
03:19:52 [INFO] org.eclipse.papyrus.tests.feature 2.0.0-SNAPSHOT ... SUCCESS [  0.712 s]
03:19:52 [INFO] org.eclipse.papyrus.infra.emf.expressions.main.tests 0.0.1-SNAPSHOT SUCCESS [  0.003 s]
03:19:52 [INFO] org.eclipse.papyrus.infra.emf.expressions.tests 1.0.0-SNAPSHOT SUCCESS [  0.100 s]
03:19:52 [INFO] org.eclipse.papyrus.tests.infra.emf.expressions.feature 1.0.0-SNAPSHOT SUCCESS [  0.079 s]
03:19:52 [INFO] org.eclipse.papyrus.infra.internationalization.main.test 1.0.0-SNAPSHOT SUCCESS [  0.007 s]
03:19:52 [INFO] org.eclipse.papyrus.infra.internationalization.tests 1.100.0-SNAPSHOT SUCCESS [  0.456 s]
03:19:52 [INFO] org.eclipse.papyrus.tests.infra.internationalization.feature 1.0.0-SNAPSHOT SUCCESS [  0.046 s]
03:19:52 [INFO] org.eclipse.papyrus.uml.expressions.tests.releng 0.0.1-SNAPSHOT SUCCESS [  0.003 s]
03:19:52 [INFO] org.eclipse.papyrus.uml.expressions.tests 1.1.0-SNAPSHOT SUCCESS [  0.402 s]
03:19:52 [INFO] org.eclipse.papyrus.tests.uml.expressions.feature 1.0.0-SNAPSHOT SUCCESS [  0.056 s]
03:19:52 [INFO] org.eclipse.papyrus.uml.internationalization.main.test 1.0.0-SNAPSHOT SUCCESS [  0.002 s]
03:19:52 [INFO] org.eclipse.papyrus.uml.internationalization.tests 1.100.0-SNAPSHOT SUCCESS [  0.586 s]
03:19:52 [INFO] org.eclipse.papyrus.uml.internationalization.controlmode.tests 1.1.0-SNAPSHOT SUCCESS [  0.348 s]
03:19:52 [INFO] org.eclipse.papyrus.tests.uml.internationalization.feature 1.0.0-SNAPSHOT SUCCESS [  0.050 s]
03:19:52 [INFO] org.eclipse.papyrus.uml.alf.tests 1.2.0-SNAPSHOT ... SUCCESS [01:04 min]
03:19:52 [INFO] org.eclipse.papyrus.uml.alf.tests.feature 1.2.0-SNAPSHOT SUCCESS [  0.134 s]
03:19:52 [INFO] Papyrus Tests Features 0.0.1-SNAPSHOT .............. SUCCESS [  0.004 s]
03:19:52 [INFO] org.eclipse.papyrus.developer.suite.tests 0.0.1-SNAPSHOT SUCCESS [ 23.278 s]
03:19:52 [INFO] org.eclipse.papyrus.bundles.tests 0.0.1-SNAPSHOT ... SUCCESS [  0.004 s]
03:19:52 [INFO] org.eclipse.papyrus.eclipse.project.editors.tests 2.1.0-SNAPSHOT SUCCESS [  0.571 s]
03:19:52 [INFO] org.eclipse.papyrus.editors.suite.tests 0.0.1-SNAPSHOT SUCCESS [ 25.805 s]
03:19:52 [INFO] org.eclipse.papyrus.infra.core.suite.tests 0.0.1-SNAPSHOT SUCCESS [ 39.036 s]
03:19:52 [INFO] org.eclipse.papyrus.infra.nattable.suite.tests 0.0.1-SNAPSHOT SUCCESS [ 22.694 s]
03:19:52 [INFO] org.eclipse.papyrus.infra.architecture.tests 1.0.0-SNAPSHOT SUCCESS [  0.425 s]
03:19:52 [INFO] org.eclipse.papyrus.infra.services.labelprovider.tests 1.2.200-SNAPSHOT SUCCESS [  0.312 s]
03:19:52 [INFO] org.eclipse.papyrus.infra.ui.architecture.tests 1.0.0-SNAPSHOT SUCCESS [  0.361 s]
03:19:52 [INFO] org.eclipse.papyrus.infra.suite.tests 0.0.1-SNAPSHOT SUCCESS [ 39.727 s]
03:19:52 [INFO] org.eclipse.papyrus.infra.newchild.tests 1.2.100-SNAPSHOT SUCCESS [  0.366 s]
03:19:52 [INFO] org.eclipse.papyrus.uml.diagram.communication.tests 1.2.100-SNAPSHOT SUCCESS [  0.558 s]
03:19:52 [INFO] org.eclipse.papyrus.uml.diagram.interactionoverview.tests 1.2.0-SNAPSHOT SUCCESS [  0.399 s]
03:19:52 [INFO] org.eclipse.papyrus.uml.diagram.statemachine.tests 1.2.100-SNAPSHOT SUCCESS [  1.827 s]
03:19:52 [INFO] org.eclipse.papyrus.uml.diagram.suite.tests 0.0.1-SNAPSHOT FAILURE [33:46 min]
03:19:52 [INFO] org.eclipse.papyrus.uml.diagram.dnd.tests 1.2.100-SNAPSHOT SKIPPED
03:19:52 [INFO] org.eclipse.papyrus.uml.diagram.properties.tests 1.0.0-SNAPSHOT SKIPPED
03:19:52 [INFO] org.eclipse.papyrus.uml.nattable.stereotype.display.tests 1.2.100-SNAPSHOT SKIPPED
03:19:52 [INFO] org.eclipse.papyrus.uml.nattable.suite.tests 0.0.1-SNAPSHOT SKIPPED
03:19:52 [INFO] org.eclipse.papyrus.uml.textedit.valuespecification.tests 1.2.100-SNAPSHOT SKIPPED
03:19:52 [INFO] org.eclipse.papyrus.uml.textedit.suite.tests 0.0.1-SNAPSHOT SKIPPED
03:19:52 [INFO] org.eclipse.papyrus.uml.architecture.tests 1.1.200-SNAPSHOT SKIPPED
03:19:52 [INFO] org.eclipse.papyrus.uml.validation.tests.releng 0.0.1-SNAPSHOT SKIPPED
03:19:52 [INFO] org.eclipse.papyrus.uml.validation.tests.staticprofile 1.2.0-SNAPSHOT SKIPPED
03:19:52 [INFO] org.eclipse.papyrus.uml.validation.tests.genvalidation 1.2.0-SNAPSHOT SKIPPED
03:19:52 [INFO] org.eclipse.papyrus.uml.validation.tests 1.2.100-SNAPSHOT SKIPPED
03:19:52 [INFO] org.eclipse.papyrus.uml.suite.tests 0.0.1-SNAPSHOT . SKIPPED
03:19:52 [INFO] org.eclipse.papyrus.uml.alf.tests.releng 0.0.1-SNAPSHOT SKIPPED
03:19:52 [INFO] org.eclipse.papyrus.uml.alf.backend.tests 1.1.0-SNAPSHOT SKIPPED
03:19:52 [INFO] org.eclipse.papyrus.views.properties.toolsmiths.tests 1.2.0-SNAPSHOT SKIPPED
03:19:52 [INFO] org.eclipse.papyrus.views.suite.tests 0.0.1-SNAPSHOT SKIPPED
03:19:52 [INFO] org.eclipse.papyrus.views.documentation.tests.releng 0.0.1-SNAPSHOT SKIPPED
03:19:52 [INFO] org.eclipse.papyrus.toolsmiths.suite.tests 0.0.1-SNAPSHOT SKIPPED
03:19:52 [INFO] org.eclipse.papyrus.tests.main.releng 1.2.0-SNAPSHOT SKIPPED
03:19:52 [INFO] org.eclipse.papyrus.main.tests.target.parent 0.0.1-SNAPSHOT SKIPPED
03:19:52 [INFO] org.eclipse.papyrus.main.tests.portable.target 0.0.1-SNAPSHOT SKIPPED
03:19:52 [INFO] ------------------------------------------------------------------------
03:19:52 [INFO] BUILD FAILURE
03:19:52 [INFO] ------------------------------------------------------------------------
03:19:52 [INFO] Total time:  59:43 min
03:19:52 [INFO] Finished at: 2019-12-01T03:19:52-05:00
03:19:52 [INFO] ------------------------------------------------------------------------
03:19:52 [ERROR] Failed to execute goal org.eclipse.tycho:tycho-surefire-plugin:1.3.0:test (default-test) on project org.eclipse.papyrus.uml.diagram.suite.tests: An unexpected error occured while launching the test runtime (return code 143). See log /jobs/genie.papyrus/Papyrus-Master-Tests-Failures/workspace/source/tests/junit/plugins/uml/diagram/org.eclipse.papyrus.uml.diagram.suite.tests/target/work/data/.metadata/.log for details. -> [Help 1]
03:19:52 [ERROR] 
03:19:52 [ERROR] To see the full stack trace of the errors, re-run Maven with the -e switch.
03:19:52 [ERROR] Re-run Maven using the -X switch to enable full debug logging.
03:19:52 [ERROR] 
03:19:52 [ERROR] For more information about the errors and possible solutions, please read the following articles:
03:19:52 [ERROR] [Help 1] http://cwiki.apache.org/confluence/display/MAVEN/MojoFailureException
03:19:52 [ERROR] 
03:19:52 [ERROR] After correcting the problems, you can resume the build with the command
03:19:52 [ERROR]   mvn <goals> -rf :org.eclipse.papyrus.uml.diagram.suite.tests
03:19:56 Taking screenshot.
03:19:56 [workspace] $ echo $XAUTHORITY
03:19:56 /home/hudson/genie.papyrus/.jenkins/jobs/Papyrus-Master-Tests-Failures/workspace/.Xauthority-805771845738161633
03:19:56 [workspace] $ ls -l $XAUTHORITY
03:19:56 -rw-rw-r-- 1 genie.papyrus 8303 0 Dec  1 02:20 /home/hudson/genie.papyrus/.jenkins/jobs/Papyrus-Master-Tests-Failures/workspace/.Xauthority-805771845738161633
03:19:56 [workspace] $ import -window root -display :727 screenshot.jpg
03:19:56 Terminating xvnc.
03:20:06 Build was aborted
03:20:06 No mail will be sent out, as 'Papyrus-Master-Tests-Failures #1126' does not have a result yet. Please make sure you set a proper result in case of pipeline/build scripts.
03:20:06 Recording test results
03:20:07 Started calculate disk usage of build
03:20:07 Finished Calculation of disk usage of build in 0 seconds
03:20:07 Started calculate disk usage of workspace
03:20:08 Finished Calculation of disk usage of workspace in  1 second
03:20:08 [WS-CLEANUP] Deleting project workspace...
03:20:08 [WS-CLEANUP] Deferred wipeout is used...
03:20:08 [WS-CLEANUP] done
03:20:08 Finished: ABORTED