FailedConsole Output

Skipping 11,687 KB.. Full Log
nfig 1.2.100-SNAPSHOT SUCCESS [  0.276 s]
13:07:02 [INFO] org.eclipse.papyrus.uml.architecture 1.1.400-SNAPSHOT SUCCESS [  0.561 s]
13:07:02 [INFO] Papyrus UML Decorator Models 0.0.1-SNAPSHOT ........ SUCCESS [  0.002 s]
13:07:02 [INFO] org.eclipse.papyrus.uml.decoratormodel 2.3.100-SNAPSHOT SUCCESS [  0.390 s]
13:07:02 [INFO] org.eclipse.papyrus.uml.decoratormodel.controlmode 1.3.0-SNAPSHOT SUCCESS [  0.332 s]
13:07:02 [INFO] org.eclipse.papyrus.uml.nattable.stereotype.display 3.0.200-SNAPSHOT SUCCESS [  0.477 s]
13:07:02 [INFO] Papyrus UML Properties 0.0.1-SNAPSHOT .............. SUCCESS [  0.001 s]
13:07:02 [INFO] org.eclipse.papyrus.uml.properties 3.5.100-SNAPSHOT  SUCCESS [  1.070 s]
13:07:02 [INFO] org.eclipse.papyrus.uml.decoratormodel.ui 2.1.0-SNAPSHOT SUCCESS [  0.365 s]
13:07:02 [INFO] org.eclipse.papyrus.uml.decoratormodel.properties 4.1.0-SNAPSHOT SUCCESS [  0.431 s]
13:07:02 [INFO] org.eclipse.papyrus.uml.diagram.common.groups 2.0.0-SNAPSHOT SUCCESS [  0.476 s]
13:07:02 [INFO] org.eclipse.papyrus.uml.diagram.css 2.0.100-SNAPSHOT SUCCESS [  0.394 s]
13:07:02 [INFO] org.eclipse.papyrus.uml.diagram.dnd 1.3.100-SNAPSHOT SUCCESS [  0.503 s]
13:07:02 [INFO] org.eclipse.papyrus.uml.diagram.icons 1.2.0-SNAPSHOT SUCCESS [  0.097 s]
13:07:02 [INFO] org.eclipse.papyrus.uml.diagram.linklf 2.0.100-SNAPSHOT SUCCESS [  0.500 s]
13:07:02 [INFO] org.eclipse.papyrus.uml.diagram.symbols 1.2.100-SNAPSHOT SUCCESS [  0.486 s]
13:07:02 [INFO] org.eclipse.papyrus.uml.diagram.sequence.restrictions 1.0.0-SNAPSHOT SUCCESS [  0.474 s]
13:07:02 [INFO] org.eclipse.papyrus.uml.diagram.symbols.properties 1.2.0-SNAPSHOT SUCCESS [  0.175 s]
13:07:02 [INFO] Papyrus UML Expressions Infrastructure 0.0.1-SNAPSHOT SUCCESS [  0.002 s]
13:07:02 [INFO] org.eclipse.papyrus.uml.expressions 2.1.100-SNAPSHOT SUCCESS [  0.109 s]
13:07:02 [INFO] org.eclipse.papyrus.uml.expressions.edit 2.1.0-SNAPSHOT SUCCESS [  0.163 s]
13:07:02 [INFO] org.eclipse.papyrus.uml.expressions.properties 1.0.100-SNAPSHOT SUCCESS [  0.219 s]
13:07:02 [INFO] Papyrus UML Model Explorer 0.0.1-SNAPSHOT .......... SUCCESS [  0.002 s]
13:07:02 [INFO] org.eclipse.papyrus.uml.modelexplorer 2.1.0-SNAPSHOT SUCCESS [  0.669 s]
13:07:02 [INFO] org.eclipse.papyrus.uml.modelexplorer.widgets 2.0.100-SNAPSHOT SUCCESS [  0.208 s]
13:07:02 [INFO] org.eclipse.papyrus.uml.nattable.generic 1.2.100-SNAPSHOT SUCCESS [  0.207 s]
13:07:02 [INFO] org.eclipse.papyrus.uml.nattable.matrix 1.0.200-SNAPSHOT SUCCESS [  0.316 s]
13:07:02 [INFO] org.eclipse.papyrus.uml.nattable.menu 1.2.200-SNAPSHOT SUCCESS [  0.558 s]
13:07:02 [INFO] org.eclipse.papyrus.uml.nattable.properties 1.0.200-SNAPSHOT SUCCESS [  0.295 s]
13:07:02 [INFO] org.eclipse.papyrus.uml.nattable.richtext 2.1.100-SNAPSHOT SUCCESS [  0.316 s]
13:07:02 [INFO] org.eclipse.papyrus.uml.nattable.xtext.integration 2.0.100-SNAPSHOT SUCCESS [  0.410 s]
13:07:02 [INFO] Papyrus UML Textual Edit 0.0.1-SNAPSHOT ............ SUCCESS [  0.002 s]
13:07:02 [INFO] org.eclipse.papyrus.uml.textedit.valuespecification.xtext 1.4.0-SNAPSHOT SUCCESS [  1.136 s]
13:07:02 [INFO] org.eclipse.papyrus.uml.textedit.valuespecification.xtext.utils 1.4.0-SNAPSHOT SUCCESS [  0.409 s]
13:07:02 [INFO] org.eclipse.papyrus.uml.textedit.valuespecification.xtext.ui 2.1.0-SNAPSHOT SUCCESS [  0.478 s]
13:07:02 [INFO] org.eclipse.papyrus.uml.nattable.xtext.valuespecification 5.0.0-SNAPSHOT SUCCESS [  0.510 s]
13:07:02 [INFO] Papyrus UML Profile 0.0.1-SNAPSHOT ................. SUCCESS [  0.004 s]
13:07:02 [INFO] org.eclipse.papyrus.uml.profile.drafter 1.4.0-SNAPSHOT SUCCESS [  0.565 s]
13:07:02 [INFO] org.eclipse.papyrus.uml.profile.drafter.documentation 1.2.100-SNAPSHOT SUCCESS [  0.054 s]
13:07:02 [INFO] org.eclipse.papyrus.uml.properties.xtext 1.3.100-SNAPSHOT SUCCESS [  0.545 s]
13:07:02 [INFO] org.eclipse.papyrus.uml.textedit.common.xtext 2.1.0-SNAPSHOT SUCCESS [  0.940 s]
13:07:02 [INFO] org.eclipse.papyrus.uml.textedit.collaborationuse.xtext 2.1.0-SNAPSHOT SUCCESS [ 16.863 s]
13:07:02 [INFO] org.eclipse.papyrus.uml.textedit.common.xtext.ui 2.1.100-SNAPSHOT SUCCESS [  0.532 s]
13:07:02 [INFO] org.eclipse.papyrus.uml.textedit.collaborationuse.xtext.ui 2.1.0-SNAPSHOT SUCCESS [  0.674 s]
13:07:02 [INFO] org.eclipse.papyrus.uml.textedit.connectionpointreference.xtext 2.1.0-SNAPSHOT SUCCESS [  0.942 s]
13:07:02 [INFO] org.eclipse.papyrus.uml.textedit.connectionpointreference.xtext.ui 2.1.0-SNAPSHOT SUCCESS [  0.428 s]
13:07:02 [INFO] org.eclipse.papyrus.uml.textedit.constraintwithessentialocl.xtext 1.3.0-SNAPSHOT SUCCESS [  0.393 s]
13:07:02 [INFO] org.eclipse.papyrus.uml.textedit.javaconstraint 2.0.100-SNAPSHOT SUCCESS [  0.175 s]
13:07:02 [INFO] org.eclipse.papyrus.uml.textedit.message.xtext 2.1.0-SNAPSHOT SUCCESS [  0.904 s]
13:07:02 [INFO] org.eclipse.papyrus.uml.textedit.message.xtext.ui 2.1.0-SNAPSHOT SUCCESS [  0.615 s]
13:07:02 [INFO] org.eclipse.papyrus.uml.textedit.parameter.xtext 2.1.0-SNAPSHOT SUCCESS [  1.088 s]
13:07:02 [INFO] org.eclipse.papyrus.uml.textedit.parameter.xtext.ui 2.1.0-SNAPSHOT SUCCESS [  0.551 s]
13:07:02 [INFO] org.eclipse.papyrus.uml.textedit.port.xtext 1.4.0-SNAPSHOT SUCCESS [  1.066 s]
13:07:02 [INFO] org.eclipse.papyrus.uml.textedit.port.xtext.ui 2.1.0-SNAPSHOT SUCCESS [  0.461 s]
13:07:02 [INFO] org.eclipse.papyrus.uml.textedit.property.xtext 2.1.0-SNAPSHOT SUCCESS [  2.101 s]
13:07:02 [INFO] org.eclipse.papyrus.uml.textedit.property.xtext.ui 2.1.0-SNAPSHOT SUCCESS [  6.526 s]
13:07:02 [INFO] org.eclipse.papyrus.uml.textedit.state.xtext 2.1.0-SNAPSHOT SUCCESS [  1.140 s]
13:07:02 [INFO] org.eclipse.papyrus.uml.textedit.state.xtext.ui 2.1.0-SNAPSHOT SUCCESS [  0.428 s]
13:07:02 [INFO] org.eclipse.papyrus.uml.textedit.stereotypeproperty.xtext 3.0.0-SNAPSHOT SUCCESS [  1.522 s]
13:07:02 [INFO] org.eclipse.papyrus.uml.textedit.stereotypeproperty.xtext.ui 3.0.0-SNAPSHOT SUCCESS [  0.948 s]
13:07:02 [INFO] org.eclipse.papyrus.uml.textedit.transition.xtext 1.4.0-SNAPSHOT SUCCESS [  0.488 s]
13:07:02 [INFO] org.eclipse.papyrus.uml.textedit.transition.xtext.ui 2.1.0-SNAPSHOT SUCCESS [  0.548 s]
13:07:02 [INFO] org.eclipse.papyrus.uml.xtext.integration.validation 2.1.0-SNAPSHOT SUCCESS [  0.341 s]
13:07:02 [INFO] org.eclipse.papyrus.uml.internationalization 1.0.0-SNAPSHOT SUCCESS [  0.334 s]
13:07:02 [INFO] Papyrus M2M QvTo 0.0.1-SNAPSHOT .................... SUCCESS [  0.003 s]
13:07:02 [INFO] org.eclipse.papyrus.uml.m2m.qvto.common 1.1.100-SNAPSHOT SUCCESS [  3.862 s]
13:07:02 [INFO] org.eclipse.papyrus.uml.m2m.qvto.common.blackboxes 1.0.100-SNAPSHOT SUCCESS [  0.128 s]
13:07:02 [INFO] org.eclipse.papyrus.plugins-doc 0.0.1-SNAPSHOT ..... SUCCESS [  0.002 s]
13:07:02 [INFO] Papyrus Infra doc 1.2.0-SNAPSHOT ................... SUCCESS [  0.030 s]
13:07:02 [INFO] Papyrus - API migration documentation 1.0.0-SNAPSHOT SUCCESS [  3.174 s]
13:07:02 [INFO] Papyrus Copypaste UI doc 1.2.0-SNAPSHOT ............ SUCCESS [  0.062 s]
13:07:02 [INFO] Papyrus Developer doc 1.0.0-SNAPSHOT ............... SUCCESS [  0.589 s]
13:07:02 [INFO] Papyrus DSML Validation doc 1.2.0-SNAPSHOT ......... SUCCESS [  0.062 s]
13:07:02 [INFO] Papyrus Infra GmfDiag Common doc 1.2.0-SNAPSHOT .... SUCCESS [  0.178 s]
13:07:02 [INFO] Papyrus Infra GmfDiag Css doc 1.2.0-SNAPSHOT ....... SUCCESS [  0.132 s]
13:07:02 [INFO] Papyrus Infra Expression doc 1.0.0-SNAPSHOT ........ SUCCESS [  0.058 s]
13:07:02 [INFO] Papyrus Internationalization doc 1.0.0-SNAPSHOT .... SUCCESS [  0.063 s]
13:07:02 [INFO] Papyrus Infra Nattable doc 1.3.100-SNAPSHOT ........ SUCCESS [  0.447 s]
13:07:02 [INFO] Papyrus Infra Newchild doc 1.2.0-SNAPSHOT .......... SUCCESS [  0.054 s]
13:07:02 [INFO] Papyrus Infra Services ControlMode doc 1.2.0-SNAPSHOT SUCCESS [  0.714 s]
13:07:02 [INFO] Papyrus Infra Service decoration doc 1.0.0-SNAPSHOT  SUCCESS [  2.563 s]
13:07:02 [INFO] Papyrus Infra Service decoration doc 1.0.0-SNAPSHOT  SUCCESS [  0.065 s]
13:07:02 [INFO] Papyrus Infra Architecture doc 1.0.0-SNAPSHOT ...... SUCCESS [  0.086 s]
13:07:02 [INFO] Papyrus Infra Types doc 3.0.100-SNAPSHOT ........... SUCCESS [  0.097 s]
13:07:02 [INFO] Papyrus Req Reqif doc 1.2.0-SNAPSHOT ............... SUCCESS [  0.101 s]
13:07:02 [INFO] Papyrus Uml DecoratorModel doc 1.2.0-SNAPSHOT ...... SUCCESS [  0.134 s]
13:07:02 [INFO] Papyrus Uml Diagram Common doc 1.2.0-SNAPSHOT ...... SUCCESS [  0.154 s]
13:07:02 [INFO] Papyrus Uml Diagram profile doc 1.2.0-SNAPSHOT ..... SUCCESS [  0.181 s]
13:07:02 [INFO] Papyrus Uml doc 1.2.0-SNAPSHOT ..................... SUCCESS [  0.361 s]
13:07:02 [INFO] Papyrus Uml Search UI doc 1.0.0-SNAPSHOT ........... SUCCESS [  0.092 s]
13:07:02 [INFO] Papyrus ModelRepair doc 1.2.0-SNAPSHOT ............. SUCCESS [  0.041 s]
13:07:02 [INFO] Papyrus Uml Profile Assistants doc 1.2.0-SNAPSHOT .. SUCCESS [  0.076 s]
13:07:02 [INFO] Papyrus Uml Search UI doc 1.2.0-SNAPSHOT ........... SUCCESS [  0.075 s]
13:07:02 [INFO] Papyrus Views Properties doc 1.3.0-SNAPSHOT ........ SUCCESS [  0.094 s]
13:07:02 [INFO] Papyrus Views References doc 1.2.0-SNAPSHOT ........ SUCCESS [  0.029 s]
13:07:02 [INFO] Papyrus Views References doc 1.0.0-SNAPSHOT ........ SUCCESS [  0.034 s]
13:07:02 [INFO] Papyrus Views References doc 1.0.0-SNAPSHOT ........ SUCCESS [  0.066 s]
13:07:02 [INFO] org.eclipse.papyrus.toolsmiths.profilemigration.doc 0.7.0-SNAPSHOT SUCCESS [  0.057 s]
13:07:02 [INFO] org.eclipse.papyrus.toolsmiths.architecture.doc 1.0.0-SNAPSHOT SUCCESS [  0.031 s]
13:07:02 [INFO] org.eclipse.papyrus.toolsmiths.validation.doc 1.0.0-SNAPSHOT SUCCESS [  0.074 s]
13:07:02 [INFO] Papyrus SDK 0.0.1-SNAPSHOT ......................... SUCCESS [  0.002 s]
13:07:02 [INFO] org.eclipse.papyrus.sdk 5.0.0-SNAPSHOT ............. SUCCESS [  0.030 s]
13:07:02 [INFO] Papyrus Examples Plugins 1.0.1-SNAPSHOT ............ SUCCESS [  0.002 s]
13:07:02 [INFO] org.eclipse.papyrus.examples.core 1.0.1-SNAPSHOT ... SUCCESS [  0.001 s]
13:07:02 [INFO] org.eclipse.papyrus.example.core.lifecycleevents 1.2.0-SNAPSHOT SUCCESS [  0.161 s]
13:07:02 [INFO] org.eclipse.papyrus.example.core.sashwindows.fulleditor 1.1.0-SNAPSHOT SUCCESS [  0.203 s]
13:07:02 [INFO] org.eclipse.papyrus.example.core.sashwindows.simpleeditor 1.1.0-SNAPSHOT SUCCESS [  1.989 s]
13:07:02 [INFO] org.eclipse.papyrus.examples.emf 1.0.1-SNAPSHOT .... SUCCESS [  0.002 s]
13:07:02 [INFO] org.eclipse.papyrus.outline.emftree 1.1.0-SNAPSHOT . SUCCESS [  0.228 s]
13:07:02 [INFO] org.eclipse.papyrus.examples.infra 1.0.1-SNAPSHOT .. SUCCESS [  0.003 s]
13:07:02 [INFO] org.eclipse.papyrus.example.infra.servicesregistry.retrieval 1.1.0-SNAPSHOT SUCCESS [  0.182 s]
13:07:02 [INFO] org.eclipse.papyrus.infra.gmfdiag.connectionpoint.preferences 1.1.0-SNAPSHOT SUCCESS [  0.719 s]
13:07:02 [INFO] org.eclipse.papyrus.examples.others 1.0.1-SNAPSHOT . SUCCESS [  0.004 s]
13:07:02 [INFO] org.eclipse.papyrus.example.diagram.simplediagram 1.1.100-SNAPSHOT SUCCESS [  0.595 s]
13:07:02 [INFO] org.eclipse.papyrus.example.text.instance 1.1.0-SNAPSHOT SUCCESS [  0.071 s]
13:07:02 [INFO] org.eclipse.papyrus.examples.uml 1.0.1-SNAPSHOT .... SUCCESS [  0.003 s]
13:07:02 [INFO] org.eclipse.papyrus.example.uml.comment.editor.newresource 1.1.0-SNAPSHOT SUCCESS [  0.210 s]
13:07:02 [INFO] org.eclipse.papyrus.example.uml.comment.editor.sharedresource 1.1.0-SNAPSHOT SUCCESS [  0.193 s]
13:07:02 [INFO] org.eclipse.papyrus.uml.diagram.emftree 1.3.0-SNAPSHOT SUCCESS [  0.151 s]
13:07:02 [INFO] org.eclipse.papyrus.uml.textual.editors.example 1.1.100-SNAPSHOT SUCCESS [  0.536 s]
13:07:02 [INFO] org.eclipse.papyrus.uml.disable.helper.advices.example 1.0.0-SNAPSHOT SUCCESS [  0.148 s]
13:07:02 [INFO] org.eclipse.papyrus.examples.uml.diagrams 1.0.100-SNAPSHOT SUCCESS [  0.137 s]
13:07:02 [INFO] org.eclipse.papyrus.example.uml.nattable.actions 1.0.0-SNAPSHOT SUCCESS [  0.205 s]
13:07:02 [INFO] org.eclipse.papyrus.example.uml.nattable.empty.line 1.0.0-SNAPSHOT SUCCESS [  0.507 s]
13:07:02 [INFO] org.eclipse.papyrus.example.uml.services.decorator 1.0.0-SNAPSHOT SUCCESS [  0.138 s]
13:07:02 [INFO] org.eclipse.papyrus.examples-user 1.0.1-SNAPSHOT ... SUCCESS [  0.002 s]
13:07:02 [INFO] org.eclipse.papyrus.examples.user.qvto 1.0.100-SNAPSHOT SUCCESS [  0.136 s]
13:07:02 [INFO] Papyrus Main Features 0.0.1-SNAPSHOT ............... SUCCESS [  0.001 s]
13:07:02 [INFO] org.eclipse.papyrus.doc.feature 3.1.0-SNAPSHOT ..... SUCCESS [  0.506 s]
13:07:02 [INFO] org.eclipse.papyrus.editor.feature 2.0.0-SNAPSHOT .. SUCCESS [  0.113 s]
13:07:02 [INFO] org.eclipse.papyrus.emf.facet.feature 3.0.0-SNAPSHOT SUCCESS [  1.581 s]
13:07:02 [INFO] org.eclipse.papyrus.emf.feature 1.1.0-SNAPSHOT ..... SUCCESS [  2.505 s]
13:07:02 [INFO] org.eclipse.papyrus.infra.architecture.feature 1.0.0-SNAPSHOT SUCCESS [  0.098 s]
13:07:02 [INFO] org.eclipse.papyrus.infra.core.feature 3.0.0-SNAPSHOT SUCCESS [  0.123 s]
13:07:02 [INFO] org.eclipse.papyrus.infra.emf.expressions.feature 1.0.0-SNAPSHOT SUCCESS [  0.123 s]
13:07:02 [INFO] org.eclipse.papyrus.infra.emf.feature 3.0.0-SNAPSHOT SUCCESS [  0.157 s]
13:07:02 [INFO] org.eclipse.papyrus.infra.gmfdiag.feature 3.0.0-SNAPSHOT SUCCESS [  0.601 s]
13:07:02 [INFO] org.eclipse.papyrus.infra.services.feature 3.0.0-SNAPSHOT SUCCESS [  0.220 s]
13:07:02 [INFO] org.eclipse.papyrus.infra.ui.feature 3.0.0-SNAPSHOT  SUCCESS [  0.335 s]
13:07:02 [INFO] org.eclipse.papyrus.infra.widget.feature 3.0.0-SNAPSHOT SUCCESS [  0.295 s]
13:07:02 [INFO] org.eclipse.papyrus.infra.internationalization.feature 1.0.0-SNAPSHOT SUCCESS [  0.211 s]
13:07:02 [INFO] org.eclipse.papyrus.infra.nattable.feature 4.0.0-SNAPSHOT SUCCESS [  0.906 s]
13:07:02 [INFO] org.eclipse.papyrus.infra.gmfdiag.css.feature 3.0.0-SNAPSHOT SUCCESS [  0.208 s]
13:07:02 [INFO] org.eclipse.papyrus.infra.viewpoints.feature 3.0.0-SNAPSHOT SUCCESS [  0.116 s]
13:07:02 [INFO] org.eclipse.papyrus.infra.feature 3.0.0-SNAPSHOT ... SUCCESS [  0.754 s]
13:07:02 [INFO] org.eclipse.papyrus.uml.alf.feature 3.0.0-SNAPSHOT . SUCCESS [  0.240 s]
13:07:02 [INFO] org.eclipse.papyrus.uml.architecture.feature 1.0.0-SNAPSHOT SUCCESS [  0.278 s]
13:07:02 [INFO] org.eclipse.papyrus.uml.decoratormodel.feature 3.0.0-SNAPSHOT SUCCESS [  0.202 s]
13:07:02 [INFO] org.eclipse.papyrus.uml.diagram.css.feature 2.0.0-SNAPSHOT SUCCESS [  0.217 s]
13:07:02 [INFO] org.eclipse.papyrus.uml.diagram.feature 3.0.0-SNAPSHOT SUCCESS [  0.472 s]
13:07:02 [INFO] org.eclipse.papyrus.uml.expressions.feature 1.0.0-SNAPSHOT SUCCESS [  0.112 s]
13:07:02 [INFO] org.eclipse.papyrus.uml.internationalization.feature 1.0.0-SNAPSHOT SUCCESS [  0.085 s]
13:07:02 [INFO] org.eclipse.papyrus.uml.modelexplorer.feature 2.0.0-SNAPSHOT SUCCESS [  0.220 s]
13:07:02 [INFO] org.eclipse.papyrus.uml.properties.feature 3.0.0-SNAPSHOT SUCCESS [  0.199 s]
13:07:02 [INFO] org.eclipse.papyrus.uml.tools.feature 3.0.0-SNAPSHOT SUCCESS [  0.151 s]
13:07:02 [INFO] org.eclipse.papyrus.uml.ui.feature 1.2.0-SNAPSHOT .. SUCCESS [  0.093 s]
13:07:02 [INFO] org.eclipse.papyrus.uml.textedit.feature 2.0.0-SNAPSHOT SUCCESS [  0.635 s]
13:07:02 [INFO] org.eclipse.papyrus.uml.search.feature 2.0.0-SNAPSHOT SUCCESS [  0.154 s]
13:07:02 [INFO] org.eclipse.papyrus.uml.xtext.integration.feature 2.0.0-SNAPSHOT SUCCESS [  0.112 s]
13:07:02 [INFO] org.eclipse.papyrus.uml.m2m.qvto.feature 1.0.0-SNAPSHOT SUCCESS [  0.118 s]
13:07:02 [INFO] org.eclipse.papyrus.uml.nattable.feature 4.0.0-SNAPSHOT SUCCESS [  0.506 s]
13:07:02 [INFO] org.eclipse.papyrus.uml.feature 4.0.0-SNAPSHOT ..... SUCCESS [  1.008 s]
13:07:02 [INFO] org.eclipse.papyrus.views.documentation.feature 1.0.0-SNAPSHOT SUCCESS [  0.188 s]
13:07:02 [INFO] org.eclipse.papyrus.views.search.feature 2.0.0-SNAPSHOT SUCCESS [  0.056 s]
13:07:02 [INFO] org.eclipse.papyrus.views.modelexplorer.feature 3.0.0-SNAPSHOT SUCCESS [  0.129 s]
13:07:02 [INFO] org.eclipse.papyrus.views.properties.feature 3.0.0-SNAPSHOT SUCCESS [  0.081 s]
13:07:02 [INFO] org.eclipse.papyrus.views.references.feature 2.0.0-SNAPSHOT SUCCESS [  0.054 s]
13:07:02 [INFO] org.eclipse.papyrus.views.validation.feature 2.0.0-SNAPSHOT SUCCESS [  0.058 s]
13:07:02 [INFO] org.eclipse.papyrus.views.feature 1.0.0-SNAPSHOT ... SUCCESS [  3.034 s]
13:07:02 [INFO] org.eclipse.papyrus.sdk.feature 5.0.0-SNAPSHOT ..... SUCCESS [  1.355 s]
13:07:02 [INFO] Papyrus Examples Features 0.0.1-SNAPSHOT ........... SUCCESS [  0.002 s]
13:07:02 [INFO] org.eclipse.papyrus.user.examples.feature 0.0.3-SNAPSHOT SUCCESS [  0.429 s]
13:07:02 [INFO] org.eclipse.papyrus.main.target.parent 0.0.1-SNAPSHOT SUCCESS [  0.003 s]
13:07:02 [INFO] org.eclipse.papyrus.main.portable.target 0.0.1-SNAPSHOT SUCCESS [  0.002 s]
13:07:02 [INFO] org.eclipse.papyrus.p2 5.0.0-SNAPSHOT .............. SUCCESS [02:26 min]
13:07:02 [INFO] org.eclipse.papyrus.toolsmiths.releng 1.0.0-SNAPSHOT SUCCESS [  1.207 s]
13:07:02 [INFO] Papyrus Toolsmiths Features 0.0.1-SNAPSHOT ......... SUCCESS [  0.005 s]
13:07:02 [INFO] Papyrus Toolsmiths Plugins 0.0.1-SNAPSHOT .......... SUCCESS [  0.004 s]
13:07:02 [INFO] org.eclipse.papyrus.architectureview 1.0.0-SNAPSHOT  SUCCESS [  0.743 s]
13:07:02 [INFO] org.eclipse.papyrus.dev.ui 0.0.1-SNAPSHOT .......... SUCCESS [  0.175 s]
13:07:02 [INFO] org.eclipse.papyrus.dev.view.services.edit.request 1.2.0-SNAPSHOT SUCCESS [  0.164 s]
13:07:02 [INFO] org.eclipse.papyrus.gmf.editpoliciesstates 1.2.0-SNAPSHOT SUCCESS [  0.302 s]
13:07:02 [INFO] org.eclipse.papyrus.gmf.editpartview 1.2.0-SNAPSHOT  SUCCESS [  0.343 s]
13:07:02 [INFO] org.eclipse.papyrus.gmf.figureview 1.2.0-SNAPSHOT .. SUCCESS [  3.655 s]
13:07:02 [INFO] org.eclipse.papyrus.infra.gmfdiag.css.debug 1.2.0-SNAPSHOT SUCCESS [  0.417 s]
13:07:02 [INFO] org.eclipse.papyrus.infra.emf.commandstack 1.2.0-SNAPSHOT SUCCESS [  0.220 s]
13:07:02 [INFO] org.eclipse.papyrus.dev.types 3.0.100-SNAPSHOT ..... SUCCESS [  1.031 s]
13:07:02 [INFO] org.eclipse.papyrus.dev.pluginexplorer 1.2.0-SNAPSHOT SUCCESS [  0.125 s]
13:07:02 [INFO] org.eclipse.papyrus.debug.feature 1.0.0-SNAPSHOT ... SUCCESS [  0.257 s]
13:07:02 [INFO] org.eclipse.papyrus.gmfgenextension 2.0.0-SNAPSHOT . SUCCESS [  0.394 s]
13:07:02 [INFO] org.eclipse.papyrus.def 1.4.0-SNAPSHOT ............. SUCCESS [  6.810 s]
13:07:02 [INFO] org.eclipse.papyrus.codegen 1.2.0-SNAPSHOT ......... SUCCESS [  0.388 s]
13:07:02 [INFO] Papyrus UML Assistants 0.0.1-SNAPSHOT .............. SUCCESS [  0.003 s]
13:07:02 [INFO] org.eclipse.papyrus.uml.profile.types.generator 2.2.0-SNAPSHOT SUCCESS [  5.488 s]
13:07:02 [INFO] org.eclipse.papyrus.uml.profile.assistants.generator 4.0.0-SNAPSHOT SUCCESS [  1.482 s]
13:07:02 [INFO] org.eclipse.papyrus.dev.assistants.codegen 1.2.100-SNAPSHOT SUCCESS [  2.257 s]
13:07:02 [INFO] org.eclipse.papyrus.mwe2.utils 1.2.0-SNAPSHOT ...... SUCCESS [  0.136 s]
13:07:02 [INFO] org.eclipse.papyrus.diagramgen.feature 1.0.0-SNAPSHOT SUCCESS [  0.284 s]
13:07:02 [INFO] org.eclipse.papyrus.tests.junit-framework 0.0.1-SNAPSHOT SUCCESS [  0.001 s]
13:07:02 [INFO] org.eclipse.papyrus.junit.framework 1.3.0-SNAPSHOT . SUCCESS [  0.218 s]
13:07:02 [INFO] org.eclipse.papyrus.junit.utils 2.4.0-SNAPSHOT ..... SUCCESS [  0.835 s]
13:07:02 [INFO] org.eclipse.papyrus.bundles.tests 1.3.0-SNAPSHOT ... SUCCESS [  0.660 s]
13:07:02 [INFO] org.eclipse.papyrus.junit.feature 1.0.0-SNAPSHOT ... SUCCESS [  0.203 s]
13:07:02 [INFO] org.eclipse.papyrus.dev.project.management 1.3.0-SNAPSHOT SUCCESS [  1.479 s]
13:07:02 [INFO] org.eclipse.papyrus.releng.tools 2.1.0-SNAPSHOT .... SUCCESS [  0.737 s]
13:07:02 [INFO] org.eclipse.papyrus.releng.feature 1.0.0-SNAPSHOT .. SUCCESS [  1.749 s]
13:07:02 [INFO] org.eclipse.papyrus.customization.nattableconfiguration 2.0.100-SNAPSHOT SUCCESS [  0.741 s]
13:07:02 [INFO] org.eclipse.papyrus.infra.emf.types.ui.properties 3.0.0-SNAPSHOT SUCCESS [  0.355 s]
13:07:02 [INFO] org.eclipse.papyrus.infra.gmfdiag.expansion.edit 2.1.0-SNAPSHOT SUCCESS [  0.290 s]
13:07:02 [INFO] org.eclipse.papyrus.infra.gmfdiag.expansion.editor 2.1.0-SNAPSHOT SUCCESS [  0.420 s]
13:07:02 [INFO] org.eclipse.papyrus.infra.gmfdiag.paletteconfiguration.editor 3.2.0-SNAPSHOT SUCCESS [  0.590 s]
13:07:02 [INFO] org.eclipse.papyrus.toolsmiths 1.2.100-SNAPSHOT .... SUCCESS [  0.380 s]
13:07:02 [INFO] org.eclipse.papyrus.toolsmiths.ecore 1.0.0-SNAPSHOT  SUCCESS [  0.936 s]
13:07:02 [INFO] org.eclipse.papyrus.toolsmiths.expressions 1.0.0-SNAPSHOT SUCCESS [  0.164 s]
13:07:02 [INFO] org.eclipse.papyrus.uml.m2m.qvto.tests.tools 1.1.100-SNAPSHOT SUCCESS [  0.441 s]
13:07:02 [INFO] org.eclipse.papyrus.uml.m2m.qvto.tests.tools.feature 1.0.0-SNAPSHOT SUCCESS [  0.194 s]
13:07:02 [INFO] org.eclipse.papyrus.toolsmiths.palette 3.0.100-SNAPSHOT SUCCESS [  0.805 s]
13:07:02 [INFO] org.eclipse.papyrus.views.properties.toolsmiths 2.1.0-SNAPSHOT SUCCESS [  0.726 s]
13:07:02 [INFO] org.eclipse.papyrus.uml.properties.generation 2.1.200-SNAPSHOT SUCCESS [  0.747 s]
13:07:02 [INFO] org.eclipse.papyrus.toolsmiths.nattable 1.0.0-SNAPSHOT SUCCESS [  0.577 s]
13:07:02 [INFO] org.eclipse.papyrus.uml.types.ui.properties 3.1.100-SNAPSHOT SUCCESS [  0.456 s]
13:07:02 [INFO] org.eclipse.papyrus.toolsmiths.profile-migration 0.0.1-SNAPSHOT SUCCESS [  0.001 s]
13:07:02 [INFO] org.eclipse.papyrus.toolsmiths.profilemigration.ui 0.8.100-SNAPSHOT SUCCESS [  0.472 s]
13:07:02 [INFO] org.eclipse.papyrus.toolsmiths.profilemigration 0.8.100-SNAPSHOT SUCCESS [  0.634 s]
13:07:02 [INFO] org.eclipse.papyrus.toolsmiths.feature 1.2.0-SNAPSHOT SUCCESS [  1.829 s]
13:07:02 [INFO] org.eclipse.papyrus.uml.profile.types.generator.ui 1.4.0-SNAPSHOT SUCCESS [  0.463 s]
13:07:02 [INFO] org.eclipse.papyrus.uml.profile.assistants.generator.ui 1.2.100-SNAPSHOT SUCCESS [  0.468 s]
13:07:02 [INFO] org.eclipse.papyrus.uml.profile.newchildmenu.generator 1.2.100-SNAPSHOT SUCCESS [  0.652 s]
13:07:02 [INFO] org.eclipse.papyrus.uml.profile.newchildmenu.generator.ui 1.2.0-SNAPSHOT SUCCESS [  0.244 s]
13:07:02 [INFO] org.eclipse.papyrus.uml.assistants.feature 4.0.0-SNAPSHOT SUCCESS [  0.270 s]
13:07:02 [INFO] org.eclipse.papyrus.toolsmiths.validations 0.0.1-SNAPSHOT SUCCESS [  0.002 s]
13:07:02 [INFO] org.eclipse.papyrus.toolsmiths.validation.common 1.0.0-SNAPSHOT SUCCESS [  0.140 s]
13:07:02 [INFO] org.eclipse.papyrus.toolsmiths.validation.architecture 1.0.0-SNAPSHOT SUCCESS [  0.285 s]
13:07:02 [INFO] org.eclipse.papyrus.toolsmiths.validation.elementtypes 1.0.0-SNAPSHOT SUCCESS [  0.341 s]
13:07:02 [INFO] org.eclipse.papyrus.toolsmiths.validation.profile 1.0.0-SNAPSHOT SUCCESS [  0.296 s]
13:07:02 [INFO] org.eclipse.papyrus.toolsmiths.validation.feature 1.0.0-SNAPSHOT SUCCESS [  0.130 s]
13:07:02 [INFO] org.eclipse.papyrus.p2.toolsmiths 1.0.0-SNAPSHOT ... SUCCESS [ 51.525 s]
13:07:02 [INFO] org.eclipse.papyrus.toolsmiths.targetplatform.parent 0.0.1-SNAPSHOT SUCCESS [  0.004 s]
13:07:02 [INFO] org.eclipse.papyrus.toolsmiths.portable.targetplatform 0.0.1-SNAPSHOT SUCCESS [  0.003 s]
13:07:02 [INFO] org.eclipse.papyrus.tests.releng 0.0.1-SNAPSHOT .... SUCCESS [ 29.107 s]
13:07:02 [INFO] org.eclipse.papyrus.plugins.tests.releng 0.0.1-SNAPSHOT SUCCESS [  0.005 s]
13:07:02 [INFO] org.eclipse.papyrus.editor.tests.releng 0.0.1-SNAPSHOT SUCCESS [  0.003 s]
13:07:02 [INFO] org.eclipse.papyrus.editor.integration.tests 1.5.0-SNAPSHOT SUCCESS [  2.626 s]
13:07:02 [INFO] org.eclipse.papyrus.emf.facet.tests 0.0.1-SNAPSHOT . SUCCESS [  0.004 s]
13:07:02 [INFO] org.eclipse.papyrus.emf.facet.architecture.tests 1.0.0-SNAPSHOT FAILURE [  0.477 s]
13:07:02 [INFO] org.eclipse.papyrus.infra.tests.releng 0.0.1-SNAPSHOT SKIPPED
13:07:02 [INFO] org.eclipse.papyrus.infra.core.tests.releng 0.0.1-SNAPSHOT SKIPPED
13:07:02 [INFO] org.eclipse.papyrus.infra.core.clipboard.tests 1.3.0-SNAPSHOT SKIPPED
13:07:02 [INFO] org.eclipse.papyrus.infra.core.sasheditor.tests 1.2.0-SNAPSHOT SKIPPED
13:07:02 [INFO] org.eclipse.papyrus.infra.core.sasheditor.di.tests 1.2.0-SNAPSHOT SKIPPED
13:07:02 [INFO] org.eclipse.papyrus.infra.core.tests 3.1.0-SNAPSHOT  SKIPPED
13:07:02 [INFO] org.eclipse.papyrus.infra.editor.tests.releng 0.0.1-SNAPSHOT SKIPPED
13:07:02 [INFO] org.eclipse.papyrus.infra.editor.welcome.tests 1.2.100-SNAPSHOT SKIPPED
13:07:02 [INFO] org.eclipse.papyrus.infra.emf.tests.releng 0.0.1-SNAPSHOT SKIPPED
13:07:02 [INFO] org.eclipse.papyrus.infra.emf.gmf.tests 1.2.100-SNAPSHOT SKIPPED
13:07:02 [INFO] org.eclipse.papyrus.infra.emf.readonly.tests 1.4.0-SNAPSHOT SKIPPED
13:07:02 [INFO] org.eclipse.papyrus.infra.emf.tests 1.5.100-SNAPSHOT SKIPPED
13:07:02 [INFO] org.eclipse.papyrus.infra.filters.tests 1.2.0-SNAPSHOT SKIPPED
13:07:02 [INFO] org.eclipse.papyrus.infra.gmfdiag.tests.releng 0.0.1-SNAPSHOT SKIPPED
13:07:02 [INFO] org.eclipse.papyrus.infra.gmfdiag.assistant.tests.releng 0.0.1-SNAPSHOT SKIPPED
13:07:02 [INFO] org.eclipse.papyrus.infra.gmfdiag.assistant.tests 1.3.100-SNAPSHOT SKIPPED
13:07:02 [INFO] org.eclipse.papyrus.infra.gmfdiag.canonical.tests 1.3.100-SNAPSHOT SKIPPED
13:07:02 [INFO] org.eclipse.papyrus.infra.gmfdiag.commands.tests 1.3.100-SNAPSHOT SKIPPED
13:07:02 [INFO] org.eclipse.papyrus.infra.gmfdiag.common.tests 3.1.100-SNAPSHOT SKIPPED
13:07:02 [INFO] org.eclipse.papyrus.infra.gmfdiag.css.tests 1.3.0-SNAPSHOT SKIPPED
13:07:02 [INFO] org.eclipse.papyrus.infra.gmfdiag.menu.tests 1.2.200-SNAPSHOT SKIPPED
13:07:02 [INFO] org.eclipse.papyrus.infra.gmfdiag.paletteconfiguration.tests 1.3.100-SNAPSHOT SKIPPED
13:07:02 [INFO] org.eclipse.papyrus.infra.gmfdiag.welcome.tests 1.2.0-SNAPSHOT SKIPPED
13:07:02 [INFO] org.eclipse.papyrus.infra.nattable.main.test 1.2.0-SNAPSHOT SKIPPED
13:07:02 [INFO] org.eclipse.papyrus.infra.nattable.common.tests 1.2.200-SNAPSHOT SKIPPED
13:07:02 [INFO] org.eclipse.papyrus.infra.nattable.model.tests 1.2.100-SNAPSHOT SKIPPED
13:07:02 [INFO] org.eclipse.papyrus.infra.nattable.tests 1.2.200-SNAPSHOT SKIPPED
13:07:02 [INFO] org.eclipse.papyrus.infra.nattable.views.tests 1.2.100-SNAPSHOT SKIPPED
13:07:02 [INFO] org.eclipse.papyrus.infra.properties.tests.releng 0.0.1-SNAPSHOT SKIPPED
13:07:02 [INFO] org.eclipse.papyrus.infra.properties.ui.tests 2.0.0-SNAPSHOT SKIPPED
13:07:02 [INFO] org.eclipse.papyrus.infra.services.tests.releng 0.0.1-SNAPSHOT SKIPPED
13:07:02 [INFO] org.eclipse.papyrus.infra.services.controlmode.tests 1.5.100-SNAPSHOT SKIPPED
13:07:02 [INFO] org.eclipse.papyrus.infra.services.edit.tests 1.2.100-SNAPSHOT SKIPPED
13:07:02 [INFO] org.eclipse.papyrus.infra.services.edit.ui.tests 1.2.0-SNAPSHOT SKIPPED
13:07:02 [INFO] org.eclipse.papyrus.infra.services.resourceloading.tests 1.3.0-SNAPSHOT SKIPPED
13:07:02 [INFO] org.eclipse.papyrus.infra.services.semantic.tests 1.2.200-SNAPSHOT SKIPPED
13:07:02 [INFO] org.eclipse.papyrus.infra.tools.tests 1.3.0-SNAPSHOT SKIPPED
13:07:02 [INFO] org.eclipse.papyrus.infra.types.tests.releng 0.0.1-SNAPSHOT SKIPPED
13:07:02 [INFO] org.eclipse.papyrus.infra.types.tests 3.0.200-SNAPSHOT SKIPPED
13:07:02 [INFO] org.eclipse.papyrus.infra.types.ui.tests 3.0.100-SNAPSHOT SKIPPED
13:07:02 [INFO] org.eclipse.papyrus.infra.ui.emf.tests 1.4.0-SNAPSHOT SKIPPED
13:07:02 [INFO] org.eclipse.papyrus.infra.ui.tests 1.2.0-SNAPSHOT .. SKIPPED
13:07:02 [INFO] org.eclipse.papyrus.infra.viewpoints.tests.releng 0.0.1-SNAPSHOT SKIPPED
13:07:02 [INFO] org.eclipse.papyrus.infra.viewpoints.policy.tests 1.2.100-SNAPSHOT SKIPPED
13:07:02 [INFO] org.eclipse.papyrus.tests.emf.facet.feature 1.0.0-SNAPSHOT SKIPPED
13:07:02 [INFO] org.eclipse.papyrus.uml.tests.releng 0.0.1-SNAPSHOT  SKIPPED
13:07:02 [INFO] org.eclipse.papyrus.uml.diagram.tests.releng 1.2.0-SNAPSHOT SKIPPED
13:07:02 [INFO] org.eclipse.papyrus.uml.diagram.tests 1.3.100-SNAPSHOT SKIPPED
13:07:02 [INFO] org.eclipse.papyrus.uml.diagram.clazz.tests 1.3.200-SNAPSHOT SKIPPED
13:07:02 [INFO] org.eclipse.papyrus.uml.diagram.activity.tests 1.2.100-SNAPSHOT SKIPPED
13:07:02 [INFO] org.eclipse.papyrus.uml.diagram.usecase.tests 4.0.200-SNAPSHOT SKIPPED
13:07:02 [INFO] org.eclipse.papyrus.uml.diagram.deployment.tests 1.2.100-SNAPSHOT SKIPPED
13:07:02 [INFO] org.eclipse.papyrus.uml.diagram.component.tests 1.2.100-SNAPSHOT SKIPPED
13:07:02 [INFO] org.eclipse.papyrus.uml.diagram.timing.tests 1.2.100-SNAPSHOT SKIPPED
13:07:02 [INFO] org.eclipse.papyrus.uml.diagram.stereotypeproperty.tests 1.2.200-SNAPSHOT SKIPPED
13:07:02 [INFO] org.eclipse.papyrus.uml.diagram.sequence.tests 1.3.200-SNAPSHOT SKIPPED
13:07:02 [INFO] org.eclipse.papyrus.uml.diagram.composite.tests 1.2.200-SNAPSHOT SKIPPED
13:07:02 [INFO] org.eclipse.papyrus.uml.diagram.profile.tests 1.2.200-SNAPSHOT SKIPPED
13:07:02 [INFO] org.eclipse.papyrus.uml.dynamic.profile.tests 1.2.100-SNAPSHOT SKIPPED
13:07:02 [INFO] org.eclipse.papyrus.uml.diagram.common.tests 1.4.0-SNAPSHOT SKIPPED
13:07:02 [INFO] org.eclipse.papyrus.uml.diagram.wizards.tests 1.3.0-SNAPSHOT SKIPPED
13:07:02 [INFO] org.eclipse.papyrus.tests.uml.diagram.feature 1.2.0-SNAPSHOT SKIPPED
13:07:02 [INFO] org.eclipse.papyrus.tests.infra.services.feature 1.2.0-SNAPSHOT SKIPPED
13:07:02 [INFO] org.eclipse.papyrus.views.tests.releng 0.0.1-SNAPSHOT SKIPPED
13:07:02 [INFO] org.eclipse.papyrus.views.modelexplorer.tests 1.3.0-SNAPSHOT SKIPPED
13:07:02 [INFO] org.eclipse.papyrus.uml.modelexplorer.tests.releng 0.0.1-SNAPSHOT SKIPPED
13:07:02 [INFO] org.eclipse.papyrus.uml.modelexplorer.tests 1.3.100-SNAPSHOT SKIPPED
13:07:02 [INFO] org.eclipse.papyrus.uml.modelrepair.tests 1.3.100-SNAPSHOT SKIPPED
13:07:02 [INFO] org.eclipse.papyrus.uml.properties.tests 1.1.100-SNAPSHOT SKIPPED
13:07:02 [INFO] org.eclipse.papyrus.uml.service.types.tests 1.3.100-SNAPSHOT SKIPPED
13:07:02 [INFO] org.eclipse.papyrus.uml.service.types.ui.tests 1.2.200-SNAPSHOT SKIPPED
13:07:02 [INFO] org.eclipse.papyrus.uml.profile.tests.releng 0.0.1-SNAPSHOT SKIPPED
13:07:02 [INFO] org.eclipse.papyrus.uml.profile.drafter.tests 1.3.100-SNAPSHOT SKIPPED
13:07:02 [INFO] org.eclipse.papyrus.uml.filters.tests 1.2.0-SNAPSHOT SKIPPED
13:07:02 [INFO] org.eclipse.papyrus.uml.profile.tests 1.2.100-SNAPSHOT SKIPPED
13:07:02 [INFO] org.eclipse.papyrus.tests.uml.feature 1.2.0-SNAPSHOT SKIPPED
13:07:02 [INFO] org.eclipse.papyrus.views.documentation.tests 1.0.100-SNAPSHOT SKIPPED
13:07:02 [INFO] org.eclipse.papyrus.tests.views.feature 1.2.0-SNAPSHOT SKIPPED
13:07:02 [INFO] org.eclipse.papyrus.tests.infra.nattable.feature 1.4.0-SNAPSHOT SKIPPED
13:07:02 [INFO] org.eclipse.papyrus.uml.nattable.main.test 1.2.0-SNAPSHOT SKIPPED
13:07:02 [INFO] org.eclipse.papyrus.uml.nattable.tests 1.2.200-SNAPSHOT SKIPPED
13:07:02 [INFO] org.eclipse.papyrus.uml.nattable.generic.tests 1.2.300-SNAPSHOT SKIPPED
13:07:02 [INFO] org.eclipse.papyrus.uml.nattable.clazz.config.tests 1.2.300-SNAPSHOT SKIPPED
13:07:02 [INFO] org.eclipse.papyrus.uml.nattable.stereotyped.elements.tests 1.0.300-SNAPSHOT SKIPPED
13:07:02 [INFO] org.eclipse.papyrus.uml.nattable.matrix.tests 1.0.200-SNAPSHOT SKIPPED
13:07:02 [INFO] org.eclipse.papyrus.tests.uml.nattable.feature 1.3.0-SNAPSHOT SKIPPED
13:07:02 [INFO] org.eclipse.papyrus.tests.infra.feature 1.2.0-SNAPSHOT SKIPPED
13:07:02 [INFO] org.eclipse.papyrus.tests.infra.core.feature 1.2.0-SNAPSHOT SKIPPED
13:07:02 [INFO] org.eclipse.papyrus.uml.tools.tests.releng 0.0.1-SNAPSHOT SKIPPED
13:07:02 [INFO] org.eclipse.papyrus.uml.tools.tests 3.1.100-SNAPSHOT SKIPPED
13:07:02 [INFO] org.eclipse.papyrus.uml.tools.utils.tests 1.3.0-SNAPSHOT SKIPPED
13:07:02 [INFO] org.eclipse.papyrus.tests.uml.tools.feature 1.2.0-SNAPSHOT SKIPPED
13:07:02 [INFO] org.eclipse.papyrus.uml.decoratormodel.tests.releng 0.0.1-SNAPSHOT SKIPPED
13:07:02 [INFO] org.eclipse.papyrus.uml.decoratormodel.controlmode.tests 1.3.100-SNAPSHOT SKIPPED
13:07:02 [INFO] org.eclipse.papyrus.uml.decoratormodel.tests 1.3.100-SNAPSHOT SKIPPED
13:07:02 [INFO] org.eclipse.papyrus.tests.uml.decoratormodel.feature 1.2.0-SNAPSHOT SKIPPED
13:07:02 [INFO] org.eclipse.papyrus.uml.textedit.tests.releng 0.0.1-SNAPSHOT SKIPPED
13:07:02 [INFO] org.eclipse.papyrus.uml.textedit.parameter.tests 1.2.200-SNAPSHOT SKIPPED
13:07:02 [INFO] org.eclipse.papyrus.uml.textedit.port.tests 1.2.200-SNAPSHOT SKIPPED
13:07:02 [INFO] org.eclipse.papyrus.uml.textedit.property.tests 1.2.300-SNAPSHOT SKIPPED
13:07:02 [INFO] org.eclipse.papyrus.uml.textedit.tests 1.3.200-SNAPSHOT SKIPPED
13:07:02 [INFO] org.eclipse.papyrus.uml.textedit.tests.feature 1.2.0-SNAPSHOT SKIPPED
13:07:02 [INFO] org.eclipse.papyrus.uml.assistants.tests.releng 0.0.1-SNAPSHOT SKIPPED
13:07:02 [INFO] org.eclipse.papyrus.uml.profile.types.generator.tests 1.2.200-SNAPSHOT SKIPPED
13:07:02 [INFO] org.eclipse.papyrus.uml.profile.assistants.generator.tests 1.2.200-SNAPSHOT SKIPPED
13:07:02 [INFO] org.eclipse.papyrus.tests.uml.assistants.feature 1.2.0-SNAPSHOT SKIPPED
13:07:02 [INFO] org.eclipse.papyrus.toolsmiths.tests.releng 0.0.1-SNAPSHOT SKIPPED
13:07:02 [INFO] org.eclipse.papyrus.toolsmiths.profilemigration.tests 0.7.100-SNAPSHOT SKIPPED
13:07:02 [INFO] org.eclipse.papyrus.toolsmiths.validation.profile.tests 1.0.0-SNAPSHOT SKIPPED
13:07:02 [INFO] org.eclipse.papyrus.toolsmiths.validation.elementtypes.tests 1.0.0-SNAPSHOT SKIPPED
13:07:02 [INFO] org.eclipse.papyrus.tests.toolsmiths.feature 1.0.0-SNAPSHOT SKIPPED
13:07:02 [INFO] org.eclipse.papyrus.tests.feature 2.0.0-SNAPSHOT ... SKIPPED
13:07:02 [INFO] org.eclipse.papyrus.infra.emf.expressions.main.tests 0.0.1-SNAPSHOT SKIPPED
13:07:02 [INFO] org.eclipse.papyrus.infra.emf.expressions.tests 1.0.0-SNAPSHOT SKIPPED
13:07:02 [INFO] org.eclipse.papyrus.tests.infra.emf.expressions.feature 1.0.0-SNAPSHOT SKIPPED
13:07:02 [INFO] org.eclipse.papyrus.infra.internationalization.main.test 1.0.0-SNAPSHOT SKIPPED
13:07:02 [INFO] org.eclipse.papyrus.infra.internationalization.tests 1.100.100-SNAPSHOT SKIPPED
13:07:02 [INFO] org.eclipse.papyrus.tests.infra.internationalization.feature 1.0.0-SNAPSHOT SKIPPED
13:07:02 [INFO] org.eclipse.papyrus.uml.expressions.tests.releng 0.0.1-SNAPSHOT SKIPPED
13:07:02 [INFO] org.eclipse.papyrus.uml.expressions.tests 1.1.100-SNAPSHOT SKIPPED
13:07:02 [INFO] org.eclipse.papyrus.tests.uml.expressions.feature 1.0.0-SNAPSHOT SKIPPED
13:07:02 [INFO] org.eclipse.papyrus.uml.internationalization.main.test 1.0.0-SNAPSHOT SKIPPED
13:07:02 [INFO] org.eclipse.papyrus.uml.internationalization.tests 1.100.100-SNAPSHOT SKIPPED
13:07:02 [INFO] org.eclipse.papyrus.uml.internationalization.controlmode.tests 1.1.100-SNAPSHOT SKIPPED
13:07:02 [INFO] org.eclipse.papyrus.tests.uml.internationalization.feature 1.0.0-SNAPSHOT SKIPPED
13:07:02 [INFO] org.eclipse.papyrus.uml.alf.tests 1.2.0-SNAPSHOT ... SKIPPED
13:07:02 [INFO] org.eclipse.papyrus.uml.alf.tests.feature 1.2.0-SNAPSHOT SKIPPED
13:07:02 [INFO] Papyrus Tests Features 0.0.1-SNAPSHOT .............. SKIPPED
13:07:02 [INFO] org.eclipse.papyrus.developer.suite.tests 0.0.1-SNAPSHOT SKIPPED
13:07:02 [INFO] org.eclipse.papyrus.bundles.tests 0.0.1-SNAPSHOT ... SKIPPED
13:07:02 [INFO] org.eclipse.papyrus.eclipse.project.editors.tests 2.1.0-SNAPSHOT SKIPPED
13:07:02 [INFO] org.eclipse.papyrus.editors.suite.tests 0.0.1-SNAPSHOT SKIPPED
13:07:02 [INFO] org.eclipse.papyrus.infra.core.suite.tests 0.0.1-SNAPSHOT SKIPPED
13:07:02 [INFO] org.eclipse.papyrus.infra.nattable.suite.tests 0.0.1-SNAPSHOT SKIPPED
13:07:02 [INFO] org.eclipse.papyrus.infra.architecture.tests 1.0.0-SNAPSHOT SKIPPED
13:07:02 [INFO] org.eclipse.papyrus.infra.services.labelprovider.tests 1.2.200-SNAPSHOT SKIPPED
13:07:02 [INFO] org.eclipse.papyrus.infra.ui.architecture.tests 1.0.100-SNAPSHOT SKIPPED
13:07:02 [INFO] org.eclipse.papyrus.infra.suite.tests 0.0.1-SNAPSHOT SKIPPED
13:07:02 [INFO] org.eclipse.papyrus.infra.newchild.tests 1.2.100-SNAPSHOT SKIPPED
13:07:02 [INFO] org.eclipse.papyrus.toolsmiths.suite.tests 0.0.1-SNAPSHOT SKIPPED
13:07:02 [INFO] org.eclipse.papyrus.uml.diagram.communication.tests 1.2.100-SNAPSHOT SKIPPED
13:07:02 [INFO] org.eclipse.papyrus.uml.diagram.interactionoverview.tests 1.2.0-SNAPSHOT SKIPPED
13:07:02 [INFO] org.eclipse.papyrus.uml.diagram.statemachine.tests 1.2.200-SNAPSHOT SKIPPED
13:07:02 [INFO] org.eclipse.papyrus.uml.diagram.suite.tests 0.0.1-SNAPSHOT SKIPPED
13:07:02 [INFO] org.eclipse.papyrus.uml.diagram.dnd.tests 1.2.200-SNAPSHOT SKIPPED
13:07:02 [INFO] org.eclipse.papyrus.uml.diagram.properties.tests 1.0.100-SNAPSHOT SKIPPED
13:07:02 [INFO] org.eclipse.papyrus.uml.nattable.stereotype.display.tests 1.3.0-SNAPSHOT SKIPPED
13:07:02 [INFO] org.eclipse.papyrus.uml.nattable.suite.tests 0.0.1-SNAPSHOT SKIPPED
13:07:02 [INFO] org.eclipse.papyrus.uml.textedit.valuespecification.tests 1.2.200-SNAPSHOT SKIPPED
13:07:02 [INFO] org.eclipse.papyrus.uml.textedit.suite.tests 0.0.1-SNAPSHOT SKIPPED
13:07:02 [INFO] org.eclipse.papyrus.uml.architecture.tests 1.1.200-SNAPSHOT SKIPPED
13:07:02 [INFO] org.eclipse.papyrus.uml.validation.tests.releng 0.0.1-SNAPSHOT SKIPPED
13:07:02 [INFO] org.eclipse.papyrus.uml.validation.tests.staticprofile 1.2.100-SNAPSHOT SKIPPED
13:07:02 [INFO] org.eclipse.papyrus.uml.validation.tests.genvalidation 1.2.0-SNAPSHOT SKIPPED
13:07:02 [INFO] org.eclipse.papyrus.uml.validation.tests 1.2.200-SNAPSHOT SKIPPED
13:07:02 [INFO] org.eclipse.papyrus.uml.suite.tests 0.0.1-SNAPSHOT . SKIPPED
13:07:02 [INFO] org.eclipse.papyrus.uml.alf.tests.releng 0.0.1-SNAPSHOT SKIPPED
13:07:02 [INFO] org.eclipse.papyrus.uml.alf.backend.tests 1.1.100-SNAPSHOT SKIPPED
13:07:02 [INFO] org.eclipse.papyrus.views.properties.toolsmiths.tests 1.2.100-SNAPSHOT SKIPPED
13:07:02 [INFO] org.eclipse.papyrus.views.suite.tests 0.0.1-SNAPSHOT SKIPPED
13:07:02 [INFO] org.eclipse.papyrus.views.documentation.tests.releng 0.0.1-SNAPSHOT SKIPPED
13:07:02 [INFO] org.eclipse.papyrus.tests.main.releng 1.2.0-SNAPSHOT SKIPPED
13:07:02 [INFO] org.eclipse.papyrus.main.tests.target.parent 0.0.1-SNAPSHOT SKIPPED
13:07:02 [INFO] org.eclipse.papyrus.main.tests.portable.target 0.0.1-SNAPSHOT SKIPPED
13:07:02 [INFO] ------------------------------------------------------------------------
13:07:02 [INFO] BUILD FAILURE
13:07:02 [INFO] ------------------------------------------------------------------------
13:07:02 [INFO] Total time:  01:08 h
13:07:02 [INFO] Finished at: 2020-08-05T13:07:02-04:00
13:07:02 [INFO] ------------------------------------------------------------------------
13:07:02 [ERROR] Failed to execute goal org.eclipse.tycho:tycho-compiler-plugin:1.3.0:compile (default-compile) on project org.eclipse.papyrus.emf.facet.architecture.tests: Compilation failure: Compilation failure: 
13:07:02 [ERROR] /jobs/genie.papyrus/Papyrus-Gerrit-Master-With-Tests/workspace/source/tests/junit/plugins/facet/org.eclipse.papyrus.emf.facet.architecture.tests/src/org/eclipse/papyrus/emf/facet/architecture/tests/BeforeNotFound_1_Test.java:[21] 
13:07:02 [ERROR] 	import org.eclipse.papyrus.emf.facet.architecture.customizationconfiguration.comparators.CustomizationMergeErrorCode;
13:07:02 [ERROR] 	       ^^^^^^^^^^^^^^^^^^^^^^^^^^^^^^^^^^^^^^^^^^^^^^^^^^^^^^^^^^^^^^^^^^^^^^^^^^^^^^^^^^^^^^^^^^^^^^^^^^^^^^^^^^^^^
13:07:02 [ERROR] Access restriction: The type 'CustomizationMergeErrorCode' is not API (restriction on classpath entry '/jobs/genie.papyrus/Papyrus-Gerrit-Master-With-Tests/workspace/source/plugins/facet/org.eclipse.papyrus.emf.facet.architecture/bin')
13:07:02 [ERROR] /jobs/genie.papyrus/Papyrus-Gerrit-Master-With-Tests/workspace/source/tests/junit/plugins/facet/org.eclipse.papyrus.emf.facet.architecture.tests/src/org/eclipse/papyrus/emf/facet/architecture/tests/BeforeNotFound_1_Test.java:[36] 
13:07:02 [ERROR] 	Assert.assertEquals(CustomizationMergeErrorCode.MERGE_ERROR__BEFORE_NOT_FOUND, diag.getCode());
13:07:02 [ERROR] 	                    ^^^^^^^^^^^^^^^^^^^^^^^^^^^^^^^^^^^^^^^^^^^^^^^^^^^^^^^^^
13:07:02 [ERROR] Access restriction: The type 'CustomizationMergeErrorCode' is not API (restriction on classpath entry '/jobs/genie.papyrus/Papyrus-Gerrit-Master-With-Tests/workspace/source/plugins/facet/org.eclipse.papyrus.emf.facet.architecture/bin')
13:07:02 [ERROR] /jobs/genie.papyrus/Papyrus-Gerrit-Master-With-Tests/workspace/source/tests/junit/plugins/facet/org.eclipse.papyrus.emf.facet.architecture.tests/src/org/eclipse/papyrus/emf/facet/architecture/tests/BeforeNotFound_1_Test.java:[36] 
13:07:02 [ERROR] 	Assert.assertEquals(CustomizationMergeErrorCode.MERGE_ERROR__BEFORE_NOT_FOUND, diag.getCode());
13:07:02 [ERROR] 	                                                ^^^^^^^^^^^^^^^^^^^^^^^^^^^^^
13:07:02 [ERROR] Access restriction: The field 'CustomizationMergeErrorCode.MERGE_ERROR__BEFORE_NOT_FOUND' is not API (restriction on classpath entry '/jobs/genie.papyrus/Papyrus-Gerrit-Master-With-Tests/workspace/source/plugins/facet/org.eclipse.papyrus.emf.facet.architecture/bin')
13:07:02 [ERROR] /jobs/genie.papyrus/Papyrus-Gerrit-Master-With-Tests/workspace/source/tests/junit/plugins/facet/org.eclipse.papyrus.emf.facet.architecture.tests/src/org/eclipse/papyrus/emf/facet/architecture/tests/OutsideOfADL_1_Test.java:[21] 
13:07:02 [ERROR] 	import org.eclipse.papyrus.emf.facet.architecture.customizationconfiguration.comparators.CustomizationMergeErrorCode;
13:07:02 [ERROR] 	       ^^^^^^^^^^^^^^^^^^^^^^^^^^^^^^^^^^^^^^^^^^^^^^^^^^^^^^^^^^^^^^^^^^^^^^^^^^^^^^^^^^^^^^^^^^^^^^^^^^^^^^^^^^^^^
13:07:02 [ERROR] Access restriction: The type 'CustomizationMergeErrorCode' is not API (restriction on classpath entry '/jobs/genie.papyrus/Papyrus-Gerrit-Master-With-Tests/workspace/source/plugins/facet/org.eclipse.papyrus.emf.facet.architecture/bin')
13:07:02 [ERROR] /jobs/genie.papyrus/Papyrus-Gerrit-Master-With-Tests/workspace/source/tests/junit/plugins/facet/org.eclipse.papyrus.emf.facet.architecture.tests/src/org/eclipse/papyrus/emf/facet/architecture/tests/OutsideOfADL_1_Test.java:[36] 
13:07:02 [ERROR] 	Assert.assertEquals(CustomizationMergeErrorCode.CHECK_ERROR__REFERENCE_OUTSIDE_OF_ADL, diag.getCode());
13:07:02 [ERROR] 	                    ^^^^^^^^^^^^^^^^^^^^^^^^^^^^^^^^^^^^^^^^^^^^^^^^^^^^^^^^^^^^^^^^^
13:07:02 [ERROR] Access restriction: The type 'CustomizationMergeErrorCode' is not API (restriction on classpath entry '/jobs/genie.papyrus/Papyrus-Gerrit-Master-With-Tests/workspace/source/plugins/facet/org.eclipse.papyrus.emf.facet.architecture/bin')
13:07:02 [ERROR] /jobs/genie.papyrus/Papyrus-Gerrit-Master-With-Tests/workspace/source/tests/junit/plugins/facet/org.eclipse.papyrus.emf.facet.architecture.tests/src/org/eclipse/papyrus/emf/facet/architecture/tests/OutsideOfADL_1_Test.java:[36] 
13:07:02 [ERROR] 	Assert.assertEquals(CustomizationMergeErrorCode.CHECK_ERROR__REFERENCE_OUTSIDE_OF_ADL, diag.getCode());
13:07:02 [ERROR] 	                                                ^^^^^^^^^^^^^^^^^^^^^^^^^^^^^^^^^^^^^
13:07:02 [ERROR] Access restriction: The field 'CustomizationMergeErrorCode.CHECK_ERROR__REFERENCE_OUTSIDE_OF_ADL' is not API (restriction on classpath entry '/jobs/genie.papyrus/Papyrus-Gerrit-Master-With-Tests/workspace/source/plugins/facet/org.eclipse.papyrus.emf.facet.architecture/bin')
13:07:02 [ERROR] /jobs/genie.papyrus/Papyrus-Gerrit-Master-With-Tests/workspace/source/tests/junit/plugins/facet/org.eclipse.papyrus.emf.facet.architecture.tests/src/org/eclipse/papyrus/emf/facet/architecture/tests/RedefinesNotFound_1_Test.java:[21] 
13:07:02 [ERROR] 	import org.eclipse.papyrus.emf.facet.architecture.customizationconfiguration.comparators.CustomizationMergeErrorCode;
13:07:02 [ERROR] 	       ^^^^^^^^^^^^^^^^^^^^^^^^^^^^^^^^^^^^^^^^^^^^^^^^^^^^^^^^^^^^^^^^^^^^^^^^^^^^^^^^^^^^^^^^^^^^^^^^^^^^^^^^^^^^^
13:07:02 [ERROR] Access restriction: The type 'CustomizationMergeErrorCode' is not API (restriction on classpath entry '/jobs/genie.papyrus/Papyrus-Gerrit-Master-With-Tests/workspace/source/plugins/facet/org.eclipse.papyrus.emf.facet.architecture/bin')
13:07:02 [ERROR] /jobs/genie.papyrus/Papyrus-Gerrit-Master-With-Tests/workspace/source/tests/junit/plugins/facet/org.eclipse.papyrus.emf.facet.architecture.tests/src/org/eclipse/papyrus/emf/facet/architecture/tests/RedefinesNotFound_1_Test.java:[36] 
13:07:02 [ERROR] 	Assert.assertEquals(CustomizationMergeErrorCode.MERGE_ERROR__REDEFINE_NOT_FOUND, diag.getCode());
13:07:02 [ERROR] 	                    ^^^^^^^^^^^^^^^^^^^^^^^^^^^^^^^^^^^^^^^^^^^^^^^^^^^^^^^^^^^
13:07:02 [ERROR] Access restriction: The type 'CustomizationMergeErrorCode' is not API (restriction on classpath entry '/jobs/genie.papyrus/Papyrus-Gerrit-Master-With-Tests/workspace/source/plugins/facet/org.eclipse.papyrus.emf.facet.architecture/bin')
13:07:02 [ERROR] /jobs/genie.papyrus/Papyrus-Gerrit-Master-With-Tests/workspace/source/tests/junit/plugins/facet/org.eclipse.papyrus.emf.facet.architecture.tests/src/org/eclipse/papyrus/emf/facet/architecture/tests/RedefinesNotFound_1_Test.java:[36] 
13:07:02 [ERROR] 	Assert.assertEquals(CustomizationMergeErrorCode.MERGE_ERROR__REDEFINE_NOT_FOUND, diag.getCode());
13:07:02 [ERROR] 	                                                ^^^^^^^^^^^^^^^^^^^^^^^^^^^^^^^
13:07:02 [ERROR] Access restriction: The field 'CustomizationMergeErrorCode.MERGE_ERROR__REDEFINE_NOT_FOUND' is not API (restriction on classpath entry '/jobs/genie.papyrus/Papyrus-Gerrit-Master-With-Tests/workspace/source/plugins/facet/org.eclipse.papyrus.emf.facet.architecture/bin')
13:07:02 [ERROR] /jobs/genie.papyrus/Papyrus-Gerrit-Master-With-Tests/workspace/source/tests/junit/plugins/facet/org.eclipse.papyrus.emf.facet.architecture.tests/src/org/eclipse/papyrus/emf/facet/architecture/tests/AbsoluteOrderInRoot_3_Test.java:[21] 
13:07:02 [ERROR] 	import org.eclipse.papyrus.emf.facet.architecture.customizationconfiguration.comparators.CustomizationMergeErrorCode;
13:07:02 [ERROR] 	       ^^^^^^^^^^^^^^^^^^^^^^^^^^^^^^^^^^^^^^^^^^^^^^^^^^^^^^^^^^^^^^^^^^^^^^^^^^^^^^^^^^^^^^^^^^^^^^^^^^^^^^^^^^^^^
13:07:02 [ERROR] Access restriction: The type 'CustomizationMergeErrorCode' is not API (restriction on classpath entry '/jobs/genie.papyrus/Papyrus-Gerrit-Master-With-Tests/workspace/source/plugins/facet/org.eclipse.papyrus.emf.facet.architecture/bin')
13:07:02 [ERROR] /jobs/genie.papyrus/Papyrus-Gerrit-Master-With-Tests/workspace/source/tests/junit/plugins/facet/org.eclipse.papyrus.emf.facet.architecture.tests/src/org/eclipse/papyrus/emf/facet/architecture/tests/AbsoluteOrderInRoot_3_Test.java:[36] 
13:07:02 [ERROR] 	Assert.assertEquals(CustomizationMergeErrorCode.CHECK_ERROR__NOT_ONLY_USE_ABSOLUTE_ORDER_IN_ROOTS, diag.getCode());
13:07:02 [ERROR] 	                    ^^^^^^^^^^^^^^^^^^^^^^^^^^^^^^^^^^^^^^^^^^^^^^^^^^^^^^^^^^^^^^^^^^^^^^^^^^^^^
13:07:02 [ERROR] Access restriction: The type 'CustomizationMergeErrorCode' is not API (restriction on classpath entry '/jobs/genie.papyrus/Papyrus-Gerrit-Master-With-Tests/workspace/source/plugins/facet/org.eclipse.papyrus.emf.facet.architecture/bin')
13:07:02 [ERROR] /jobs/genie.papyrus/Papyrus-Gerrit-Master-With-Tests/workspace/source/tests/junit/plugins/facet/org.eclipse.papyrus.emf.facet.architecture.tests/src/org/eclipse/papyrus/emf/facet/architecture/tests/AbsoluteOrderInRoot_3_Test.java:[36] 
13:07:02 [ERROR] 	Assert.assertEquals(CustomizationMergeErrorCode.CHECK_ERROR__NOT_ONLY_USE_ABSOLUTE_ORDER_IN_ROOTS, diag.getCode());
13:07:02 [ERROR] 	                                                ^^^^^^^^^^^^^^^^^^^^^^^^^^^^^^^^^^^^^^^^^^^^^^^^^
13:07:02 [ERROR] Access restriction: The field 'CustomizationMergeErrorCode.CHECK_ERROR__NOT_ONLY_USE_ABSOLUTE_ORDER_IN_ROOTS' is not API (restriction on classpath entry '/jobs/genie.papyrus/Papyrus-Gerrit-Master-With-Tests/workspace/source/plugins/facet/org.eclipse.papyrus.emf.facet.architecture/bin')
13:07:02 [ERROR] /jobs/genie.papyrus/Papyrus-Gerrit-Master-With-Tests/workspace/source/tests/junit/plugins/facet/org.eclipse.papyrus.emf.facet.architecture.tests/src/org/eclipse/papyrus/emf/facet/architecture/tests/TooManyBefore_1_Test.java:[21] 
13:07:02 [ERROR] 	import org.eclipse.papyrus.emf.facet.architecture.customizationconfiguration.comparators.CustomizationMergeErrorCode;
13:07:02 [ERROR] 	       ^^^^^^^^^^^^^^^^^^^^^^^^^^^^^^^^^^^^^^^^^^^^^^^^^^^^^^^^^^^^^^^^^^^^^^^^^^^^^^^^^^^^^^^^^^^^^^^^^^^^^^^^^^^^^
13:07:02 [ERROR] Access restriction: The type 'CustomizationMergeErrorCode' is not API (restriction on classpath entry '/jobs/genie.papyrus/Papyrus-Gerrit-Master-With-Tests/workspace/source/plugins/facet/org.eclipse.papyrus.emf.facet.architecture/bin')
13:07:02 [ERROR] /jobs/genie.papyrus/Papyrus-Gerrit-Master-With-Tests/workspace/source/tests/junit/plugins/facet/org.eclipse.papyrus.emf.facet.architecture.tests/src/org/eclipse/papyrus/emf/facet/architecture/tests/TooManyBefore_1_Test.java:[38] 
13:07:02 [ERROR] 	if (CustomizationMergeErrorCode.CHECK_ERROR__TOO_MANY_BEFORE_FOR_ME == diag.getCode()) {
13:07:02 [ERROR] 	    ^^^^^^^^^^^^^^^^^^^^^^^^^^^^^^^^^^^^^^^^^^^^^^^^^^^^^^^^^^^^^^^
13:07:02 [ERROR] Access restriction: The type 'CustomizationMergeErrorCode' is not API (restriction on classpath entry '/jobs/genie.papyrus/Papyrus-Gerrit-Master-With-Tests/workspace/source/plugins/facet/org.eclipse.papyrus.emf.facet.architecture/bin')
13:07:02 [ERROR] /jobs/genie.papyrus/Papyrus-Gerrit-Master-With-Tests/workspace/source/tests/junit/plugins/facet/org.eclipse.papyrus.emf.facet.architecture.tests/src/org/eclipse/papyrus/emf/facet/architecture/tests/TooManyBefore_1_Test.java:[38] 
13:07:02 [ERROR] 	if (CustomizationMergeErrorCode.CHECK_ERROR__TOO_MANY_BEFORE_FOR_ME == diag.getCode()) {
13:07:02 [ERROR] 	                                ^^^^^^^^^^^^^^^^^^^^^^^^^^^^^^^^^^^
13:07:02 [ERROR] Access restriction: The field 'CustomizationMergeErrorCode.CHECK_ERROR__TOO_MANY_BEFORE_FOR_ME' is not API (restriction on classpath entry '/jobs/genie.papyrus/Papyrus-Gerrit-Master-With-Tests/workspace/source/plugins/facet/org.eclipse.papyrus.emf.facet.architecture/bin')
13:07:02 [ERROR] /jobs/genie.papyrus/Papyrus-Gerrit-Master-With-Tests/workspace/source/tests/junit/plugins/facet/org.eclipse.papyrus.emf.facet.architecture.tests/src/org/eclipse/papyrus/emf/facet/architecture/tests/TooManyBefore_1_Test.java:[41] 
13:07:02 [ERROR] 	if (CustomizationMergeErrorCode.CHECK_ERROR__EXTRA_BEFORE == diag.getCode()) {
13:07:02 [ERROR] 	    ^^^^^^^^^^^^^^^^^^^^^^^^^^^^^^^^^^^^^^^^^^^^^^^^^^^^^
13:07:02 [ERROR] Access restriction: The type 'CustomizationMergeErrorCode' is not API (restriction on classpath entry '/jobs/genie.papyrus/Papyrus-Gerrit-Master-With-Tests/workspace/source/plugins/facet/org.eclipse.papyrus.emf.facet.architecture/bin')
13:07:02 [ERROR] /jobs/genie.papyrus/Papyrus-Gerrit-Master-With-Tests/workspace/source/tests/junit/plugins/facet/org.eclipse.papyrus.emf.facet.architecture.tests/src/org/eclipse/papyrus/emf/facet/architecture/tests/TooManyBefore_1_Test.java:[41] 
13:07:02 [ERROR] 	if (CustomizationMergeErrorCode.CHECK_ERROR__EXTRA_BEFORE == diag.getCode()) {
13:07:02 [ERROR] 	                                ^^^^^^^^^^^^^^^^^^^^^^^^^
13:07:02 [ERROR] Access restriction: The field 'CustomizationMergeErrorCode.CHECK_ERROR__EXTRA_BEFORE' is not API (restriction on classpath entry '/jobs/genie.papyrus/Papyrus-Gerrit-Master-With-Tests/workspace/source/plugins/facet/org.eclipse.papyrus.emf.facet.architecture/bin')
13:07:02 [ERROR] /jobs/genie.papyrus/Papyrus-Gerrit-Master-With-Tests/workspace/source/tests/junit/plugins/facet/org.eclipse.papyrus.emf.facet.architecture.tests/src/org/eclipse/papyrus/emf/facet/architecture/tests/TooManyAfter_1_Test.java:[21] 
13:07:02 [ERROR] 	import org.eclipse.papyrus.emf.facet.architecture.customizationconfiguration.comparators.CustomizationMergeErrorCode;
13:07:02 [ERROR] 	       ^^^^^^^^^^^^^^^^^^^^^^^^^^^^^^^^^^^^^^^^^^^^^^^^^^^^^^^^^^^^^^^^^^^^^^^^^^^^^^^^^^^^^^^^^^^^^^^^^^^^^^^^^^^^^
13:07:02 [ERROR] Access restriction: The type 'CustomizationMergeErrorCode' is not API (restriction on classpath entry '/jobs/genie.papyrus/Papyrus-Gerrit-Master-With-Tests/workspace/source/plugins/facet/org.eclipse.papyrus.emf.facet.architecture/bin')
13:07:02 [ERROR] /jobs/genie.papyrus/Papyrus-Gerrit-Master-With-Tests/workspace/source/tests/junit/plugins/facet/org.eclipse.papyrus.emf.facet.architecture.tests/src/org/eclipse/papyrus/emf/facet/architecture/tests/TooManyAfter_1_Test.java:[38] 
13:07:02 [ERROR] 	if (CustomizationMergeErrorCode.CHECK_ERROR__TOO_MANY_AFTER_FOR_ME == diag.getCode()) {
13:07:02 [ERROR] 	    ^^^^^^^^^^^^^^^^^^^^^^^^^^^^^^^^^^^^^^^^^^^^^^^^^^^^^^^^^^^^^^
13:07:02 [ERROR] Access restriction: The type 'CustomizationMergeErrorCode' is not API (restriction on classpath entry '/jobs/genie.papyrus/Papyrus-Gerrit-Master-With-Tests/workspace/source/plugins/facet/org.eclipse.papyrus.emf.facet.architecture/bin')
13:07:02 [ERROR] /jobs/genie.papyrus/Papyrus-Gerrit-Master-With-Tests/workspace/source/tests/junit/plugins/facet/org.eclipse.papyrus.emf.facet.architecture.tests/src/org/eclipse/papyrus/emf/facet/architecture/tests/TooManyAfter_1_Test.java:[38] 
13:07:02 [ERROR] 	if (CustomizationMergeErrorCode.CHECK_ERROR__TOO_MANY_AFTER_FOR_ME == diag.getCode()) {
13:07:02 [ERROR] 	                                ^^^^^^^^^^^^^^^^^^^^^^^^^^^^^^^^^^
13:07:02 [ERROR] Access restriction: The field 'CustomizationMergeErrorCode.CHECK_ERROR__TOO_MANY_AFTER_FOR_ME' is not API (restriction on classpath entry '/jobs/genie.papyrus/Papyrus-Gerrit-Master-With-Tests/workspace/source/plugins/facet/org.eclipse.papyrus.emf.facet.architecture/bin')
13:07:02 [ERROR] /jobs/genie.papyrus/Papyrus-Gerrit-Master-With-Tests/workspace/source/tests/junit/plugins/facet/org.eclipse.papyrus.emf.facet.architecture.tests/src/org/eclipse/papyrus/emf/facet/architecture/tests/TooManyAfter_1_Test.java:[41] 
13:07:02 [ERROR] 	if (CustomizationMergeErrorCode.CHECK_ERROR__EXTRA_AFTER == diag.getCode()) {
13:07:02 [ERROR] 	    ^^^^^^^^^^^^^^^^^^^^^^^^^^^^^^^^^^^^^^^^^^^^^^^^^^^^
13:07:02 [ERROR] Access restriction: The type 'CustomizationMergeErrorCode' is not API (restriction on classpath entry '/jobs/genie.papyrus/Papyrus-Gerrit-Master-With-Tests/workspace/source/plugins/facet/org.eclipse.papyrus.emf.facet.architecture/bin')
13:07:02 [ERROR] /jobs/genie.papyrus/Papyrus-Gerrit-Master-With-Tests/workspace/source/tests/junit/plugins/facet/org.eclipse.papyrus.emf.facet.architecture.tests/src/org/eclipse/papyrus/emf/facet/architecture/tests/TooManyAfter_1_Test.java:[41] 
13:07:02 [ERROR] 	if (CustomizationMergeErrorCode.CHECK_ERROR__EXTRA_AFTER == diag.getCode()) {
13:07:02 [ERROR] 	                                ^^^^^^^^^^^^^^^^^^^^^^^^
13:07:02 [ERROR] Access restriction: The field 'CustomizationMergeErrorCode.CHECK_ERROR__EXTRA_AFTER' is not API (restriction on classpath entry '/jobs/genie.papyrus/Papyrus-Gerrit-Master-With-Tests/workspace/source/plugins/facet/org.eclipse.papyrus.emf.facet.architecture/bin')
13:07:02 [ERROR] /jobs/genie.papyrus/Papyrus-Gerrit-Master-With-Tests/workspace/source/tests/junit/plugins/facet/org.eclipse.papyrus.emf.facet.architecture.tests/src/org/eclipse/papyrus/emf/facet/architecture/tests/TooManyRedefines_1_Test.java:[21] 
13:07:02 [ERROR] 	import org.eclipse.papyrus.emf.facet.architecture.customizationconfiguration.comparators.CustomizationMergeErrorCode;
13:07:02 [ERROR] 	       ^^^^^^^^^^^^^^^^^^^^^^^^^^^^^^^^^^^^^^^^^^^^^^^^^^^^^^^^^^^^^^^^^^^^^^^^^^^^^^^^^^^^^^^^^^^^^^^^^^^^^^^^^^^^^
13:07:02 [ERROR] Access restriction: The type 'CustomizationMergeErrorCode' is not API (restriction on classpath entry '/jobs/genie.papyrus/Papyrus-Gerrit-Master-With-Tests/workspace/source/plugins/facet/org.eclipse.papyrus.emf.facet.architecture/bin')
13:07:02 [ERROR] /jobs/genie.papyrus/Papyrus-Gerrit-Master-With-Tests/workspace/source/tests/junit/plugins/facet/org.eclipse.papyrus.emf.facet.architecture.tests/src/org/eclipse/papyrus/emf/facet/architecture/tests/TooManyRedefines_1_Test.java:[38] 
13:07:02 [ERROR] 	if (CustomizationMergeErrorCode.CHECK_ERROR__TOO_MANY_REDEFINES_FOR_ME == diag.getCode()) {
13:07:02 [ERROR] 	    ^^^^^^^^^^^^^^^^^^^^^^^^^^^^^^^^^^^^^^^^^^^^^^^^^^^^^^^^^^^^^^^^^^
13:07:02 [ERROR] Access restriction: The type 'CustomizationMergeErrorCode' is not API (restriction on classpath entry '/jobs/genie.papyrus/Papyrus-Gerrit-Master-With-Tests/workspace/source/plugins/facet/org.eclipse.papyrus.emf.facet.architecture/bin')
13:07:02 [ERROR] /jobs/genie.papyrus/Papyrus-Gerrit-Master-With-Tests/workspace/source/tests/junit/plugins/facet/org.eclipse.papyrus.emf.facet.architecture.tests/src/org/eclipse/papyrus/emf/facet/architecture/tests/TooManyRedefines_1_Test.java:[38] 
13:07:02 [ERROR] 	if (CustomizationMergeErrorCode.CHECK_ERROR__TOO_MANY_REDEFINES_FOR_ME == diag.getCode()) {
13:07:02 [ERROR] 	                                ^^^^^^^^^^^^^^^^^^^^^^^^^^^^^^^^^^^^^^
13:07:02 [ERROR] Access restriction: The field 'CustomizationMergeErrorCode.CHECK_ERROR__TOO_MANY_REDEFINES_FOR_ME' is not API (restriction on classpath entry '/jobs/genie.papyrus/Papyrus-Gerrit-Master-With-Tests/workspace/source/plugins/facet/org.eclipse.papyrus.emf.facet.architecture/bin')
13:07:02 [ERROR] /jobs/genie.papyrus/Papyrus-Gerrit-Master-With-Tests/workspace/source/tests/junit/plugins/facet/org.eclipse.papyrus.emf.facet.architecture.tests/src/org/eclipse/papyrus/emf/facet/architecture/tests/TooManyRedefines_1_Test.java:[41] 
13:07:02 [ERROR] 	if (CustomizationMergeErrorCode.CHECK_ERROR__EXTRA_REDEFINES == diag.getCode()) {
13:07:02 [ERROR] 	    ^^^^^^^^^^^^^^^^^^^^^^^^^^^^^^^^^^^^^^^^^^^^^^^^^^^^^^^^
13:07:02 [ERROR] Access restriction: The type 'CustomizationMergeErrorCode' is not API (restriction on classpath entry '/jobs/genie.papyrus/Papyrus-Gerrit-Master-With-Tests/workspace/source/plugins/facet/org.eclipse.papyrus.emf.facet.architecture/bin')
13:07:02 [ERROR] /jobs/genie.papyrus/Papyrus-Gerrit-Master-With-Tests/workspace/source/tests/junit/plugins/facet/org.eclipse.papyrus.emf.facet.architecture.tests/src/org/eclipse/papyrus/emf/facet/architecture/tests/TooManyRedefines_1_Test.java:[41] 
13:07:02 [ERROR] 	if (CustomizationMergeErrorCode.CHECK_ERROR__EXTRA_REDEFINES == diag.getCode()) {
13:07:02 [ERROR] 	                                ^^^^^^^^^^^^^^^^^^^^^^^^^^^^
13:07:02 [ERROR] Access restriction: The field 'CustomizationMergeErrorCode.CHECK_ERROR__EXTRA_REDEFINES' is not API (restriction on classpath entry '/jobs/genie.papyrus/Papyrus-Gerrit-Master-With-Tests/workspace/source/plugins/facet/org.eclipse.papyrus.emf.facet.architecture/bin')
13:07:02 [ERROR] /jobs/genie.papyrus/Papyrus-Gerrit-Master-With-Tests/workspace/source/tests/junit/plugins/facet/org.eclipse.papyrus.emf.facet.architecture.tests/src/org/eclipse/papyrus/emf/facet/architecture/tests/TooManyRedefines_2_Test.java:[21] 
13:07:02 [ERROR] 	import org.eclipse.papyrus.emf.facet.architecture.customizationconfiguration.comparators.CustomizationMergeErrorCode;
13:07:02 [ERROR] 	       ^^^^^^^^^^^^^^^^^^^^^^^^^^^^^^^^^^^^^^^^^^^^^^^^^^^^^^^^^^^^^^^^^^^^^^^^^^^^^^^^^^^^^^^^^^^^^^^^^^^^^^^^^^^^^
13:07:02 [ERROR] Access restriction: The type 'CustomizationMergeErrorCode' is not API (restriction on classpath entry '/jobs/genie.papyrus/Papyrus-Gerrit-Master-With-Tests/workspace/source/plugins/facet/org.eclipse.papyrus.emf.facet.architecture/bin')
13:07:02 [ERROR] /jobs/genie.papyrus/Papyrus-Gerrit-Master-With-Tests/workspace/source/tests/junit/plugins/facet/org.eclipse.papyrus.emf.facet.architecture.tests/src/org/eclipse/papyrus/emf/facet/architecture/tests/TooManyRedefines_2_Test.java:[38] 
13:07:02 [ERROR] 	if (CustomizationMergeErrorCode.CHECK_ERROR__TOO_MANY_REDEFINES_FOR_ME == diag.getCode()) {
13:07:02 [ERROR] 	    ^^^^^^^^^^^^^^^^^^^^^^^^^^^^^^^^^^^^^^^^^^^^^^^^^^^^^^^^^^^^^^^^^^
13:07:02 [ERROR] Access restriction: The type 'CustomizationMergeErrorCode' is not API (restriction on classpath entry '/jobs/genie.papyrus/Papyrus-Gerrit-Master-With-Tests/workspace/source/plugins/facet/org.eclipse.papyrus.emf.facet.architecture/bin')
13:07:02 [ERROR] /jobs/genie.papyrus/Papyrus-Gerrit-Master-With-Tests/workspace/source/tests/junit/plugins/facet/org.eclipse.papyrus.emf.facet.architecture.tests/src/org/eclipse/papyrus/emf/facet/architecture/tests/TooManyRedefines_2_Test.java:[38] 
13:07:02 [ERROR] 	if (CustomizationMergeErrorCode.CHECK_ERROR__TOO_MANY_REDEFINES_FOR_ME == diag.getCode()) {
13:07:02 [ERROR] 	                                ^^^^^^^^^^^^^^^^^^^^^^^^^^^^^^^^^^^^^^
13:07:02 [ERROR] Access restriction: The field 'CustomizationMergeErrorCode.CHECK_ERROR__TOO_MANY_REDEFINES_FOR_ME' is not API (restriction on classpath entry '/jobs/genie.papyrus/Papyrus-Gerrit-Master-With-Tests/workspace/source/plugins/facet/org.eclipse.papyrus.emf.facet.architecture/bin')
13:07:02 [ERROR] /jobs/genie.papyrus/Papyrus-Gerrit-Master-With-Tests/workspace/source/tests/junit/plugins/facet/org.eclipse.papyrus.emf.facet.architecture.tests/src/org/eclipse/papyrus/emf/facet/architecture/tests/TooManyRedefines_2_Test.java:[41] 
13:07:02 [ERROR] 	if (CustomizationMergeErrorCode.CHECK_ERROR__EXTRA_REDEFINES == diag.getCode()) {
13:07:02 [ERROR] 	    ^^^^^^^^^^^^^^^^^^^^^^^^^^^^^^^^^^^^^^^^^^^^^^^^^^^^^^^^
13:07:02 [ERROR] Access restriction: The type 'CustomizationMergeErrorCode' is not API (restriction on classpath entry '/jobs/genie.papyrus/Papyrus-Gerrit-Master-With-Tests/workspace/source/plugins/facet/org.eclipse.papyrus.emf.facet.architecture/bin')
13:07:02 [ERROR] /jobs/genie.papyrus/Papyrus-Gerrit-Master-With-Tests/workspace/source/tests/junit/plugins/facet/org.eclipse.papyrus.emf.facet.architecture.tests/src/org/eclipse/papyrus/emf/facet/architecture/tests/TooManyRedefines_2_Test.java:[41] 
13:07:02 [ERROR] 	if (CustomizationMergeErrorCode.CHECK_ERROR__EXTRA_REDEFINES == diag.getCode()) {
13:07:02 [ERROR] 	                                ^^^^^^^^^^^^^^^^^^^^^^^^^^^^
13:07:02 [ERROR] Access restriction: The field 'CustomizationMergeErrorCode.CHECK_ERROR__EXTRA_REDEFINES' is not API (restriction on classpath entry '/jobs/genie.papyrus/Papyrus-Gerrit-Master-With-Tests/workspace/source/plugins/facet/org.eclipse.papyrus.emf.facet.architecture/bin')
13:07:02 [ERROR] /jobs/genie.papyrus/Papyrus-Gerrit-Master-With-Tests/workspace/source/tests/junit/plugins/facet/org.eclipse.papyrus.emf.facet.architecture.tests/src/org/eclipse/papyrus/emf/facet/architecture/tests/TooManyBefore_2_Test.java:[21] 
13:07:02 [ERROR] 	import org.eclipse.papyrus.emf.facet.architecture.customizationconfiguration.comparators.CustomizationMergeErrorCode;
13:07:02 [ERROR] 	       ^^^^^^^^^^^^^^^^^^^^^^^^^^^^^^^^^^^^^^^^^^^^^^^^^^^^^^^^^^^^^^^^^^^^^^^^^^^^^^^^^^^^^^^^^^^^^^^^^^^^^^^^^^^^^
13:07:02 [ERROR] Access restriction: The type 'CustomizationMergeErrorCode' is not API (restriction on classpath entry '/jobs/genie.papyrus/Papyrus-Gerrit-Master-With-Tests/workspace/source/plugins/facet/org.eclipse.papyrus.emf.facet.architecture/bin')
13:07:02 [ERROR] /jobs/genie.papyrus/Papyrus-Gerrit-Master-With-Tests/workspace/source/tests/junit/plugins/facet/org.eclipse.papyrus.emf.facet.architecture.tests/src/org/eclipse/papyrus/emf/facet/architecture/tests/TooManyBefore_2_Test.java:[38] 
13:07:02 [ERROR] 	if (CustomizationMergeErrorCode.CHECK_ERROR__TOO_MANY_BEFORE_FOR_ME == diag.getCode()) {
13:07:02 [ERROR] 	    ^^^^^^^^^^^^^^^^^^^^^^^^^^^^^^^^^^^^^^^^^^^^^^^^^^^^^^^^^^^^^^^
13:07:02 [ERROR] Access restriction: The type 'CustomizationMergeErrorCode' is not API (restriction on classpath entry '/jobs/genie.papyrus/Papyrus-Gerrit-Master-With-Tests/workspace/source/plugins/facet/org.eclipse.papyrus.emf.facet.architecture/bin')
13:07:02 [ERROR] /jobs/genie.papyrus/Papyrus-Gerrit-Master-With-Tests/workspace/source/tests/junit/plugins/facet/org.eclipse.papyrus.emf.facet.architecture.tests/src/org/eclipse/papyrus/emf/facet/architecture/tests/TooManyBefore_2_Test.java:[38] 
13:07:02 [ERROR] 	if (CustomizationMergeErrorCode.CHECK_ERROR__TOO_MANY_BEFORE_FOR_ME == diag.getCode()) {
13:07:02 [ERROR] 	                                ^^^^^^^^^^^^^^^^^^^^^^^^^^^^^^^^^^^
13:07:02 [ERROR] Access restriction: The field 'CustomizationMergeErrorCode.CHECK_ERROR__TOO_MANY_BEFORE_FOR_ME' is not API (restriction on classpath entry '/jobs/genie.papyrus/Papyrus-Gerrit-Master-With-Tests/workspace/source/plugins/facet/org.eclipse.papyrus.emf.facet.architecture/bin')
13:07:02 [ERROR] /jobs/genie.papyrus/Papyrus-Gerrit-Master-With-Tests/workspace/source/tests/junit/plugins/facet/org.eclipse.papyrus.emf.facet.architecture.tests/src/org/eclipse/papyrus/emf/facet/architecture/tests/TooManyBefore_2_Test.java:[41] 
13:07:02 [ERROR] 	if (CustomizationMergeErrorCode.CHECK_ERROR__EXTRA_BEFORE == diag.getCode()) {
13:07:02 [ERROR] 	    ^^^^^^^^^^^^^^^^^^^^^^^^^^^^^^^^^^^^^^^^^^^^^^^^^^^^^
13:07:02 [ERROR] Access restriction: The type 'CustomizationMergeErrorCode' is not API (restriction on classpath entry '/jobs/genie.papyrus/Papyrus-Gerrit-Master-With-Tests/workspace/source/plugins/facet/org.eclipse.papyrus.emf.facet.architecture/bin')
13:07:02 [ERROR] /jobs/genie.papyrus/Papyrus-Gerrit-Master-With-Tests/workspace/source/tests/junit/plugins/facet/org.eclipse.papyrus.emf.facet.architecture.tests/src/org/eclipse/papyrus/emf/facet/architecture/tests/TooManyBefore_2_Test.java:[41] 
13:07:02 [ERROR] 	if (CustomizationMergeErrorCode.CHECK_ERROR__EXTRA_BEFORE == diag.getCode()) {
13:07:02 [ERROR] 	                                ^^^^^^^^^^^^^^^^^^^^^^^^^
13:07:02 [ERROR] Access restriction: The field 'CustomizationMergeErrorCode.CHECK_ERROR__EXTRA_BEFORE' is not API (restriction on classpath entry '/jobs/genie.papyrus/Papyrus-Gerrit-Master-With-Tests/workspace/source/plugins/facet/org.eclipse.papyrus.emf.facet.architecture/bin')
13:07:02 [ERROR] /jobs/genie.papyrus/Papyrus-Gerrit-Master-With-Tests/workspace/source/tests/junit/plugins/facet/org.eclipse.papyrus.emf.facet.architecture.tests/src/org/eclipse/papyrus/emf/facet/architecture/tests/DuplicateAbsoluteOrder_4_Test.java:[21] 
13:07:02 [ERROR] 	import org.eclipse.papyrus.emf.facet.architecture.customizationconfiguration.comparators.CustomizationMergeErrorCode;
13:07:02 [ERROR] 	       ^^^^^^^^^^^^^^^^^^^^^^^^^^^^^^^^^^^^^^^^^^^^^^^^^^^^^^^^^^^^^^^^^^^^^^^^^^^^^^^^^^^^^^^^^^^^^^^^^^^^^^^^^^^^^
13:07:02 [ERROR] Access restriction: The type 'CustomizationMergeErrorCode' is not API (restriction on classpath entry '/jobs/genie.papyrus/Papyrus-Gerrit-Master-With-Tests/workspace/source/plugins/facet/org.eclipse.papyrus.emf.facet.architecture/bin')
13:07:02 [ERROR] /jobs/genie.papyrus/Papyrus-Gerrit-Master-With-Tests/workspace/source/tests/junit/plugins/facet/org.eclipse.papyrus.emf.facet.architecture.tests/src/org/eclipse/papyrus/emf/facet/architecture/tests/DuplicateAbsoluteOrder_4_Test.java:[36] 
13:07:02 [ERROR] 	Assert.assertEquals(CustomizationMergeErrorCode.CHECK_ERROR__DUPLICATE_ABSOLUTE_ORDER, diag.getCode());
13:07:02 [ERROR] 	                    ^^^^^^^^^^^^^^^^^^^^^^^^^^^^^^^^^^^^^^^^^^^^^^^^^^^^^^^^^^^^^^^^^
13:07:02 [ERROR] Access restriction: The type 'CustomizationMergeErrorCode' is not API (restriction on classpath entry '/jobs/genie.papyrus/Papyrus-Gerrit-Master-With-Tests/workspace/source/plugins/facet/org.eclipse.papyrus.emf.facet.architecture/bin')
13:07:02 [ERROR] /jobs/genie.papyrus/Papyrus-Gerrit-Master-With-Tests/workspace/source/tests/junit/plugins/facet/org.eclipse.papyrus.emf.facet.architecture.tests/src/org/eclipse/papyrus/emf/facet/architecture/tests/DuplicateAbsoluteOrder_4_Test.java:[36] 
13:07:02 [ERROR] 	Assert.assertEquals(CustomizationMergeErrorCode.CHECK_ERROR__DUPLICATE_ABSOLUTE_ORDER, diag.getCode());
13:07:02 [ERROR] 	                                                ^^^^^^^^^^^^^^^^^^^^^^^^^^^^^^^^^^^^^
13:07:02 [ERROR] Access restriction: The field 'CustomizationMergeErrorCode.CHECK_ERROR__DUPLICATE_ABSOLUTE_ORDER' is not API (restriction on classpath entry '/jobs/genie.papyrus/Papyrus-Gerrit-Master-With-Tests/workspace/source/plugins/facet/org.eclipse.papyrus.emf.facet.architecture/bin')
13:07:02 [ERROR] /jobs/genie.papyrus/Papyrus-Gerrit-Master-With-Tests/workspace/source/tests/junit/plugins/facet/org.eclipse.papyrus.emf.facet.architecture.tests/src/org/eclipse/papyrus/emf/facet/architecture/tests/InfiniteLoop_1_Test.java:[21] 
13:07:02 [ERROR] 	import org.eclipse.papyrus.emf.facet.architecture.customizationconfiguration.comparators.CustomizationMergeErrorCode;
13:07:02 [ERROR] 	       ^^^^^^^^^^^^^^^^^^^^^^^^^^^^^^^^^^^^^^^^^^^^^^^^^^^^^^^^^^^^^^^^^^^^^^^^^^^^^^^^^^^^^^^^^^^^^^^^^^^^^^^^^^^^^
13:07:02 [ERROR] Access restriction: The type 'CustomizationMergeErrorCode' is not API (restriction on classpath entry '/jobs/genie.papyrus/Papyrus-Gerrit-Master-With-Tests/workspace/source/plugins/facet/org.eclipse.papyrus.emf.facet.architecture/bin')
13:07:02 [ERROR] /jobs/genie.papyrus/Papyrus-Gerrit-Master-With-Tests/workspace/source/tests/junit/plugins/facet/org.eclipse.papyrus.emf.facet.architecture.tests/src/org/eclipse/papyrus/emf/facet/architecture/tests/InfiniteLoop_1_Test.java:[36] 
13:07:02 [ERROR] 	Assert.assertEquals(CustomizationMergeErrorCode.CHECK_ERROR__EXTENDS_INFINITE_LOOP, diag.getCode());
13:07:02 [ERROR] 	                    ^^^^^^^^^^^^^^^^^^^^^^^^^^^^^^^^^^^^^^^^^^^^^^^^^^^^^^^^^^^^^^
13:07:02 [ERROR] Access restriction: The type 'CustomizationMergeErrorCode' is not API (restriction on classpath entry '/jobs/genie.papyrus/Papyrus-Gerrit-Master-With-Tests/workspace/source/plugins/facet/org.eclipse.papyrus.emf.facet.architecture/bin')
13:07:02 [ERROR] /jobs/genie.papyrus/Papyrus-Gerrit-Master-With-Tests/workspace/source/tests/junit/plugins/facet/org.eclipse.papyrus.emf.facet.architecture.tests/src/org/eclipse/papyrus/emf/facet/architecture/tests/InfiniteLoop_1_Test.java:[36] 
13:07:02 [ERROR] 	Assert.assertEquals(CustomizationMergeErrorCode.CHECK_ERROR__EXTENDS_INFINITE_LOOP, diag.getCode());
13:07:02 [ERROR] 	                                                ^^^^^^^^^^^^^^^^^^^^^^^^^^^^^^^^^^
13:07:02 [ERROR] Access restriction: The field 'CustomizationMergeErrorCode.CHECK_ERROR__EXTENDS_INFINITE_LOOP' is not API (restriction on classpath entry '/jobs/genie.papyrus/Papyrus-Gerrit-Master-With-Tests/workspace/source/plugins/facet/org.eclipse.papyrus.emf.facet.architecture/bin')
13:07:02 [ERROR] /jobs/genie.papyrus/Papyrus-Gerrit-Master-With-Tests/workspace/source/tests/junit/plugins/facet/org.eclipse.papyrus.emf.facet.architecture.tests/src/org/eclipse/papyrus/emf/facet/architecture/tests/DuplicateAbsoluteOrder_3_Test.java:[21] 
13:07:02 [ERROR] 	import org.eclipse.papyrus.emf.facet.architecture.customizationconfiguration.comparators.CustomizationMergeErrorCode;
13:07:02 [ERROR] 	       ^^^^^^^^^^^^^^^^^^^^^^^^^^^^^^^^^^^^^^^^^^^^^^^^^^^^^^^^^^^^^^^^^^^^^^^^^^^^^^^^^^^^^^^^^^^^^^^^^^^^^^^^^^^^^
13:07:02 [ERROR] Access restriction: The type 'CustomizationMergeErrorCode' is not API (restriction on classpath entry '/jobs/genie.papyrus/Papyrus-Gerrit-Master-With-Tests/workspace/source/plugins/facet/org.eclipse.papyrus.emf.facet.architecture/bin')
13:07:02 [ERROR] /jobs/genie.papyrus/Papyrus-Gerrit-Master-With-Tests/workspace/source/tests/junit/plugins/facet/org.eclipse.papyrus.emf.facet.architecture.tests/src/org/eclipse/papyrus/emf/facet/architecture/tests/DuplicateAbsoluteOrder_3_Test.java:[36] 
13:07:02 [ERROR] 	Assert.assertEquals(CustomizationMergeErrorCode.CHECK_ERROR__DUPLICATE_ABSOLUTE_ORDER, diag.getCode());
13:07:02 [ERROR] 	                    ^^^^^^^^^^^^^^^^^^^^^^^^^^^^^^^^^^^^^^^^^^^^^^^^^^^^^^^^^^^^^^^^^
13:07:02 [ERROR] Access restriction: The type 'CustomizationMergeErrorCode' is not API (restriction on classpath entry '/jobs/genie.papyrus/Papyrus-Gerrit-Master-With-Tests/workspace/source/plugins/facet/org.eclipse.papyrus.emf.facet.architecture/bin')
13:07:02 [ERROR] /jobs/genie.papyrus/Papyrus-Gerrit-Master-With-Tests/workspace/source/tests/junit/plugins/facet/org.eclipse.papyrus.emf.facet.architecture.tests/src/org/eclipse/papyrus/emf/facet/architecture/tests/DuplicateAbsoluteOrder_3_Test.java:[36] 
13:07:02 [ERROR] 	Assert.assertEquals(CustomizationMergeErrorCode.CHECK_ERROR__DUPLICATE_ABSOLUTE_ORDER, diag.getCode());
13:07:02 [ERROR] 	                                                ^^^^^^^^^^^^^^^^^^^^^^^^^^^^^^^^^^^^^
13:07:02 [ERROR] Access restriction: The field 'CustomizationMergeErrorCode.CHECK_ERROR__DUPLICATE_ABSOLUTE_ORDER' is not API (restriction on classpath entry '/jobs/genie.papyrus/Papyrus-Gerrit-Master-With-Tests/workspace/source/plugins/facet/org.eclipse.papyrus.emf.facet.architecture/bin')
13:07:02 [ERROR] /jobs/genie.papyrus/Papyrus-Gerrit-Master-With-Tests/workspace/source/tests/junit/plugins/facet/org.eclipse.papyrus.emf.facet.architecture.tests/src/org/eclipse/papyrus/emf/facet/architecture/tests/AbsoluteOrderInRoot_1_Test.java:[21] 
13:07:02 [ERROR] 	import org.eclipse.papyrus.emf.facet.architecture.customizationconfiguration.comparators.CustomizationMergeErrorCode;
13:07:02 [ERROR] 	       ^^^^^^^^^^^^^^^^^^^^^^^^^^^^^^^^^^^^^^^^^^^^^^^^^^^^^^^^^^^^^^^^^^^^^^^^^^^^^^^^^^^^^^^^^^^^^^^^^^^^^^^^^^^^^
13:07:02 [ERROR] Access restriction: The type 'CustomizationMergeErrorCode' is not API (restriction on classpath entry '/jobs/genie.papyrus/Papyrus-Gerrit-Master-With-Tests/workspace/source/plugins/facet/org.eclipse.papyrus.emf.facet.architecture/bin')
13:07:02 [ERROR] /jobs/genie.papyrus/Papyrus-Gerrit-Master-With-Tests/workspace/source/tests/junit/plugins/facet/org.eclipse.papyrus.emf.facet.architecture.tests/src/org/eclipse/papyrus/emf/facet/architecture/tests/AbsoluteOrderInRoot_1_Test.java:[36] 
13:07:02 [ERROR] 	Assert.assertEquals(CustomizationMergeErrorCode.CHECK_ERROR__NOT_ONLY_USE_ABSOLUTE_ORDER_IN_ROOTS, diag.getCode());
13:07:02 [ERROR] 	                    ^^^^^^^^^^^^^^^^^^^^^^^^^^^^^^^^^^^^^^^^^^^^^^^^^^^^^^^^^^^^^^^^^^^^^^^^^^^^^
13:07:02 [ERROR] Access restriction: The type 'CustomizationMergeErrorCode' is not API (restriction on classpath entry '/jobs/genie.papyrus/Papyrus-Gerrit-Master-With-Tests/workspace/source/plugins/facet/org.eclipse.papyrus.emf.facet.architecture/bin')
13:07:02 [ERROR] /jobs/genie.papyrus/Papyrus-Gerrit-Master-With-Tests/workspace/source/tests/junit/plugins/facet/org.eclipse.papyrus.emf.facet.architecture.tests/src/org/eclipse/papyrus/emf/facet/architecture/tests/AbsoluteOrderInRoot_1_Test.java:[36] 
13:07:02 [ERROR] 	Assert.assertEquals(CustomizationMergeErrorCode.CHECK_ERROR__NOT_ONLY_USE_ABSOLUTE_ORDER_IN_ROOTS, diag.getCode());
13:07:02 [ERROR] 	                                                ^^^^^^^^^^^^^^^^^^^^^^^^^^^^^^^^^^^^^^^^^^^^^^^^^
13:07:02 [ERROR] Access restriction: The field 'CustomizationMergeErrorCode.CHECK_ERROR__NOT_ONLY_USE_ABSOLUTE_ORDER_IN_ROOTS' is not API (restriction on classpath entry '/jobs/genie.papyrus/Papyrus-Gerrit-Master-With-Tests/workspace/source/plugins/facet/org.eclipse.papyrus.emf.facet.architecture/bin')
13:07:02 [ERROR] /jobs/genie.papyrus/Papyrus-Gerrit-Master-With-Tests/workspace/source/tests/junit/plugins/facet/org.eclipse.papyrus.emf.facet.architecture.tests/src/org/eclipse/papyrus/emf/facet/architecture/tests/InfiniteLoop_2_Test.java:[21] 
13:07:02 [ERROR] 	import org.eclipse.papyrus.emf.facet.architecture.customizationconfiguration.comparators.CustomizationMergeErrorCode;
13:07:02 [ERROR] 	       ^^^^^^^^^^^^^^^^^^^^^^^^^^^^^^^^^^^^^^^^^^^^^^^^^^^^^^^^^^^^^^^^^^^^^^^^^^^^^^^^^^^^^^^^^^^^^^^^^^^^^^^^^^^^^
13:07:02 [ERROR] Access restriction: The type 'CustomizationMergeErrorCode' is not API (restriction on classpath entry '/jobs/genie.papyrus/Papyrus-Gerrit-Master-With-Tests/workspace/source/plugins/facet/org.eclipse.papyrus.emf.facet.architecture/bin')
13:07:02 [ERROR] /jobs/genie.papyrus/Papyrus-Gerrit-Master-With-Tests/workspace/source/tests/junit/plugins/facet/org.eclipse.papyrus.emf.facet.architecture.tests/src/org/eclipse/papyrus/emf/facet/architecture/tests/InfiniteLoop_2_Test.java:[36] 
13:07:02 [ERROR] 	Assert.assertEquals(CustomizationMergeErrorCode.CHECK_ERROR__EXTENDS_INFINITE_LOOP, diag.getCode());
13:07:02 [ERROR] 	                    ^^^^^^^^^^^^^^^^^^^^^^^^^^^^^^^^^^^^^^^^^^^^^^^^^^^^^^^^^^^^^^
13:07:02 [ERROR] Access restriction: The type 'CustomizationMergeErrorCode' is not API (restriction on classpath entry '/jobs/genie.papyrus/Papyrus-Gerrit-Master-With-Tests/workspace/source/plugins/facet/org.eclipse.papyrus.emf.facet.architecture/bin')
13:07:02 [ERROR] /jobs/genie.papyrus/Papyrus-Gerrit-Master-With-Tests/workspace/source/tests/junit/plugins/facet/org.eclipse.papyrus.emf.facet.architecture.tests/src/org/eclipse/papyrus/emf/facet/architecture/tests/InfiniteLoop_2_Test.java:[36] 
13:07:02 [ERROR] 	Assert.assertEquals(CustomizationMergeErrorCode.CHECK_ERROR__EXTENDS_INFINITE_LOOP, diag.getCode());
13:07:02 [ERROR] 	                                                ^^^^^^^^^^^^^^^^^^^^^^^^^^^^^^^^^^
13:07:02 [ERROR] Access restriction: The field 'CustomizationMergeErrorCode.CHECK_ERROR__EXTENDS_INFINITE_LOOP' is not API (restriction on classpath entry '/jobs/genie.papyrus/Papyrus-Gerrit-Master-With-Tests/workspace/source/plugins/facet/org.eclipse.papyrus.emf.facet.architecture/bin')
13:07:02 [ERROR] /jobs/genie.papyrus/Papyrus-Gerrit-Master-With-Tests/workspace/source/tests/junit/plugins/facet/org.eclipse.papyrus.emf.facet.architecture.tests/src/org/eclipse/papyrus/emf/facet/architecture/tests/DuplicateAbsoluteOrder_2_Test.java:[21] 
13:07:02 [ERROR] 	import org.eclipse.papyrus.emf.facet.architecture.customizationconfiguration.comparators.CustomizationMergeErrorCode;
13:07:02 [ERROR] 	       ^^^^^^^^^^^^^^^^^^^^^^^^^^^^^^^^^^^^^^^^^^^^^^^^^^^^^^^^^^^^^^^^^^^^^^^^^^^^^^^^^^^^^^^^^^^^^^^^^^^^^^^^^^^^^
13:07:02 [ERROR] Access restriction: The type 'CustomizationMergeErrorCode' is not API (restriction on classpath entry '/jobs/genie.papyrus/Papyrus-Gerrit-Master-With-Tests/workspace/source/plugins/facet/org.eclipse.papyrus.emf.facet.architecture/bin')
13:07:02 [ERROR] /jobs/genie.papyrus/Papyrus-Gerrit-Master-With-Tests/workspace/source/tests/junit/plugins/facet/org.eclipse.papyrus.emf.facet.architecture.tests/src/org/eclipse/papyrus/emf/facet/architecture/tests/DuplicateAbsoluteOrder_2_Test.java:[36] 
13:07:02 [ERROR] 	Assert.assertEquals(CustomizationMergeErrorCode.CHECK_ERROR__DUPLICATE_ABSOLUTE_ORDER, diag.getCode());
13:07:02 [ERROR] 	                    ^^^^^^^^^^^^^^^^^^^^^^^^^^^^^^^^^^^^^^^^^^^^^^^^^^^^^^^^^^^^^^^^^
13:07:02 [ERROR] Access restriction: The type 'CustomizationMergeErrorCode' is not API (restriction on classpath entry '/jobs/genie.papyrus/Papyrus-Gerrit-Master-With-Tests/workspace/source/plugins/facet/org.eclipse.papyrus.emf.facet.architecture/bin')
13:07:02 [ERROR] /jobs/genie.papyrus/Papyrus-Gerrit-Master-With-Tests/workspace/source/tests/junit/plugins/facet/org.eclipse.papyrus.emf.facet.architecture.tests/src/org/eclipse/papyrus/emf/facet/architecture/tests/DuplicateAbsoluteOrder_2_Test.java:[36] 
13:07:02 [ERROR] 	Assert.assertEquals(CustomizationMergeErrorCode.CHECK_ERROR__DUPLICATE_ABSOLUTE_ORDER, diag.getCode());
13:07:02 [ERROR] 	                                                ^^^^^^^^^^^^^^^^^^^^^^^^^^^^^^^^^^^^^
13:07:02 [ERROR] Access restriction: The field 'CustomizationMergeErrorCode.CHECK_ERROR__DUPLICATE_ABSOLUTE_ORDER' is not API (restriction on classpath entry '/jobs/genie.papyrus/Papyrus-Gerrit-Master-With-Tests/workspace/source/plugins/facet/org.eclipse.papyrus.emf.facet.architecture/bin')
13:07:02 [ERROR] /jobs/genie.papyrus/Papyrus-Gerrit-Master-With-Tests/workspace/source/tests/junit/plugins/facet/org.eclipse.papyrus.emf.facet.architecture.tests/src/org/eclipse/papyrus/emf/facet/architecture/tests/TooManyAfter_2_Test.java:[21] 
13:07:02 [ERROR] 	import org.eclipse.papyrus.emf.facet.architecture.customizationconfiguration.comparators.CustomizationMergeErrorCode;
13:07:02 [ERROR] 	       ^^^^^^^^^^^^^^^^^^^^^^^^^^^^^^^^^^^^^^^^^^^^^^^^^^^^^^^^^^^^^^^^^^^^^^^^^^^^^^^^^^^^^^^^^^^^^^^^^^^^^^^^^^^^^
13:07:02 [ERROR] Access restriction: The type 'CustomizationMergeErrorCode' is not API (restriction on classpath entry '/jobs/genie.papyrus/Papyrus-Gerrit-Master-With-Tests/workspace/source/plugins/facet/org.eclipse.papyrus.emf.facet.architecture/bin')
13:07:02 [ERROR] /jobs/genie.papyrus/Papyrus-Gerrit-Master-With-Tests/workspace/source/tests/junit/plugins/facet/org.eclipse.papyrus.emf.facet.architecture.tests/src/org/eclipse/papyrus/emf/facet/architecture/tests/TooManyAfter_2_Test.java:[38] 
13:07:02 [ERROR] 	if (CustomizationMergeErrorCode.CHECK_ERROR__TOO_MANY_AFTER_FOR_ME == diag.getCode()) {
13:07:02 [ERROR] 	    ^^^^^^^^^^^^^^^^^^^^^^^^^^^^^^^^^^^^^^^^^^^^^^^^^^^^^^^^^^^^^^
13:07:02 [ERROR] Access restriction: The type 'CustomizationMergeErrorCode' is not API (restriction on classpath entry '/jobs/genie.papyrus/Papyrus-Gerrit-Master-With-Tests/workspace/source/plugins/facet/org.eclipse.papyrus.emf.facet.architecture/bin')
13:07:02 [ERROR] /jobs/genie.papyrus/Papyrus-Gerrit-Master-With-Tests/workspace/source/tests/junit/plugins/facet/org.eclipse.papyrus.emf.facet.architecture.tests/src/org/eclipse/papyrus/emf/facet/architecture/tests/TooManyAfter_2_Test.java:[38] 
13:07:02 [ERROR] 	if (CustomizationMergeErrorCode.CHECK_ERROR__TOO_MANY_AFTER_FOR_ME == diag.getCode()) {
13:07:02 [ERROR] 	                                ^^^^^^^^^^^^^^^^^^^^^^^^^^^^^^^^^^
13:07:02 [ERROR] Access restriction: The field 'CustomizationMergeErrorCode.CHECK_ERROR__TOO_MANY_AFTER_FOR_ME' is not API (restriction on classpath entry '/jobs/genie.papyrus/Papyrus-Gerrit-Master-With-Tests/workspace/source/plugins/facet/org.eclipse.papyrus.emf.facet.architecture/bin')
13:07:02 [ERROR] /jobs/genie.papyrus/Papyrus-Gerrit-Master-With-Tests/workspace/source/tests/junit/plugins/facet/org.eclipse.papyrus.emf.facet.architecture.tests/src/org/eclipse/papyrus/emf/facet/architecture/tests/TooManyAfter_2_Test.java:[41] 
13:07:02 [ERROR] 	if (CustomizationMergeErrorCode.CHECK_ERROR__EXTRA_AFTER == diag.getCode()) {
13:07:02 [ERROR] 	    ^^^^^^^^^^^^^^^^^^^^^^^^^^^^^^^^^^^^^^^^^^^^^^^^^^^^
13:07:02 [ERROR] Access restriction: The type 'CustomizationMergeErrorCode' is not API (restriction on classpath entry '/jobs/genie.papyrus/Papyrus-Gerrit-Master-With-Tests/workspace/source/plugins/facet/org.eclipse.papyrus.emf.facet.architecture/bin')
13:07:02 [ERROR] /jobs/genie.papyrus/Papyrus-Gerrit-Master-With-Tests/workspace/source/tests/junit/plugins/facet/org.eclipse.papyrus.emf.facet.architecture.tests/src/org/eclipse/papyrus/emf/facet/architecture/tests/TooManyAfter_2_Test.java:[41] 
13:07:02 [ERROR] 	if (CustomizationMergeErrorCode.CHECK_ERROR__EXTRA_AFTER == diag.getCode()) {
13:07:02 [ERROR] 	                                ^^^^^^^^^^^^^^^^^^^^^^^^
13:07:02 [ERROR] Access restriction: The field 'CustomizationMergeErrorCode.CHECK_ERROR__EXTRA_AFTER' is not API (restriction on classpath entry '/jobs/genie.papyrus/Papyrus-Gerrit-Master-With-Tests/workspace/source/plugins/facet/org.eclipse.papyrus.emf.facet.architecture/bin')
13:07:02 [ERROR] /jobs/genie.papyrus/Papyrus-Gerrit-Master-With-Tests/workspace/source/tests/junit/plugins/facet/org.eclipse.papyrus.emf.facet.architecture.tests/src/org/eclipse/papyrus/emf/facet/architecture/tests/AbsoluteOrderInRoot_2_Test.java:[21] 
13:07:02 [ERROR] 	import org.eclipse.papyrus.emf.facet.architecture.customizationconfiguration.comparators.CustomizationMergeErrorCode;
13:07:02 [ERROR] 	       ^^^^^^^^^^^^^^^^^^^^^^^^^^^^^^^^^^^^^^^^^^^^^^^^^^^^^^^^^^^^^^^^^^^^^^^^^^^^^^^^^^^^^^^^^^^^^^^^^^^^^^^^^^^^^
13:07:02 [ERROR] Access restriction: The type 'CustomizationMergeErrorCode' is not API (restriction on classpath entry '/jobs/genie.papyrus/Papyrus-Gerrit-Master-With-Tests/workspace/source/plugins/facet/org.eclipse.papyrus.emf.facet.architecture/bin')
13:07:02 [ERROR] /jobs/genie.papyrus/Papyrus-Gerrit-Master-With-Tests/workspace/source/tests/junit/plugins/facet/org.eclipse.papyrus.emf.facet.architecture.tests/src/org/eclipse/papyrus/emf/facet/architecture/tests/AbsoluteOrderInRoot_2_Test.java:[36] 
13:07:02 [ERROR] 	Assert.assertEquals(CustomizationMergeErrorCode.CHECK_ERROR__NOT_ONLY_USE_ABSOLUTE_ORDER_IN_ROOTS, diag.getCode());
13:07:02 [ERROR] 	                    ^^^^^^^^^^^^^^^^^^^^^^^^^^^^^^^^^^^^^^^^^^^^^^^^^^^^^^^^^^^^^^^^^^^^^^^^^^^^^
13:07:02 [ERROR] Access restriction: The type 'CustomizationMergeErrorCode' is not API (restriction on classpath entry '/jobs/genie.papyrus/Papyrus-Gerrit-Master-With-Tests/workspace/source/plugins/facet/org.eclipse.papyrus.emf.facet.architecture/bin')
13:07:02 [ERROR] /jobs/genie.papyrus/Papyrus-Gerrit-Master-With-Tests/workspace/source/tests/junit/plugins/facet/org.eclipse.papyrus.emf.facet.architecture.tests/src/org/eclipse/papyrus/emf/facet/architecture/tests/AbsoluteOrderInRoot_2_Test.java:[36] 
13:07:02 [ERROR] 	Assert.assertEquals(CustomizationMergeErrorCode.CHECK_ERROR__NOT_ONLY_USE_ABSOLUTE_ORDER_IN_ROOTS, diag.getCode());
13:07:02 [ERROR] 	                                                ^^^^^^^^^^^^^^^^^^^^^^^^^^^^^^^^^^^^^^^^^^^^^^^^^
13:07:02 [ERROR] Access restriction: The field 'CustomizationMergeErrorCode.CHECK_ERROR__NOT_ONLY_USE_ABSOLUTE_ORDER_IN_ROOTS' is not API (restriction on classpath entry '/jobs/genie.papyrus/Papyrus-Gerrit-Master-With-Tests/workspace/source/plugins/facet/org.eclipse.papyrus.emf.facet.architecture/bin')
13:07:02 [ERROR] /jobs/genie.papyrus/Papyrus-Gerrit-Master-With-Tests/workspace/source/tests/junit/plugins/facet/org.eclipse.papyrus.emf.facet.architecture.tests/src/org/eclipse/papyrus/emf/facet/architecture/tests/Merge_1_Test.java:[22] 
13:07:02 [ERROR] 	import org.eclipse.papyrus.emf.facet.architecture.customizationconfiguration.comparators.CustomizationReferenceMerger;
13:07:02 [ERROR] 	       ^^^^^^^^^^^^^^^^^^^^^^^^^^^^^^^^^^^^^^^^^^^^^^^^^^^^^^^^^^^^^^^^^^^^^^^^^^^^^^^^^^^^^^^^^^^^^^^^^^^^^^^^^^^^^^
13:07:02 [ERROR] Access restriction: The type 'CustomizationReferenceMerger' is not API (restriction on classpath entry '/jobs/genie.papyrus/Papyrus-Gerrit-Master-With-Tests/workspace/source/plugins/facet/org.eclipse.papyrus.emf.facet.architecture/bin')
13:07:02 [ERROR] /jobs/genie.papyrus/Papyrus-Gerrit-Master-With-Tests/workspace/source/tests/junit/plugins/facet/org.eclipse.papyrus.emf.facet.architecture.tests/src/org/eclipse/papyrus/emf/facet/architecture/tests/Merge_1_Test.java:[68] 
13:07:02 [ERROR] 	CustomizationReferenceMerger merger = new CustomizationReferenceMerger(facetConfiguration);
13:07:02 [ERROR] 	^^^^^^^^^^^^^^^^^^^^^^^^^^^^
13:07:02 [ERROR] Access restriction: The type 'CustomizationReferenceMerger' is not API (restriction on classpath entry '/jobs/genie.papyrus/Papyrus-Gerrit-Master-With-Tests/workspace/source/plugins/facet/org.eclipse.papyrus.emf.facet.architecture/bin')
13:07:02 [ERROR] /jobs/genie.papyrus/Papyrus-Gerrit-Master-With-Tests/workspace/source/tests/junit/plugins/facet/org.eclipse.papyrus.emf.facet.architecture.tests/src/org/eclipse/papyrus/emf/facet/architecture/tests/Merge_1_Test.java:[68] 
13:07:02 [ERROR] 	CustomizationReferenceMerger merger = new CustomizationReferenceMerger(facetConfiguration);
13:07:02 [ERROR] 	                                      ^^^^^^^^^^^^^^^^^^^^^^^^^^^^^^^^^^^^^^^^^^^^^^^^^^^^
13:07:02 [ERROR] Access restriction: The constructor 'CustomizationReferenceMerger(Collection<EMFFacetTreeViewerConfiguration>)' is not API (restriction on classpath entry '/jobs/genie.papyrus/Papyrus-Gerrit-Master-With-Tests/workspace/source/plugins/facet/org.eclipse.papyrus.emf.facet.architecture/bin')
13:07:02 [ERROR] /jobs/genie.papyrus/Papyrus-Gerrit-Master-With-Tests/workspace/source/tests/junit/plugins/facet/org.eclipse.papyrus.emf.facet.architecture.tests/src/org/eclipse/papyrus/emf/facet/architecture/tests/Merge_1_Test.java:[68] 
13:07:02 [ERROR] 	CustomizationReferenceMerger merger = new CustomizationReferenceMerger(facetConfiguration);
13:07:02 [ERROR] 	                                          ^^^^^^^^^^^^^^^^^^^^^^^^^^^^
13:07:02 [ERROR] Access restriction: The type 'CustomizationReferenceMerger' is not API (restriction on classpath entry '/jobs/genie.papyrus/Papyrus-Gerrit-Master-With-Tests/workspace/source/plugins/facet/org.eclipse.papyrus.emf.facet.architecture/bin')
13:07:02 [ERROR] /jobs/genie.papyrus/Papyrus-Gerrit-Master-With-Tests/workspace/source/tests/junit/plugins/facet/org.eclipse.papyrus.emf.facet.architecture.tests/src/org/eclipse/papyrus/emf/facet/architecture/tests/Merge_1_Test.java:[69] 
13:07:02 [ERROR] 	Assert.assertTrue("The tested model is not valid", merger.doValidationAndMerge()); //$NON-NLS-1$
13:07:02 [ERROR] 	                                                   ^^^^^^^^^^^^^^^^^^^^^^^^^^^^^
13:07:02 [ERROR] Access restriction: The method 'CustomizationReferenceMerger.doValidationAndMerge()' is not API (restriction on classpath entry '/jobs/genie.papyrus/Papyrus-Gerrit-Master-With-Tests/workspace/source/plugins/facet/org.eclipse.papyrus.emf.facet.architecture/bin')
13:07:02 [ERROR] /jobs/genie.papyrus/Papyrus-Gerrit-Master-With-Tests/workspace/source/tests/junit/plugins/facet/org.eclipse.papyrus.emf.facet.architecture.tests/src/org/eclipse/papyrus/emf/facet/architecture/tests/Merge_1_Test.java:[70] 
13:07:02 [ERROR] 	final List<Customization> customizations = merger.getMergedCustomizations();
13:07:02 [ERROR] 	                                           ^^^^^^^^^^^^^^^^^^^^^^^^^^^^^^^^
13:07:02 [ERROR] Access restriction: The method 'CustomizationReferenceMerger.getMergedCustomizations()' is not API (restriction on classpath entry '/jobs/genie.papyrus/Papyrus-Gerrit-Master-With-Tests/workspace/source/plugins/facet/org.eclipse.papyrus.emf.facet.architecture/bin')
13:07:02 [ERROR] /jobs/genie.papyrus/Papyrus-Gerrit-Master-With-Tests/workspace/source/tests/junit/plugins/facet/org.eclipse.papyrus.emf.facet.architecture.tests/src/org/eclipse/papyrus/emf/facet/architecture/tests/AfterNotFound_1_Test.java:[21] 
13:07:02 [ERROR] 	import org.eclipse.papyrus.emf.facet.architecture.customizationconfiguration.comparators.CustomizationMergeErrorCode;
13:07:02 [ERROR] 	       ^^^^^^^^^^^^^^^^^^^^^^^^^^^^^^^^^^^^^^^^^^^^^^^^^^^^^^^^^^^^^^^^^^^^^^^^^^^^^^^^^^^^^^^^^^^^^^^^^^^^^^^^^^^^^
13:07:02 [ERROR] Access restriction: The type 'CustomizationMergeErrorCode' is not API (restriction on classpath entry '/jobs/genie.papyrus/Papyrus-Gerrit-Master-With-Tests/workspace/source/plugins/facet/org.eclipse.papyrus.emf.facet.architecture/bin')
13:07:02 [ERROR] /jobs/genie.papyrus/Papyrus-Gerrit-Master-With-Tests/workspace/source/tests/junit/plugins/facet/org.eclipse.papyrus.emf.facet.architecture.tests/src/org/eclipse/papyrus/emf/facet/architecture/tests/AfterNotFound_1_Test.java:[36] 
13:07:02 [ERROR] 	Assert.assertEquals(CustomizationMergeErrorCode.MERGE_ERROR__AFTER_NOT_FOUND, diag.getCode());
13:07:02 [ERROR] 	                    ^^^^^^^^^^^^^^^^^^^^^^^^^^^^^^^^^^^^^^^^^^^^^^^^^^^^^^^^
13:07:02 [ERROR] Access restriction: The type 'CustomizationMergeErrorCode' is not API (restriction on classpath entry '/jobs/genie.papyrus/Papyrus-Gerrit-Master-With-Tests/workspace/source/plugins/facet/org.eclipse.papyrus.emf.facet.architecture/bin')
13:07:02 [ERROR] /jobs/genie.papyrus/Papyrus-Gerrit-Master-With-Tests/workspace/source/tests/junit/plugins/facet/org.eclipse.papyrus.emf.facet.architecture.tests/src/org/eclipse/papyrus/emf/facet/architecture/tests/AfterNotFound_1_Test.java:[36] 
13:07:02 [ERROR] 	Assert.assertEquals(CustomizationMergeErrorCode.MERGE_ERROR__AFTER_NOT_FOUND, diag.getCode());
13:07:02 [ERROR] 	                                                ^^^^^^^^^^^^^^^^^^^^^^^^^^^^
13:07:02 [ERROR] Access restriction: The field 'CustomizationMergeErrorCode.MERGE_ERROR__AFTER_NOT_FOUND' is not API (restriction on classpath entry '/jobs/genie.papyrus/Papyrus-Gerrit-Master-With-Tests/workspace/source/plugins/facet/org.eclipse.papyrus.emf.facet.architecture/bin')
13:07:02 [ERROR] /jobs/genie.papyrus/Papyrus-Gerrit-Master-With-Tests/workspace/source/tests/junit/plugins/facet/org.eclipse.papyrus.emf.facet.architecture.tests/src/org/eclipse/papyrus/emf/facet/architecture/tests/DuplicateAbsoluteOrder_1_Test.java:[21] 
13:07:02 [ERROR] 	import org.eclipse.papyrus.emf.facet.architecture.customizationconfiguration.comparators.CustomizationMergeErrorCode;
13:07:02 [ERROR] 	       ^^^^^^^^^^^^^^^^^^^^^^^^^^^^^^^^^^^^^^^^^^^^^^^^^^^^^^^^^^^^^^^^^^^^^^^^^^^^^^^^^^^^^^^^^^^^^^^^^^^^^^^^^^^^^
13:07:02 [ERROR] Access restriction: The type 'CustomizationMergeErrorCode' is not API (restriction on classpath entry '/jobs/genie.papyrus/Papyrus-Gerrit-Master-With-Tests/workspace/source/plugins/facet/org.eclipse.papyrus.emf.facet.architecture/bin')
13:07:02 [ERROR] /jobs/genie.papyrus/Papyrus-Gerrit-Master-With-Tests/workspace/source/tests/junit/plugins/facet/org.eclipse.papyrus.emf.facet.architecture.tests/src/org/eclipse/papyrus/emf/facet/architecture/tests/DuplicateAbsoluteOrder_1_Test.java:[36] 
13:07:02 [ERROR] 	Assert.assertEquals(CustomizationMergeErrorCode.CHECK_ERROR__DUPLICATE_ABSOLUTE_ORDER, diag.getCode());
13:07:02 [ERROR] 	                    ^^^^^^^^^^^^^^^^^^^^^^^^^^^^^^^^^^^^^^^^^^^^^^^^^^^^^^^^^^^^^^^^^
13:07:02 [ERROR] Access restriction: The type 'CustomizationMergeErrorCode' is not API (restriction on classpath entry '/jobs/genie.papyrus/Papyrus-Gerrit-Master-With-Tests/workspace/source/plugins/facet/org.eclipse.papyrus.emf.facet.architecture/bin')
13:07:02 [ERROR] /jobs/genie.papyrus/Papyrus-Gerrit-Master-With-Tests/workspace/source/tests/junit/plugins/facet/org.eclipse.papyrus.emf.facet.architecture.tests/src/org/eclipse/papyrus/emf/facet/architecture/tests/DuplicateAbsoluteOrder_1_Test.java:[36] 
13:07:02 [ERROR] 	Assert.assertEquals(CustomizationMergeErrorCode.CHECK_ERROR__DUPLICATE_ABSOLUTE_ORDER, diag.getCode());
13:07:02 [ERROR] 	                                                ^^^^^^^^^^^^^^^^^^^^^^^^^^^^^^^^^^^^^
13:07:02 [ERROR] Access restriction: The field 'CustomizationMergeErrorCode.CHECK_ERROR__DUPLICATE_ABSOLUTE_ORDER' is not API (restriction on classpath entry '/jobs/genie.papyrus/Papyrus-Gerrit-Master-With-Tests/workspace/source/plugins/facet/org.eclipse.papyrus.emf.facet.architecture/bin')
13:07:02 [ERROR] /jobs/genie.papyrus/Papyrus-Gerrit-Master-With-Tests/workspace/source/tests/junit/plugins/facet/org.eclipse.papyrus.emf.facet.architecture.tests/src/org/eclipse/papyrus/emf/facet/architecture/tests/OutsideOfADL_2_Test.java:[21] 
13:07:02 [ERROR] 	import org.eclipse.papyrus.emf.facet.architecture.customizationconfiguration.comparators.CustomizationMergeErrorCode;
13:07:02 [ERROR] 	       ^^^^^^^^^^^^^^^^^^^^^^^^^^^^^^^^^^^^^^^^^^^^^^^^^^^^^^^^^^^^^^^^^^^^^^^^^^^^^^^^^^^^^^^^^^^^^^^^^^^^^^^^^^^^^
13:07:02 [ERROR] Access restriction: The type 'CustomizationMergeErrorCode' is not API (restriction on classpath entry '/jobs/genie.papyrus/Papyrus-Gerrit-Master-With-Tests/workspace/source/plugins/facet/org.eclipse.papyrus.emf.facet.architecture/bin')
13:07:02 [ERROR] /jobs/genie.papyrus/Papyrus-Gerrit-Master-With-Tests/workspace/source/tests/junit/plugins/facet/org.eclipse.papyrus.emf.facet.architecture.tests/src/org/eclipse/papyrus/emf/facet/architecture/tests/OutsideOfADL_2_Test.java:[36] 
13:07:02 [ERROR] 	Assert.assertEquals(CustomizationMergeErrorCode.CHECK_ERROR__REFERENCE_OUTSIDE_OF_ADL, diag.getCode());
13:07:02 [ERROR] 	                    ^^^^^^^^^^^^^^^^^^^^^^^^^^^^^^^^^^^^^^^^^^^^^^^^^^^^^^^^^^^^^^^^^
13:07:02 [ERROR] Access restriction: The type 'CustomizationMergeErrorCode' is not API (restriction on classpath entry '/jobs/genie.papyrus/Papyrus-Gerrit-Master-With-Tests/workspace/source/plugins/facet/org.eclipse.papyrus.emf.facet.architecture/bin')
13:07:02 [ERROR] /jobs/genie.papyrus/Papyrus-Gerrit-Master-With-Tests/workspace/source/tests/junit/plugins/facet/org.eclipse.papyrus.emf.facet.architecture.tests/src/org/eclipse/papyrus/emf/facet/architecture/tests/OutsideOfADL_2_Test.java:[36] 
13:07:02 [ERROR] 	Assert.assertEquals(CustomizationMergeErrorCode.CHECK_ERROR__REFERENCE_OUTSIDE_OF_ADL, diag.getCode());
13:07:02 [ERROR] 	                                                ^^^^^^^^^^^^^^^^^^^^^^^^^^^^^^^^^^^^^
13:07:02 [ERROR] Access restriction: The field 'CustomizationMergeErrorCode.CHECK_ERROR__REFERENCE_OUTSIDE_OF_ADL' is not API (restriction on classpath entry '/jobs/genie.papyrus/Papyrus-Gerrit-Master-With-Tests/workspace/source/plugins/facet/org.eclipse.papyrus.emf.facet.architecture/bin')
13:07:02 [ERROR] 78 problems (78 errors)
13:07:02 [ERROR] -> [Help 1]
13:07:02 [ERROR] 
13:07:02 [ERROR] To see the full stack trace of the errors, re-run Maven with the -e switch.
13:07:02 [ERROR] Re-run Maven using the -X switch to enable full debug logging.
13:07:02 [ERROR] 
13:07:02 [ERROR] For more information about the errors and possible solutions, please read the following articles:
13:07:02 [ERROR] [Help 1] http://cwiki.apache.org/confluence/display/MAVEN/MojoFailureException
13:07:02 [ERROR] 
13:07:02 [ERROR] After correcting the problems, you can resume the build with the command
13:07:02 [ERROR]   mvn <args> -rf :org.eclipse.papyrus.emf.facet.architecture.tests
13:07:04 Build step 'Invoke top-level Maven targets' marked build as failure
13:07:04 Terminating xvnc.
13:07:18 Recording test results
13:07:18 ERROR: Step ‘Publish JUnit test result report’ failed: No test report files were found. Configuration error?
13:07:19 An attempt to send an e-mail to empty list of recipients, ignored.
13:07:19 Started calculate disk usage of build
13:07:19 Finished Calculation of disk usage of build in 0 seconds
13:07:19 Started calculate disk usage of workspace
13:07:20 Finished Calculation of disk usage of workspace in  1 second
13:07:20 [WS-CLEANUP] Deleting project workspace...
13:07:20 [WS-CLEANUP] Deferred wipeout is used...
13:07:20 [WS-CLEANUP] done
13:07:20 Finished: FAILURE