UnstableConsole Output

Skipping 14,259 KB.. Full Log
 elapsed: 1.038 s
07:36:16 testObservableValue(org.eclipse.papyrus.uml.properties.databinding.tests.ImageExpressionObservableValueTest)  Time elapsed: 0.784 s
07:36:16 testObservableValue(org.eclipse.papyrus.uml.properties.databinding.tests.ImageKindObservableValueTest)  Time elapsed: 0.855 s
07:36:16 testObservableValue(org.eclipse.papyrus.uml.properties.databinding.tests.ImageNameObservableValueTest)  Time elapsed: 0.664 s
07:36:16 testObservableValue(org.eclipse.papyrus.uml.properties.databinding.tests.ElementCustomizationElementIconObservableValueTest)  Time elapsed: 1.374 s
07:36:16 testObservableValue(org.eclipse.papyrus.uml.properties.databinding.tests.ElementCustomizationQualifiedNameObservableValueTest)  Time elapsed: 1.108 s
07:36:16 testObservableValue(org.eclipse.papyrus.uml.properties.databinding.tests.ElementCustomizationShadowObservableValueTest)  Time elapsed: 1.355 s
07:36:16 testObservableValue(org.eclipse.papyrus.uml.properties.databinding.tests.ExtensionRequiredObservableValueTest)  Time elapsed: 1.175 s
07:36:16 testObservableValue(org.eclipse.papyrus.uml.properties.databinding.tests.ImportedPackageLocationObservableValueTest)  Time elapsed: 0.776 s
07:36:16 testObservableValue(org.eclipse.papyrus.uml.properties.databinding.tests.UnsettableStringObservableValueTest)  Time elapsed: 0.767 s
07:36:16 testObservableValue(org.eclipse.papyrus.uml.properties.databinding.tests.BasicObservableValueTest)  Time elapsed: 0.703 s
07:36:16 testObservableValue(org.eclipse.papyrus.uml.properties.databinding.tests.AnnotationObservableValueTest)  Time elapsed: 0.642 s
07:36:16 testObservableList(org.eclipse.papyrus.uml.properties.databinding.tests.MaskValueObservableListTest)  Time elapsed: 1.196 s
07:36:16 testObservableList(org.eclipse.papyrus.uml.properties.databinding.tests.AppliedCommentsObservableListTest)  Time elapsed: 1.156 s
07:36:16 testObservableList(org.eclipse.papyrus.uml.properties.databinding.tests.OwnedCommentsObservableListTest)  Time elapsed: 1.291 s
07:36:16 testObservableList(org.eclipse.papyrus.uml.properties.databinding.tests.ProvidedInterfaceObservableListTest)  Time elapsed: 1.01 s
07:36:16 testObservableList(org.eclipse.papyrus.uml.properties.databinding.tests.RequiredInterfaceObservableListTest)  Time elapsed: 0.879 s
07:36:16 testObservableList(org.eclipse.papyrus.uml.properties.databinding.tests.ProfileApplicationObservableListTest)  Time elapsed: 0.749 s
07:36:16 testObservableList(org.eclipse.papyrus.uml.properties.databinding.tests.StereotypeApplicationObservableListTest)  Time elapsed: 0.639 s
07:36:16 testObservableList(org.eclipse.papyrus.uml.properties.databinding.tests.BasicObservableListTest)  Time elapsed: 0.591 s
07:36:16 testObservableValue(org.eclipse.papyrus.uml.diagram.properties.databinding.tests.CanonicalObservableValueTest)  Time elapsed: 1.15 s
07:36:16 testObservableValue(org.eclipse.papyrus.uml.diagram.properties.databinding.tests.ConnectionDecorationStyleObservableValueTest)  Time elapsed: 1.433 s
07:36:16 testObservableValue(org.eclipse.papyrus.uml.diagram.properties.databinding.tests.CustomStringStyleCompartmentObservableValueTest)  Time elapsed: 1.109 s
07:36:16 testObservableValue(org.eclipse.papyrus.uml.diagram.properties.databinding.tests.CustomIntStyleCompartmentObservableValueTest)  Time elapsed: 1.033 s
07:36:16 testObservableValue(org.eclipse.papyrus.uml.diagram.properties.databinding.tests.DiagramLabelObservableValueTest)  Time elapsed: 0.955 s
07:36:16 testObservableValue(org.eclipse.papyrus.uml.diagram.properties.databinding.tests.CustomBooleanStyleWithStoreObservableValueTest)  Time elapsed: 1.397 s
07:36:16 testObservableValue(org.eclipse.papyrus.uml.diagram.properties.databinding.tests.CustomDoubleStyleWithStoreObservableValueTest)  Time elapsed: 1.179 s
07:36:16 testObservableValue(org.eclipse.papyrus.uml.diagram.properties.databinding.tests.CustomIntStyleWithStoreObservableValueTest)  Time elapsed: 1.038 s
07:36:16 testObservableValue(org.eclipse.papyrus.uml.diagram.properties.databinding.tests.RulersUnitStyleObservableValueTest)  Time elapsed: 0.902 s
07:36:16 testObservableValue(org.eclipse.papyrus.uml.diagram.properties.databinding.tests.SwitchOrientationObservableValueTest)  Time elapsed: 1.51 s
07:36:16 outOfDateModelSkipMigration_papyrus(org.eclipse.papyrus.uml.profile.service.ReapplyProfilesServiceTest)  Time elapsed: 1.003 s
07:36:16 upToDateModelDoesNotPromptForMigration_papyrus(org.eclipse.papyrus.uml.profile.service.ReapplyProfilesServiceTest)  Time elapsed: 0.874 s
07:36:16 outOfDateModelDoMigration_dynamic(org.eclipse.papyrus.uml.profile.service.ReapplyProfilesServiceTest)  Time elapsed: 1.21 s
07:36:16 outOfDateModelSkipMigration_uml2(org.eclipse.papyrus.uml.profile.service.ReapplyProfilesServiceTest)  Time elapsed: 1.096 s
07:36:16 outOfDateModelDoMigration_papyrus(org.eclipse.papyrus.uml.profile.service.ReapplyProfilesServiceTest)  Time elapsed: 1.711 s
07:36:16 outOfDateModelSkipMigration_dynamic(org.eclipse.papyrus.uml.profile.service.ReapplyProfilesServiceTest)  Time elapsed: 1.03 s
07:36:16 outOfDateModelDoMigration_uml2(org.eclipse.papyrus.uml.profile.service.ReapplyProfilesServiceTest)  Time elapsed: 1.774 s
07:36:16 upToDateModelDoesNotPromptForMigration_uml2(org.eclipse.papyrus.uml.profile.service.ReapplyProfilesServiceTest)  Time elapsed: 0.967 s
07:36:16 upToDateModelDoesNotPromptForMigration_dynamic(org.eclipse.papyrus.uml.profile.service.ReapplyProfilesServiceTest)  Time elapsed: 0.773 s
07:36:16 loadDecoratorAsMainModel(org.eclipse.papyrus.uml.decoratormodel.tests.ExternalizeProfileApplicationTest)  Time elapsed: 0.521 s
07:36:16 externalizeApplication(org.eclipse.papyrus.uml.decoratormodel.tests.ExternalizeProfileApplicationTest)  Time elapsed: 0.61 s
07:36:16 unloadApplication(org.eclipse.papyrus.uml.decoratormodel.tests.ExternalizeProfileApplicationTest)  Time elapsed: 0.479 s
07:36:16 externalizeApplication_undo(org.eclipse.papyrus.uml.decoratormodel.tests.ExternalizeProfileApplicationTest)  Time elapsed: 0.63 s
07:36:16 unloadedApplicationNotAvailable(org.eclipse.papyrus.uml.decoratormodel.tests.ExternalizeProfileApplicationTest)  Time elapsed: 0.441 s
07:36:16 loadApplication(org.eclipse.papyrus.uml.decoratormodel.tests.ExternalizeProfileApplicationTest)  Time elapsed: 0.51 s
07:36:16 externalizeApplication_undo_redo(org.eclipse.papyrus.uml.decoratormodel.tests.ExternalizeProfileApplicationTest)  Time elapsed: 0.519 s
07:36:16 nestedPackageApplicationOfSameProfile_bug459613(org.eclipse.papyrus.uml.decoratormodel.tests.ExternalizeProfileApplicationTest)  Time elapsed: 0.593 s
07:36:16 externalizeApplication_forNestedPackage(org.eclipse.papyrus.uml.decoratormodel.tests.ExternalizeProfileApplicationTest)  Time elapsed: 0.602 s
07:36:16 internalizeApplication_undo(org.eclipse.papyrus.uml.decoratormodel.tests.InternalizeProfileApplicationTest)  Time elapsed: 0.396 s
07:36:16 internalizeApplication_undo_redo(org.eclipse.papyrus.uml.decoratormodel.tests.InternalizeProfileApplicationTest)  Time elapsed: 0.498 s
07:36:16 internalizeApplication(org.eclipse.papyrus.uml.decoratormodel.tests.InternalizeProfileApplicationTest)  Time elapsed: 0.616 s
07:36:16 migrateProfile(org.eclipse.papyrus.uml.decoratormodel.tests.ProfileMigrationTest)  Time elapsed: 0.415 s
07:36:16 missingSchema(org.eclipse.papyrus.uml.decoratormodel.tests.StereotypeApplicationRepairTest)  Time elapsed: 0.401 s
07:36:16 wrongProfileVersion(org.eclipse.papyrus.uml.decoratormodel.tests.StereotypeApplicationRepairTest)  Time elapsed: 0.412 s
07:36:16 missingProfileApplication(org.eclipse.papyrus.uml.decoratormodel.tests.StereotypeApplicationRepairTest)  Time elapsed: 0.383 s
07:36:16 decoratorModelsForPackageAsync(org.eclipse.papyrus.uml.decoratormodel.internal.resource.tests.DecoratorModelIndexTest)  Time elapsed: 0.572 s
07:36:16 decoratorModelsForPackage_none(org.eclipse.papyrus.uml.decoratormodel.internal.resource.tests.DecoratorModelIndexTest)  Time elapsed: 0.538 s
07:36:16 removeResource(org.eclipse.papyrus.uml.decoratormodel.internal.resource.tests.DecoratorModelIndexTest)  Time elapsed: 0.581 s
07:36:16 decoratorModelsAsync_uri(org.eclipse.papyrus.uml.decoratormodel.internal.resource.tests.DecoratorModelIndexTest)  Time elapsed: 0.483 s
07:36:16 decoratorModelName(org.eclipse.papyrus.uml.decoratormodel.internal.resource.tests.DecoratorModelIndexTest)  Time elapsed: 0.515 s
07:36:16 baseline(org.eclipse.papyrus.uml.decoratormodel.internal.resource.tests.DecoratorModelIndexTest)  Time elapsed: 0.496 s
07:36:16 decoratorModelsForPackage(org.eclipse.papyrus.uml.decoratormodel.internal.resource.tests.DecoratorModelIndexTest)  Time elapsed: 0.522 s
07:36:16 decoratorModelNameAsync(org.eclipse.papyrus.uml.decoratormodel.internal.resource.tests.DecoratorModelIndexTest)  Time elapsed: 0.62 s
07:36:16 appliedProfilesByResourceIndex(org.eclipse.papyrus.uml.decoratormodel.internal.resource.tests.DecoratorModelIndexTest)  Time elapsed: 0.512 s
07:36:16 decoratorModels(org.eclipse.papyrus.uml.decoratormodel.internal.resource.tests.DecoratorModelIndexTest)  Time elapsed: 0.548 s
07:36:16 decoratorModelsAsync(org.eclipse.papyrus.uml.decoratormodel.internal.resource.tests.DecoratorModelIndexTest)  Time elapsed: 0.581 s
07:36:16 allAppliedProfiles(org.eclipse.papyrus.uml.decoratormodel.internal.resource.tests.DecoratorModelIndexTest)  Time elapsed: 0.578 s
07:36:16 decoratorModelNames(org.eclipse.papyrus.uml.decoratormodel.internal.resource.tests.DecoratorModelIndexTest)  Time elapsed: 0.657 s
07:36:16 decoratorModels_uri(org.eclipse.papyrus.uml.decoratormodel.internal.resource.tests.DecoratorModelIndexTest)  Time elapsed: 0.609 s
07:36:16 decoratorModelNamesAsync(org.eclipse.papyrus.uml.decoratormodel.internal.resource.tests.DecoratorModelIndexTest)  Time elapsed: 0.533 s
07:36:16 listener(org.eclipse.papyrus.uml.decoratormodel.internal.resource.tests.DecoratorModelIndexTest)  Time elapsed: 1.187 s
07:36:16 allAppliedProfilesAsync(org.eclipse.papyrus.uml.decoratormodel.internal.resource.tests.DecoratorModelIndexTest)  Time elapsed: 0.559 s
07:36:16 addNewResource(org.eclipse.papyrus.uml.decoratormodel.internal.resource.tests.DecoratorModelIndexTest)  Time elapsed: 1.331 s
07:36:16 decoratorModelsForPackageAsync_none(org.eclipse.papyrus.uml.decoratormodel.internal.resource.tests.DecoratorModelIndexTest)  Time elapsed: 0.6 s
07:36:16 copy_subsetOfProfiles(org.eclipse.papyrus.uml.decoratormodel.internal.resource.tests.DecoratorModelCopierTest)  Time elapsed: 0.868 s
07:36:16 copy_allProfiles(org.eclipse.papyrus.uml.decoratormodel.internal.resource.tests.DecoratorModelCopierTest)  Time elapsed: 0.75 s
07:36:16 testHasUnloadedDecoratorModelsAsync_recursive(org.eclipse.papyrus.uml.decoratormodel.helper.tests.DecoratorModelUtilsTest)  Time elapsed: 0.723 s
07:36:16 testIsDecoratorModelFor(org.eclipse.papyrus.uml.decoratormodel.helper.tests.DecoratorModelUtilsTest)  Time elapsed: 0.42 s
07:36:16 testIsDecoratorModelURI(org.eclipse.papyrus.uml.decoratormodel.helper.tests.DecoratorModelUtilsTest)  Time elapsed: 0.42 s
07:36:16 testInternalizeProfileApplications(org.eclipse.papyrus.uml.decoratormodel.helper.tests.DecoratorModelUtilsTest)  Time elapsed: 0.663 s
07:36:16 testHasUnloadedDecoratorModelsAsync(org.eclipse.papyrus.uml.decoratormodel.helper.tests.DecoratorModelUtilsTest)  Time elapsed: 0.476 s
07:36:16 testExternalizeProfileApplication(org.eclipse.papyrus.uml.decoratormodel.helper.tests.DecoratorModelUtilsTest)  Time elapsed: 0.491 s
07:36:16 testGetDecoratorPackages(org.eclipse.papyrus.uml.decoratormodel.helper.tests.DecoratorModelUtilsTest)  Time elapsed: 0.459 s
07:36:16 testGetDecoratorModelAppliedProfiles(org.eclipse.papyrus.uml.decoratormodel.helper.tests.DecoratorModelUtilsTest)  Time elapsed: 0.434 s
07:36:16 testGetUnloadedDecoratorModelsAsyncResource(org.eclipse.papyrus.uml.decoratormodel.helper.tests.DecoratorModelUtilsTest)  Time elapsed: 0.597 s
07:36:16 testGetExternalizationProfile(org.eclipse.papyrus.uml.decoratormodel.helper.tests.DecoratorModelUtilsTest)  Time elapsed: 0.392 s
07:36:16 testIsDecoratorModelResource(org.eclipse.papyrus.uml.decoratormodel.helper.tests.DecoratorModelUtilsTest)  Time elapsed: 0.483 s
07:36:16 testGetDecoratorModelProfileApplications(org.eclipse.papyrus.uml.decoratormodel.helper.tests.DecoratorModelUtilsTest)  Time elapsed: 0.452 s
07:36:16 testGetUnloadedDecoratorModelsAsyncPackage(org.eclipse.papyrus.uml.decoratormodel.helper.tests.DecoratorModelUtilsTest)  Time elapsed: 0.535 s
07:36:16 testGetLoadedDecoratorModels(org.eclipse.papyrus.uml.decoratormodel.helper.tests.DecoratorModelUtilsTest)  Time elapsed: 0.525 s
07:36:16 testGetLoadedSubUnitPackages(org.eclipse.papyrus.uml.decoratormodel.helper.tests.DecoratorModelUtilsTest)  Time elapsed: 0.44 s
07:36:16 testGetUnloadedDecoratorModels(org.eclipse.papyrus.uml.decoratormodel.helper.tests.DecoratorModelUtilsTest)  Time elapsed: 0.567 s
07:36:16 testHasExternalizationProfile(org.eclipse.papyrus.uml.decoratormodel.helper.tests.DecoratorModelUtilsTest)  Time elapsed: 0.449 s
07:36:16 testGetUnloadedDecoratorModelsAsyncIterableOfResource(org.eclipse.papyrus.uml.decoratormodel.helper.tests.DecoratorModelUtilsTest)  Time elapsed: 1.005 s
07:36:16 testGetUserModelResources(org.eclipse.papyrus.uml.decoratormodel.helper.tests.DecoratorModelUtilsTest)  Time elapsed: 0.432 s
07:36:16 testGetDecoratorProfileApplications(org.eclipse.papyrus.uml.decoratormodel.helper.tests.DecoratorModelUtilsTest)  Time elapsed: 0.449 s
07:36:16 stereotypeApplication_inNestedPackage(org.eclipse.papyrus.uml.decoratormodel.helper.tests.PapyrusStereotypeApplicationHelperTest)  Time elapsed: 0.149 s
07:36:16 stereotypeApplication_inNonPackageSubmodelUnit_bug459613(org.eclipse.papyrus.uml.decoratormodel.helper.tests.PapyrusStereotypeApplicationHelperTest)  Time elapsed: 0.145 s
07:36:16 applyStereotype_resourceSet(org.eclipse.papyrus.uml.decoratormodel.helper.tests.PapyrusStereotypeApplicationHelperTest)  Time elapsed: 0.144 s
07:36:16 applyStereotype_freeFloating(org.eclipse.papyrus.uml.decoratormodel.helper.tests.PapyrusStereotypeApplicationHelperTest)  Time elapsed: 0.143 s
07:36:16 isDecoratorModel_decoratorModelUML(org.eclipse.papyrus.uml.decoratormodel.internal.expressions.tests.FilePropertyTesterTest)  Time elapsed: 0.284 s
07:36:16 isDecoratorModel_decoratorModelNotation(org.eclipse.papyrus.uml.decoratormodel.internal.expressions.tests.FilePropertyTesterTest)  Time elapsed: 0.367 s
07:36:16 isDecoratorModel_userModelUML(org.eclipse.papyrus.uml.decoratormodel.internal.expressions.tests.FilePropertyTesterTest)  Time elapsed: 0.313 s
07:36:16 decoratorIndexing(org.eclipse.papyrus.uml.decoratormodel.internal.resource.index.tests.ProfileIndexTest)  Time elapsed: 0.402 s
07:36:16 userModelIndexing(org.eclipse.papyrus.uml.decoratormodel.internal.resource.index.tests.ProfileIndexTest)  Time elapsed: 0 s
07:36:16 decoratorAsUserModelIndexing(org.eclipse.papyrus.uml.decoratormodel.internal.resource.index.tests.ProfileIndexTest)  Time elapsed: 0 s
07:36:16 migrateProfileExtendingDynamic_bug481302(org.eclipse.papyrus.uml.decoratormodel.tests.RegressionTest)  Time elapsed: 0.485 s
07:36:16 basicUMLMigrateProfileExtendingStatic_bug481302(org.eclipse.papyrus.uml.decoratormodel.tests.RegressionTest) skipped
07:36:16 migrateProfileExtendingStatic_bug481302(org.eclipse.papyrus.uml.decoratormodel.tests.RegressionTest)  Time elapsed: 0.359 s
07:36:16 control_undo_redo_allDecoratorsLoaded(org.eclipse.papyrus.uml.decoratormodel.controlmode.tests.ControlModeWithDecoratorModelsTest)  Time elapsed: 1.252 s
07:36:16 uncontrol_undo_redo_allDecoratorsUnloaded(org.eclipse.papyrus.uml.decoratormodel.controlmode.tests.ControlModeWithDecoratorModelsTest)  Time elapsed: 2.796 s
07:36:16 control_someDecoratorsLoaded(org.eclipse.papyrus.uml.decoratormodel.controlmode.tests.ControlModeWithDecoratorModelsTest)  Time elapsed: 1.364 s
07:36:16 uncontrol_someDecoratorsLoaded(org.eclipse.papyrus.uml.decoratormodel.controlmode.tests.ControlModeWithDecoratorModelsTest)  Time elapsed: 1.781 s
07:36:16 uncontrol_allDecoratorsUnloaded(org.eclipse.papyrus.uml.decoratormodel.controlmode.tests.ControlModeWithDecoratorModelsTest)  Time elapsed: 2.069 s
07:36:16 control_undo_redo_someDecoratorsLoaded(org.eclipse.papyrus.uml.decoratormodel.controlmode.tests.ControlModeWithDecoratorModelsTest)  Time elapsed: 3.109 s
07:36:16 control_allDecoratorsLoaded(org.eclipse.papyrus.uml.decoratormodel.controlmode.tests.ControlModeWithDecoratorModelsTest)  Time elapsed: 0.992 s
07:36:16 control_undo_redo_allDecoratorsUnloaded(org.eclipse.papyrus.uml.decoratormodel.controlmode.tests.ControlModeWithDecoratorModelsTest)  Time elapsed: 2.818 s
07:36:16 control_allDecoratorsUnloaded(org.eclipse.papyrus.uml.decoratormodel.controlmode.tests.ControlModeWithDecoratorModelsTest)  Time elapsed: 1.559 s
07:36:16 uncontrol_undo_redo_someDecoratorsLoaded(org.eclipse.papyrus.uml.decoratormodel.controlmode.tests.ControlModeWithDecoratorModelsTest)  Time elapsed: 2.616 s
07:36:16 uncontrol_undo_redo_allDecoratorsLoaded(org.eclipse.papyrus.uml.decoratormodel.controlmode.tests.ControlModeWithDecoratorModelsTest)  Time elapsed: 0.697 s
07:36:16 uncontrol_allDecoratorsLoaded(org.eclipse.papyrus.uml.decoratormodel.controlmode.tests.ControlModeWithDecoratorModelsTest)  Time elapsed: 0.716 s
07:36:16 nonBaseElementStereotypeCrossReferences(org.eclipse.papyrus.uml.decoratormodel.controlmode.tests.AdditionalModelStructuresTest)  Time elapsed: 0.945 s
07:36:16 classUnitExternalizeParentUnitProfileApplication_bug459613(org.eclipse.papyrus.uml.decoratormodel.controlmode.tests.AdditionalModelStructuresTest)  Time elapsed: 0.465 s
07:36:16 nestedPackagesInheritingExternalProfileApplications(org.eclipse.papyrus.uml.decoratormodel.controlmode.tests.AdditionalModelStructuresTest)  Time elapsed: 1.533 s
07:36:16 validateOCLOnInstanceSpec(org.eclipse.papyrus.uml.validation.tests.rules.TestOCLConstraintOnInstanceSpec)  Time elapsed: 5.196 s
07:36:16 validateCamelCaseRule(org.eclipse.papyrus.uml.validation.tests.rules.TestOCLValidationRuleFromFile)  Time elapsed: 1.006 s
07:36:16 validateIsActiveOCLRule_inactiveClass(org.eclipse.papyrus.uml.validation.tests.rules.TestValidationRulesInPluginXML)  Time elapsed: 1.895 s
07:36:16 validateIsPassiveJavaRule_inactiveClass(org.eclipse.papyrus.uml.validation.tests.rules.TestValidationRulesInPluginXML)  Time elapsed: 1.32 s
07:36:16 validateIsPassiveJavaRule_activeClass(org.eclipse.papyrus.uml.validation.tests.rules.TestValidationRulesInPluginXML)  Time elapsed: 1.439 s
07:36:16 validateMalformedActiveRule_notActiveCapsule(org.eclipse.papyrus.uml.validation.tests.rules.TestValidationRulesInProfile)  Time elapsed: 1.848 s
07:36:16 validateIsActiveRule_notActiveCapsule(org.eclipse.papyrus.uml.validation.tests.rules.TestValidationRulesInProfile)  Time elapsed: 1.443 s
07:36:16 validateIsActiveRule_ActiveCapsule(org.eclipse.papyrus.uml.validation.tests.rules.TestValidationRulesInProfile)  Time elapsed: 1.595 s
07:36:16 validateNameClashDetection(org.eclipse.papyrus.uml.validation.tests.rules.TestUMLValidationRules)  Time elapsed: 1.548 s
07:36:16 validateNonStandardMultiplicity(org.eclipse.papyrus.uml.validation.tests.rules.TestUMLValidationRules)  Time elapsed: 1.074 s
07:36:16 validateUnsetStereotypeAttribute(org.eclipse.papyrus.uml.validation.tests.rules.TestStereotypeValidation)  Time elapsed: 1.411 s
07:36:16 testResolveProfile__Object(org.eclipse.papyrus.uml.filters.tests.ProfileAppliedTest)  Time elapsed: 0.034 s
07:36:16 testMatches__Object(org.eclipse.papyrus.uml.filters.tests.ProfileAppliedTest)  Time elapsed: 0.012 s
07:36:16 profileAppliedFilterResourceURI_bug480221(org.eclipse.papyrus.uml.filters.tests.ProfileAppliedRegressionTest)  Time elapsed: 0.024 s
07:36:16 profileAppliedFilterDoesNotLoadProfiles_miss_bug480221(org.eclipse.papyrus.uml.filters.tests.ProfileAppliedRegressionTest)  Time elapsed: 0.023 s
07:36:16 profileAppliedFilterDoesNotLoadProfiles_hit_bug480221(org.eclipse.papyrus.uml.filters.tests.ProfileAppliedRegressionTest)  Time elapsed: 0.024 s
07:36:16 popupsGenerated(org.eclipse.papyrus.uml.profile.assistants.generator.tests.BasicAssistantsGenerationTest)  Time elapsed: 0.011 s
07:36:16 connectionTargetFilters(org.eclipse.papyrus.uml.profile.assistants.generator.tests.BasicAssistantsGenerationTest)  Time elapsed: 0.003 s
07:36:16 popupFilters(org.eclipse.papyrus.uml.profile.assistants.generator.tests.BasicAssistantsGenerationTest)  Time elapsed: 0.001 s
07:36:16 connectionSourceFilters(org.eclipse.papyrus.uml.profile.assistants.generator.tests.BasicAssistantsGenerationTest)  Time elapsed: 0 s
07:36:16 connectionsGenerated(org.eclipse.papyrus.uml.profile.assistants.generator.tests.BasicAssistantsGenerationTest)  Time elapsed: 0 s
07:36:16 popupsGenerated(org.eclipse.papyrus.uml.profile.assistants.generator.tests.DiagramSpecificAssistantsGenerationTest)  Time elapsed: 0.026 s
07:36:16 connectionTargetFilters(org.eclipse.papyrus.uml.profile.assistants.generator.tests.DiagramSpecificAssistantsGenerationTest)  Time elapsed: 0.003 s
07:36:16 distinctConnectionHintsGenerated(org.eclipse.papyrus.uml.profile.assistants.generator.tests.DiagramSpecificAssistantsGenerationTest)  Time elapsed: 0.001 s
07:36:16 popupFilters(org.eclipse.papyrus.uml.profile.assistants.generator.tests.DiagramSpecificAssistantsGenerationTest)  Time elapsed: 0.001 s
07:36:16 connectionSourceFilters(org.eclipse.papyrus.uml.profile.assistants.generator.tests.DiagramSpecificAssistantsGenerationTest)  Time elapsed: 0 s
07:36:16 distinctPopupHintsGenerated(org.eclipse.papyrus.uml.profile.assistants.generator.tests.DiagramSpecificAssistantsGenerationTest)  Time elapsed: 0.001 s
07:36:16 connectionsGenerated(org.eclipse.papyrus.uml.profile.assistants.generator.tests.DiagramSpecificAssistantsGenerationTest)  Time elapsed: 0 s
07:36:16 popupsGenerated(org.eclipse.papyrus.uml.profile.assistants.generator.tests.ProfilesWithPackageNestingTest)  Time elapsed: 0.006 s
07:36:16 connectionTargetFilters(org.eclipse.papyrus.uml.profile.assistants.generator.tests.ProfilesWithPackageNestingTest)  Time elapsed: 0.005 s
07:36:16 popupFilters(org.eclipse.papyrus.uml.profile.assistants.generator.tests.ProfilesWithPackageNestingTest)  Time elapsed: 0.001 s
07:36:16 connectionSourceFilters(org.eclipse.papyrus.uml.profile.assistants.generator.tests.ProfilesWithPackageNestingTest)  Time elapsed: 0 s
07:36:16 connectionsGenerated(org.eclipse.papyrus.uml.profile.assistants.generator.tests.ProfilesWithPackageNestingTest)  Time elapsed: 0 s
07:36:16 connectionsGenerated[<<Indirect>> Generalization](org.eclipse.papyrus.uml.profile.assistants.generator.tests.ConnectionTypesTest)  Time elapsed: 0.003 s
07:36:16 connectionsGenerated[<<Indirect>> GeneralizationSet](org.eclipse.papyrus.uml.profile.assistants.generator.tests.ConnectionTypesTest)  Time elapsed: 0 s
07:36:16 connectionsGenerated[<<Virtual>> ControlFlow](org.eclipse.papyrus.uml.profile.assistants.generator.tests.ConnectionTypesTest)  Time elapsed: 0 s
07:36:16 connectionsGenerated[<<Virtual>> ObjectFlow](org.eclipse.papyrus.uml.profile.assistants.generator.tests.ConnectionTypesTest)  Time elapsed: 0 s
07:36:16 connectionsGenerated[<<Virtual>> Transition](org.eclipse.papyrus.uml.profile.assistants.generator.tests.ConnectionTypesTest)  Time elapsed: 0 s
07:36:16 connectionsGenerated[<<Virtual>> Message](org.eclipse.papyrus.uml.profile.assistants.generator.tests.ConnectionTypesTest)  Time elapsed: 0 s
07:36:16 connectionsGenerated[<<Indirect>> Connector](org.eclipse.papyrus.uml.profile.assistants.generator.tests.ConnectionTypesTest)  Time elapsed: 0 s
07:36:16 iconGenerated(org.eclipse.papyrus.uml.profile.types.generator.tests.BasicElementTypesGenerationTest)  Time elapsed: 0.011 s
07:36:16 elementTypeSpecializedTypes_bug461717(org.eclipse.papyrus.uml.profile.types.generator.tests.BasicElementTypesGenerationTest)  Time elapsed: 0.011 s
07:36:16 multipleElementTypesForOneStereotypeGenerated(org.eclipse.papyrus.uml.profile.types.generator.tests.BasicElementTypesGenerationTest)  Time elapsed: 0.001 s
07:36:16 stereotypeAdviceGenerated(org.eclipse.papyrus.uml.profile.types.generator.tests.BasicElementTypesGenerationTest)  Time elapsed: 0 s
07:36:16 elementTypesGenerated(org.eclipse.papyrus.uml.profile.types.generator.tests.BasicElementTypesGenerationTest)  Time elapsed: 0 s
07:36:16 stereotypeMatcherGenerated(org.eclipse.papyrus.uml.profile.types.generator.tests.BasicElementTypesGenerationTest)  Time elapsed: 0 s
07:36:16 stereotypeAdviceNotGenerated(org.eclipse.papyrus.uml.profile.types.generator.tests.DiagramSpecificElementTypesGenerationTest)  Time elapsed: 0.003 s
07:36:16 distinctHintsGenerated(org.eclipse.papyrus.uml.profile.types.generator.tests.DiagramSpecificElementTypesGenerationTest)  Time elapsed: 0.002 s
07:36:16 stereotypeMatcherNotGenerated(org.eclipse.papyrus.uml.profile.types.generator.tests.DiagramSpecificElementTypesGenerationTest)  Time elapsed: 0 s
07:36:16 iconGenerated(org.eclipse.papyrus.uml.profile.types.generator.tests.DiagramSpecificElementTypesGenerationTest)  Time elapsed: 0.001 s
07:36:16 elementTypeSpecializedTypes_bug461717(org.eclipse.papyrus.uml.profile.types.generator.tests.DiagramSpecificElementTypesGenerationTest)  Time elapsed: 0.019 s
07:36:16 elementTypesGenerated(org.eclipse.papyrus.uml.profile.types.generator.tests.DiagramSpecificElementTypesGenerationTest)  Time elapsed: 0 s
07:36:16 iconGenerated(org.eclipse.papyrus.uml.profile.types.generator.tests.ProfilesWithPackageNestingTest)  Time elapsed: 0.002 s
07:36:16 stereotypeAdviceGenerated(org.eclipse.papyrus.uml.profile.types.generator.tests.ProfilesWithPackageNestingTest)  Time elapsed: 0.001 s
07:36:16 elementTypesGenerated(org.eclipse.papyrus.uml.profile.types.generator.tests.ProfilesWithPackageNestingTest)  Time elapsed: 0 s
07:36:16 stereotypeMatcherGenerated(org.eclipse.papyrus.uml.profile.types.generator.tests.ProfilesWithPackageNestingTest)  Time elapsed: 0 s
07:36:16 elementTypeSpecializedTypes(org.eclipse.papyrus.uml.profile.types.generator.tests.DiagramSpecificElementTypesGenerationBug461717Test)  Time elapsed: 0.02 s
07:36:16 stereotypeAdviceGenerated(org.eclipse.papyrus.uml.profile.types.generator.tests.DiagramSpecificElementTypesGenerationBug461717Test)  Time elapsed: 0.001 s
07:36:16 stereotypeMatcherGenerated(org.eclipse.papyrus.uml.profile.types.generator.tests.DiagramSpecificElementTypesGenerationBug461717Test)  Time elapsed: 0 s
07:36:16 testGetStereotypeNames(org.eclipse.papyrus.uml.profile.drafter.tests.ProfileCatalogTest)  Time elapsed: 0.042 s
07:36:16 testGetStereotypes(org.eclipse.papyrus.uml.profile.drafter.tests.ProfileCatalogTest)  Time elapsed: 0.069 s
07:36:16 testGetAllStereotypeNames(org.eclipse.papyrus.uml.profile.drafter.tests.ProfileCatalogTest) skipped
07:36:16 testGetProfileNames(org.eclipse.papyrus.uml.profile.drafter.tests.ProfileCatalogTest)  Time elapsed: 0.062 s
07:36:16 testProfileCatalog(org.eclipse.papyrus.uml.profile.drafter.tests.ProfileCatalogTest)  Time elapsed: 0.085 s
07:36:16 testLookupStereotype(org.eclipse.papyrus.uml.profile.drafter.tests.ProfileCatalogTest)  Time elapsed: 0.158 s
07:36:16 testLookupStereotypeInAppliedProfile(org.eclipse.papyrus.uml.profile.drafter.tests.ProfileCatalogTest)  Time elapsed: 0.083 s
07:36:16 testProfileCopy(org.eclipse.papyrus.uml.profile.drafter.tests.ProfileCatalogTest)  Time elapsed: 0.104 s
07:36:16 testGetProfiles(org.eclipse.papyrus.uml.profile.drafter.tests.ProfileCatalogTest)  Time elapsed: 0.081 s
07:36:16 testGetNamedElement(org.eclipse.papyrus.uml.profile.drafter.tests.ProfileCatalogTest)  Time elapsed: 0.036 s
07:36:16 testIsModelsExist(org.eclipse.papyrus.uml.profile.drafter.tests.ProfileCatalogTest)  Time elapsed: 0.08 s
07:36:16 testGetStereotypeQualifiedNames(org.eclipse.papyrus.uml.profile.drafter.tests.ProfileCatalogTest)  Time elapsed: 0.059 s
07:36:16 testGetProfileQualifiedNames(org.eclipse.papyrus.uml.profile.drafter.tests.ProfileCatalogTest)  Time elapsed: 0.057 s
07:36:16 testCopyResources(org.eclipse.papyrus.uml.profile.drafter.tests.EclipseProjectTest)  Time elapsed: 0.005 s
07:36:16 testCopyResource(org.eclipse.papyrus.uml.profile.drafter.tests.EclipseProjectTest)  Time elapsed: 0.002 s
07:36:16 testGetProject(org.eclipse.papyrus.uml.profile.drafter.tests.EclipseProjectTest)  Time elapsed: 0 s
07:36:16 testEclipseProject(org.eclipse.papyrus.uml.profile.drafter.tests.EclipseProjectTest)  Time elapsed: 0 s
07:36:16 testGetUmlModelWithIFile(org.eclipse.papyrus.uml.profile.drafter.tests.ModelSetManagerTest)  Time elapsed: 0.069 s
07:36:16 testModelSetManagerString(org.eclipse.papyrus.uml.profile.drafter.tests.ModelSetManagerTest)  Time elapsed: 0.004 s
07:36:16 testModelSetManagerURI(org.eclipse.papyrus.uml.profile.drafter.tests.ModelSetManagerTest)  Time elapsed: 0.003 s
07:36:16 testGetNamedElementByNameString(org.eclipse.papyrus.uml.profile.drafter.tests.ModelSetManagerTest)  Time elapsed: 0.004 s
07:36:16 testGetUmlModel(org.eclipse.papyrus.uml.profile.drafter.tests.ModelSetManagerTest)  Time elapsed: 0.013 s
07:36:16 testModelSetManagerStringModels(org.eclipse.papyrus.uml.profile.drafter.tests.ModelSetManagerTest)  Time elapsed: 0.002 s
07:36:16 testGetNamedElementByNameWithSterotype(org.eclipse.papyrus.uml.profile.drafter.tests.ModelSetManagerTest)  Time elapsed: 0.027 s
07:36:16 testCreation(org.eclipse.papyrus.uml.profile.drafter.tests.utils.UMLModelCreatorTest)  Time elapsed: 0.003 s
07:36:16 testCreateClass(org.eclipse.papyrus.uml.profile.drafter.tests.utils.UMLModelCreatorTest)  Time elapsed: 0 s
07:36:16 testCreateModel(org.eclipse.papyrus.uml.profile.drafter.tests.utils.UMLModelCreatorTest)  Time elapsed: 0 s
07:36:16 testCreatePackage(org.eclipse.papyrus.uml.profile.drafter.tests.utils.UMLModelCreatorTest)  Time elapsed: 0 s
07:36:16 testCd(org.eclipse.papyrus.uml.profile.drafter.tests.utils.UMLModelCreatorTest)  Time elapsed: 0.001 s
07:36:16 testUMLModelCreatorResourceFailing(org.eclipse.papyrus.uml.profile.drafter.tests.utils.UMLModelCreatorTest)  Time elapsed: 0 s
07:36:16 testUMLModelCreatorStringString(org.eclipse.papyrus.uml.profile.drafter.tests.utils.UMLModelCreatorTest)  Time elapsed: 0 s
07:36:16 testUMLModelCreatorResource(org.eclipse.papyrus.uml.profile.drafter.tests.utils.UMLModelCreatorTest)  Time elapsed: 0.001 s
07:36:16 testCreateDatatype(org.eclipse.papyrus.uml.profile.drafter.tests.utils.UMLModelCreatorTest)  Time elapsed: 0 s
07:36:16 testCompoundTypeProvider(org.eclipse.papyrus.uml.profile.drafter.ui.model.CompoundTypeProviderTest)  Time elapsed: 0.001 s
07:36:16 testGetTypes(org.eclipse.papyrus.uml.profile.drafter.ui.model.CompoundTypeProviderTest)  Time elapsed: 0 s
07:36:16 testAddITypeProvider(org.eclipse.papyrus.uml.profile.drafter.ui.model.CompoundTypeProviderTest)  Time elapsed: 0 s
07:36:16 testIterator(org.eclipse.papyrus.uml.profile.drafter.ui.model.CompoundTypeProviderTest)  Time elapsed: 0 s
07:36:16 testVisitMetaclassesModel(org.eclipse.papyrus.uml.profile.drafter.ui.model.SimpleModelVisitorTest) skipped
07:36:16 testVisitPropertyModel(org.eclipse.papyrus.uml.profile.drafter.ui.model.SimpleModelVisitorTest) skipped
07:36:16 testSimpleModelVisitor(org.eclipse.papyrus.uml.profile.drafter.ui.model.SimpleModelVisitorTest)  Time elapsed: 0.001 s
07:36:16 testDoVisitStereoptypeModel(org.eclipse.papyrus.uml.profile.drafter.ui.model.SimpleModelVisitorTest) skipped
07:36:16 testDoVisitPropertyModel(org.eclipse.papyrus.uml.profile.drafter.ui.model.SimpleModelVisitorTest) skipped
07:36:16 testVisitStereoptypeModel(org.eclipse.papyrus.uml.profile.drafter.ui.model.SimpleModelVisitorTest) skipped
07:36:16 testDoVisitMetaclassesModel(org.eclipse.papyrus.uml.profile.drafter.ui.model.SimpleModelVisitorTest) skipped
07:36:16 testSetStereotypeName(org.eclipse.papyrus.uml.profile.drafter.ui.model.StereotypeURLTest)  Time elapsed: 0.016 s
07:36:16 testGetProfileName(org.eclipse.papyrus.uml.profile.drafter.ui.model.StereotypeURLTest)  Time elapsed: 0 s
07:36:16 testAddPropertyChangeListenerPropertyChangeListener(org.eclipse.papyrus.uml.profile.drafter.ui.model.StereotypeURLTest)  Time elapsed: 0.001 s
07:36:16 testSetQualifiedNameComplex(org.eclipse.papyrus.uml.profile.drafter.ui.model.StereotypeURLTest)  Time elapsed: 0 s
07:36:16 testClear(org.eclipse.papyrus.uml.profile.drafter.ui.model.StereotypeURLTest)  Time elapsed: 0 s
07:36:16 testStereotypeURLString(org.eclipse.papyrus.uml.profile.drafter.ui.model.StereotypeURLTest)  Time elapsed: 0 s
07:36:16 testToString(org.eclipse.papyrus.uml.profile.drafter.ui.model.StereotypeURLTest)  Time elapsed: 0 s
07:36:16 testGetStereotypeName(org.eclipse.papyrus.uml.profile.drafter.ui.model.StereotypeURLTest)  Time elapsed: 0 s
07:36:16 testAddPropertyChangeListenerStringPropertyChangeListener(org.eclipse.papyrus.uml.profile.drafter.ui.model.StereotypeURLTest)  Time elapsed: 0 s
07:36:16 testStereotypeURL(org.eclipse.papyrus.uml.profile.drafter.ui.model.StereotypeURLTest)  Time elapsed: 0 s
07:36:16 testRemovePropertyChangeListenerPropertyChangeListener(org.eclipse.papyrus.uml.profile.drafter.ui.model.StereotypeURLTest)  Time elapsed: 0 s
07:36:16 testSetQualifiedNameSimple(org.eclipse.papyrus.uml.profile.drafter.ui.model.StereotypeURLTest)  Time elapsed: 0.001 s
07:36:16 testSetProfileName(org.eclipse.papyrus.uml.profile.drafter.ui.model.StereotypeURLTest)  Time elapsed: 0 s
07:36:16 testRemovePropertyChangeListenerStringPropertyChangeListener(org.eclipse.papyrus.uml.profile.drafter.ui.model.StereotypeURLTest)  Time elapsed: 0 s
07:36:16 testComputeQualifiedName(org.eclipse.papyrus.uml.profile.drafter.ui.model.StereotypeURLTest)  Time elapsed: 0 s
07:36:16 testGetQualifiedName(org.eclipse.papyrus.uml.profile.drafter.ui.model.StereotypeURLTest)  Time elapsed: 0.003 s
07:36:16 testStereotypeURLStringString(org.eclipse.papyrus.uml.profile.drafter.ui.model.StereotypeURLTest)  Time elapsed: 0 s
07:36:16 testGetTypes(org.eclipse.papyrus.uml.profile.drafter.ui.model.TypeProviderTest)  Time elapsed: 0.002 s
07:36:16 testTypeProvider(org.eclipse.papyrus.uml.profile.drafter.ui.model.TypeProviderTest)  Time elapsed: 0 s
07:36:16 testIterator(org.eclipse.papyrus.uml.profile.drafter.ui.model.TypeProviderTest)  Time elapsed: 0 s
07:36:16 testGetTypes(org.eclipse.papyrus.uml.profile.drafter.ui.model.TypeProviderTest2)  Time elapsed: 0.001 s
07:36:16 testAddType(org.eclipse.papyrus.uml.profile.drafter.ui.model.TypeProviderTest2)  Time elapsed: 0 s
07:36:16 testAddTypeFromConstructor(org.eclipse.papyrus.uml.profile.drafter.ui.model.TypeProviderTest2)  Time elapsed: 0 s
07:36:16 testTypeProvider(org.eclipse.papyrus.uml.profile.drafter.ui.model.TypeProviderTest2)  Time elapsed: 0 s
07:36:16 testTypeProviderTypeArray(org.eclipse.papyrus.uml.profile.drafter.ui.model.TypeProviderTest2)  Time elapsed: 0 s
07:36:16 testIterator(org.eclipse.papyrus.uml.profile.drafter.ui.model.TypeProviderTest2)  Time elapsed: 0 s
07:36:16 testUMLPrimitiveTypesModel(org.eclipse.papyrus.uml.profile.drafter.utils.UMLPrimitiveTypesModelTest)  Time elapsed: 0.016 s
07:36:16 testGetLibraryPackage(org.eclipse.papyrus.uml.profile.drafter.utils.UMLPrimitiveTypesModelTest)  Time elapsed: 0.011 s
07:36:16 testUseInternationalizationModification(org.eclipse.papyrus.uml.internationalization.tests.tests.UMLInternationalizationChangePreferencesTest)  Time elapsed: 0.695 s
07:36:16 testLanguageModification(org.eclipse.papyrus.uml.internationalization.tests.tests.UMLInternationalizationChangeLanguageTest)  Time elapsed: 0.902 s
07:36:16 rebuildAdapters(org.eclipse.papyrus.uml.internationalization.tests.tests.InternationalizationUMLItemProviderAdapterFactoryTest)  Time elapsed: 1.112 s
07:36:16 normalAdapters(org.eclipse.papyrus.uml.internationalization.tests.tests.InternationalizationUMLItemProviderAdapterFactoryTest)  Time elapsed: 1.082 s
07:36:16 testLabelProviderAdapter(org.eclipse.papyrus.uml.internationalization.tests.tests.InternationalizationAdapterTest)  Time elapsed: 0.004 s
07:36:16 testMapping(org.eclipse.papyrus.uml.alf.tests.mapper.MappingTest) skipped
07:36:16 org.eclipse.papyrus.uml.alf.tests.mapper.MappingTest skipped
07:36:16 testMerging(org.eclipse.papyrus.uml.alf.tests.mapper.MergeTest) skipped
07:36:16 org.eclipse.papyrus.uml.alf.tests.mapper.MergeTest skipped
07:36:16 testStaticSemantics(org.eclipse.papyrus.uml.alf.tests.SemanticTest) skipped
07:36:16 org.eclipse.papyrus.uml.alf.tests.SemanticTest skipped
07:36:16 testOneFile(org.eclipse.papyrus.uml.alf.tests.SingleTest) skipped
07:36:16 org.eclipse.papyrus.uml.alf.tests.SingleTest skipped
07:36:16 testSyntax(org.eclipse.papyrus.uml.alf.tests.SyntacticTest) skipped
07:36:16 org.eclipse.papyrus.uml.alf.tests.SyntacticTest skipped
07:36:16 testGeneration(org.eclipse.papyrus.uml.alf.tests.generator.GenerationTest) skipped
07:36:16 org.eclipse.papyrus.uml.alf.tests.generator.GenerationTest skipped
07:36:16 org.eclipse.papyrus.uml.alf.tests.AllTests skipped
07:36:16 IsStereotypedWithExpression_Test10(org.eclipse.papyrus.uml.expressions.tests.IsStereotypedWithExpressionTests)  Time elapsed: 0.896 s
07:36:16 IsStereotypedWithExpression_Test11(org.eclipse.papyrus.uml.expressions.tests.IsStereotypedWithExpressionTests)  Time elapsed: 0.9 s
07:36:16 IsStereotypedWithExpression_Test12(org.eclipse.papyrus.uml.expressions.tests.IsStereotypedWithExpressionTests)  Time elapsed: 0.87 s
07:36:16 IsStereotypedWithExpression_Test13(org.eclipse.papyrus.uml.expressions.tests.IsStereotypedWithExpressionTests)  Time elapsed: 0.95 s
07:36:16 IsStereotypedWithExpression_Test1(org.eclipse.papyrus.uml.expressions.tests.IsStereotypedWithExpressionTests)  Time elapsed: 0.866 s
07:36:16 IsStereotypedWithExpression_Test2(org.eclipse.papyrus.uml.expressions.tests.IsStereotypedWithExpressionTests)  Time elapsed: 0.872 s
07:36:16 IsStereotypedWithExpression_Test3(org.eclipse.papyrus.uml.expressions.tests.IsStereotypedWithExpressionTests)  Time elapsed: 0.849 s
07:36:16 IsStereotypedWithExpression_Test4(org.eclipse.papyrus.uml.expressions.tests.IsStereotypedWithExpressionTests)  Time elapsed: 0.96 s
07:36:16 IsStereotypedWithExpression_Test5(org.eclipse.papyrus.uml.expressions.tests.IsStereotypedWithExpressionTests)  Time elapsed: 0.905 s
07:36:16 IsStereotypedWithExpression_Test6(org.eclipse.papyrus.uml.expressions.tests.IsStereotypedWithExpressionTests)  Time elapsed: 0.98 s
07:36:16 IsStereotypedWithExpression_Test7(org.eclipse.papyrus.uml.expressions.tests.IsStereotypedWithExpressionTests)  Time elapsed: 1.101 s
07:36:16 IsStereotypedWithExpression_Test8(org.eclipse.papyrus.uml.expressions.tests.IsStereotypedWithExpressionTests)  Time elapsed: 1.312 s
07:36:16 IsStereotypedWithExpression_Test9(org.eclipse.papyrus.uml.expressions.tests.IsStereotypedWithExpressionTests)  Time elapsed: 1.358 s
07:36:16 HasStereotypeExpressionTests_Test1(org.eclipse.papyrus.uml.expressions.tests.HasAppliedStereotypeExpressionTests)  Time elapsed: 1.071 s
07:36:16 HasStereotypeExpressionTests_Test2(org.eclipse.papyrus.uml.expressions.tests.HasAppliedStereotypeExpressionTests)  Time elapsed: 0.947 s
07:36:16 HasStereotypeExpressionTests_Test3(org.eclipse.papyrus.uml.expressions.tests.HasAppliedStereotypeExpressionTests)  Time elapsed: 1.056 s
07:36:16 HasStereotypeExpressionTests_Test4(org.eclipse.papyrus.uml.expressions.tests.HasAppliedStereotypeExpressionTests)  Time elapsed: 1.359 s
07:36:16 metaclassAndNoContext(org.eclipse.papyrus.uml.expressions.tests.IsKindOfExpressionTest)  Time elapsed: 0.006 s
07:36:16 noMetaclassAndNoContextTest(org.eclipse.papyrus.uml.expressions.tests.IsKindOfExpressionTest)  Time elapsed: 0 s
07:36:16 metaclassAndValidContext_1(org.eclipse.papyrus.uml.expressions.tests.IsKindOfExpressionTest)  Time elapsed: 0.001 s
07:36:16 metaclassAndValidContext_2(org.eclipse.papyrus.uml.expressions.tests.IsKindOfExpressionTest)  Time elapsed: 0 s
07:36:16 metaclassAndInvalidContext(org.eclipse.papyrus.uml.expressions.tests.IsKindOfExpressionTest)  Time elapsed: 0 s
07:36:16 metaclassAndNoContext(org.eclipse.papyrus.uml.expressions.tests.IsTypeOfExpressionTests)  Time elapsed: 0.002 s
07:36:16 noMetaclassAndNoContextTest(org.eclipse.papyrus.uml.expressions.tests.IsTypeOfExpressionTests)  Time elapsed: 0 s
07:36:16 metaclassAndValidContext_2(org.eclipse.papyrus.uml.expressions.tests.IsTypeOfExpressionTests)  Time elapsed: 0 s
07:36:16 metaclassAndInValidContext_1(org.eclipse.papyrus.uml.expressions.tests.IsTypeOfExpressionTests)  Time elapsed: 0 s
07:36:16 IsKindOfStereotypeExpression_Test10(org.eclipse.papyrus.uml.expressions.tests.IsKindOfStereotypeExpressionTests)  Time elapsed: 1.042 s
07:36:16 IsKindOfStereotypeExpression_Test11(org.eclipse.papyrus.uml.expressions.tests.IsKindOfStereotypeExpressionTests)  Time elapsed: 1.136 s
07:36:16 IsKindOfStereotypeExpression_Test12(org.eclipse.papyrus.uml.expressions.tests.IsKindOfStereotypeExpressionTests)  Time elapsed: 1.083 s
07:36:16 IsKindOfStereotypeExpression_Test13(org.eclipse.papyrus.uml.expressions.tests.IsKindOfStereotypeExpressionTests)  Time elapsed: 1.176 s
07:36:16 IsKindOfStereotypeExpression_Test14(org.eclipse.papyrus.uml.expressions.tests.IsKindOfStereotypeExpressionTests)  Time elapsed: 1.123 s
07:36:16 IsKindOfStereotypeExpression_Test1(org.eclipse.papyrus.uml.expressions.tests.IsKindOfStereotypeExpressionTests)  Time elapsed: 1.123 s
07:36:16 IsKindOfStereotypeExpression_Test2(org.eclipse.papyrus.uml.expressions.tests.IsKindOfStereotypeExpressionTests)  Time elapsed: 0.981 s
07:36:16 IsKindOfStereotypeExpression_Test3(org.eclipse.papyrus.uml.expressions.tests.IsKindOfStereotypeExpressionTests)  Time elapsed: 0.967 s
07:36:16 IsKindOfStereotypeExpression_Test4(org.eclipse.papyrus.uml.expressions.tests.IsKindOfStereotypeExpressionTests)  Time elapsed: 0.908 s
07:36:16 IsKindOfStereotypeExpression_Test5(org.eclipse.papyrus.uml.expressions.tests.IsKindOfStereotypeExpressionTests)  Time elapsed: 1.061 s
07:36:16 IsKindOfStereotypeExpression_Test6(org.eclipse.papyrus.uml.expressions.tests.IsKindOfStereotypeExpressionTests)  Time elapsed: 1.037 s
07:36:16 IsKindOfStereotypeExpression_Test7(org.eclipse.papyrus.uml.expressions.tests.IsKindOfStereotypeExpressionTests)  Time elapsed: 1.051 s
07:36:16 IsKindOfStereotypeExpression_Test8(org.eclipse.papyrus.uml.expressions.tests.IsKindOfStereotypeExpressionTests)  Time elapsed: 0.985 s
07:36:16 IsKindOfStereotypeExpression_Test9(org.eclipse.papyrus.uml.expressions.tests.IsKindOfStereotypeExpressionTests)  Time elapsed: 0.953 s
07:36:16 IsTypeOfStereotypeExpression_Test1(org.eclipse.papyrus.uml.expressions.tests.IsTypeOfStereotypeExpressionTests)  Time elapsed: 1.016 s
07:36:16 IsTypeOfStereotypeExpression_Test2(org.eclipse.papyrus.uml.expressions.tests.IsTypeOfStereotypeExpressionTests)  Time elapsed: 0.954 s
07:36:16 IsTypeOfStereotypeExpression_Test3(org.eclipse.papyrus.uml.expressions.tests.IsTypeOfStereotypeExpressionTests)  Time elapsed: 1.411 s
07:36:16 IsTypeOfStereotypeExpression_Test4(org.eclipse.papyrus.uml.expressions.tests.IsTypeOfStereotypeExpressionTests)  Time elapsed: 0.974 s
07:36:16 IsTypeOfStereotypeExpression_Test5(org.eclipse.papyrus.uml.expressions.tests.IsTypeOfStereotypeExpressionTests)  Time elapsed: 0.858 s
07:36:16 IsTypeOfStereotypeExpression_Test6(org.eclipse.papyrus.uml.expressions.tests.IsTypeOfStereotypeExpressionTests)  Time elapsed: 0.862 s
07:36:16 IsTypeOfStereotypeExpression_Test7(org.eclipse.papyrus.uml.expressions.tests.IsTypeOfStereotypeExpressionTests)  Time elapsed: 0.808 s
07:36:16 IsTypeOfStereotypeExpression_Test8(org.eclipse.papyrus.uml.expressions.tests.IsTypeOfStereotypeExpressionTests)  Time elapsed: 0.941 s
07:36:16 IsTypeOfStereotypeExpression_Test9(org.eclipse.papyrus.uml.expressions.tests.IsTypeOfStereotypeExpressionTests)  Time elapsed: 0.873 s
07:36:16 IsTypeOfStereotypeExpression_Test10(org.eclipse.papyrus.uml.expressions.tests.IsTypeOfStereotypeExpressionTests)  Time elapsed: 0.858 s
07:36:16 IsTypeOfStereotypeExpression_Test11(org.eclipse.papyrus.uml.expressions.tests.IsTypeOfStereotypeExpressionTests)  Time elapsed: 1.342 s
07:36:16 IsTypeOfStereotypeExpression_Test12(org.eclipse.papyrus.uml.expressions.tests.IsTypeOfStereotypeExpressionTests)  Time elapsed: 1.786 s
07:36:16 IsTypeOfStereotypeExpression_Test13(org.eclipse.papyrus.uml.expressions.tests.IsTypeOfStereotypeExpressionTests)  Time elapsed: 1.703 s
07:36:16 SingleStereotypeAttributeEqualityExpressionTests_Test10(org.eclipse.papyrus.uml.expressions.tests.SingleStereotypeAttributeEqualityExpressionTests)  Time elapsed: 1.489 s
07:36:16 SingleStereotypeAttributeEqualityExpressionTests_Test11(org.eclipse.papyrus.uml.expressions.tests.SingleStereotypeAttributeEqualityExpressionTests)  Time elapsed: 1.034 s
07:36:16 SingleStereotypeAttributeEqualityExpressionTests_Test12(org.eclipse.papyrus.uml.expressions.tests.SingleStereotypeAttributeEqualityExpressionTests)  Time elapsed: 1.168 s
07:36:16 SingleStereotypeAttributeEqualityExpressionTests_Test13(org.eclipse.papyrus.uml.expressions.tests.SingleStereotypeAttributeEqualityExpressionTests)  Time elapsed: 1.028 s
07:36:16 SingleStereotypeAttributeEqualityExpressionTests_Test1(org.eclipse.papyrus.uml.expressions.tests.SingleStereotypeAttributeEqualityExpressionTests)  Time elapsed: 1.012 s
07:36:16 SingleStereotypeAttributeEqualityExpressionTests_Test2(org.eclipse.papyrus.uml.expressions.tests.SingleStereotypeAttributeEqualityExpressionTests)  Time elapsed: 0.918 s
07:36:16 SingleStereotypeAttributeEqualityExpressionTests_Test3(org.eclipse.papyrus.uml.expressions.tests.SingleStereotypeAttributeEqualityExpressionTests)  Time elapsed: 1.068 s
07:36:16 SingleStereotypeAttributeEqualityExpressionTests_Test4(org.eclipse.papyrus.uml.expressions.tests.SingleStereotypeAttributeEqualityExpressionTests)  Time elapsed: 0.828 s
07:36:16 SingleStereotypeAttributeEqualityExpressionTests_Test5(org.eclipse.papyrus.uml.expressions.tests.SingleStereotypeAttributeEqualityExpressionTests)  Time elapsed: 0.809 s
07:36:16 SingleStereotypeAttributeEqualityExpressionTests_Test6(org.eclipse.papyrus.uml.expressions.tests.SingleStereotypeAttributeEqualityExpressionTests)  Time elapsed: 0.796 s
07:36:16 SingleStereotypeAttributeEqualityExpressionTests_Test7(org.eclipse.papyrus.uml.expressions.tests.SingleStereotypeAttributeEqualityExpressionTests)  Time elapsed: 0.825 s
07:36:16 SingleStereotypeAttributeEqualityExpressionTests_Test8(org.eclipse.papyrus.uml.expressions.tests.SingleStereotypeAttributeEqualityExpressionTests)  Time elapsed: 1.01 s
07:36:16 SingleStereotypeAttributeEqualityExpressionTests_Test9(org.eclipse.papyrus.uml.expressions.tests.SingleStereotypeAttributeEqualityExpressionTests)  Time elapsed: 0.954 s
07:36:16 validateModel[0](org.eclipse.papyrus.uml.architecture.tests.resources.ModelValidationTest)  Time elapsed: 0.093 s
07:36:16 
07:36:16 Results:
07:36:16 
07:36:16 Failures: 
07:36:16   InstanceSpecificationTest.init:91->initModel:131 Cannot load the test diagram
07:36:16 Errors: 
07:36:16 org.eclipse.papyrus.uml.modelexplorer.tests.AdvancedModeTest.advancedModeDoesNotCollapseItself(org.eclipse.papyrus.uml.modelexplorer.tests.AdvancedModeTest)
07:36:16   Run 1: AdvancedModeTest.advancedModeDoesNotCollapseItself » BasicIndexOutOfBounds ind...
07:36:16   Run 2: AdvancedModeTest.advancedModeDoesNotCollapseItself:69 » NullPointer
07:36:16 
07:36:16 
07:36:16 Tests run: 657, Failures: 1, Errors: 1, Skipped: 38
07:36:16 
07:36:19 [ERROR] There are test failures.
07:36:19 
07:36:19 Please refer to /jobs/genie.papyrus/Papyrus-Gerrit-Master-With-Tests/workspace/source/tests/junit/plugins/uml/org.eclipse.papyrus.uml.suite.tests/target/surefire-reports for the individual test results.
07:36:19 [INFO] 
07:36:19 [INFO] --- jacoco-maven-plugin:0.8.2:report (default-report) @ org.eclipse.papyrus.uml.suite.tests ---
07:36:19 [INFO] Loading execution data file /jobs/genie.papyrus/Papyrus-Gerrit-Master-With-Tests/workspace/source/tests/junit/plugins/uml/org.eclipse.papyrus.uml.suite.tests/target/jacoco.exec
07:36:19 [INFO] Analyzed bundle 'org.eclipse.papyrus.uml.suite.tests' with 0 classes
07:36:19 [INFO] 
07:36:19 [INFO] --< org.eclipse.papyrus.tests:org.eclipse.papyrus.uml.alf.tests.releng >--
07:36:19 [INFO] Building org.eclipse.papyrus.uml.alf.tests.releng 0.0.1-SNAPSHOT [689/697]
07:36:19 [INFO] --------------------------------[ pom ]---------------------------------
07:36:19 [INFO] 
07:36:19 [INFO] --- maven-clean-plugin:3.1.0:clean (default-clean) @ org.eclipse.papyrus.uml.alf.tests.releng ---
07:36:19 [INFO] 
07:36:19 [INFO] --- jacoco-maven-plugin:0.8.2:prepare-agent (default-prepare-agent) @ org.eclipse.papyrus.uml.alf.tests.releng ---
07:36:19 [INFO] argLine set to -javaagent:/home/hudson/genie.papyrus/.jenkins/jobs/Papyrus-Gerrit-Master-With-Tests/workspace/.repository/org/jacoco/org.jacoco.agent/0.8.2/org.jacoco.agent-0.8.2-runtime.jar=destfile=/jobs/genie.papyrus/Papyrus-Gerrit-Master-With-Tests/workspace/source/tests/junit/plugins/uml/alf/target/jacoco.exec,includes=org.eclipse.papyrus.*,excludes=org.eclipse.uml2
07:36:19 [INFO] 
07:36:19 [INFO] --- tycho-p2-plugin:1.3.0:p2-metadata (attach-p2-metadata) @ org.eclipse.papyrus.uml.alf.tests.releng ---
07:36:19 [INFO] 
07:36:19 [INFO] --- jacoco-maven-plugin:0.8.2:report (default-report) @ org.eclipse.papyrus.uml.alf.tests.releng ---
07:36:19 [INFO] Skipping JaCoCo execution due to missing execution data file.
07:36:19 [INFO] 
07:36:19 [INFO] --< org.eclipse.papyrus.tests:org.eclipse.papyrus.uml.alf.backend.tests >--
07:36:19 [INFO] Building org.eclipse.papyrus.uml.alf.backend.tests 1.1.0-SNAPSHOT [690/697]
07:36:19 [INFO] ------------------------[ eclipse-test-plugin ]-------------------------
07:36:19 [INFO] 
07:36:19 [INFO] --- maven-clean-plugin:3.1.0:clean (default-clean) @ org.eclipse.papyrus.uml.alf.backend.tests ---
07:36:19 [INFO] 
07:36:19 [INFO] --- tycho-packaging-plugin:1.3.0:build-qualifier (default-build-qualifier) @ org.eclipse.papyrus.uml.alf.backend.tests ---
07:36:19 [INFO] The project's OSGi version is 1.1.0.202008030953
07:36:19 [INFO] 
07:36:19 [INFO] --- tycho-packaging-plugin:1.3.0:validate-id (default-validate-id) @ org.eclipse.papyrus.uml.alf.backend.tests ---
07:36:19 [INFO] 
07:36:19 [INFO] --- tycho-packaging-plugin:1.3.0:validate-version (default-validate-version) @ org.eclipse.papyrus.uml.alf.backend.tests ---
07:36:19 [INFO] 
07:36:19 [INFO] --- jacoco-maven-plugin:0.8.2:prepare-agent (default-prepare-agent) @ org.eclipse.papyrus.uml.alf.backend.tests ---
07:36:19 [INFO] tycho.testArgLine set to -javaagent:/home/hudson/genie.papyrus/.jenkins/jobs/Papyrus-Gerrit-Master-With-Tests/workspace/.repository/org/jacoco/org.jacoco.agent/0.8.2/org.jacoco.agent-0.8.2-runtime.jar=destfile=/jobs/genie.papyrus/Papyrus-Gerrit-Master-With-Tests/workspace/source/tests/junit/plugins/uml/alf/org.eclipse.papyrus.uml.alf.backend.tests/target/jacoco.exec,includes=org.eclipse.papyrus.*,excludes=org.eclipse.uml2
07:36:19 [INFO] 
07:36:19 [INFO] --- xtend-maven-plugin:2.16.0:compile (default) @ org.eclipse.papyrus.uml.alf.backend.tests ---
07:36:20 [INFO] 
07:36:20 [INFO] --- maven-resources-plugin:3.1.0:resources (default-resources) @ org.eclipse.papyrus.uml.alf.backend.tests ---
07:36:20 [INFO] Using 'UTF-8' encoding to copy filtered resources.
07:36:20 [INFO] skip non existing resourceDirectory /jobs/genie.papyrus/Papyrus-Gerrit-Master-With-Tests/workspace/source/tests/junit/plugins/uml/alf/org.eclipse.papyrus.uml.alf.backend.tests/src/main/resources
07:36:20 [INFO] 
07:36:20 [INFO] --- tycho-compiler-plugin:1.3.0:compile (default-compile) @ org.eclipse.papyrus.uml.alf.backend.tests ---
07:36:20 [WARNING] The effective compiler target level 1.8 is incompatible with the following OSGi execution environments: [JavaSE-1.7 (assumes 1.7)] @ MavenProject: org.eclipse.papyrus.tests:org.eclipse.papyrus.uml.alf.backend.tests:1.1.0-SNAPSHOT @ /jobs/genie.papyrus/Papyrus-Gerrit-Master-With-Tests/workspace/source/tests/junit/plugins/uml/alf/org.eclipse.papyrus.uml.alf.backend.tests/pom.xml
07:36:20 [INFO] Compiling 4 source files to /jobs/genie.papyrus/Papyrus-Gerrit-Master-With-Tests/workspace/source/tests/junit/plugins/uml/alf/org.eclipse.papyrus.uml.alf.backend.tests/bin
07:36:21 [INFO] 
07:36:21 [INFO] --- maven-resources-plugin:3.1.0:testResources (default-testResources) @ org.eclipse.papyrus.uml.alf.backend.tests ---
07:36:21 [INFO] Using 'UTF-8' encoding to copy filtered resources.
07:36:21 [INFO] skip non existing resourceDirectory /jobs/genie.papyrus/Papyrus-Gerrit-Master-With-Tests/workspace/source/tests/junit/plugins/uml/alf/org.eclipse.papyrus.uml.alf.backend.tests/src/test/resources
07:36:21 [INFO] 
07:36:21 [INFO] --- target-platform-configuration:1.3.0:target-platform (default-target-platform) @ org.eclipse.papyrus.uml.alf.backend.tests ---
07:36:21 [INFO] 
07:36:21 [INFO] --- tycho-packaging-plugin:1.3.0:package-plugin (default-package-plugin) @ org.eclipse.papyrus.uml.alf.backend.tests ---
07:36:21 [INFO] Building jar: /jobs/genie.papyrus/Papyrus-Gerrit-Master-With-Tests/workspace/source/tests/junit/plugins/uml/alf/org.eclipse.papyrus.uml.alf.backend.tests/target/org.eclipse.papyrus.uml.alf.backend.tests-1.1.0-SNAPSHOT.jar
07:36:21 [INFO] 
07:36:21 [INFO] --- tycho-p2-plugin:1.3.0:p2-metadata-default (default-p2-metadata-default) @ org.eclipse.papyrus.uml.alf.backend.tests ---
07:36:21 [INFO] 
07:36:21 [INFO] --- tycho-p2-plugin:1.3.0:p2-metadata (attach-p2-metadata) @ org.eclipse.papyrus.uml.alf.backend.tests ---
07:36:21 [INFO] 
07:36:21 [INFO] --- tycho-surefire-plugin:1.3.0:test (default-test) @ org.eclipse.papyrus.uml.alf.backend.tests ---
07:36:21 [INFO] Skipping tests
07:36:21 [INFO] 
07:36:21 [INFO] --- jacoco-maven-plugin:0.8.2:report (default-report) @ org.eclipse.papyrus.uml.alf.backend.tests ---
07:36:21 [INFO] Skipping JaCoCo execution due to missing execution data file.
07:36:21 [INFO] 
07:36:21 [INFO] --< org.eclipse.papyrus.tests:org.eclipse.papyrus.views.properties.toolsmiths.tests >--
07:36:21 [INFO] Building org.eclipse.papyrus.views.properties.toolsmiths.tests 1.2.0-SNAPSHOT [691/697]
07:36:21 [INFO] ------------------------[ eclipse-test-plugin ]-------------------------
07:36:21 [INFO] 
07:36:21 [INFO] --- maven-clean-plugin:3.1.0:clean (default-clean) @ org.eclipse.papyrus.views.properties.toolsmiths.tests ---
07:36:21 [INFO] 
07:36:21 [INFO] --- tycho-packaging-plugin:1.3.0:build-qualifier (default-build-qualifier) @ org.eclipse.papyrus.views.properties.toolsmiths.tests ---
07:36:21 [INFO] The project's OSGi version is 1.2.0.202008030953
07:36:21 [INFO] 
07:36:21 [INFO] --- tycho-packaging-plugin:1.3.0:validate-id (default-validate-id) @ org.eclipse.papyrus.views.properties.toolsmiths.tests ---
07:36:21 [INFO] 
07:36:21 [INFO] --- tycho-packaging-plugin:1.3.0:validate-version (default-validate-version) @ org.eclipse.papyrus.views.properties.toolsmiths.tests ---
07:36:21 [INFO] 
07:36:21 [INFO] --- jacoco-maven-plugin:0.8.2:prepare-agent (default-prepare-agent) @ org.eclipse.papyrus.views.properties.toolsmiths.tests ---
07:36:21 [INFO] tycho.testArgLine set to -javaagent:/home/hudson/genie.papyrus/.jenkins/jobs/Papyrus-Gerrit-Master-With-Tests/workspace/.repository/org/jacoco/org.jacoco.agent/0.8.2/org.jacoco.agent-0.8.2-runtime.jar=destfile=/jobs/genie.papyrus/Papyrus-Gerrit-Master-With-Tests/workspace/source/tests/junit/plugins/views/org.eclipse.papyrus.views.properties.toolsmiths.tests/target/jacoco.exec,includes=org.eclipse.papyrus.*,excludes=org.eclipse.uml2
07:36:21 [INFO] 
07:36:21 [INFO] --- maven-resources-plugin:3.1.0:resources (default-resources) @ org.eclipse.papyrus.views.properties.toolsmiths.tests ---
07:36:21 [INFO] Using 'UTF-8' encoding to copy filtered resources.
07:36:21 [INFO] skip non existing resourceDirectory /jobs/genie.papyrus/Papyrus-Gerrit-Master-With-Tests/workspace/source/tests/junit/plugins/views/org.eclipse.papyrus.views.properties.toolsmiths.tests/src/main/resources
07:36:21 [INFO] 
07:36:21 [INFO] --- tycho-compiler-plugin:1.3.0:compile (default-compile) @ org.eclipse.papyrus.views.properties.toolsmiths.tests ---
07:36:21 [WARNING] The effective compiler target level 1.8 is incompatible with the following OSGi execution environments: [J2SE-1.5 (assumes 1.5)] @ MavenProject: org.eclipse.papyrus.tests:org.eclipse.papyrus.views.properties.toolsmiths.tests:1.2.0-SNAPSHOT @ /jobs/genie.papyrus/Papyrus-Gerrit-Master-With-Tests/workspace/source/tests/junit/plugins/views/org.eclipse.papyrus.views.properties.toolsmiths.tests/pom.xml
07:36:21 [INFO] Compiling 3 source files to /jobs/genie.papyrus/Papyrus-Gerrit-Master-With-Tests/workspace/source/tests/junit/plugins/views/org.eclipse.papyrus.views.properties.toolsmiths.tests/bin
07:36:23 [WARNING] /jobs/genie.papyrus/Papyrus-Gerrit-Master-With-Tests/workspace/source/tests/junit/plugins/views/org.eclipse.papyrus.views.properties.toolsmiths.tests/src/org/eclipse/papyrus/views/properties/toolsmiths/tests/qvt/TransformationsTests.java:[274] 
07:36:23 	DataContextElement st3Element = findContextElement(context, "Stereotype3");
07:36:23 	                   ^^^^^^^^^^
07:36:23 The value of the local variable st3Element is not used
07:36:23 1 problem (1 warning)
07:36:23 [INFO] 
07:36:23 [INFO] --- maven-resources-plugin:3.1.0:testResources (default-testResources) @ org.eclipse.papyrus.views.properties.toolsmiths.tests ---
07:36:23 [INFO] Using 'UTF-8' encoding to copy filtered resources.
07:36:23 [INFO] skip non existing resourceDirectory /jobs/genie.papyrus/Papyrus-Gerrit-Master-With-Tests/workspace/source/tests/junit/plugins/views/org.eclipse.papyrus.views.properties.toolsmiths.tests/src/test/resources
07:36:23 [INFO] 
07:36:23 [INFO] --- target-platform-configuration:1.3.0:target-platform (default-target-platform) @ org.eclipse.papyrus.views.properties.toolsmiths.tests ---
07:36:23 [INFO] 
07:36:23 [INFO] --- tycho-packaging-plugin:1.3.0:package-plugin (default-package-plugin) @ org.eclipse.papyrus.views.properties.toolsmiths.tests ---
07:36:23 [INFO] Building jar: /jobs/genie.papyrus/Papyrus-Gerrit-Master-With-Tests/workspace/source/tests/junit/plugins/views/org.eclipse.papyrus.views.properties.toolsmiths.tests/target/org.eclipse.papyrus.views.properties.toolsmiths.tests-1.2.0-SNAPSHOT.jar
07:36:23 [INFO] 
07:36:23 [INFO] --- tycho-p2-plugin:1.3.0:p2-metadata-default (default-p2-metadata-default) @ org.eclipse.papyrus.views.properties.toolsmiths.tests ---
07:36:23 [INFO] 
07:36:23 [INFO] --- tycho-p2-plugin:1.3.0:p2-metadata (attach-p2-metadata) @ org.eclipse.papyrus.views.properties.toolsmiths.tests ---
07:36:23 [INFO] 
07:36:23 [INFO] --- tycho-surefire-plugin:1.3.0:test (default-test) @ org.eclipse.papyrus.views.properties.toolsmiths.tests ---
07:36:23 [INFO] Skipping tests
07:36:23 [INFO] 
07:36:23 [INFO] --- jacoco-maven-plugin:0.8.2:report (default-report) @ org.eclipse.papyrus.views.properties.toolsmiths.tests ---
07:36:23 [INFO] Skipping JaCoCo execution due to missing execution data file.
07:36:23 [INFO] 
07:36:23 [INFO] --< org.eclipse.papyrus.tests:org.eclipse.papyrus.views.suite.tests >---
07:36:23 [INFO] Building org.eclipse.papyrus.views.suite.tests 0.0.1-SNAPSHOT  [692/697]
07:36:23 [INFO] ------------------------[ eclipse-test-plugin ]-------------------------
07:36:26 [INFO] 
07:36:26 [INFO] --- maven-clean-plugin:3.1.0:clean (default-clean) @ org.eclipse.papyrus.views.suite.tests ---
07:36:26 [INFO] 
07:36:26 [INFO] --- tycho-packaging-plugin:1.3.0:build-qualifier (default-build-qualifier) @ org.eclipse.papyrus.views.suite.tests ---
07:36:26 [INFO] The project's OSGi version is 0.0.1.202008030953
07:36:26 [INFO] 
07:36:26 [INFO] --- tycho-packaging-plugin:1.3.0:validate-id (default-validate-id) @ org.eclipse.papyrus.views.suite.tests ---
07:36:26 [INFO] 
07:36:26 [INFO] --- tycho-packaging-plugin:1.3.0:validate-version (default-validate-version) @ org.eclipse.papyrus.views.suite.tests ---
07:36:26 [INFO] 
07:36:26 [INFO] --- jacoco-maven-plugin:0.8.2:prepare-agent (default-prepare-agent) @ org.eclipse.papyrus.views.suite.tests ---
07:36:26 [INFO] tycho.testArgLine set to -javaagent:/home/hudson/genie.papyrus/.jenkins/jobs/Papyrus-Gerrit-Master-With-Tests/workspace/.repository/org/jacoco/org.jacoco.agent/0.8.2/org.jacoco.agent-0.8.2-runtime.jar=destfile=/jobs/genie.papyrus/Papyrus-Gerrit-Master-With-Tests/workspace/source/tests/junit/plugins/views/org.eclipse.papyrus.views.suite.tests/target/jacoco.exec,includes=org.eclipse.papyrus.*,excludes=org.eclipse.uml2
07:36:26 [INFO] 
07:36:26 [INFO] --- maven-resources-plugin:3.1.0:resources (default-resources) @ org.eclipse.papyrus.views.suite.tests ---
07:36:26 [INFO] Using 'UTF-8' encoding to copy filtered resources.
07:36:26 [INFO] skip non existing resourceDirectory /jobs/genie.papyrus/Papyrus-Gerrit-Master-With-Tests/workspace/source/tests/junit/plugins/views/org.eclipse.papyrus.views.suite.tests/src/main/resources
07:36:26 [INFO] 
07:36:26 [INFO] --- tycho-compiler-plugin:1.3.0:compile (default-compile) @ org.eclipse.papyrus.views.suite.tests ---
07:36:26 [INFO] Compiling 2 source files to /jobs/genie.papyrus/Papyrus-Gerrit-Master-With-Tests/workspace/source/tests/junit/plugins/views/org.eclipse.papyrus.views.suite.tests/bin
07:36:29 [INFO] 
07:36:29 [INFO] --- maven-resources-plugin:3.1.0:testResources (default-testResources) @ org.eclipse.papyrus.views.suite.tests ---
07:36:29 [INFO] Using 'UTF-8' encoding to copy filtered resources.
07:36:29 [INFO] skip non existing resourceDirectory /jobs/genie.papyrus/Papyrus-Gerrit-Master-With-Tests/workspace/source/tests/junit/plugins/views/org.eclipse.papyrus.views.suite.tests/src/test/resources
07:36:29 [INFO] 
07:36:29 [INFO] --- target-platform-configuration:1.3.0:target-platform (default-target-platform) @ org.eclipse.papyrus.views.suite.tests ---
07:36:29 [INFO] 
07:36:29 [INFO] --- tycho-packaging-plugin:1.3.0:package-plugin (default-package-plugin) @ org.eclipse.papyrus.views.suite.tests ---
07:36:29 [INFO] Building jar: /jobs/genie.papyrus/Papyrus-Gerrit-Master-With-Tests/workspace/source/tests/junit/plugins/views/org.eclipse.papyrus.views.suite.tests/target/org.eclipse.papyrus.views.suite.tests-0.0.1-SNAPSHOT.jar
07:36:29 [INFO] 
07:36:29 [INFO] --- tycho-p2-plugin:1.3.0:p2-metadata-default (default-p2-metadata-default) @ org.eclipse.papyrus.views.suite.tests ---
07:36:29 [INFO] 
07:36:29 [INFO] --- tycho-p2-plugin:1.3.0:p2-metadata (attach-p2-metadata) @ org.eclipse.papyrus.views.suite.tests ---
07:36:29 [INFO] 
07:36:29 [INFO] --- tycho-surefire-plugin:1.3.0:test (default-test) @ org.eclipse.papyrus.views.suite.tests ---
07:36:44 [INFO] Expected eclipse log file: /jobs/genie.papyrus/Papyrus-Gerrit-Master-With-Tests/workspace/source/tests/junit/plugins/views/org.eclipse.papyrus.views.suite.tests/target/work/data/.metadata/.log
07:36:44 [INFO] Command line:
07:36:44 	[/opt/public/common/java/oracle/jdk1.8.0_202_x64/jre/bin/java, -Dosgi.noShutdown=false, -Dosgi.os=linux, -Dosgi.ws=gtk, -Dosgi.arch=x86_64, -javaagent:/home/hudson/genie.papyrus/.jenkins/jobs/Papyrus-Gerrit-Master-With-Tests/workspace/.repository/org/jacoco/org.jacoco.agent/0.8.2/org.jacoco.agent-0.8.2-runtime.jar=destfile=/jobs/genie.papyrus/Papyrus-Gerrit-Master-With-Tests/workspace/source/tests/junit/plugins/views/org.eclipse.papyrus.views.suite.tests/target/jacoco.exec,includes=org.eclipse.papyrus.*,excludes=org.eclipse.uml2, -Xms512m, -Xmx2048m, -XX:SoftRefLRUPolicyMSPerMB=100, -Dosgi.clean=true, -jar, /jobs/genie.papyrus/Papyrus-Gerrit-Master-With-Tests/workspace/.repository/p2/osgi/bundle/org.eclipse.equinox.launcher/1.5.700.v20200207-2156/org.eclipse.equinox.launcher-1.5.700.v20200207-2156.jar, -data, /jobs/genie.papyrus/Papyrus-Gerrit-Master-With-Tests/workspace/source/tests/junit/plugins/views/org.eclipse.papyrus.views.suite.tests/target/work/data, -install, /jobs/genie.papyrus/Papyrus-Gerrit-Master-With-Tests/workspace/source/tests/junit/plugins/views/org.eclipse.papyrus.views.suite.tests/target/work, -configuration, /jobs/genie.papyrus/Papyrus-Gerrit-Master-With-Tests/workspace/source/tests/junit/plugins/views/org.eclipse.papyrus.views.suite.tests/target/work/configuration, -application, org.eclipse.tycho.surefire.osgibooter.uitest, -testproperties, /jobs/genie.papyrus/Papyrus-Gerrit-Master-With-Tests/workspace/source/tests/junit/plugins/views/org.eclipse.papyrus.views.suite.tests/target/surefire.properties, -product, org.eclipse.sdk.ide, -testConfig=CI_TESTS_CONFIG]
07:36:44 Picked up JAVA_TOOL_OPTIONS: -Xmx2G -Djava.io.tmpdir=/tmp/genie.papyrus -DforkCount=1
07:36:48 ***WARNING: GTK+ version too old (micro mismatch)
07:36:48 ***WARNING: SWT requires GTK 3.14.0
07:36:48 ***WARNING: Detected: 3.10.9
07:36:55 SWT Webkit: Warning, You are using an old version of webkitgtk. (pre 2.4) BrowserFunction functionality will not be avaliable
07:36:55 SWT WebKit: error initializing DBus server, dBusServer == 0
07:36:56 Running org.eclipse.papyrus.views.suite.tests.AllTests
07:37:01 No JFaces support for org.eclipse.jface.viewers.TableTreeViewer
07:37:15 Tests run: 11, Failures: 0, Errors: 0, Skipped: 0, Time elapsed: 19.365 s - in org.eclipse.papyrus.views.suite.tests.AllTests
07:37:15 revealSemanticElement_rootTest(org.eclipse.papyrus.views.modelexplorer.tests.ModelExplorerViewTests)  Time elapsed: 8.632 s
07:37:15 deleteDiagramTest(org.eclipse.papyrus.views.modelexplorer.tests.DeleteHandlerTest)  Time elapsed: 2.062 s
07:37:15 deleteTableTest(org.eclipse.papyrus.views.modelexplorer.tests.DeleteHandlerTest)  Time elapsed: 1.486 s
07:37:15 deleteLinkItemTest(org.eclipse.papyrus.views.modelexplorer.tests.DeleteHandlerTest)  Time elapsed: 0.823 s
07:37:15 deleteRootOfTheModel(org.eclipse.papyrus.views.modelexplorer.tests.DeleteHandlerTest)  Time elapsed: 0.942 s
07:37:15 testOpendiagramTest(org.eclipse.papyrus.views.modelexplorer.tests.OpendiagramTest)  Time elapsed: 0.906 s
07:37:15 documentationViewTests(org.eclipse.papyrus.views.documentation.tests.DocumentationViewTests)  Time elapsed: 2.076 s
07:37:15 handleXWTFileFromResourceSet(org.eclipse.papyrus.views.properties.toolsmiths.tests.qvt.TransformationsTests)  Time elapsed: 0.964 s
07:37:15 handleXWTFileFromResource(org.eclipse.papyrus.views.properties.toolsmiths.tests.qvt.TransformationsTests)  Time elapsed: 0.16 s
07:37:15 generateEcoreContext(org.eclipse.papyrus.views.properties.toolsmiths.tests.qvt.TransformationsTests)  Time elapsed: 0.07 s
07:37:15 generateProfileContext(org.eclipse.papyrus.views.properties.toolsmiths.tests.qvt.TransformationsTests)  Time elapsed: 0.456 s
07:37:15 
07:37:15 Results:
07:37:15 
07:37:15 Tests run: 11, Failures: 0, Errors: 0, Skipped: 0
07:37:15 
07:37:17 [INFO] All tests passed!
07:37:17 [INFO] 
07:37:17 [INFO] --- jacoco-maven-plugin:0.8.2:report (default-report) @ org.eclipse.papyrus.views.suite.tests ---
07:37:17 [INFO] Loading execution data file /jobs/genie.papyrus/Papyrus-Gerrit-Master-With-Tests/workspace/source/tests/junit/plugins/views/org.eclipse.papyrus.views.suite.tests/target/jacoco.exec
07:37:17 [INFO] Analyzed bundle 'org.eclipse.papyrus.views.suite.tests' with 0 classes
07:37:17 [INFO] 
07:37:17 [INFO] --< org.eclipse.papyrus.tests:org.eclipse.papyrus.views.documentation.tests.releng >--
07:37:17 [INFO] Building org.eclipse.papyrus.views.documentation.tests.releng 0.0.1-SNAPSHOT [693/697]
07:37:17 [INFO] --------------------------------[ pom ]---------------------------------
07:37:17 [INFO] 
07:37:17 [INFO] --- maven-clean-plugin:3.1.0:clean (default-clean) @ org.eclipse.papyrus.views.documentation.tests.releng ---
07:37:17 [INFO] 
07:37:17 [INFO] --- jacoco-maven-plugin:0.8.2:prepare-agent (default-prepare-agent) @ org.eclipse.papyrus.views.documentation.tests.releng ---
07:37:17 [INFO] argLine set to -javaagent:/home/hudson/genie.papyrus/.jenkins/jobs/Papyrus-Gerrit-Master-With-Tests/workspace/.repository/org/jacoco/org.jacoco.agent/0.8.2/org.jacoco.agent-0.8.2-runtime.jar=destfile=/jobs/genie.papyrus/Papyrus-Gerrit-Master-With-Tests/workspace/source/tests/junit/plugins/views/documentation/target/jacoco.exec,includes=org.eclipse.papyrus.*,excludes=org.eclipse.uml2
07:37:17 [INFO] 
07:37:17 [INFO] --- tycho-p2-plugin:1.3.0:p2-metadata (attach-p2-metadata) @ org.eclipse.papyrus.views.documentation.tests.releng ---
07:37:17 [INFO] 
07:37:17 [INFO] --- jacoco-maven-plugin:0.8.2:report (default-report) @ org.eclipse.papyrus.views.documentation.tests.releng ---
07:37:17 [INFO] Skipping JaCoCo execution due to missing execution data file.
07:37:17 [INFO] 
07:37:17 [INFO] --< org.eclipse.papyrus.tests:org.eclipse.papyrus.toolsmiths.suite.tests >--
07:37:17 [INFO] Building org.eclipse.papyrus.toolsmiths.suite.tests 0.0.1-SNAPSHOT [694/697]
07:37:17 [INFO] ------------------------[ eclipse-test-plugin ]-------------------------
07:37:21 [INFO] 
07:37:21 [INFO] --- maven-clean-plugin:3.1.0:clean (default-clean) @ org.eclipse.papyrus.toolsmiths.suite.tests ---
07:37:21 [INFO] 
07:37:21 [INFO] --- tycho-packaging-plugin:1.3.0:build-qualifier (default-build-qualifier) @ org.eclipse.papyrus.toolsmiths.suite.tests ---
07:37:21 [INFO] The project's OSGi version is 0.0.1.202008030953
07:37:21 [INFO] 
07:37:21 [INFO] --- tycho-packaging-plugin:1.3.0:validate-id (default-validate-id) @ org.eclipse.papyrus.toolsmiths.suite.tests ---
07:37:21 [INFO] 
07:37:21 [INFO] --- tycho-packaging-plugin:1.3.0:validate-version (default-validate-version) @ org.eclipse.papyrus.toolsmiths.suite.tests ---
07:37:21 [INFO] 
07:37:21 [INFO] --- jacoco-maven-plugin:0.8.2:prepare-agent (default-prepare-agent) @ org.eclipse.papyrus.toolsmiths.suite.tests ---
07:37:21 [INFO] tycho.testArgLine set to -javaagent:/home/hudson/genie.papyrus/.jenkins/jobs/Papyrus-Gerrit-Master-With-Tests/workspace/.repository/org/jacoco/org.jacoco.agent/0.8.2/org.jacoco.agent-0.8.2-runtime.jar=destfile=/jobs/genie.papyrus/Papyrus-Gerrit-Master-With-Tests/workspace/source/tests/junit/plugins/toolsmiths/org.eclipse.papyrus.toolsmiths.suite.tests/target/jacoco.exec,includes=org.eclipse.papyrus.*,excludes=org.eclipse.uml2
07:37:21 [INFO] 
07:37:21 [INFO] --- maven-resources-plugin:3.1.0:resources (default-resources) @ org.eclipse.papyrus.toolsmiths.suite.tests ---
07:37:21 [INFO] Using 'UTF-8' encoding to copy filtered resources.
07:37:21 [INFO] skip non existing resourceDirectory /jobs/genie.papyrus/Papyrus-Gerrit-Master-With-Tests/workspace/source/tests/junit/plugins/toolsmiths/org.eclipse.papyrus.toolsmiths.suite.tests/src/main/resources
07:37:21 [INFO] 
07:37:21 [INFO] --- tycho-compiler-plugin:1.3.0:compile (default-compile) @ org.eclipse.papyrus.toolsmiths.suite.tests ---
07:37:21 [INFO] Compiling 2 source files to /jobs/genie.papyrus/Papyrus-Gerrit-Master-With-Tests/workspace/source/tests/junit/plugins/toolsmiths/org.eclipse.papyrus.toolsmiths.suite.tests/bin
07:37:22 [INFO] 
07:37:22 [INFO] --- maven-resources-plugin:3.1.0:testResources (default-testResources) @ org.eclipse.papyrus.toolsmiths.suite.tests ---
07:37:22 [INFO] Using 'UTF-8' encoding to copy filtered resources.
07:37:22 [INFO] skip non existing resourceDirectory /jobs/genie.papyrus/Papyrus-Gerrit-Master-With-Tests/workspace/source/tests/junit/plugins/toolsmiths/org.eclipse.papyrus.toolsmiths.suite.tests/src/test/resources
07:37:22 [INFO] 
07:37:22 [INFO] --- target-platform-configuration:1.3.0:target-platform (default-target-platform) @ org.eclipse.papyrus.toolsmiths.suite.tests ---
07:37:22 [INFO] 
07:37:22 [INFO] --- tycho-packaging-plugin:1.3.0:package-plugin (default-package-plugin) @ org.eclipse.papyrus.toolsmiths.suite.tests ---
07:37:22 [INFO] Building jar: /jobs/genie.papyrus/Papyrus-Gerrit-Master-With-Tests/workspace/source/tests/junit/plugins/toolsmiths/org.eclipse.papyrus.toolsmiths.suite.tests/target/org.eclipse.papyrus.toolsmiths.suite.tests-0.0.1-SNAPSHOT.jar
07:37:22 [INFO] 
07:37:22 [INFO] --- tycho-p2-plugin:1.3.0:p2-metadata-default (default-p2-metadata-default) @ org.eclipse.papyrus.toolsmiths.suite.tests ---
07:37:22 [INFO] 
07:37:22 [INFO] --- tycho-p2-plugin:1.3.0:p2-metadata (attach-p2-metadata) @ org.eclipse.papyrus.toolsmiths.suite.tests ---
07:37:22 [INFO] 
07:37:22 [INFO] --- tycho-surefire-plugin:1.3.0:test (default-test) @ org.eclipse.papyrus.toolsmiths.suite.tests ---
07:37:35 [INFO] Expected eclipse log file: /jobs/genie.papyrus/Papyrus-Gerrit-Master-With-Tests/workspace/source/tests/junit/plugins/toolsmiths/org.eclipse.papyrus.toolsmiths.suite.tests/target/work/data/.metadata/.log
07:37:35 [INFO] Command line:
07:37:35 	[/opt/public/common/java/oracle/jdk1.8.0_202_x64/jre/bin/java, -Dosgi.noShutdown=false, -Dosgi.os=linux, -Dosgi.ws=gtk, -Dosgi.arch=x86_64, -javaagent:/home/hudson/genie.papyrus/.jenkins/jobs/Papyrus-Gerrit-Master-With-Tests/workspace/.repository/org/jacoco/org.jacoco.agent/0.8.2/org.jacoco.agent-0.8.2-runtime.jar=destfile=/jobs/genie.papyrus/Papyrus-Gerrit-Master-With-Tests/workspace/source/tests/junit/plugins/toolsmiths/org.eclipse.papyrus.toolsmiths.suite.tests/target/jacoco.exec,includes=org.eclipse.papyrus.*,excludes=org.eclipse.uml2, -Xms512m, -Xmx2048m, -XX:SoftRefLRUPolicyMSPerMB=100, -Dosgi.clean=true, -jar, /jobs/genie.papyrus/Papyrus-Gerrit-Master-With-Tests/workspace/.repository/p2/osgi/bundle/org.eclipse.equinox.launcher/1.5.700.v20200207-2156/org.eclipse.equinox.launcher-1.5.700.v20200207-2156.jar, -data, /jobs/genie.papyrus/Papyrus-Gerrit-Master-With-Tests/workspace/source/tests/junit/plugins/toolsmiths/org.eclipse.papyrus.toolsmiths.suite.tests/target/work/data, -install, /jobs/genie.papyrus/Papyrus-Gerrit-Master-With-Tests/workspace/source/tests/junit/plugins/toolsmiths/org.eclipse.papyrus.toolsmiths.suite.tests/target/work, -configuration, /jobs/genie.papyrus/Papyrus-Gerrit-Master-With-Tests/workspace/source/tests/junit/plugins/toolsmiths/org.eclipse.papyrus.toolsmiths.suite.tests/target/work/configuration, -application, org.eclipse.tycho.surefire.osgibooter.uitest, -testproperties, /jobs/genie.papyrus/Papyrus-Gerrit-Master-With-Tests/workspace/source/tests/junit/plugins/toolsmiths/org.eclipse.papyrus.toolsmiths.suite.tests/target/surefire.properties, -product, org.eclipse.sdk.ide, -testConfig=CI_TESTS_CONFIG]
07:37:35 Picked up JAVA_TOOL_OPTIONS: -Xmx2G -Djava.io.tmpdir=/tmp/genie.papyrus -DforkCount=1
07:37:39 ***WARNING: GTK+ version too old (micro mismatch)
07:37:39 ***WARNING: SWT requires GTK 3.14.0
07:37:39 ***WARNING: Detected: 3.10.9
07:37:44 SWT Webkit: Warning, You are using an old version of webkitgtk. (pre 2.4) BrowserFunction functionality will not be avaliable
07:37:44 SWT WebKit: error initializing DBus server, dBusServer == 0
07:37:45 Running org.eclipse.papyrus.toolsmiths.suite.tests.AllTests
07:37:46 log4j:WARN No appenders could be found for logger (org.eclipse.emf.compare.EMFCompare).
07:37:46 log4j:WARN Please initialize the log4j system properly.
07:37:48 Tests run: 21, Failures: 0, Errors: 0, Skipped: 0, Time elapsed: 2.383 s - in org.eclipse.papyrus.toolsmiths.suite.tests.AllTests
07:37:48 ProfileAutomaticMigrationTest(org.eclipse.papyrus.toolsmiths.profilemigration.tests.automatic.AutomaticMigrationTest)  Time elapsed: 0.006 s
07:37:48 PackageAutomaticMigrationTest(org.eclipse.papyrus.toolsmiths.profilemigration.tests.automatic.AutomaticMigrationTest)  Time elapsed: 0.002 s
07:37:48 StereotypeAutomaticMigrationTest_Stereotype_delete_Property(org.eclipse.papyrus.toolsmiths.profilemigration.tests.automatic.AutomaticMigrationTest)  Time elapsed: 0 s
07:37:48 PropertyAutomaticMigrationTest(org.eclipse.papyrus.toolsmiths.profilemigration.tests.automatic.AutomaticMigrationTest)  Time elapsed: 0.002 s
07:37:48 StereotypeAutomaticMigrationTest(org.eclipse.papyrus.toolsmiths.profilemigration.tests.automatic.AutomaticMigrationTest)  Time elapsed: 0.001 s
07:37:48 GeneralizationAutomaticMigrationTest(org.eclipse.papyrus.toolsmiths.profilemigration.tests.automatic.AutomaticMigrationTest)  Time elapsed: 0.001 s
07:37:48 atomicListTest(org.eclipse.papyrus.toolsmiths.profilemigration.tests.migrators.ChangeIsAbstractFromStereotypeTest)  Time elapsed: 0.002 s
07:37:48 atomicListMoveProfileIntoNonApplyProfileTest(org.eclipse.papyrus.toolsmiths.profilemigration.tests.migrators.MoveMigratorTest)  Time elapsed: 0.029 s
07:37:48 atomicListMoveStereotypeIntoNonApplyProfileTest(org.eclipse.papyrus.toolsmiths.profilemigration.tests.migrators.MoveMigratorTest)  Time elapsed: 0.026 s
07:37:48 atomicListMovePackageIntoAlreadyApplyProfileTest(org.eclipse.papyrus.toolsmiths.profilemigration.tests.migrators.MoveMigratorTest)  Time elapsed: 0.025 s
07:37:48 atomicListMoveStereotypeIntoAlreadyApplyProfileTest(org.eclipse.papyrus.toolsmiths.profilemigration.tests.migrators.MoveMigratorTest)  Time elapsed: 0.04 s
07:37:48 atomicListMovePackageIntoNonApplyProfileTest(org.eclipse.papyrus.toolsmiths.profilemigration.tests.migrators.MoveMigratorTest)  Time elapsed: 0.039 s
07:37:48 atomicListMoveProfileIntoAlreadyApplyProfileTest(org.eclipse.papyrus.toolsmiths.profilemigration.tests.migrators.MoveMigratorTest)  Time elapsed: 0.033 s
07:37:48 UpperMultiplicityTest(org.eclipse.papyrus.toolsmiths.profilemigration.tests.migrators.ChangeMultiplicityFromPropertyMigratorTest)  Time elapsed: 0.002 s
07:37:48 atomicListTest(org.eclipse.papyrus.toolsmiths.profilemigration.tests.migrators.ChangeMultiplicityFromPropertyMigratorTest)  Time elapsed: 0 s
07:37:48 LowerMultiplicityTest(org.eclipse.papyrus.toolsmiths.profilemigration.tests.migrators.ChangeMultiplicityFromPropertyMigratorTest)  Time elapsed: 0 s
07:37:48 DeleteEnumerationLiteralTest(org.eclipse.papyrus.toolsmiths.profilemigration.tests.migrators.DeleteEnumLiteralFromEnumerationTest)  Time elapsed: 0.002 s
07:37:48 MoveEnumerationLiteralTest(org.eclipse.papyrus.toolsmiths.profilemigration.tests.migrators.DeleteEnumLiteralFromEnumerationTest)  Time elapsed: 0.002 s
07:37:48 atomicListTest(org.eclipse.papyrus.toolsmiths.profilemigration.tests.migrators.DeleteEnumLiteralFromEnumerationTest)  Time elapsed: 0 s
07:37:48 atomicListTest(org.eclipse.papyrus.toolsmiths.profilemigration.tests.migrators.ChangeIsStaticFromPropertyTest)  Time elapsed: 0.002 s
07:37:48 atomicListTest(org.eclipse.papyrus.toolsmiths.profilemigration.tests.migrators.AddPropertyToStereotypeTest)  Time elapsed: 0.001 s
07:37:48 
07:37:48 Results:
07:37:48 
07:37:48 Tests run: 21, Failures: 0, Errors: 0, Skipped: 0
07:37:48 
07:37:50 [INFO] All tests passed!
07:37:50 [INFO] 
07:37:50 [INFO] --- jacoco-maven-plugin:0.8.2:report (default-report) @ org.eclipse.papyrus.toolsmiths.suite.tests ---
07:37:50 [INFO] Loading execution data file /jobs/genie.papyrus/Papyrus-Gerrit-Master-With-Tests/workspace/source/tests/junit/plugins/toolsmiths/org.eclipse.papyrus.toolsmiths.suite.tests/target/jacoco.exec
07:37:50 [INFO] Analyzed bundle 'org.eclipse.papyrus.toolsmiths.suite.tests' with 0 classes
07:37:50 [INFO] 
07:37:50 [INFO] -----< org.eclipse.papyrus:org.eclipse.papyrus.tests.main.releng >------
07:37:50 [INFO] Building org.eclipse.papyrus.tests.main.releng 1.2.0-SNAPSHOT  [695/697]
07:37:50 [INFO] --------------------------------[ pom ]---------------------------------
07:37:50 [INFO] 
07:37:50 [INFO] --- maven-clean-plugin:3.1.0:clean (default-clean) @ org.eclipse.papyrus.tests.main.releng ---
07:37:50 [INFO] 
07:37:50 [INFO] --- jacoco-maven-plugin:0.8.2:prepare-agent (default-prepare-agent) @ org.eclipse.papyrus.tests.main.releng ---
07:37:50 [INFO] argLine set to -javaagent:/home/hudson/genie.papyrus/.jenkins/jobs/Papyrus-Gerrit-Master-With-Tests/workspace/.repository/org/jacoco/org.jacoco.agent/0.8.2/org.jacoco.agent-0.8.2-runtime.jar=destfile=/jobs/genie.papyrus/Papyrus-Gerrit-Master-With-Tests/workspace/source/releng/tests/main-tests/target/jacoco.exec,includes=org.eclipse.papyrus.*,excludes=org.eclipse.uml2
07:37:50 [INFO] 
07:37:50 [INFO] --- tycho-p2-plugin:1.3.0:p2-metadata (attach-p2-metadata) @ org.eclipse.papyrus.tests.main.releng ---
07:37:50 [INFO] 
07:37:50 [INFO] --- jacoco-maven-plugin:0.8.2:report (default-report) @ org.eclipse.papyrus.tests.main.releng ---
07:37:50 [INFO] Skipping JaCoCo execution due to missing execution data file.
07:37:50 [INFO] 
07:37:50 [INFO] --< org.eclipse.papyrus:org.eclipse.papyrus.main.tests.target.parent >--
07:37:50 [INFO] Building org.eclipse.papyrus.main.tests.target.parent 0.0.1-SNAPSHOT [696/697]
07:37:50 [INFO] --------------------------------[ pom ]---------------------------------
07:37:50 [INFO] 
07:37:50 [INFO] --- maven-clean-plugin:3.1.0:clean (default-clean) @ org.eclipse.papyrus.main.tests.target.parent ---
07:37:50 [INFO] 
07:37:50 [INFO] --- jacoco-maven-plugin:0.8.2:prepare-agent (default-prepare-agent) @ org.eclipse.papyrus.main.tests.target.parent ---
07:37:50 [INFO] argLine set to -javaagent:/home/hudson/genie.papyrus/.jenkins/jobs/Papyrus-Gerrit-Master-With-Tests/workspace/.repository/org/jacoco/org.jacoco.agent/0.8.2/org.jacoco.agent-0.8.2-runtime.jar=destfile=/jobs/genie.papyrus/Papyrus-Gerrit-Master-With-Tests/workspace/source/releng/tests/main-tests/targetPlatform/target/jacoco.exec,includes=org.eclipse.papyrus.*,excludes=org.eclipse.uml2
07:37:50 [INFO] 
07:37:50 [INFO] --- tycho-p2-plugin:1.3.0:p2-metadata (attach-p2-metadata) @ org.eclipse.papyrus.main.tests.target.parent ---
07:37:50 [INFO] 
07:37:50 [INFO] --- jacoco-maven-plugin:0.8.2:report (default-report) @ org.eclipse.papyrus.main.tests.target.parent ---
07:37:50 [INFO] Skipping JaCoCo execution due to missing execution data file.
07:37:50 [INFO] 
07:37:50 [INFO] --< org.eclipse.papyrus:org.eclipse.papyrus.main.tests.portable.target >--
07:37:50 [INFO] Building org.eclipse.papyrus.main.tests.portable.target 0.0.1-SNAPSHOT [697/697]
07:37:50 [INFO] ---------------------[ eclipse-target-definition ]----------------------
07:37:50 [INFO] 
07:37:50 [INFO] --- maven-clean-plugin:3.1.0:clean (default-clean) @ org.eclipse.papyrus.main.tests.portable.target ---
07:37:50 [INFO] 
07:37:50 [INFO] --- jacoco-maven-plugin:0.8.2:prepare-agent (default-prepare-agent) @ org.eclipse.papyrus.main.tests.portable.target ---
07:37:50 [INFO] argLine set to -javaagent:/home/hudson/genie.papyrus/.jenkins/jobs/Papyrus-Gerrit-Master-With-Tests/workspace/.repository/org/jacoco/org.jacoco.agent/0.8.2/org.jacoco.agent-0.8.2-runtime.jar=destfile=/jobs/genie.papyrus/Papyrus-Gerrit-Master-With-Tests/workspace/source/releng/tests/main-tests/targetPlatform/portable/target/jacoco.exec,includes=org.eclipse.papyrus.*,excludes=org.eclipse.uml2
07:37:50 [INFO] 
07:37:50 [INFO] --- tycho-packaging-plugin:1.3.0:package-target-definition (default-package-target-definition) @ org.eclipse.papyrus.main.tests.portable.target ---
07:37:50 [INFO] 
07:37:50 [INFO] --- tycho-p2-plugin:1.3.0:p2-metadata (attach-p2-metadata) @ org.eclipse.papyrus.main.tests.portable.target ---
07:37:50 [INFO] 
07:37:50 [INFO] --- jacoco-maven-plugin:0.8.2:report (default-report) @ org.eclipse.papyrus.main.tests.portable.target ---
07:37:50 [INFO] Skipping JaCoCo execution due to missing execution data file.
07:37:50 [INFO] ------------------------------------------------------------------------
07:37:50 [INFO] Reactor Summary:
07:37:50 [INFO] 
07:37:50 [INFO] org.eclipse.papyrus.all.releng 0.0.1-SNAPSHOT ...... SUCCESS [  1.460 s]
07:37:50 [INFO] org.eclipse.papyrus.releng 0.0.1-SNAPSHOT .......... SUCCESS [  0.033 s]
07:37:50 [INFO] Papyrus Main Plugins 0.0.1-SNAPSHOT ................ SUCCESS [  0.007 s]
07:37:50 [INFO] Papyrus EMF 0.0.1-SNAPSHOT ......................... SUCCESS [  0.006 s]
07:37:50 [INFO] org.eclipse.papyrus.emf 1.0.0-SNAPSHOT ............. SUCCESS [ 13.477 s]
07:37:50 [INFO] org.eclipse.papyrus.emf.ui 1.0.0-SNAPSHOT .......... SUCCESS [  0.779 s]
07:37:50 [INFO] EMF Facet, the Papyrus Edition 0.0.1-SNAPSHOT ...... SUCCESS [  0.007 s]
07:37:50 [INFO] Papyrus EMF Facet Editors 0.0.1-SNAPSHOT ........... SUCCESS [  0.007 s]
07:37:50 [INFO] org.eclipse.papyrus.emf.facet.custom.doc 1.2.0-SNAPSHOT SUCCESS [  0.076 s]
07:37:50 [INFO] org.eclipse.papyrus.emf.facet.common.core 1.2.0-SNAPSHOT SUCCESS [  0.183 s]
07:37:50 [INFO] org.eclipse.papyrus.emf.facet.util.emf.catalog 1.2.0-SNAPSHOT SUCCESS [  0.268 s]
07:37:50 [INFO] org.eclipse.papyrus.emf.facet.util.core 1.2.0-SNAPSHOT SUCCESS [  0.324 s]
07:37:50 [INFO] org.eclipse.papyrus.emf.facet.common.sdk.core 1.2.0-SNAPSHOT SUCCESS [  0.482 s]
07:37:50 [INFO] org.eclipse.papyrus.emf.facet.common.ui 1.2.0-SNAPSHOT SUCCESS [  0.553 s]
07:37:50 [INFO] org.eclipse.papyrus.emf.facet.util.pde.core 1.2.0-SNAPSHOT SUCCESS [  0.238 s]
07:37:50 [INFO] org.eclipse.papyrus.emf.facet.util.emf.core 1.2.0-SNAPSHOT SUCCESS [  0.424 s]
07:37:50 [INFO] org.eclipse.papyrus.emf.facet.efacet.metamodel 1.3.0-SNAPSHOT SUCCESS [  0.976 s]
07:37:50 [INFO] org.eclipse.papyrus.emf.facet.custom.metamodel 1.4.0-SNAPSHOT SUCCESS [  0.386 s]
07:37:50 [INFO] org.eclipse.papyrus.emf.facet.efacet 1.2.0-SNAPSHOT  SUCCESS [  0.454 s]
07:37:50 [INFO] org.eclipse.papyrus.emf.facet.efacet.catalog 1.2.0-SNAPSHOT SUCCESS [  0.219 s]
07:37:50 [INFO] org.eclipse.papyrus.emf.facet.util.ui 2.0.0-SNAPSHOT SUCCESS [  0.368 s]
07:37:50 [INFO] org.eclipse.papyrus.emf.facet.util.swt 1.2.0-SNAPSHOT SUCCESS [  0.161 s]
07:37:50 [INFO] org.eclipse.papyrus.emf.facet.util.emf.ui 2.0.0-SNAPSHOT SUCCESS [  0.360 s]
07:37:50 [INFO] org.eclipse.papyrus.emf.facet.efacet.core 2.0.0-SNAPSHOT SUCCESS [  1.841 s]
07:37:50 [INFO] org.eclipse.papyrus.emf.facet.custom.core 3.0.0-SNAPSHOT SUCCESS [  0.415 s]
07:37:50 [INFO] org.eclipse.papyrus.emf.facet.efacet.metamodel.edit 1.2.0-SNAPSHOT SUCCESS [  0.283 s]
07:37:50 [INFO] org.eclipse.papyrus.emf.facet.custom.metamodel.edit 1.3.0-SNAPSHOT SUCCESS [  2.214 s]
07:37:50 [INFO] org.eclipse.papyrus.emf.facet.query.java 1.2.0-SNAPSHOT SUCCESS [  0.293 s]
07:37:50 [INFO] Papyrus Infra 0.0.1-SNAPSHOT ....................... SUCCESS [  0.003 s]
07:37:50 [INFO] Papyrus Infra Core 0.0.1-SNAPSHOT .................. SUCCESS [  0.002 s]
07:37:50 [INFO] org.eclipse.papyrus.infra.core.log 1.2.0-SNAPSHOT .. SUCCESS [  0.091 s]
07:37:50 [INFO] org.eclipse.papyrus.infra.tools 3.2.100-SNAPSHOT ... SUCCESS [  0.753 s]
07:37:50 [INFO] org.eclipse.papyrus.emf.facet.query.java.metamodel 1.3.0-SNAPSHOT SUCCESS [  0.274 s]
07:37:50 [INFO] org.eclipse.papyrus.emf.facet.query.java.core 2.0.0-SNAPSHOT SUCCESS [  0.454 s]
07:37:50 [INFO] org.eclipse.papyrus.emf.facet.util.jface.ui 2.0.0-SNAPSHOT SUCCESS [  0.235 s]
07:37:50 [INFO] org.eclipse.papyrus.emf.facet.custom.ui 3.1.0-SNAPSHOT SUCCESS [  0.498 s]
07:37:50 [INFO] org.eclipse.papyrus.emf.facet.efacet.sdk.ui 2.0.0-SNAPSHOT SUCCESS [  0.519 s]
07:37:50 [INFO] org.eclipse.papyrus.emf.facet.custom.sdk.core 1.2.0-SNAPSHOT SUCCESS [  0.195 s]
07:37:50 [INFO] org.eclipse.papyrus.emf.facet.widgets 1.2.0-SNAPSHOT SUCCESS [  0.185 s]
07:37:50 [INFO] org.eclipse.papyrus.emf.facet.widgets.celleditors 1.2.0-SNAPSHOT SUCCESS [  0.315 s]
07:37:50 [INFO] org.eclipse.papyrus.emf.facet.efacet.ui 3.0.0-SNAPSHOT SUCCESS [  0.495 s]
07:37:50 [INFO] org.eclipse.papyrus.emf.facet.custom.sdk.ui 1.2.0-SNAPSHOT SUCCESS [  0.344 s]
07:37:50 [INFO] org.eclipse.papyrus.emf.facet.query.ocl.metamodel 1.2.0-SNAPSHOT SUCCESS [  0.233 s]
07:37:50 [INFO] org.eclipse.papyrus.emf.facet.custom.metamodel.editor 1.3.0-SNAPSHOT SUCCESS [  0.472 s]
07:37:50 [INFO] org.eclipse.papyrus.emf.facet.custom.metamodel.editor.doc 1.2.0-SNAPSHOT SUCCESS [  0.060 s]
07:37:50 [INFO] org.eclipse.papyrus.emf.facet.doc 1.2.0-SNAPSHOT ... SUCCESS [  0.211 s]
07:37:50 [INFO] org.eclipse.papyrus.emf.facet.aggregate.doc 1.2.0-SNAPSHOT SUCCESS [  0.056 s]
07:37:50 [INFO] org.eclipse.papyrus.emf.facet.efacet.doc 1.2.0-SNAPSHOT SUCCESS [  0.100 s]
07:37:50 [INFO] org.eclipse.papyrus.emf.facet.efacet.edit 1.2.0-SNAPSHOT SUCCESS [  0.351 s]
07:37:50 [INFO] org.eclipse.papyrus.emf.facet.efacet.editor 1.2.0-SNAPSHOT SUCCESS [  0.238 s]
07:37:50 [INFO] org.eclipse.papyrus.emf.facet.query.java.sdk.ui 1.2.0-SNAPSHOT SUCCESS [  0.265 s]
07:37:50 [INFO] org.eclipse.papyrus.emf.facet.query.ocl.core 1.2.0-SNAPSHOT SUCCESS [  0.207 s]
07:37:50 [INFO] org.eclipse.papyrus.emf.facet.query.ocl.sdk.ui 2.0.0-SNAPSHOT SUCCESS [  0.376 s]
07:37:50 [INFO] org.eclipse.papyrus.emf.facet.util.emf.doc 1.2.0-SNAPSHOT SUCCESS [  0.043 s]
07:37:50 [INFO] org.eclipse.papyrus.emf.facet.widgets.celleditors.ecore 1.2.0-SNAPSHOT SUCCESS [  0.637 s]
07:37:50 [INFO] Papyrus Infra Architecture 0.0.1-SNAPSHOT .......... SUCCESS [  0.005 s]
07:37:50 [INFO] Papyrus Infra Element Types Configurations 0.0.1-SNAPSHOT SUCCESS [  0.002 s]
07:37:50 [INFO] org.eclipse.papyrus.infra.types 4.0.0-SNAPSHOT ..... SUCCESS [  0.273 s]
07:37:50 [INFO] org.eclipse.papyrus.infra.core.architecture 2.1.0-SNAPSHOT SUCCESS [  0.265 s]
07:37:50 [INFO] org.eclipse.papyrus.infra.core.sashwindows.di 1.4.0-SNAPSHOT SUCCESS [  0.245 s]
07:37:50 [INFO] org.eclipse.papyrus.infra.core 3.1.0-SNAPSHOT ...... SUCCESS [  0.643 s]
07:37:50 [INFO] Papyrus EMF Infrastructure 0.0.1-SNAPSHOT .......... SUCCESS [  0.003 s]
07:37:50 [INFO] org.eclipse.papyrus.infra.emf 3.1.0-SNAPSHOT ....... SUCCESS [  0.510 s]
07:37:50 [INFO] Papyrus Infra Services 0.0.1-SNAPSHOT .............. SUCCESS [  0.004 s]
07:37:50 [INFO] org.eclipse.papyrus.infra.services.markerlistener 2.0.0-SNAPSHOT SUCCESS [  0.202 s]
07:37:50 [INFO] org.eclipse.papyrus.infra.services.edit 3.2.0-SNAPSHOT SUCCESS [  0.268 s]
07:37:50 [INFO] org.eclipse.papyrus.infra.architecture 2.1.0-SNAPSHOT SUCCESS [  0.236 s]
07:37:50 [INFO] Papyrus Infra Constraints 0.0.1-SNAPSHOT ........... SUCCESS [  0.002 s]
07:37:50 [INFO] org.eclipse.papyrus.infra.constraints 2.0.0-SNAPSHOT SUCCESS [  0.270 s]
07:37:50 [INFO] org.eclipse.papyrus.infra.architecture.representation 2.1.0-SNAPSHOT SUCCESS [  0.426 s]
07:37:50 [INFO] org.eclipse.papyrus.infra.types.edit 4.0.0-SNAPSHOT  SUCCESS [  0.164 s]
07:37:50 [INFO] org.eclipse.papyrus.infra.core.architecture.edit 2.1.0-SNAPSHOT SUCCESS [  0.351 s]
07:37:50 [INFO] org.eclipse.papyrus.infra.constraints.edit 2.0.0-SNAPSHOT SUCCESS [  0.290 s]
07:37:50 [INFO] org.eclipse.papyrus.infra.architecture.representation.edit 1.2.0-SNAPSHOT SUCCESS [  0.389 s]
07:37:50 [INFO] org.eclipse.papyrus.infra.core.sasheditor 2.2.0-SNAPSHOT SUCCESS [  0.520 s]
07:37:50 [INFO] org.eclipse.papyrus.infra.core.sasheditor.di 2.1.0-SNAPSHOT SUCCESS [  0.300 s]
07:37:50 [INFO] Papyrus Infra One-file 0.0.1-SNAPSHOT .............. SUCCESS [  0.002 s]
07:37:50 [INFO] Papyrus EMF Expressions Infrastructure 0.0.1-SNAPSHOT SUCCESS [  0.002 s]
07:37:50 [INFO] org.eclipse.papyrus.infra.emf.expressions 1.1.0-SNAPSHOT SUCCESS [  0.196 s]
07:37:50 [INFO] org.eclipse.papyrus.infra.emf.gmf 1.3.0-SNAPSHOT ... SUCCESS [  0.284 s]
07:37:50 [INFO] Papyrus Nattable 0.0.1-SNAPSHOT .................... SUCCESS [  0.004 s]
07:37:50 [INFO] org.eclipse.papyrus.infra.nattable.model 4.2.0-SNAPSHOT SUCCESS [  1.902 s]
07:37:50 [INFO] org.eclipse.papyrus.infra.services.labelprovider 2.0.0-SNAPSHOT SUCCESS [  0.172 s]
07:37:50 [INFO] Papyrus Infra UI 0.0.1-SNAPSHOT .................... SUCCESS [  0.002 s]
07:37:50 [INFO] org.eclipse.papyrus.infra.widgets 3.6.0-SNAPSHOT ... SUCCESS [  1.105 s]
07:37:50 [INFO] org.eclipse.papyrus.infra.widgets.toolbox 2.0.0-SNAPSHOT SUCCESS [  0.278 s]
07:37:50 [INFO] org.eclipse.papyrus.infra.ui 2.1.0-SNAPSHOT ........ SUCCESS [  1.048 s]
07:37:50 [INFO] Papyrus Internationalization 0.0.1-SNAPSHOT ........ SUCCESS [  0.004 s]
07:37:50 [INFO] org.eclipse.papyrus.infra.internationalization.common 1.100.0-SNAPSHOT SUCCESS [  0.425 s]
07:37:50 [INFO] org.eclipse.papyrus.infra.internationalization 1.2.100-SNAPSHOT SUCCESS [  0.493 s]
07:37:50 [INFO] org.eclipse.papyrus.infra.onefile 2.2.0-SNAPSHOT ... SUCCESS [  0.297 s]
07:37:50 [INFO] org.eclipse.papyrus.infra.constraints.editor 2.0.0-SNAPSHOT SUCCESS [  0.452 s]
07:37:50 [INFO] org.eclipse.papyrus.infra.constraints.ui 2.0.0-SNAPSHOT SUCCESS [  0.598 s]
07:37:50 [INFO] Papyrus Editor Welcome Page 0.0.1-SNAPSHOT ......... SUCCESS [  0.002 s]
07:37:50 [INFO] org.eclipse.papyrus.infra.emf.readonly 3.1.0-SNAPSHOT SUCCESS [  0.466 s]
07:37:50 [INFO] org.eclipse.papyrus.infra.internationalization.utils 1.0.100-SNAPSHOT SUCCESS [  0.277 s]
07:37:50 [INFO] Papyrus Infra Properties Framework 0.0.1-SNAPSHOT .. SUCCESS [  0.002 s]
07:37:50 [INFO] org.eclipse.papyrus.infra.properties 3.0.0-SNAPSHOT  SUCCESS [  0.710 s]
07:37:50 [INFO] org.eclipse.papyrus.infra.ui.emf 2.2.0-SNAPSHOT .... SUCCESS [  0.640 s]
07:37:50 [INFO] org.eclipse.papyrus.infra.properties.ui 3.4.0-SNAPSHOT SUCCESS [  2.308 s]
07:37:50 [INFO] org.eclipse.papyrus.infra.editor.welcome 2.0.100-SNAPSHOT SUCCESS [  0.571 s]
07:37:50 [INFO] org.eclipse.papyrus.infra.services.navigation 3.0.0-SNAPSHOT SUCCESS [  0.305 s]
07:37:50 [INFO] org.eclipse.papyrus.infra.editor.welcome.nattable 3.0.0-SNAPSHOT SUCCESS [  0.492 s]
07:37:50 [INFO] org.eclipse.papyrus.infra.emf.appearance 2.0.0-SNAPSHOT SUCCESS [  0.220 s]
07:37:50 [INFO] org.eclipse.papyrus.infra.emf.diagram.common 2.0.0-SNAPSHOT SUCCESS [  0.285 s]
07:37:50 [INFO] org.eclipse.papyrus.infra.types.core 4.1.0-SNAPSHOT  SUCCESS [  0.350 s]
07:37:50 [INFO] org.eclipse.papyrus.infra.types.rulebased 4.0.0-SNAPSHOT SUCCESS [  0.287 s]
07:37:50 [INFO] org.eclipse.papyrus.infra.properties.edit 3.0.0-SNAPSHOT SUCCESS [  0.620 s]
07:37:50 [INFO] org.eclipse.papyrus.infra.emf.types 4.1.0-SNAPSHOT . SUCCESS [  0.493 s]
07:37:50 [INFO] org.eclipse.papyrus.infra.emf.types.ui 4.1.0-SNAPSHOT SUCCESS [  6.340 s]
07:37:50 [INFO] org.eclipse.papyrus.infra.emf.expressions.edit 1.1.0-SNAPSHOT SUCCESS [  0.295 s]
07:37:50 [INFO] org.eclipse.papyrus.infra.emf.expressions.editor 1.1.0-SNAPSHOT SUCCESS [  0.326 s]
07:37:50 [INFO] org.eclipse.papyrus.infra.emf.expressions.properties 1.0.100-SNAPSHOT SUCCESS [  0.402 s]
07:37:50 [INFO] Papyrus Infra Filters Model 0.0.1-SNAPSHOT ......... SUCCESS [  0.004 s]
07:37:50 [INFO] org.eclipse.papyrus.infra.filters 1.3.0-SNAPSHOT ... SUCCESS [  0.129 s]
07:37:50 [INFO] org.eclipse.papyrus.infra.filters.edit 1.4.0-SNAPSHOT SUCCESS [  0.115 s]
07:37:50 [INFO] org.eclipse.papyrus.infra.properties.editor 3.0.0-SNAPSHOT SUCCESS [  0.379 s]
07:37:50 [INFO] org.eclipse.papyrus.infra.services.architecture 1.0.100-SNAPSHOT SUCCESS [  0.216 s]
07:37:50 [INFO] org.eclipse.papyrus.infra.services.controlmode 2.1.0-SNAPSHOT SUCCESS [  0.649 s]
07:37:50 [INFO] org.eclipse.papyrus.infra.services.controlmode.history 2.0.0-SNAPSHOT SUCCESS [  0.190 s]
07:37:50 [INFO] org.eclipse.papyrus.infra.services.decoration 2.0.0-SNAPSHOT SUCCESS [  0.241 s]
07:37:50 [INFO] org.eclipse.papyrus.infra.services.edit.ui 3.0.0-SNAPSHOT SUCCESS [  0.342 s]
07:37:50 [INFO] org.eclipse.papyrus.infra.services.localizer 2.1.0-SNAPSHOT SUCCESS [  0.252 s]
07:37:50 [INFO] org.eclipse.papyrus.infra.services.openelement 3.0.0-SNAPSHOT SUCCESS [  0.301 s]
07:37:50 [INFO] org.eclipse.papyrus.infra.services.resourceloading 3.0.0-SNAPSHOT SUCCESS [  0.315 s]
07:37:50 [INFO] org.eclipse.papyrus.infra.services.resourceloading.ui 1.2.100-SNAPSHOT SUCCESS [  0.473 s]
07:37:50 [INFO] org.eclipse.papyrus.infra.services.semantic 2.0.0-SNAPSHOT SUCCESS [  0.133 s]
07:37:50 [INFO] org.eclipse.papyrus.infra.services.validation 3.1.100-SNAPSHOT SUCCESS [  0.366 s]
07:37:50 [INFO] org.eclipse.papyrus.infra.services.viewersearch 3.0.0-SNAPSHOT SUCCESS [  0.111 s]
07:37:50 [INFO] org.eclipse.papyrus.infra.services.viewlabelprovider 1.2.0-SNAPSHOT SUCCESS [  0.132 s]
07:37:50 [INFO] Papyrus Infra New-Child Model 0.0.1-SNAPSHOT ....... SUCCESS [  0.002 s]
07:37:50 [INFO] Papyrus Views 0.0.1-SNAPSHOT ....................... SUCCESS [  0.002 s]
07:37:50 [INFO] Papyrus Properties View 0.0.1-SNAPSHOT ............. SUCCESS [  0.001 s]
07:37:50 [INFO] org.eclipse.papyrus.views.properties 4.0.0-SNAPSHOT  SUCCESS [  0.505 s]
07:37:50 [INFO] Papyrus Diagram Infrastructure 0.0.1-SNAPSHOT ...... SUCCESS [  0.004 s]
07:37:50 [INFO] Papyrus UML Diagram PaletteConfiguration 0.0.1-SNAPSHOT SUCCESS [  0.003 s]
07:37:50 [INFO] org.eclipse.papyrus.infra.gmfdiag.paletteconfiguration 4.0.0-SNAPSHOT SUCCESS [  0.505 s]
07:37:50 [INFO] org.eclipse.papyrus.infra.gmfdiag.representation 2.1.0-SNAPSHOT SUCCESS [  0.452 s]
07:37:50 [INFO] org.eclipse.papyrus.infra.nattable.representation 2.2.0-SNAPSHOT SUCCESS [  0.621 s]
07:37:50 [INFO] Papyrus Infra Viewpoints 0.0.1-SNAPSHOT ............ SUCCESS [  0.003 s]
07:37:50 [INFO] org.eclipse.papyrus.infra.viewpoints.policy 3.2.0-SNAPSHOT SUCCESS [  0.511 s]
07:37:50 [INFO] org.eclipse.papyrus.infra.gmfdiag.commands 3.0.0-SNAPSHOT SUCCESS [  0.640 s]
07:37:50 [INFO] org.eclipse.papyrus.infra.newchild 4.1.0-SNAPSHOT .. SUCCESS [  0.714 s]
07:37:50 [INFO] org.eclipse.papyrus.infra.newchild.edit 4.1.0-SNAPSHOT SUCCESS [  0.474 s]
07:37:50 [INFO] org.eclipse.papyrus.infra.newchild.editor 3.1.0-SNAPSHOT SUCCESS [  0.698 s]
07:37:50 [INFO] org.eclipse.papyrus.infra.types.editor 3.1.0-SNAPSHOT SUCCESS [  0.175 s]
07:37:50 [INFO] org.eclipse.papyrus.infra.types.ui 3.0.100-SNAPSHOT  SUCCESS [  0.206 s]
07:37:50 [INFO] Papyrus Editor 0.0.1-SNAPSHOT ...................... SUCCESS [  0.003 s]
07:37:50 [INFO] org.eclipse.papyrus.editor 2.0.0-SNAPSHOT .......... SUCCESS [  0.445 s]
07:37:50 [INFO] org.eclipse.papyrus.infra.nattable 6.7.0-SNAPSHOT .. SUCCESS [  4.452 s]
07:37:50 [INFO] org.eclipse.papyrus.infra.emf.nattable 5.2.0-SNAPSHOT SUCCESS [  0.654 s]
07:37:50 [INFO] org.eclipse.papyrus.infra.nattable.common 5.5.0-SNAPSHOT SUCCESS [  0.837 s]
07:37:50 [INFO] org.eclipse.papyrus.infra.nattable.controlmode 2.1.0-SNAPSHOT SUCCESS [  0.677 s]
07:37:50 [INFO] org.eclipse.papyrus.infra.nattable.model.edit 4.1.0-SNAPSHOT SUCCESS [  0.549 s]
07:37:50 [INFO] org.eclipse.papyrus.infra.nattable.model.editor 5.0.0-SNAPSHOT SUCCESS [  0.694 s]
07:37:50 [INFO] org.eclipse.papyrus.infra.gmfdiag.tooling.runtime 3.1.0-SNAPSHOT SUCCESS [  0.840 s]
07:37:50 [INFO] Papyrus Infra Other Bundles 0.0.1-SNAPSHOT ......... SUCCESS [  0.003 s]
07:37:50 [INFO] org.eclipse.papyrus.infra.sync 2.1.0-SNAPSHOT ...... SUCCESS [  0.273 s]
07:37:50 [INFO] org.eclipse.papyrus.infra.gmfdiag.style 2.0.0-SNAPSHOT SUCCESS [  0.503 s]
07:37:50 [INFO] org.eclipse.papyrus.infra.gmfdiag.common 3.104.0-SNAPSHOT SUCCESS [  1.761 s]
07:37:50 [INFO] org.eclipse.papyrus.infra.gmfdiag.extensionpoints.editors 1.0.0-SNAPSHOT SUCCESS [  0.356 s]
07:37:50 [INFO] Papyrus Model Explorer View 0.0.1-SNAPSHOT ......... SUCCESS [  0.002 s]
07:37:50 [INFO] org.eclipse.papyrus.views.modelexplorer 3.1.0-SNAPSHOT SUCCESS [  4.727 s]
07:37:50 [INFO] org.eclipse.papyrus.infra.nattable.modelexplorer 4.1.0-SNAPSHOT SUCCESS [  0.555 s]
07:37:50 [INFO] org.eclipse.papyrus.infra.nattable.properties 2.5.0-SNAPSHOT SUCCESS [  0.864 s]
07:37:50 [INFO] org.eclipse.papyrus.infra.nattable.views.config 5.0.0-SNAPSHOT SUCCESS [  0.592 s]
07:37:50 [INFO] org.eclipse.papyrus.infra.nattable.views.editor 1.2.100-SNAPSHOT SUCCESS [  0.147 s]
07:37:50 [INFO] org.eclipse.papyrus.infra.nattable.representation.edit 2.2.0-SNAPSHOT SUCCESS [  0.433 s]
07:37:50 [INFO] org.eclipse.papyrus.infra.nattable.gmfdiag 1.2.100-SNAPSHOT SUCCESS [  0.448 s]
07:37:50 [INFO] org.eclipse.papyrus.infra.ui.fonts 1.0.0-SNAPSHOT .. SUCCESS [  0.172 s]
07:37:50 [INFO] org.eclipse.papyrus.infra.ui.architecture 2.1.0-SNAPSHOT SUCCESS [  0.601 s]
07:37:50 [INFO] org.eclipse.papyrus.infra.ui.resources 1.3.0-SNAPSHOT SUCCESS [  0.398 s]
07:37:50 [INFO] org.eclipse.papyrus.infra.onefile.ui 1.2.0-SNAPSHOT  SUCCESS [  0.511 s]
07:37:50 [INFO] org.eclipse.papyrus.infra.newchild.ui 2.0.100-SNAPSHOT SUCCESS [  0.397 s]
07:37:50 [INFO] org.eclipse.papyrus.infra.hyperlink 3.0.0-SNAPSHOT . SUCCESS [  0.489 s]
07:37:50 [INFO] org.eclipse.papyrus.infra.psf 1.2.0-SNAPSHOT ....... SUCCESS [  0.158 s]
07:37:50 [INFO] org.eclipse.papyrus.infra.internationalization.edit 1.0.0-SNAPSHOT SUCCESS [  0.362 s]
07:37:50 [INFO] org.eclipse.papyrus.infra.internationalization.ui 1.0.0-SNAPSHOT SUCCESS [  0.476 s]
07:37:50 [INFO] org.eclipse.papyrus.infra.internationalization.controlmode 1.0.100-SNAPSHOT SUCCESS [  0.558 s]
07:37:50 [INFO] org.eclipse.papyrus.infra.internationalization.readonly 1.1.0-SNAPSHOT SUCCESS [  0.371 s]
07:37:50 [INFO] org.eclipse.papyrus.infra.editor.welcome.internationalization 2.0.0-SNAPSHOT SUCCESS [  0.466 s]
07:37:50 [INFO] org.eclipse.papyrus.extensionpoints.editors 3.1.0-SNAPSHOT SUCCESS [  0.313 s]
07:37:50 [INFO] org.eclipse.papyrus.infra.gmfdiag.canonical 2.1.0-SNAPSHOT SUCCESS [  0.540 s]
07:37:50 [INFO] org.eclipse.papyrus.infra.gmfdiag.controlmode 1.2.0-SNAPSHOT SUCCESS [  0.323 s]
07:37:50 [INFO] org.eclipse.papyrus.infra.gmfdiag.css.model 1.3.0-SNAPSHOT SUCCESS [  0.129 s]
07:37:50 [INFO] org.eclipse.papyrus.infra.gmfdiag.css.model.edit 1.3.0-SNAPSHOT SUCCESS [  0.121 s]
07:37:50 [INFO] Papyrus Diagram Expansion 0.0.1-SNAPSHOT ........... SUCCESS [  0.002 s]
07:37:50 [INFO] org.eclipse.papyrus.infra.gmfdiag.expansion 3.0.0-SNAPSHOT SUCCESS [  0.616 s]
07:37:50 [INFO] org.eclipse.papyrus.infra.gmfdiag.dnd 1.4.0-SNAPSHOT SUCCESS [  0.737 s]
07:37:50 [INFO] Papyrus Diagram CSS Support 0.0.1-SNAPSHOT ......... SUCCESS [  0.004 s]
07:37:50 [INFO] org.eclipse.papyrus.infra.gmfdiag.css 2.4.0-SNAPSHOT SUCCESS [  1.042 s]
07:37:50 [INFO] org.eclipse.papyrus.infra.gmfdiag.export 2.1.0-SNAPSHOT SUCCESS [  0.636 s]
07:37:50 [INFO] org.eclipse.papyrus.infra.gmfdiag.gef 1.2.0-SNAPSHOT SUCCESS [  0.383 s]
07:37:50 [INFO] org.eclipse.papyrus.infra.gmfdiag.gmfmenu.filter 1.2.0-SNAPSHOT SUCCESS [  0.315 s]
07:37:50 [INFO] org.eclipse.papyrus.infra.gmfdiag.preferences 3.0.0-SNAPSHOT SUCCESS [  0.539 s]
07:37:50 [INFO] org.eclipse.papyrus.infra.gmfdiag.navigation 2.0.0-SNAPSHOT SUCCESS [  0.423 s]
07:37:50 [INFO] org.eclipse.papyrus.infra.gmfdiag.hyperlink 3.0.100-SNAPSHOT SUCCESS [  0.623 s]
07:37:50 [INFO] org.eclipse.papyrus.infra.gmfdiag.menu 1.3.0-SNAPSHOT SUCCESS [  0.369 s]
07:37:50 [INFO] org.eclipse.papyrus.infra.gmfdiag.modelexplorer 1.3.0-SNAPSHOT SUCCESS [  0.451 s]
07:37:50 [INFO] org.eclipse.papyrus.infra.gmfdiag.outline 2.0.0-SNAPSHOT SUCCESS [  0.424 s]
07:37:50 [INFO] org.eclipse.papyrus.infra.gmfdiag.properties 4.1.100-SNAPSHOT SUCCESS [  0.700 s]
07:37:50 [INFO] org.eclipse.papyrus.views.search 2.0.0-SNAPSHOT .... SUCCESS [  0.357 s]
07:37:50 [INFO] org.eclipse.papyrus.infra.gmfdiag.viewersearcher 1.2.0-SNAPSHOT SUCCESS [  0.325 s]
07:37:50 [INFO] org.eclipse.papyrus.infra.gmfdiag.welcome 1.2.100-SNAPSHOT SUCCESS [  0.466 s]
07:37:50 [INFO] org.eclipse.papyrus.infra.gmfdiag.widgets 1.2.0-SNAPSHOT SUCCESS [  0.386 s]
07:37:50 [INFO] org.eclipse.papyrus.infra.gmfdiag.paletteconfiguration.edit 4.0.0-SNAPSHOT SUCCESS [  0.575 s]
07:37:50 [INFO] org.eclipse.papyrus.infra.gmfdiag.representation.edit 2.1.0-SNAPSHOT SUCCESS [  0.486 s]
07:37:50 [INFO] org.eclipse.papyrus.infra.gmfdiag.style.edit 2.0.0-SNAPSHOT SUCCESS [  0.466 s]
07:37:50 [INFO] Papyrus Diagram Assistants 0.0.1-SNAPSHOT .......... SUCCESS [  0.002 s]
07:37:50 [INFO] org.eclipse.papyrus.infra.gmfdiag.assistant 1.5.0-SNAPSHOT SUCCESS [  0.601 s]
07:37:50 [INFO] org.eclipse.papyrus.infra.gmfdiag.assistant.edit 1.3.0-SNAPSHOT SUCCESS [  0.460 s]
07:37:50 [INFO] org.eclipse.papyrus.infra.gmfdiag.assistant.editor 1.3.0-SNAPSHOT SUCCESS [  0.441 s]
07:37:50 [INFO] org.eclipse.papyrus.infra.gmfdiag.assistant.ui 1.3.0-SNAPSHOT SUCCESS [  0.530 s]
07:37:50 [INFO] org.eclipse.papyrus.infra.gmfdiag.css.properties 3.1.0-SNAPSHOT SUCCESS [  0.526 s]
07:37:50 [INFO] org.eclipse.papyrus.infra.gmfdiag.css3.xtext 3.0.0-SNAPSHOT SUCCESS [02:18 min]
07:37:50 [INFO] org.eclipse.papyrus.infra.gmfdiag.css.configuration 2.0.0-SNAPSHOT SUCCESS [  0.666 s]
07:37:50 [INFO] org.eclipse.papyrus.infra.gmfdiag.css.theme 1.2.0-SNAPSHOT SUCCESS [  0.124 s]
07:37:50 [INFO] org.eclipse.papyrus.infra.gmfdiag.css3.xtext.ui 3.0.0-SNAPSHOT SUCCESS [  2.484 s]
07:37:50 [INFO] org.eclipse.papyrus.views.modelexplorer.newchild 1.2.100-SNAPSHOT SUCCESS [  0.774 s]
07:37:50 [INFO] org.eclipse.papyrus.views.modelexplorer.resourceloading 2.0.0-SNAPSHOT SUCCESS [  0.514 s]
07:37:50 [INFO] org.eclipse.papyrus.views.modelexplorer.widgets 2.0.0-SNAPSHOT SUCCESS [  0.446 s]
07:37:50 [INFO] org.eclipse.papyrus.views.properties.model.xwt 2.0.0-SNAPSHOT SUCCESS [  0.632 s]
07:37:50 [INFO] Papyrus Validation View 0.0.1-SNAPSHOT ............. SUCCESS [  0.003 s]
07:37:50 [INFO] org.eclipse.papyrus.views.validation 2.1.0-SNAPSHOT  SUCCESS [  0.300 s]
07:37:50 [INFO] Papyrus References View 0.0.1-SNAPSHOT ............. SUCCESS [  0.003 s]
07:37:50 [INFO] org.eclipse.papyrus.views.references 2.0.0-SNAPSHOT  SUCCESS [  0.446 s]
07:37:50 [INFO] Papyrus Documentation View 0.0.1-SNAPSHOT .......... SUCCESS [  0.004 s]
07:37:50 [INFO] Papyrus UML 0.0.1-SNAPSHOT ......................... SUCCESS [  0.003 s]
07:37:50 [INFO] org.eclipse.papyrus.uml.appearance 2.0.0-SNAPSHOT .. SUCCESS [  0.186 s]
07:37:50 [INFO] Papyrus UML Internationalization 0.0.1-SNAPSHOT .... SUCCESS [  0.004 s]
07:37:50 [INFO] org.eclipse.papyrus.uml.internationalization.utils 1.0.0-SNAPSHOT SUCCESS [  0.498 s]
07:37:50 [INFO] Papyrus UML Tools 0.0.1-SNAPSHOT ................... SUCCESS [  0.006 s]
07:37:50 [INFO] org.eclipse.papyrus.uml.tools.utils 3.5.0-SNAPSHOT . SUCCESS [  0.733 s]
07:37:50 [INFO] org.eclipse.papyrus.uml.extensionpoints 1.3.0-SNAPSHOT SUCCESS [  0.284 s]
07:37:50 [INFO] org.eclipse.papyrus.uml.internationalization.edit 1.100.100-SNAPSHOT SUCCESS [  0.596 s]
07:37:50 [INFO] org.eclipse.papyrus.uml.tools 4.3.0-SNAPSHOT ....... SUCCESS [  1.025 s]
07:37:50 [INFO] Papyrus UML Diagrams 0.0.1-SNAPSHOT ................ SUCCESS [  0.003 s]
07:37:50 [INFO] org.eclipse.papyrus.uml.diagram.wizards 3.2.0-SNAPSHOT SUCCESS [  0.899 s]
07:37:50 [INFO] org.eclipse.papyrus.uml.diagram.navigation 2.0.0-SNAPSHOT SUCCESS [  0.565 s]
07:37:50 [INFO] org.eclipse.papyrus.uml.modelrepair 2.1.0-SNAPSHOT . SUCCESS [  0.764 s]
07:37:50 [INFO] org.eclipse.papyrus.uml.profile 3.2.0-SNAPSHOT ..... SUCCESS [  0.896 s]
07:37:50 [INFO] org.eclipse.papyrus.uml.diagram.common 3.4.100-SNAPSHOT SUCCESS [ 10.520 s]
07:37:50 [INFO] org.eclipse.papyrus.uml.documentation.profile 1.3.0-SNAPSHOT SUCCESS [  0.565 s]
07:37:50 [INFO] org.eclipse.papyrus.uml.types.core 4.1.0-SNAPSHOT .. SUCCESS [  1.451 s]
07:37:50 [INFO] org.eclipse.papyrus.uml.ui 1.3.100-SNAPSHOT ........ SUCCESS [  0.614 s]
07:37:50 [INFO] org.eclipse.papyrus.views.documentation 1.0.100-SNAPSHOT SUCCESS [  0.918 s]
07:37:50 [INFO] org.eclipse.papyrus.eclipse.project.editors 2.1.0-SNAPSHOT SUCCESS [  0.613 s]
07:37:50 [INFO] org.eclipse.papyrus.editor.perspectiveconfiguration 1.2.0-SNAPSHOT SUCCESS [  0.197 s]
07:37:50 [INFO] org.eclipse.papyrus.uml.commands 1.3.100-SNAPSHOT .. SUCCESS [  0.522 s]
07:37:50 [INFO] org.eclipse.papyrus.uml.controlmode.profile 2.1.0-SNAPSHOT SUCCESS [  0.585 s]
07:37:50 [INFO] org.eclipse.papyrus.uml.filters 1.4.0-SNAPSHOT ..... SUCCESS [  0.183 s]
07:37:50 [INFO] org.eclipse.papyrus.uml.filters.edit 1.3.0-SNAPSHOT  SUCCESS [  0.120 s]
07:37:50 [INFO] org.eclipse.papyrus.uml.icons 1.2.0-SNAPSHOT ....... SUCCESS [  0.137 s]
07:37:50 [INFO] org.eclipse.papyrus.uml.import 1.2.0-SNAPSHOT ...... SUCCESS [  0.597 s]
07:37:50 [INFO] org.eclipse.papyrus.uml.export 1.0.0-SNAPSHOT ...... SUCCESS [  0.739 s]
07:37:50 [INFO] org.eclipse.papyrus.uml.navigation 1.2.0-SNAPSHOT .. SUCCESS [  0.435 s]
07:37:50 [INFO] org.eclipse.papyrus.uml.oclconstraintevaluation 1.2.0-SNAPSHOT SUCCESS [  0.495 s]
07:37:50 [INFO] org.eclipse.papyrus.uml.perspective 1.2.0-SNAPSHOT . SUCCESS [  0.376 s]
07:37:50 [INFO] org.eclipse.papyrus.uml.resourceloading.profile 1.2.100-SNAPSHOT SUCCESS [  0.470 s]
07:37:50 [INFO] org.eclipse.papyrus.uml.search.ui 2.0.100-SNAPSHOT . SUCCESS [  0.714 s]
07:37:50 [INFO] org.eclipse.papyrus.uml.service.types 4.3.0-SNAPSHOT SUCCESS [  1.290 s]
07:37:50 [INFO] org.eclipse.papyrus.uml.service.types.ui 2.1.0-SNAPSHOT SUCCESS [  1.126 s]
07:37:50 [INFO] org.eclipse.papyrus.uml.service.validation 2.1.1-SNAPSHOT SUCCESS [  0.509 s]
07:37:50 [INFO] org.eclipse.papyrus.uml.services.decoration 1.2.0-SNAPSHOT SUCCESS [  0.276 s]
07:37:50 [INFO] org.eclipse.papyrus.uml.templaterepository 2.0.100-SNAPSHOT SUCCESS [  0.401 s]
07:37:50 [INFO] Papyrus UML ALF 0.0.1-SNAPSHOT ..................... SUCCESS [  0.003 s]
07:37:50 [INFO] org.eclipse.papyrus.uml.alf.libraries 2.0.0-SNAPSHOT SUCCESS [  0.645 s]
07:37:50 [INFO] org.eclipse.papyrus.uml.alf 3.0.0-SNAPSHOT ......... SUCCESS [  5.781 s]
07:37:50 [INFO] org.eclipse.papyrus.uml.alf.common 2.0.0-SNAPSHOT .. SUCCESS [  0.464 s]
07:37:50 [INFO] org.eclipse.papyrus.uml.alf.common.ui 2.0.0-SNAPSHOT SUCCESS [  0.473 s]
07:37:50 [INFO] org.eclipse.papyrus.uml.alf.to.fuml 1.2.0-SNAPSHOT . SUCCESS [  0.718 s]
07:37:50 [INFO] Papyrus UML Xtext Integration 0.0.1-SNAPSHOT ....... SUCCESS [  0.003 s]
07:37:50 [INFO] org.eclipse.papyrus.uml.xtext.integration.core 2.1.0-SNAPSHOT SUCCESS [  0.116 s]
07:37:50 [INFO] org.eclipse.papyrus.uml.xtext.integration.ui 2.2.0-SNAPSHOT SUCCESS [  7.409 s]
07:37:50 [INFO] org.eclipse.papyrus.uml.alf.ui 3.0.0-SNAPSHOT ...... SUCCESS [  3.721 s]
07:37:50 [INFO] Papyrus UML Architecture 0.0.1-SNAPSHOT ............ SUCCESS [  0.004 s]
07:37:50 [INFO] org.eclipse.papyrus.uml.diagram.activity 3.5.0-SNAPSHOT SUCCESS [ 13.175 s]
07:37:50 [INFO] org.eclipse.papyrus.uml.diagram.clazz 3.2.0-SNAPSHOT SUCCESS [  3.153 s]
07:37:50 [INFO] org.eclipse.papyrus.uml.diagram.communication 4.1.0-SNAPSHOT SUCCESS [  1.865 s]
07:37:50 [INFO] org.eclipse.papyrus.uml.diagram.menu 2.0.100-SNAPSHOT SUCCESS [  3.293 s]
07:37:50 [INFO] org.eclipse.papyrus.uml.diagram.component 3.2.0-SNAPSHOT SUCCESS [  2.108 s]
07:37:50 [INFO] org.eclipse.papyrus.uml.diagram.composite 3.2.0-SNAPSHOT SUCCESS [  3.397 s]
07:37:50 [INFO] org.eclipse.papyrus.uml.diagram.deployment 3.2.0-SNAPSHOT SUCCESS [  1.388 s]
07:37:50 [INFO] org.eclipse.papyrus.uml.diagram.stereotype.edition 2.0.100-SNAPSHOT SUCCESS [  0.785 s]
07:37:50 [INFO] org.eclipse.papyrus.uml.diagram.modelexplorer 1.2.100-SNAPSHOT SUCCESS [  0.497 s]
07:37:50 [INFO] org.eclipse.papyrus.uml.diagram.interactionoverview 3.1.0-SNAPSHOT SUCCESS [  1.017 s]
07:37:50 [INFO] org.eclipse.papyrus.uml.diagram.profile 3.2.0-SNAPSHOT SUCCESS [  2.151 s]
07:37:50 [INFO] org.eclipse.papyrus.uml.diagram.sequence 5.3.0-SNAPSHOT SUCCESS [  2.791 s]
07:37:50 [INFO] org.eclipse.papyrus.uml.diagram.statemachine 3.2.200-SNAPSHOT SUCCESS [  1.486 s]
07:37:50 [INFO] org.eclipse.papyrus.uml.diagram.timing 1.4.200-SNAPSHOT SUCCESS [  1.767 s]
07:37:50 [INFO] org.eclipse.papyrus.uml.diagram.usecase 4.0.200-SNAPSHOT SUCCESS [  1.720 s]
07:37:50 [INFO] Papyrus UML Nattable 0.0.1-SNAPSHOT ................ SUCCESS [  0.003 s]
07:37:50 [INFO] org.eclipse.papyrus.uml.nattable 5.4.0-SNAPSHOT .... SUCCESS [  1.025 s]
07:37:50 [INFO] org.eclipse.papyrus.uml.nattable.clazz.config 5.0.0-SNAPSHOT SUCCESS [  0.430 s]
07:37:50 [INFO] org.eclipse.papyrus.uml.nattable.generic.config 1.2.100-SNAPSHOT SUCCESS [  0.489 s]
07:37:50 [INFO] org.eclipse.papyrus.uml.architecture 1.1.300-SNAPSHOT SUCCESS [  0.913 s]
07:37:50 [INFO] Papyrus UML Decorator Models 0.0.1-SNAPSHOT ........ SUCCESS [  0.003 s]
07:37:50 [INFO] org.eclipse.papyrus.uml.decoratormodel 2.3.0-SNAPSHOT SUCCESS [  0.638 s]
07:37:50 [INFO] org.eclipse.papyrus.uml.decoratormodel.controlmode 1.3.0-SNAPSHOT SUCCESS [  0.618 s]
07:37:50 [INFO] org.eclipse.papyrus.uml.nattable.stereotype.display 3.0.100-SNAPSHOT SUCCESS [  0.727 s]
07:37:50 [INFO] Papyrus UML Properties 0.0.1-SNAPSHOT .............. SUCCESS [  0.002 s]
07:37:50 [INFO] org.eclipse.papyrus.uml.properties 3.5.100-SNAPSHOT  SUCCESS [  1.466 s]
07:37:50 [INFO] org.eclipse.papyrus.uml.decoratormodel.ui 2.1.0-SNAPSHOT SUCCESS [  0.722 s]
07:37:50 [INFO] org.eclipse.papyrus.uml.decoratormodel.properties 4.1.0-SNAPSHOT SUCCESS [  0.687 s]
07:37:50 [INFO] org.eclipse.papyrus.uml.diagram.common.groups 2.0.0-SNAPSHOT SUCCESS [  0.626 s]
07:37:50 [INFO] org.eclipse.papyrus.uml.diagram.css 2.0.100-SNAPSHOT SUCCESS [  0.891 s]
07:37:50 [INFO] org.eclipse.papyrus.uml.diagram.dnd 1.3.100-SNAPSHOT SUCCESS [  0.906 s]
07:37:50 [INFO] org.eclipse.papyrus.uml.diagram.icons 1.2.0-SNAPSHOT SUCCESS [  6.993 s]
07:37:50 [INFO] org.eclipse.papyrus.uml.diagram.linklf 2.0.100-SNAPSHOT SUCCESS [  2.493 s]
07:37:50 [INFO] org.eclipse.papyrus.uml.diagram.symbols 1.2.0-SNAPSHOT SUCCESS [  1.228 s]
07:37:50 [INFO] org.eclipse.papyrus.uml.diagram.sequence.restrictions 1.0.0-SNAPSHOT SUCCESS [  0.871 s]
07:37:50 [INFO] org.eclipse.papyrus.uml.diagram.symbols.properties 1.2.0-SNAPSHOT SUCCESS [  0.395 s]
07:37:50 [INFO] Papyrus UML Expressions Infrastructure 0.0.1-SNAPSHOT SUCCESS [  0.004 s]
07:37:50 [INFO] org.eclipse.papyrus.uml.expressions 2.1.0-SNAPSHOT . SUCCESS [  0.183 s]
07:37:50 [INFO] org.eclipse.papyrus.uml.expressions.edit 2.1.0-SNAPSHOT SUCCESS [  0.381 s]
07:37:50 [INFO] org.eclipse.papyrus.uml.expressions.properties 1.0.100-SNAPSHOT SUCCESS [  0.549 s]
07:37:50 [INFO] Papyrus UML Model Explorer 0.0.1-SNAPSHOT .......... SUCCESS [  0.004 s]
07:37:50 [INFO] org.eclipse.papyrus.uml.modelexplorer 2.1.0-SNAPSHOT SUCCESS [  1.574 s]
07:37:50 [INFO] org.eclipse.papyrus.uml.modelexplorer.widgets 2.0.100-SNAPSHOT SUCCESS [  0.370 s]
07:37:50 [INFO] org.eclipse.papyrus.uml.nattable.generic 1.2.100-SNAPSHOT SUCCESS [  0.529 s]
07:37:50 [INFO] org.eclipse.papyrus.uml.nattable.matrix 1.0.200-SNAPSHOT SUCCESS [  0.786 s]
07:37:50 [INFO] org.eclipse.papyrus.uml.nattable.menu 1.2.200-SNAPSHOT SUCCESS [  1.095 s]
07:37:50 [INFO] org.eclipse.papyrus.uml.nattable.properties 1.0.200-SNAPSHOT SUCCESS [  0.695 s]
07:37:50 [INFO] org.eclipse.papyrus.uml.nattable.richtext 2.1.100-SNAPSHOT SUCCESS [  0.458 s]
07:37:50 [INFO] org.eclipse.papyrus.uml.nattable.xtext.integration 2.0.100-SNAPSHOT SUCCESS [  0.683 s]
07:37:50 [INFO] Papyrus UML Textual Edit 0.0.1-SNAPSHOT ............ SUCCESS [  0.005 s]
07:37:50 [INFO] org.eclipse.papyrus.uml.textedit.valuespecification.xtext 1.4.0-SNAPSHOT SUCCESS [  1.610 s]
07:37:50 [INFO] org.eclipse.papyrus.uml.textedit.valuespecification.xtext.utils 1.4.0-SNAPSHOT SUCCESS [  0.571 s]
07:37:50 [INFO] org.eclipse.papyrus.uml.textedit.valuespecification.xtext.ui 2.1.0-SNAPSHOT SUCCESS [  0.680 s]
07:37:50 [INFO] org.eclipse.papyrus.uml.nattable.xtext.valuespecification 5.0.0-SNAPSHOT SUCCESS [  0.773 s]
07:37:50 [INFO] Papyrus UML Profile 0.0.1-SNAPSHOT ................. SUCCESS [  0.003 s]
07:37:50 [INFO] org.eclipse.papyrus.uml.profile.drafter 1.4.0-SNAPSHOT SUCCESS [  0.874 s]
07:37:50 [INFO] org.eclipse.papyrus.uml.profile.drafter.documentation 1.2.0-SNAPSHOT SUCCESS [  0.035 s]
07:37:50 [INFO] org.eclipse.papyrus.uml.properties.xtext 1.3.100-SNAPSHOT SUCCESS [  0.792 s]
07:37:50 [INFO] org.eclipse.papyrus.uml.textedit.common.xtext 2.1.0-SNAPSHOT SUCCESS [  1.785 s]
07:37:50 [INFO] org.eclipse.papyrus.uml.textedit.collaborationuse.xtext 2.1.0-SNAPSHOT SUCCESS [  1.639 s]
07:37:50 [INFO] org.eclipse.papyrus.uml.textedit.common.xtext.ui 2.1.100-SNAPSHOT SUCCESS [  0.727 s]
07:37:50 [INFO] org.eclipse.papyrus.uml.textedit.collaborationuse.xtext.ui 2.1.0-SNAPSHOT SUCCESS [  0.884 s]
07:37:50 [INFO] org.eclipse.papyrus.uml.textedit.connectionpointreference.xtext 2.1.0-SNAPSHOT SUCCESS [  2.974 s]
07:37:50 [INFO] org.eclipse.papyrus.uml.textedit.connectionpointreference.xtext.ui 2.1.0-SNAPSHOT SUCCESS [  0.762 s]
07:37:50 [INFO] org.eclipse.papyrus.uml.textedit.constraintwithessentialocl.xtext 1.3.0-SNAPSHOT SUCCESS [  0.853 s]
07:37:50 [INFO] org.eclipse.papyrus.uml.textedit.javaconstraint 2.0.100-SNAPSHOT SUCCESS [  0.421 s]
07:37:50 [INFO] org.eclipse.papyrus.uml.textedit.message.xtext 2.1.0-SNAPSHOT SUCCESS [  1.459 s]
07:37:50 [INFO] org.eclipse.papyrus.uml.textedit.message.xtext.ui 2.1.0-SNAPSHOT SUCCESS [  0.867 s]
07:37:50 [INFO] org.eclipse.papyrus.uml.textedit.parameter.xtext 2.1.0-SNAPSHOT SUCCESS [  1.932 s]
07:37:50 [INFO] org.eclipse.papyrus.uml.textedit.parameter.xtext.ui 2.1.0-SNAPSHOT SUCCESS [  0.904 s]
07:37:50 [INFO] org.eclipse.papyrus.uml.textedit.port.xtext 1.4.0-SNAPSHOT SUCCESS [  1.991 s]
07:37:50 [INFO] org.eclipse.papyrus.uml.textedit.port.xtext.ui 2.1.0-SNAPSHOT SUCCESS [  0.747 s]
07:37:50 [INFO] org.eclipse.papyrus.uml.textedit.property.xtext 2.1.0-SNAPSHOT SUCCESS [  1.549 s]
07:37:50 [INFO] org.eclipse.papyrus.uml.textedit.property.xtext.ui 2.1.0-SNAPSHOT SUCCESS [  0.759 s]
07:37:50 [INFO] org.eclipse.papyrus.uml.textedit.state.xtext 2.1.0-SNAPSHOT SUCCESS [  1.633 s]
07:37:50 [INFO] org.eclipse.papyrus.uml.textedit.state.xtext.ui 2.1.0-SNAPSHOT SUCCESS [  0.916 s]
07:37:50 [INFO] org.eclipse.papyrus.uml.textedit.stereotypeproperty.xtext 3.0.0-SNAPSHOT SUCCESS [  5.535 s]
07:37:50 [INFO] org.eclipse.papyrus.uml.textedit.stereotypeproperty.xtext.ui 3.0.0-SNAPSHOT SUCCESS [  1.915 s]
07:37:50 [INFO] org.eclipse.papyrus.uml.textedit.transition.xtext 1.4.0-SNAPSHOT SUCCESS [  0.574 s]
07:37:50 [INFO] org.eclipse.papyrus.uml.textedit.transition.xtext.ui 2.1.0-SNAPSHOT SUCCESS [  0.695 s]
07:37:50 [INFO] org.eclipse.papyrus.uml.xtext.integration.validation 2.1.0-SNAPSHOT SUCCESS [  0.553 s]
07:37:50 [INFO] org.eclipse.papyrus.uml.internationalization 1.0.0-SNAPSHOT SUCCESS [  0.415 s]
07:37:50 [INFO] Papyrus M2M QvTo 0.0.1-SNAPSHOT .................... SUCCESS [  0.004 s]
07:37:50 [INFO] org.eclipse.papyrus.uml.m2m.qvto.common 1.1.0-SNAPSHOT SUCCESS [  0.825 s]
07:37:50 [INFO] org.eclipse.papyrus.uml.m2m.qvto.common.blackboxes 1.0.0-SNAPSHOT SUCCESS [  0.283 s]
07:37:50 [INFO] org.eclipse.papyrus.plugins-doc 0.0.1-SNAPSHOT ..... SUCCESS [  0.002 s]
07:37:50 [INFO] Papyrus Infra doc 1.2.0-SNAPSHOT ................... SUCCESS [  0.045 s]
07:37:50 [INFO] Papyrus Copypaste UI doc 1.2.0-SNAPSHOT ............ SUCCESS [  4.600 s]
07:37:50 [INFO] Papyrus Developer doc 1.0.0-SNAPSHOT ............... SUCCESS [  0.661 s]
07:37:50 [INFO] Papyrus DSML Validation doc 1.2.0-SNAPSHOT ......... SUCCESS [  0.085 s]
07:37:50 [INFO] Papyrus Infra GmfDiag Common doc 1.2.0-SNAPSHOT .... SUCCESS [  0.207 s]
07:37:50 [INFO] Papyrus Infra GmfDiag Css doc 1.2.0-SNAPSHOT ....... SUCCESS [  0.472 s]
07:37:50 [INFO] Papyrus Infra Expression doc 1.0.0-SNAPSHOT ........ SUCCESS [  0.083 s]
07:37:50 [INFO] Papyrus Internationalization doc 1.0.0-SNAPSHOT .... SUCCESS [  0.076 s]
07:37:50 [INFO] Papyrus Infra Nattable doc 1.3.0-SNAPSHOT .......... SUCCESS [  0.487 s]
07:37:50 [INFO] Papyrus Infra Newchild doc 1.2.0-SNAPSHOT .......... SUCCESS [  0.089 s]
07:37:50 [INFO] Papyrus Infra Services ControlMode doc 1.2.0-SNAPSHOT SUCCESS [  0.110 s]
07:37:50 [INFO] Papyrus Infra Service decoration doc 1.0.0-SNAPSHOT  SUCCESS [  0.133 s]
07:37:50 [INFO] Papyrus Infra Service decoration doc 1.0.0-SNAPSHOT  SUCCESS [  0.062 s]
07:37:50 [INFO] Papyrus Infra Architecture doc 1.0.0-SNAPSHOT ...... SUCCESS [  0.093 s]
07:37:50 [INFO] Papyrus Infra Types doc 3.0.0-SNAPSHOT ............. SUCCESS [  0.067 s]
07:37:50 [INFO] Papyrus Req Reqif doc 1.2.0-SNAPSHOT ............... SUCCESS [  0.123 s]
07:37:50 [INFO] Papyrus Uml DecoratorModel doc 1.2.0-SNAPSHOT ...... SUCCESS [  0.165 s]
07:37:50 [INFO] Papyrus Uml Diagram Common doc 1.2.0-SNAPSHOT ...... SUCCESS [  0.186 s]
07:37:50 [INFO] Papyrus Uml Diagram profile doc 1.2.0-SNAPSHOT ..... SUCCESS [  0.245 s]
07:37:50 [INFO] Papyrus Uml doc 1.2.0-SNAPSHOT ..................... SUCCESS [  0.440 s]
07:37:50 [INFO] Papyrus Uml Search UI doc 1.0.0-SNAPSHOT ........... SUCCESS [  0.115 s]
07:37:50 [INFO] Papyrus ModelRepair doc 1.2.0-SNAPSHOT ............. SUCCESS [  0.104 s]
07:37:50 [INFO] Papyrus Uml Profile Assistants doc 1.2.0-SNAPSHOT .. SUCCESS [  0.108 s]
07:37:50 [INFO] Papyrus Uml Search UI doc 1.2.0-SNAPSHOT ........... SUCCESS [  0.113 s]
07:37:50 [INFO] Papyrus Views Properties doc 1.3.0-SNAPSHOT ........ SUCCESS [  0.108 s]
07:37:50 [INFO] Papyrus Views References doc 1.2.0-SNAPSHOT ........ SUCCESS [  0.038 s]
07:37:50 [INFO] Papyrus Views References doc 1.0.0-SNAPSHOT ........ SUCCESS [  0.046 s]
07:37:50 [INFO] Papyrus Views References doc 1.0.0-SNAPSHOT ........ SUCCESS [  0.056 s]
07:37:50 [INFO] org.eclipse.papyrus.toolsmiths.profilemigration.doc 0.7.0-SNAPSHOT SUCCESS [  0.078 s]
07:37:50 [INFO] org.eclipse.papyrus.toolsmiths.architecture.doc 1.0.0-SNAPSHOT SUCCESS [  0.044 s]
07:37:50 [INFO] org.eclipse.papyrus.toolsmiths.validation.doc 1.0.0-SNAPSHOT SUCCESS [  0.060 s]
07:37:50 [INFO] Papyrus SDK 0.0.1-SNAPSHOT ......................... SUCCESS [  0.003 s]
07:37:50 [INFO] org.eclipse.papyrus.sdk 4.8.0-SNAPSHOT ............. SUCCESS [  0.031 s]
07:37:50 [INFO] Papyrus Examples Plugins 1.0.1-SNAPSHOT ............ SUCCESS [  0.002 s]
07:37:50 [INFO] org.eclipse.papyrus.examples.core 1.0.1-SNAPSHOT ... SUCCESS [  0.002 s]
07:37:50 [INFO] org.eclipse.papyrus.example.core.lifecycleevents 1.2.0-SNAPSHOT SUCCESS [  0.341 s]
07:37:50 [INFO] org.eclipse.papyrus.example.core.sashwindows.fulleditor 1.1.0-SNAPSHOT SUCCESS [  0.239 s]
07:37:50 [INFO] org.eclipse.papyrus.example.core.sashwindows.simpleeditor 1.1.0-SNAPSHOT SUCCESS [  0.199 s]
07:37:50 [INFO] org.eclipse.papyrus.examples.emf 1.0.1-SNAPSHOT .... SUCCESS [  0.004 s]
07:37:50 [INFO] org.eclipse.papyrus.outline.emftree 1.1.0-SNAPSHOT . SUCCESS [  0.531 s]
07:37:50 [INFO] org.eclipse.papyrus.examples.infra 1.0.1-SNAPSHOT .. SUCCESS [  0.003 s]
07:37:50 [INFO] org.eclipse.papyrus.example.infra.servicesregistry.retrieval 1.1.0-SNAPSHOT SUCCESS [  0.251 s]
07:37:50 [INFO] org.eclipse.papyrus.infra.gmfdiag.connectionpoint.preferences 1.1.0-SNAPSHOT SUCCESS [  0.420 s]
07:37:50 [INFO] org.eclipse.papyrus.examples.others 1.0.1-SNAPSHOT . SUCCESS [  0.004 s]
07:37:50 [INFO] org.eclipse.papyrus.example.diagram.simplediagram 1.1.100-SNAPSHOT SUCCESS [  0.852 s]
07:37:50 [INFO] org.eclipse.papyrus.example.text.instance 1.1.0-SNAPSHOT SUCCESS [  0.100 s]
07:37:50 [INFO] org.eclipse.papyrus.examples.uml 1.0.1-SNAPSHOT .... SUCCESS [  0.003 s]
07:37:50 [INFO] org.eclipse.papyrus.example.uml.comment.editor.newresource 1.1.0-SNAPSHOT SUCCESS [  0.356 s]
07:37:50 [INFO] org.eclipse.papyrus.example.uml.comment.editor.sharedresource 1.1.0-SNAPSHOT SUCCESS [  0.371 s]
07:37:50 [INFO] org.eclipse.papyrus.uml.diagram.emftree 1.2.0-SNAPSHOT SUCCESS [  0.256 s]
07:37:50 [INFO] org.eclipse.papyrus.uml.textual.editors.example 1.1.100-SNAPSHOT SUCCESS [  0.853 s]
07:37:50 [INFO] org.eclipse.papyrus.uml.disable.helper.advices.example 1.0.0-SNAPSHOT SUCCESS [  0.231 s]
07:37:50 [INFO] org.eclipse.papyrus.examples.uml.diagrams 1.0.0-SNAPSHOT SUCCESS [  0.237 s]
07:37:50 [INFO] org.eclipse.papyrus.example.uml.services.decorator 1.0.0-SNAPSHOT SUCCESS [  0.265 s]
07:37:50 [INFO] org.eclipse.papyrus.examples-user 1.0.1-SNAPSHOT ... SUCCESS [  0.003 s]
07:37:50 [INFO] org.eclipse.papyrus.examples.user.qvto 1.0.0-SNAPSHOT SUCCESS [  0.290 s]
07:37:50 [INFO] Papyrus Main Features 0.0.1-SNAPSHOT ............... SUCCESS [  0.006 s]
07:37:50 [INFO] org.eclipse.papyrus.doc.feature 3.1.0-SNAPSHOT ..... SUCCESS [  1.152 s]
07:37:50 [INFO] org.eclipse.papyrus.editor.feature 2.0.0-SNAPSHOT .. SUCCESS [  0.143 s]
07:37:50 [INFO] org.eclipse.papyrus.emf.facet.feature 3.0.0-SNAPSHOT SUCCESS [  0.968 s]
07:37:50 [INFO] org.eclipse.papyrus.emf.feature 1.1.0-SNAPSHOT ..... SUCCESS [  0.074 s]
07:37:50 [INFO] org.eclipse.papyrus.infra.architecture.feature 1.0.0-SNAPSHOT SUCCESS [  0.114 s]
07:37:50 [INFO] org.eclipse.papyrus.infra.core.feature 3.0.0-SNAPSHOT SUCCESS [  0.283 s]
07:37:50 [INFO] org.eclipse.papyrus.infra.emf.expressions.feature 1.0.0-SNAPSHOT SUCCESS [  0.196 s]
07:37:50 [INFO] org.eclipse.papyrus.infra.emf.feature 3.0.0-SNAPSHOT SUCCESS [  0.206 s]
07:37:50 [INFO] org.eclipse.papyrus.infra.gmfdiag.feature 3.0.0-SNAPSHOT SUCCESS [  0.822 s]
07:37:50 [INFO] org.eclipse.papyrus.infra.services.feature 3.0.0-SNAPSHOT SUCCESS [  0.296 s]
07:37:50 [INFO] org.eclipse.papyrus.infra.ui.feature 3.0.0-SNAPSHOT  SUCCESS [  0.585 s]
07:37:50 [INFO] org.eclipse.papyrus.infra.widget.feature 3.0.0-SNAPSHOT SUCCESS [  0.386 s]
07:37:50 [INFO] org.eclipse.papyrus.infra.internationalization.feature 1.0.0-SNAPSHOT SUCCESS [  0.494 s]
07:37:50 [INFO] org.eclipse.papyrus.infra.nattable.feature 4.0.0-SNAPSHOT SUCCESS [  1.626 s]
07:37:50 [INFO] org.eclipse.papyrus.infra.gmfdiag.css.feature 3.0.0-SNAPSHOT SUCCESS [  0.377 s]
07:37:50 [INFO] org.eclipse.papyrus.infra.viewpoints.feature 3.0.0-SNAPSHOT SUCCESS [  0.142 s]
07:37:50 [INFO] org.eclipse.papyrus.infra.feature 3.0.0-SNAPSHOT ... SUCCESS [  0.957 s]
07:37:50 [INFO] org.eclipse.papyrus.uml.alf.feature 3.0.0-SNAPSHOT . SUCCESS [  0.457 s]
07:37:50 [INFO] org.eclipse.papyrus.uml.architecture.feature 1.0.0-SNAPSHOT SUCCESS [  0.445 s]
07:37:50 [INFO] org.eclipse.papyrus.uml.decoratormodel.feature 3.0.0-SNAPSHOT SUCCESS [  0.346 s]
07:37:50 [INFO] org.eclipse.papyrus.uml.diagram.css.feature 2.0.0-SNAPSHOT SUCCESS [  0.382 s]
07:37:50 [INFO] org.eclipse.papyrus.uml.diagram.feature 3.0.0-SNAPSHOT SUCCESS [  0.686 s]
07:37:50 [INFO] org.eclipse.papyrus.uml.expressions.feature 1.0.0-SNAPSHOT SUCCESS [  0.274 s]
07:37:50 [INFO] org.eclipse.papyrus.uml.internationalization.feature 1.0.0-SNAPSHOT SUCCESS [  0.173 s]
07:37:50 [INFO] org.eclipse.papyrus.uml.modelexplorer.feature 2.0.0-SNAPSHOT SUCCESS [  0.358 s]
07:37:50 [INFO] org.eclipse.papyrus.uml.properties.feature 3.0.0-SNAPSHOT SUCCESS [  1.305 s]
07:37:50 [INFO] org.eclipse.papyrus.uml.tools.feature 3.0.0-SNAPSHOT SUCCESS [  0.159 s]
07:37:50 [INFO] org.eclipse.papyrus.uml.ui.feature 1.2.0-SNAPSHOT .. SUCCESS [  0.139 s]
07:37:50 [INFO] org.eclipse.papyrus.uml.textedit.feature 2.0.0-SNAPSHOT SUCCESS [  0.958 s]
07:37:50 [INFO] org.eclipse.papyrus.uml.search.feature 2.0.0-SNAPSHOT SUCCESS [  0.218 s]
07:37:50 [INFO] org.eclipse.papyrus.uml.xtext.integration.feature 2.0.0-SNAPSHOT SUCCESS [  0.198 s]
07:37:50 [INFO] org.eclipse.papyrus.uml.m2m.qvto.feature 1.0.0-SNAPSHOT SUCCESS [  0.174 s]
07:37:50 [INFO] org.eclipse.papyrus.uml.nattable.feature 4.0.0-SNAPSHOT SUCCESS [  1.179 s]
07:37:50 [INFO] org.eclipse.papyrus.uml.feature 4.0.0-SNAPSHOT ..... SUCCESS [  5.148 s]
07:37:50 [INFO] org.eclipse.papyrus.views.documentation.feature 1.0.0-SNAPSHOT SUCCESS [  0.315 s]
07:37:50 [INFO] org.eclipse.papyrus.views.search.feature 2.0.0-SNAPSHOT SUCCESS [  0.194 s]
07:37:50 [INFO] org.eclipse.papyrus.views.modelexplorer.feature 3.0.0-SNAPSHOT SUCCESS [  0.260 s]
07:37:50 [INFO] org.eclipse.papyrus.views.properties.feature 3.0.0-SNAPSHOT SUCCESS [  0.123 s]
07:37:50 [INFO] org.eclipse.papyrus.views.references.feature 2.0.0-SNAPSHOT SUCCESS [  0.097 s]
07:37:50 [INFO] org.eclipse.papyrus.views.validation.feature 2.0.0-SNAPSHOT SUCCESS [  0.202 s]
07:37:50 [INFO] org.eclipse.papyrus.views.feature 1.0.0-SNAPSHOT ... SUCCESS [  0.464 s]
07:37:50 [INFO] org.eclipse.papyrus.sdk.feature 4.8.0-SNAPSHOT ..... SUCCESS [  1.839 s]
07:37:50 [INFO] Papyrus Examples Features 0.0.1-SNAPSHOT ........... SUCCESS [  0.002 s]
07:37:50 [INFO] org.eclipse.papyrus.user.examples.feature 0.0.2-SNAPSHOT SUCCESS [  0.410 s]
07:37:50 [INFO] org.eclipse.papyrus.main.target.parent 0.0.1-SNAPSHOT SUCCESS [  0.003 s]
07:37:50 [INFO] org.eclipse.papyrus.main.portable.target 0.0.1-SNAPSHOT SUCCESS [  0.002 s]
07:37:50 [INFO] org.eclipse.papyrus.p2 4.8.0-SNAPSHOT .............. SUCCESS [01:24 min]
07:37:50 [INFO] org.eclipse.papyrus.toolsmiths.releng 1.0.0-SNAPSHOT SUCCESS [  0.479 s]
07:37:50 [INFO] Papyrus Toolsmiths Features 0.0.1-SNAPSHOT ......... SUCCESS [  0.005 s]
07:37:50 [INFO] Papyrus Toolsmiths Plugins 0.0.1-SNAPSHOT .......... SUCCESS [  0.002 s]
07:37:50 [INFO] org.eclipse.papyrus.architectureview 1.0.0-SNAPSHOT  SUCCESS [  0.823 s]
07:37:50 [INFO] org.eclipse.papyrus.dev.ui 0.0.1-SNAPSHOT .......... SUCCESS [  0.303 s]
07:37:50 [INFO] org.eclipse.papyrus.dev.view.services.edit.request 1.2.0-SNAPSHOT SUCCESS [  0.217 s]
07:37:50 [INFO] org.eclipse.papyrus.gmf.editpoliciesstates 1.2.0-SNAPSHOT SUCCESS [  0.416 s]
07:37:50 [INFO] org.eclipse.papyrus.gmf.editpartview 1.2.0-SNAPSHOT  SUCCESS [  0.554 s]
07:37:50 [INFO] org.eclipse.papyrus.gmf.figureview 1.2.0-SNAPSHOT .. SUCCESS [  0.706 s]
07:37:50 [INFO] org.eclipse.papyrus.infra.gmfdiag.css.debug 1.2.0-SNAPSHOT SUCCESS [  0.663 s]
07:37:50 [INFO] org.eclipse.papyrus.infra.emf.commandstack 1.2.0-SNAPSHOT SUCCESS [  0.584 s]
07:37:50 [INFO] org.eclipse.papyrus.dev.types 3.0.100-SNAPSHOT ..... SUCCESS [  2.781 s]
07:37:50 [INFO] org.eclipse.papyrus.dev.pluginexplorer 1.2.0-SNAPSHOT SUCCESS [  0.249 s]
07:37:50 [INFO] org.eclipse.papyrus.debug.feature 1.0.0-SNAPSHOT ... SUCCESS [  0.389 s]
07:37:50 [INFO] org.eclipse.papyrus.gmfgenextension 2.0.0-SNAPSHOT . SUCCESS [  0.645 s]
07:37:50 [INFO] org.eclipse.papyrus.def 1.3.100-SNAPSHOT ........... SUCCESS [  8.589 s]
07:37:50 [INFO] org.eclipse.papyrus.codegen 1.2.0-SNAPSHOT ......... SUCCESS [  0.581 s]
07:37:50 [INFO] Papyrus UML Assistants 0.0.1-SNAPSHOT .............. SUCCESS [  0.003 s]
07:37:50 [INFO] org.eclipse.papyrus.uml.profile.types.generator 2.2.0-SNAPSHOT SUCCESS [ 11.178 s]
07:37:50 [INFO] org.eclipse.papyrus.uml.profile.assistants.generator 4.0.0-SNAPSHOT SUCCESS [  4.686 s]
07:37:50 [INFO] org.eclipse.papyrus.dev.assistants.codegen 1.2.100-SNAPSHOT SUCCESS [  5.769 s]
07:37:50 [INFO] org.eclipse.papyrus.mwe2.utils 1.2.0-SNAPSHOT ...... SUCCESS [  0.189 s]
07:37:50 [INFO] org.eclipse.papyrus.diagramgen.feature 1.0.0-SNAPSHOT SUCCESS [  3.157 s]
07:37:50 [INFO] org.eclipse.papyrus.tests.junit-framework 0.0.1-SNAPSHOT SUCCESS [  0.006 s]
07:37:50 [INFO] org.eclipse.papyrus.junit.framework 1.3.0-SNAPSHOT . SUCCESS [  0.371 s]
07:37:50 [INFO] org.eclipse.papyrus.junit.utils 2.4.0-SNAPSHOT ..... SUCCESS [  2.914 s]
07:37:50 [INFO] org.eclipse.papyrus.bundles.tests 1.3.0-SNAPSHOT ... SUCCESS [  2.593 s]
07:37:50 [INFO] org.eclipse.papyrus.junit.feature 1.0.0-SNAPSHOT ... SUCCESS [  0.228 s]
07:37:50 [INFO] org.eclipse.papyrus.dev.project.management 1.3.0-SNAPSHOT SUCCESS [  2.356 s]
07:37:50 [INFO] org.eclipse.papyrus.releng.tools 2.1.0-SNAPSHOT .... SUCCESS [  2.345 s]
07:37:50 [INFO] org.eclipse.papyrus.releng.feature 1.0.0-SNAPSHOT .. SUCCESS [  0.853 s]
07:37:50 [INFO] org.eclipse.papyrus.customization.nattableconfiguration 2.0.100-SNAPSHOT SUCCESS [  2.993 s]
07:37:50 [INFO] org.eclipse.papyrus.infra.emf.types.ui.properties 3.0.0-SNAPSHOT SUCCESS [  0.584 s]
07:37:50 [INFO] org.eclipse.papyrus.infra.gmfdiag.expansion.edit 2.1.0-SNAPSHOT SUCCESS [  2.442 s]
07:37:50 [INFO] org.eclipse.papyrus.infra.gmfdiag.expansion.editor 2.1.0-SNAPSHOT SUCCESS [  2.695 s]
07:37:50 [INFO] org.eclipse.papyrus.infra.gmfdiag.paletteconfiguration.editor 3.2.0-SNAPSHOT SUCCESS [  0.833 s]
07:37:50 [INFO] org.eclipse.papyrus.toolsmiths 1.2.0-SNAPSHOT ...... SUCCESS [  2.156 s]
07:37:50 [INFO] org.eclipse.papyrus.toolsmiths.ecore 1.0.0-SNAPSHOT  SUCCESS [  0.359 s]
07:37:50 [INFO] org.eclipse.papyrus.toolsmiths.expressions 1.0.0-SNAPSHOT SUCCESS [  1.930 s]
07:37:50 [INFO] org.eclipse.papyrus.uml.m2m.qvto.tests.tools 1.1.0-SNAPSHOT SUCCESS [  0.521 s]
07:37:50 [INFO] org.eclipse.papyrus.uml.m2m.qvto.tests.tools.feature 1.0.0-SNAPSHOT SUCCESS [  2.003 s]
07:37:50 [INFO] org.eclipse.papyrus.toolsmiths.palette 3.0.100-SNAPSHOT SUCCESS [  0.718 s]
07:37:50 [INFO] org.eclipse.papyrus.views.properties.toolsmiths 2.1.0-SNAPSHOT SUCCESS [  3.382 s]
07:37:50 [INFO] org.eclipse.papyrus.uml.properties.generation 2.1.100-SNAPSHOT SUCCESS [  0.974 s]
07:37:50 [INFO] org.eclipse.papyrus.toolsmiths.nattable 1.0.0-SNAPSHOT SUCCESS [  2.650 s]
07:37:50 [INFO] org.eclipse.papyrus.uml.types.ui.properties 3.1.100-SNAPSHOT SUCCESS [  2.490 s]
07:37:50 [INFO] org.eclipse.papyrus.toolsmiths.profile-migration 0.0.1-SNAPSHOT SUCCESS [  0.002 s]
07:37:50 [INFO] org.eclipse.papyrus.toolsmiths.profilemigration.ui 0.8.100-SNAPSHOT SUCCESS [  2.271 s]
07:37:50 [INFO] org.eclipse.papyrus.toolsmiths.profilemigration 0.8.0-SNAPSHOT SUCCESS [  2.657 s]
07:37:50 [INFO] org.eclipse.papyrus.toolsmiths.feature 1.2.0-SNAPSHOT SUCCESS [  2.937 s]
07:37:50 [INFO] org.eclipse.papyrus.uml.profile.types.generator.ui 1.4.0-SNAPSHOT SUCCESS [  3.096 s]
07:37:50 [INFO] org.eclipse.papyrus.uml.profile.assistants.generator.ui 1.2.100-SNAPSHOT SUCCESS [  2.449 s]
07:37:50 [INFO] org.eclipse.papyrus.uml.profile.newchildmenu.generator 1.2.100-SNAPSHOT SUCCESS [  2.802 s]
07:37:50 [INFO] org.eclipse.papyrus.uml.profile.newchildmenu.generator.ui 1.2.0-SNAPSHOT SUCCESS [  2.120 s]
07:37:50 [INFO] org.eclipse.papyrus.uml.assistants.feature 4.0.0-SNAPSHOT SUCCESS [  0.328 s]
07:37:50 [INFO] org.eclipse.papyrus.toolsmiths.validations 0.0.1-SNAPSHOT SUCCESS [  0.003 s]
07:37:50 [INFO] org.eclipse.papyrus.toolsmiths.validation.common 1.0.0-SNAPSHOT SUCCESS [  0.185 s]
07:37:50 [INFO] org.eclipse.papyrus.toolsmiths.validation.architecture 1.0.0-SNAPSHOT SUCCESS [  2.237 s]
07:37:50 [INFO] org.eclipse.papyrus.toolsmiths.validation.elementtypes 1.0.0-SNAPSHOT SUCCESS [  3.071 s]
07:37:50 [INFO] org.eclipse.papyrus.toolsmiths.validation.profile 1.0.0-SNAPSHOT SUCCESS [  0.765 s]
07:37:50 [INFO] org.eclipse.papyrus.toolsmiths.validation.feature 1.0.0-SNAPSHOT SUCCESS [  0.220 s]
07:37:50 [INFO] org.eclipse.papyrus.p2.toolsmiths 1.0.0-SNAPSHOT ... SUCCESS [ 28.710 s]
07:37:50 [INFO] org.eclipse.papyrus.toolsmiths.targetplatform.parent 0.0.1-SNAPSHOT SUCCESS [  0.007 s]
07:37:50 [INFO] org.eclipse.papyrus.toolsmiths.portable.targetplatform 0.0.1-SNAPSHOT SUCCESS [  0.004 s]
07:37:50 [INFO] org.eclipse.papyrus.tests.releng 0.0.1-SNAPSHOT .... SUCCESS [ 32.490 s]
07:37:50 [INFO] org.eclipse.papyrus.plugins.tests.releng 0.0.1-SNAPSHOT SUCCESS [  0.012 s]
07:37:50 [INFO] org.eclipse.papyrus.editor.tests.releng 0.0.1-SNAPSHOT SUCCESS [  0.007 s]
07:37:50 [INFO] org.eclipse.papyrus.editor.integration.tests 1.4.0-SNAPSHOT SUCCESS [  2.981 s]
07:37:50 [INFO] org.eclipse.papyrus.infra.tests.releng 0.0.1-SNAPSHOT SUCCESS [  0.008 s]
07:37:50 [INFO] org.eclipse.papyrus.infra.core.tests.releng 0.0.1-SNAPSHOT SUCCESS [  0.004 s]
07:37:50 [INFO] org.eclipse.papyrus.infra.core.clipboard.tests 1.3.0-SNAPSHOT SUCCESS [  2.760 s]
07:37:50 [INFO] org.eclipse.papyrus.infra.core.sasheditor.tests 1.2.0-SNAPSHOT SUCCESS [  0.383 s]
07:37:50 [INFO] org.eclipse.papyrus.infra.core.sasheditor.di.tests 1.2.0-SNAPSHOT SUCCESS [  2.392 s]
07:37:50 [INFO] org.eclipse.papyrus.infra.core.tests 3.1.0-SNAPSHOT  SUCCESS [  3.138 s]
07:37:50 [INFO] org.eclipse.papyrus.infra.editor.tests.releng 0.0.1-SNAPSHOT SUCCESS [  0.011 s]
07:37:50 [INFO] org.eclipse.papyrus.infra.editor.welcome.tests 1.2.0-SNAPSHOT SUCCESS [  0.684 s]
07:37:50 [INFO] org.eclipse.papyrus.infra.emf.tests.releng 0.0.1-SNAPSHOT SUCCESS [  0.005 s]
07:37:50 [INFO] org.eclipse.papyrus.infra.emf.gmf.tests 1.2.100-SNAPSHOT SUCCESS [  2.597 s]
07:37:50 [INFO] org.eclipse.papyrus.infra.emf.readonly.tests 1.3.0-SNAPSHOT SUCCESS [  4.151 s]
07:37:50 [INFO] org.eclipse.papyrus.infra.emf.tests 1.5.0-SNAPSHOT . SUCCESS [  0.898 s]
07:37:50 [INFO] org.eclipse.papyrus.infra.filters.tests 1.2.0-SNAPSHOT SUCCESS [  2.038 s]
07:37:50 [INFO] org.eclipse.papyrus.infra.gmfdiag.tests.releng 0.0.1-SNAPSHOT SUCCESS [  0.007 s]
07:37:50 [INFO] org.eclipse.papyrus.infra.gmfdiag.assistant.tests.releng 0.0.1-SNAPSHOT SUCCESS [  0.003 s]
07:37:50 [INFO] org.eclipse.papyrus.infra.gmfdiag.assistant.tests 1.3.0-SNAPSHOT SUCCESS [  0.777 s]
07:37:50 [INFO] org.eclipse.papyrus.infra.gmfdiag.canonical.tests 1.3.0-SNAPSHOT SUCCESS [  2.439 s]
07:37:50 [INFO] org.eclipse.papyrus.infra.gmfdiag.commands.tests 1.3.0-SNAPSHOT SUCCESS [  2.759 s]
07:37:50 [INFO] org.eclipse.papyrus.infra.gmfdiag.common.tests 3.1.0-SNAPSHOT SUCCESS [  2.647 s]
07:37:50 [INFO] org.eclipse.papyrus.infra.gmfdiag.css.tests 1.2.0-SNAPSHOT SUCCESS [  2.496 s]
07:37:50 [INFO] org.eclipse.papyrus.infra.gmfdiag.menu.tests 1.2.100-SNAPSHOT SUCCESS [  0.475 s]
07:37:50 [INFO] org.eclipse.papyrus.infra.gmfdiag.paletteconfiguration.tests 1.3.0-SNAPSHOT SUCCESS [  2.489 s]
07:37:50 [INFO] org.eclipse.papyrus.infra.gmfdiag.welcome.tests 1.2.0-SNAPSHOT SUCCESS [  2.971 s]
07:37:50 [INFO] org.eclipse.papyrus.infra.nattable.main.test 1.2.0-SNAPSHOT SUCCESS [  0.003 s]
07:37:50 [INFO] org.eclipse.papyrus.infra.nattable.common.tests 1.2.200-SNAPSHOT SUCCESS [  0.552 s]
07:37:50 [INFO] org.eclipse.papyrus.infra.nattable.model.tests 1.2.100-SNAPSHOT SUCCESS [  2.652 s]
07:37:50 [INFO] org.eclipse.papyrus.infra.nattable.tests 1.2.200-SNAPSHOT SUCCESS [  3.133 s]
07:37:50 [INFO] org.eclipse.papyrus.infra.nattable.views.tests 1.2.100-SNAPSHOT SUCCESS [  0.913 s]
07:37:50 [INFO] org.eclipse.papyrus.infra.properties.tests.releng 0.0.1-SNAPSHOT SUCCESS [  0.018 s]
07:37:50 [INFO] org.eclipse.papyrus.infra.properties.ui.tests 2.0.0-SNAPSHOT SUCCESS [  2.889 s]
07:37:50 [INFO] org.eclipse.papyrus.infra.services.tests.releng 0.0.1-SNAPSHOT SUCCESS [  0.011 s]
07:37:50 [INFO] org.eclipse.papyrus.infra.services.controlmode.tests 1.5.0-SNAPSHOT SUCCESS [  2.723 s]
07:37:50 [INFO] org.eclipse.papyrus.infra.services.edit.tests 1.2.0-SNAPSHOT SUCCESS [  0.551 s]
07:37:50 [INFO] org.eclipse.papyrus.infra.services.edit.ui.tests 1.2.0-SNAPSHOT SUCCESS [  2.723 s]
07:37:50 [INFO] org.eclipse.papyrus.infra.services.resourceloading.tests 1.2.0-SNAPSHOT SUCCESS [  0.492 s]
07:37:50 [INFO] org.eclipse.papyrus.infra.services.semantic.tests 1.2.100-SNAPSHOT SUCCESS [  2.554 s]
07:37:50 [INFO] org.eclipse.papyrus.infra.tools.tests 1.3.0-SNAPSHOT SUCCESS [  2.456 s]
07:37:50 [INFO] org.eclipse.papyrus.infra.types.tests.releng 0.0.1-SNAPSHOT SUCCESS [  0.006 s]
07:37:50 [INFO] org.eclipse.papyrus.infra.types.tests 3.0.100-SNAPSHOT SUCCESS [  2.288 s]
07:37:50 [INFO] org.eclipse.papyrus.infra.types.ui.tests 3.0.100-SNAPSHOT SUCCESS [  0.793 s]
07:37:50 [INFO] org.eclipse.papyrus.infra.ui.emf.tests 1.3.0-SNAPSHOT SUCCESS [  2.668 s]
07:37:50 [INFO] org.eclipse.papyrus.infra.ui.tests 1.2.0-SNAPSHOT .. SUCCESS [  6.747 s]
07:37:50 [INFO] org.eclipse.papyrus.infra.viewpoints.tests.releng 1.2.0-SNAPSHOT SUCCESS [  0.006 s]
07:37:50 [INFO] org.eclipse.papyrus.infra.viewpoints.policy.tests 1.2.0-SNAPSHOT SUCCESS [  2.735 s]
07:37:50 [INFO] org.eclipse.papyrus.uml.tests.releng 0.0.1-SNAPSHOT  SUCCESS [  0.004 s]
07:37:50 [INFO] org.eclipse.papyrus.uml.diagram.tests.releng 1.2.0-SNAPSHOT SUCCESS [  0.004 s]
07:37:50 [INFO] org.eclipse.papyrus.uml.diagram.tests 1.3.100-SNAPSHOT SUCCESS [  2.699 s]
07:37:50 [INFO] org.eclipse.papyrus.uml.diagram.clazz.tests 1.3.100-SNAPSHOT SUCCESS [  3.351 s]
07:37:50 [INFO] org.eclipse.papyrus.uml.diagram.activity.tests 1.2.100-SNAPSHOT SUCCESS [  3.378 s]
07:37:50 [INFO] org.eclipse.papyrus.uml.diagram.usecase.tests 4.0.100-SNAPSHOT SUCCESS [  3.242 s]
07:37:50 [INFO] org.eclipse.papyrus.uml.diagram.deployment.tests 1.2.100-SNAPSHOT SUCCESS [  3.107 s]
07:37:50 [INFO] org.eclipse.papyrus.uml.diagram.component.tests 1.2.100-SNAPSHOT SUCCESS [  3.219 s]
07:37:50 [INFO] org.eclipse.papyrus.uml.diagram.timing.tests 1.2.100-SNAPSHOT SUCCESS [  2.743 s]
07:37:50 [INFO] org.eclipse.papyrus.uml.diagram.stereotypeproperty.tests 1.2.100-SNAPSHOT SUCCESS [  0.811 s]
07:37:50 [INFO] org.eclipse.papyrus.uml.diagram.sequence.tests 1.3.100-SNAPSHOT SUCCESS [  8.587 s]
07:37:50 [INFO] org.eclipse.papyrus.uml.diagram.composite.tests 1.2.100-SNAPSHOT SUCCESS [  2.823 s]
07:37:50 [INFO] org.eclipse.papyrus.uml.diagram.profile.tests 1.2.100-SNAPSHOT SUCCESS [  2.516 s]
07:37:50 [INFO] org.eclipse.papyrus.uml.dynamic.profile.tests 1.2.0-SNAPSHOT SUCCESS [  0.089 s]
07:37:50 [INFO] org.eclipse.papyrus.uml.diagram.common.tests 1.3.100-SNAPSHOT SUCCESS [  2.921 s]
07:37:50 [INFO] org.eclipse.papyrus.uml.diagram.wizards.tests 1.3.0-SNAPSHOT SUCCESS [  2.285 s]
07:37:50 [INFO] org.eclipse.papyrus.tests.uml.diagram.feature 1.2.0-SNAPSHOT SUCCESS [  0.544 s]
07:37:50 [INFO] org.eclipse.papyrus.tests.infra.services.feature 1.2.0-SNAPSHOT SUCCESS [  0.206 s]
07:37:50 [INFO] org.eclipse.papyrus.views.tests.releng 0.0.1-SNAPSHOT SUCCESS [  0.007 s]
07:37:50 [INFO] org.eclipse.papyrus.views.modelexplorer.tests 1.2.100-SNAPSHOT SUCCESS [  2.464 s]
07:37:50 [INFO] org.eclipse.papyrus.uml.modelexplorer.tests.releng 0.0.1-SNAPSHOT SUCCESS [  0.007 s]
07:37:50 [INFO] org.eclipse.papyrus.uml.modelexplorer.tests 1.3.100-SNAPSHOT SUCCESS [  2.251 s]
07:37:50 [INFO] org.eclipse.papyrus.uml.modelrepair.tests 1.3.0-SNAPSHOT SUCCESS [  2.581 s]
07:37:50 [INFO] org.eclipse.papyrus.uml.properties.tests 1.1.0-SNAPSHOT SUCCESS [  0.870 s]
07:37:50 [INFO] org.eclipse.papyrus.uml.service.types.tests 1.3.0-SNAPSHOT SUCCESS [  4.305 s]
07:37:50 [INFO] org.eclipse.papyrus.uml.service.types.ui.tests 1.2.100-SNAPSHOT SUCCESS [  2.835 s]
07:37:50 [INFO] org.eclipse.papyrus.uml.profile.tests.releng 0.0.1-SNAPSHOT SUCCESS [  0.003 s]
07:37:50 [INFO] org.eclipse.papyrus.uml.profile.drafter.tests 1.3.0-SNAPSHOT SUCCESS [  2.404 s]
07:37:50 [INFO] org.eclipse.papyrus.uml.filters.tests 1.2.0-SNAPSHOT SUCCESS [  2.366 s]
07:37:50 [INFO] org.eclipse.papyrus.uml.profile.tests 1.2.0-SNAPSHOT SUCCESS [  0.487 s]
07:37:50 [INFO] org.eclipse.papyrus.tests.uml.feature 1.2.0-SNAPSHOT SUCCESS [  0.373 s]
07:37:50 [INFO] org.eclipse.papyrus.views.documentation.tests 1.0.0-SNAPSHOT SUCCESS [  2.270 s]
07:37:50 [INFO] org.eclipse.papyrus.tests.views.feature 1.2.0-SNAPSHOT SUCCESS [  0.354 s]
07:37:50 [INFO] org.eclipse.papyrus.tests.infra.nattable.feature 1.4.0-SNAPSHOT SUCCESS [  2.168 s]
07:37:50 [INFO] org.eclipse.papyrus.uml.nattable.main.test 1.2.0-SNAPSHOT SUCCESS [  0.003 s]
07:37:50 [INFO] org.eclipse.papyrus.uml.nattable.tests 1.2.100-SNAPSHOT SUCCESS [  0.446 s]
07:37:50 [INFO] org.eclipse.papyrus.uml.nattable.generic.tests 1.2.200-SNAPSHOT SUCCESS [  3.212 s]
07:37:50 [INFO] org.eclipse.papyrus.uml.nattable.clazz.config.tests 1.2.200-SNAPSHOT SUCCESS [  3.308 s]
07:37:50 [INFO] org.eclipse.papyrus.uml.nattable.stereotyped.elements.tests 1.0.200-SNAPSHOT SUCCESS [  2.680 s]
07:37:50 [INFO] org.eclipse.papyrus.uml.nattable.matrix.tests 1.0.100-SNAPSHOT SUCCESS [  2.600 s]
07:37:50 [INFO] org.eclipse.papyrus.tests.uml.nattable.feature 1.3.0-SNAPSHOT SUCCESS [  0.431 s]
07:37:50 [INFO] org.eclipse.papyrus.tests.infra.feature 1.2.0-SNAPSHOT SUCCESS [  0.464 s]
07:37:50 [INFO] org.eclipse.papyrus.tests.infra.core.feature 1.2.0-SNAPSHOT SUCCESS [  0.197 s]
07:37:50 [INFO] org.eclipse.papyrus.uml.tools.tests.releng 0.0.1-SNAPSHOT SUCCESS [  0.004 s]
07:37:50 [INFO] org.eclipse.papyrus.uml.tools.tests 3.1.0-SNAPSHOT . SUCCESS [  4.755 s]
07:37:50 [INFO] org.eclipse.papyrus.uml.tools.utils.tests 1.3.0-SNAPSHOT SUCCESS [  3.097 s]
07:37:50 [INFO] org.eclipse.papyrus.tests.uml.tools.feature 1.2.0-SNAPSHOT SUCCESS [  0.185 s]
07:37:50 [INFO] org.eclipse.papyrus.uml.decoratormodel.tests.releng 0.0.1-SNAPSHOT SUCCESS [  0.005 s]
07:37:50 [INFO] org.eclipse.papyrus.uml.decoratormodel.controlmode.tests 1.3.0-SNAPSHOT SUCCESS [  2.646 s]
07:37:50 [INFO] org.eclipse.papyrus.uml.decoratormodel.tests 1.3.0-SNAPSHOT SUCCESS [  0.733 s]
07:37:50 [INFO] org.eclipse.papyrus.tests.uml.decoratormodel.feature 1.2.0-SNAPSHOT SUCCESS [  2.323 s]
07:37:50 [INFO] org.eclipse.papyrus.uml.textedit.tests.releng 0.0.1-SNAPSHOT SUCCESS [  0.004 s]
07:37:50 [INFO] org.eclipse.papyrus.uml.textedit.parameter.tests 1.2.100-SNAPSHOT SUCCESS [  0.723 s]
07:37:50 [INFO] org.eclipse.papyrus.uml.textedit.port.tests 1.2.100-SNAPSHOT SUCCESS [  2.925 s]
07:37:50 [INFO] org.eclipse.papyrus.uml.textedit.property.tests 1.2.200-SNAPSHOT SUCCESS [  2.753 s]
07:37:50 [INFO] org.eclipse.papyrus.uml.textedit.tests 1.3.100-SNAPSHOT SUCCESS [  0.713 s]
07:37:50 [INFO] org.eclipse.papyrus.uml.textedit.tests.feature 1.2.0-SNAPSHOT SUCCESS [  2.199 s]
07:37:50 [INFO] org.eclipse.papyrus.uml.assistants.tests.releng 0.0.1-SNAPSHOT SUCCESS [  0.006 s]
07:37:50 [INFO] org.eclipse.papyrus.uml.profile.types.generator.tests 1.2.100-SNAPSHOT SUCCESS [  2.822 s]
07:37:50 [INFO] org.eclipse.papyrus.uml.profile.assistants.generator.tests 1.2.100-SNAPSHOT SUCCESS [  0.873 s]
07:37:50 [INFO] org.eclipse.papyrus.tests.uml.assistants.feature 1.2.0-SNAPSHOT SUCCESS [  0.377 s]
07:37:50 [INFO] org.eclipse.papyrus.toolsmiths.tests.releng 0.0.1-SNAPSHOT SUCCESS [  0.002 s]
07:37:50 [INFO] org.eclipse.papyrus.toolsmiths.profilemigration.tests 0.7.0-SNAPSHOT SUCCESS [  2.686 s]
07:37:50 [INFO] org.eclipse.papyrus.toolsmiths.validation.profile.tests 1.0.0-SNAPSHOT SUCCESS [  2.757 s]
07:37:50 [INFO] org.eclipse.papyrus.toolsmiths.validation.elementtypes.tests 1.0.0-SNAPSHOT SUCCESS [  2.265 s]
07:37:50 [INFO] org.eclipse.papyrus.tests.toolsmiths.feature 1.0.0-SNAPSHOT SUCCESS [  0.269 s]
07:37:50 [INFO] org.eclipse.papyrus.tests.feature 2.0.0-SNAPSHOT ... SUCCESS [  1.123 s]
07:37:50 [INFO] org.eclipse.papyrus.infra.emf.expressions.main.tests 0.0.1-SNAPSHOT SUCCESS [  0.003 s]
07:37:50 [INFO] org.eclipse.papyrus.infra.emf.expressions.tests 1.0.0-SNAPSHOT SUCCESS [  2.122 s]
07:37:50 [INFO] org.eclipse.papyrus.tests.infra.emf.expressions.feature 1.0.0-SNAPSHOT SUCCESS [  0.023 s]
07:37:50 [INFO] org.eclipse.papyrus.infra.internationalization.main.test 1.0.0-SNAPSHOT SUCCESS [  0.004 s]
07:37:50 [INFO] org.eclipse.papyrus.infra.internationalization.tests 1.100.0-SNAPSHOT SUCCESS [  0.520 s]
07:37:50 [INFO] org.eclipse.papyrus.tests.infra.internationalization.feature 1.0.0-SNAPSHOT SUCCESS [  2.164 s]
07:37:50 [INFO] org.eclipse.papyrus.uml.expressions.tests.releng 0.0.1-SNAPSHOT SUCCESS [  0.006 s]
07:37:50 [INFO] org.eclipse.papyrus.uml.expressions.tests 1.1.0-SNAPSHOT SUCCESS [  2.968 s]
07:37:50 [INFO] org.eclipse.papyrus.tests.uml.expressions.feature 1.0.0-SNAPSHOT SUCCESS [  0.281 s]
07:37:50 [INFO] org.eclipse.papyrus.uml.internationalization.main.test 1.0.0-SNAPSHOT SUCCESS [  0.008 s]
07:37:50 [INFO] org.eclipse.papyrus.uml.internationalization.tests 1.100.0-SNAPSHOT SUCCESS [  2.528 s]
07:37:50 [INFO] org.eclipse.papyrus.uml.internationalization.controlmode.tests 1.1.0-SNAPSHOT SUCCESS [  0.684 s]
07:37:50 [INFO] org.eclipse.papyrus.tests.uml.internationalization.feature 1.0.0-SNAPSHOT SUCCESS [  0.199 s]
07:37:50 [INFO] org.eclipse.papyrus.uml.alf.tests 1.2.0-SNAPSHOT ... SUCCESS [  6.091 s]
07:37:50 [INFO] org.eclipse.papyrus.uml.alf.tests.feature 1.2.0-SNAPSHOT SUCCESS [  0.232 s]
07:37:50 [INFO] Papyrus Tests Features 0.0.1-SNAPSHOT .............. SUCCESS [  0.006 s]
07:37:50 [INFO] org.eclipse.papyrus.developer.suite.tests 0.0.1-SNAPSHOT SUCCESS [ 34.988 s]
07:37:50 [INFO] org.eclipse.papyrus.bundles.tests 0.0.1-SNAPSHOT ... SUCCESS [  0.003 s]
07:37:50 [INFO] org.eclipse.papyrus.eclipse.project.editors.tests 2.1.0-SNAPSHOT SUCCESS [  3.255 s]
07:37:50 [INFO] org.eclipse.papyrus.editors.suite.tests 0.0.1-SNAPSHOT SUCCESS [05:31 min]
07:37:50 [INFO] org.eclipse.papyrus.infra.core.suite.tests 0.0.1-SNAPSHOT SUCCESS [01:07 min]
07:37:50 [INFO] org.eclipse.papyrus.infra.nattable.suite.tests 0.0.1-SNAPSHOT SUCCESS [01:00 min]
07:37:50 [INFO] org.eclipse.papyrus.infra.architecture.tests 1.0.0-SNAPSHOT SUCCESS [  1.437 s]
07:37:50 [INFO] org.eclipse.papyrus.infra.services.labelprovider.tests 1.2.200-SNAPSHOT SUCCESS [  0.492 s]
07:37:50 [INFO] org.eclipse.papyrus.infra.ui.architecture.tests 1.0.0-SNAPSHOT SUCCESS [  2.355 s]
07:37:50 [INFO] org.eclipse.papyrus.infra.suite.tests 0.0.1-SNAPSHOT SUCCESS [05:28 min]
07:37:50 [INFO] org.eclipse.papyrus.infra.newchild.tests 1.2.100-SNAPSHOT SUCCESS [  1.174 s]
07:37:50 [INFO] org.eclipse.papyrus.uml.diagram.communication.tests 1.2.100-SNAPSHOT SUCCESS [  3.041 s]
07:37:50 [INFO] org.eclipse.papyrus.uml.diagram.interactionoverview.tests 1.2.0-SNAPSHOT SUCCESS [  3.187 s]
07:37:50 [INFO] org.eclipse.papyrus.uml.diagram.statemachine.tests 1.2.100-SNAPSHOT SUCCESS [  2.934 s]
07:37:50 [INFO] org.eclipse.papyrus.uml.diagram.suite.tests 0.0.1-SNAPSHOT SUCCESS [11:46 min]
07:37:50 [INFO] org.eclipse.papyrus.uml.diagram.dnd.tests 1.2.100-SNAPSHOT SUCCESS [  1.474 s]
07:37:50 [INFO] org.eclipse.papyrus.uml.diagram.properties.tests 1.0.0-SNAPSHOT SUCCESS [  3.465 s]
07:37:50 [INFO] org.eclipse.papyrus.uml.nattable.stereotype.display.tests 1.2.100-SNAPSHOT SUCCESS [  2.642 s]
07:37:50 [INFO] org.eclipse.papyrus.uml.nattable.suite.tests 0.0.1-SNAPSHOT SUCCESS [14:07 min]
07:37:50 [INFO] org.eclipse.papyrus.uml.textedit.valuespecification.tests 1.2.100-SNAPSHOT SUCCESS [  0.648 s]
07:37:50 [INFO] org.eclipse.papyrus.uml.textedit.suite.tests 0.0.1-SNAPSHOT SUCCESS [ 38.565 s]
07:37:50 [INFO] org.eclipse.papyrus.uml.architecture.tests 1.1.200-SNAPSHOT SUCCESS [  0.185 s]
07:37:50 [INFO] org.eclipse.papyrus.uml.validation.tests.releng 0.0.1-SNAPSHOT SUCCESS [  0.007 s]
07:37:50 [INFO] org.eclipse.papyrus.uml.validation.tests.staticprofile 1.2.0-SNAPSHOT SUCCESS [  2.005 s]
07:37:50 [INFO] org.eclipse.papyrus.uml.validation.tests.genvalidation 1.2.0-SNAPSHOT SUCCESS [  2.496 s]
07:37:50 [INFO] org.eclipse.papyrus.uml.validation.tests 1.2.100-SNAPSHOT SUCCESS [  0.945 s]
07:37:50 [INFO] org.eclipse.papyrus.uml.suite.tests 0.0.1-SNAPSHOT . SUCCESS [05:44 min]
07:37:50 [INFO] org.eclipse.papyrus.uml.alf.tests.releng 0.0.1-SNAPSHOT SUCCESS [  0.008 s]
07:37:50 [INFO] org.eclipse.papyrus.uml.alf.backend.tests 1.1.0-SNAPSHOT SUCCESS [  1.990 s]
07:37:50 [INFO] org.eclipse.papyrus.views.properties.toolsmiths.tests 1.2.0-SNAPSHOT SUCCESS [  2.539 s]
07:37:50 [INFO] org.eclipse.papyrus.views.suite.tests 0.0.1-SNAPSHOT SUCCESS [ 54.060 s]
07:37:50 [INFO] org.eclipse.papyrus.views.documentation.tests.releng 0.0.1-SNAPSHOT SUCCESS [  0.004 s]
07:37:50 [INFO] org.eclipse.papyrus.toolsmiths.suite.tests 0.0.1-SNAPSHOT SUCCESS [ 32.330 s]
07:37:50 [INFO] org.eclipse.papyrus.tests.main.releng 1.2.0-SNAPSHOT SUCCESS [  0.004 s]
07:37:50 [INFO] org.eclipse.papyrus.main.tests.target.parent 0.0.1-SNAPSHOT SUCCESS [  0.003 s]
07:37:50 [INFO] org.eclipse.papyrus.main.tests.portable.target 0.0.1-SNAPSHOT SUCCESS [  0.003 s]
07:37:50 [INFO] ------------------------------------------------------------------------
07:37:50 [INFO] BUILD SUCCESS
07:37:50 [INFO] ------------------------------------------------------------------------
07:37:50 [INFO] Total time:  01:44 h
07:37:50 [INFO] Finished at: 2020-08-03T07:37:50-04:00
07:37:50 [INFO] ------------------------------------------------------------------------
07:37:55 Terminating xvnc.
07:38:14 Recording test results
07:38:15 Build step 'Publish JUnit test result report' changed build result to UNSTABLE
07:38:15 Started calculate disk usage of build
07:38:15 Finished Calculation of disk usage of build in 0 seconds
07:38:15 Started calculate disk usage of workspace
07:38:18 Finished Calculation of disk usage of workspace in  2 second
07:38:18 [WS-CLEANUP] Deleting project workspace...
07:38:18 [WS-CLEANUP] Deferred wipeout is used...
07:38:18 [WS-CLEANUP] done
07:38:18 Finished: UNSTABLE