AbortedConsole Output

Skipping 13,844 KB.. Full Log
amPasteCommandTest)  Time elapsed: 0.946 s
14:56:30 pasteProperty(org.eclipse.papyrus.infra.gmfdiag.common.commands.tests.DefaultDiagramPasteCommandTest)  Time elapsed: 1.44 s
14:56:30 validateModel[0](org.eclipse.papyrus.infra.gmfdiag.common.tests.resources.ModelValidationTest)  Time elapsed: 0.002 s
14:56:30 validateModel[1](org.eclipse.papyrus.infra.gmfdiag.common.tests.resources.ModelValidationTest)  Time elapsed: 0.005 s
14:56:30 validateModel[0](org.eclipse.papyrus.infra.gmfdiag.common.tests.resources.TestModelValidationTest)  Time elapsed: 0.002 s
14:56:30 validateModel[1](org.eclipse.papyrus.infra.gmfdiag.common.tests.resources.TestModelValidationTest)  Time elapsed: 0.001 s
14:56:30 validateModel[2](org.eclipse.papyrus.infra.gmfdiag.common.tests.resources.TestModelValidationTest)  Time elapsed: 0.001 s
14:56:30 validateModel[3](org.eclipse.papyrus.infra.gmfdiag.common.tests.resources.TestModelValidationTest)  Time elapsed: 0.001 s
14:56:30 validateModel[4](org.eclipse.papyrus.infra.gmfdiag.common.tests.resources.TestModelValidationTest)  Time elapsed: 0.001 s
14:56:30 validateModel[5](org.eclipse.papyrus.infra.gmfdiag.common.tests.resources.TestModelValidationTest)  Time elapsed: 0.012 s
14:56:30 validateModel[6](org.eclipse.papyrus.infra.gmfdiag.common.tests.resources.TestModelValidationTest)  Time elapsed: 0.001 s
14:56:30 validateModel[7](org.eclipse.papyrus.infra.gmfdiag.common.tests.resources.TestModelValidationTest)  Time elapsed: 0.007 s
14:56:30 canonicalEdgesInClassDiagram(org.eclipse.papyrus.infra.gmfdiag.canonical.tests.BasicCanonicalClassDiagramTest)  Time elapsed: 2.172 s
14:56:30 noCanonicalViewInCanonicalView(org.eclipse.papyrus.infra.gmfdiag.canonical.tests.BasicCanonicalClassDiagramTest)  Time elapsed: 1.961 s
14:56:30 canonicalNodesInClassDiagram(org.eclipse.papyrus.infra.gmfdiag.canonical.tests.BasicCanonicalClassDiagramTest)  Time elapsed: 1.947 s
14:56:30 noCanonicalEdgeOnCanonicalView(org.eclipse.papyrus.infra.gmfdiag.canonical.tests.BasicCanonicalClassDiagramTest)  Time elapsed: 2.079 s
14:56:30 controlTestForNothingCanonical(org.eclipse.papyrus.infra.gmfdiag.canonical.tests.CanonicalStateInClassDiagramTest)  Time elapsed: 0.895 s
14:56:30 toggleCanonicalOn:execute(org.eclipse.papyrus.infra.gmfdiag.canonical.tests.CanonicalStateInClassDiagramTest)  Time elapsed: 1.572 s
14:56:30 toggleCanonicalOn:undo(org.eclipse.papyrus.infra.gmfdiag.canonical.tests.CanonicalStateInClassDiagramTest)  Time elapsed: 0 s
14:56:30 toggleCanonicalOn:redo(org.eclipse.papyrus.infra.gmfdiag.canonical.tests.CanonicalStateInClassDiagramTest)  Time elapsed: 0 s
14:56:30 toggleCanonicalInCanonicalNestedViews:on(org.eclipse.papyrus.infra.gmfdiag.canonical.tests.CanonicalStateInClassDiagramTest)  Time elapsed: 1.018 s
14:56:30 toggleCanonicalInCanonicalNestedViews:off(org.eclipse.papyrus.infra.gmfdiag.canonical.tests.CanonicalStateInClassDiagramTest)  Time elapsed: 0 s
14:56:30 toggleCanonicalOff:execute(org.eclipse.papyrus.infra.gmfdiag.canonical.tests.CanonicalStateInClassDiagramTest)  Time elapsed: 1.45 s
14:56:30 toggleCanonicalOff:undo(org.eclipse.papyrus.infra.gmfdiag.canonical.tests.CanonicalStateInClassDiagramTest)  Time elapsed: 0 s
14:56:30 toggleCanonicalOff:redo(org.eclipse.papyrus.infra.gmfdiag.canonical.tests.CanonicalStateInClassDiagramTest)  Time elapsed: 0 s
14:56:30 reorderPropertiesInClass_bug420549:execute(org.eclipse.papyrus.infra.gmfdiag.canonical.tests.EditingInModelInClassDiagramTest)  Time elapsed: 1.683 s
14:56:30 reorderPropertiesInClass_bug420549:undo(org.eclipse.papyrus.infra.gmfdiag.canonical.tests.EditingInModelInClassDiagramTest)  Time elapsed: 0 s
14:56:30 reorderPropertiesInClass_bug420549:redo(org.eclipse.papyrus.infra.gmfdiag.canonical.tests.EditingInModelInClassDiagramTest)  Time elapsed: 0 s
14:56:30 removeGeneralizationFromClass:execute(org.eclipse.papyrus.infra.gmfdiag.canonical.tests.EditingInModelInClassDiagramTest)  Time elapsed: 2.533 s
14:56:30 removeGeneralizationFromClass:undo(org.eclipse.papyrus.infra.gmfdiag.canonical.tests.EditingInModelInClassDiagramTest)  Time elapsed: 0 s
14:56:30 removeGeneralizationFromClass:redo(org.eclipse.papyrus.infra.gmfdiag.canonical.tests.EditingInModelInClassDiagramTest)  Time elapsed: 0 s
14:56:30 addAssociationToClass:execute(org.eclipse.papyrus.infra.gmfdiag.canonical.tests.EditingInModelInClassDiagramTest)  Time elapsed: 2.226 s
14:56:30 addAssociationToClass:undo(org.eclipse.papyrus.infra.gmfdiag.canonical.tests.EditingInModelInClassDiagramTest)  Time elapsed: 0 s
14:56:30 addAssociationToClass:redo(org.eclipse.papyrus.infra.gmfdiag.canonical.tests.EditingInModelInClassDiagramTest)  Time elapsed: 0 s
14:56:30 addElementImportToPackage:execute(org.eclipse.papyrus.infra.gmfdiag.canonical.tests.EditingInModelInClassDiagramTest)  Time elapsed: 2.252 s
14:56:30 addElementImportToPackage:undo(org.eclipse.papyrus.infra.gmfdiag.canonical.tests.EditingInModelInClassDiagramTest)  Time elapsed: 0 s
14:56:30 addElementImportToPackage:redo(org.eclipse.papyrus.infra.gmfdiag.canonical.tests.EditingInModelInClassDiagramTest)  Time elapsed: 0 s
14:56:30 removeOperationFromClass:execute(org.eclipse.papyrus.infra.gmfdiag.canonical.tests.EditingInModelInClassDiagramTest)  Time elapsed: 1.681 s
14:56:30 removeOperationFromClass:undo(org.eclipse.papyrus.infra.gmfdiag.canonical.tests.EditingInModelInClassDiagramTest)  Time elapsed: 0 s
14:56:30 removeOperationFromClass:redo(org.eclipse.papyrus.infra.gmfdiag.canonical.tests.EditingInModelInClassDiagramTest)  Time elapsed: 0 s
14:56:30 addInterfaceToPackage:execute(org.eclipse.papyrus.infra.gmfdiag.canonical.tests.EditingInModelInClassDiagramTest)  Time elapsed: 1.904 s
14:56:30 addInterfaceToPackage:undo(org.eclipse.papyrus.infra.gmfdiag.canonical.tests.EditingInModelInClassDiagramTest)  Time elapsed: 0 s
14:56:30 addInterfaceToPackage:redo(org.eclipse.papyrus.infra.gmfdiag.canonical.tests.EditingInModelInClassDiagramTest)  Time elapsed: 0 s
14:56:30 removeClassFromPackage:execute(org.eclipse.papyrus.infra.gmfdiag.canonical.tests.EditingInModelInClassDiagramTest)  Time elapsed: 1.765 s
14:56:30 removeClassFromPackage:undo(org.eclipse.papyrus.infra.gmfdiag.canonical.tests.EditingInModelInClassDiagramTest)  Time elapsed: 0 s
14:56:30 removeClassFromPackage:redo(org.eclipse.papyrus.infra.gmfdiag.canonical.tests.EditingInModelInClassDiagramTest)  Time elapsed: 0 s
14:56:30 addPropertyToClass:execute(org.eclipse.papyrus.infra.gmfdiag.canonical.tests.EditingInModelInClassDiagramTest)  Time elapsed: 1.555 s
14:56:30 addPropertyToClass:undo(org.eclipse.papyrus.infra.gmfdiag.canonical.tests.EditingInModelInClassDiagramTest)  Time elapsed: 0 s
14:56:30 addPropertyToClass:redo(org.eclipse.papyrus.infra.gmfdiag.canonical.tests.EditingInModelInClassDiagramTest)  Time elapsed: 0 s
14:56:30 addDependencyToClass:execute(org.eclipse.papyrus.infra.gmfdiag.canonical.tests.EditingInModelInClassDiagramTest)  Time elapsed: 2.335 s
14:56:30 addDependencyToClass:undo(org.eclipse.papyrus.infra.gmfdiag.canonical.tests.EditingInModelInClassDiagramTest)  Time elapsed: 0 s
14:56:30 addDependencyToClass:redo(org.eclipse.papyrus.infra.gmfdiag.canonical.tests.EditingInModelInClassDiagramTest)  Time elapsed: 0 s
14:56:30 deleteGeneralizationViewFromClass:execute(org.eclipse.papyrus.infra.gmfdiag.canonical.tests.CanonicalViewDeletionInClassDiagramTest)  Time elapsed: 2.114 s
14:56:30 deleteGeneralizationViewFromClass:undo(org.eclipse.papyrus.infra.gmfdiag.canonical.tests.CanonicalViewDeletionInClassDiagramTest)  Time elapsed: 0 s
14:56:30 deleteGeneralizationViewFromClass:redo(org.eclipse.papyrus.infra.gmfdiag.canonical.tests.CanonicalViewDeletionInClassDiagramTest)  Time elapsed: 0 s
14:56:30 deleteAssociationViewFromClass:execute(org.eclipse.papyrus.infra.gmfdiag.canonical.tests.CanonicalViewDeletionInClassDiagramTest)  Time elapsed: 2.362 s
14:56:30 deleteAssociationViewFromClass:undo(org.eclipse.papyrus.infra.gmfdiag.canonical.tests.CanonicalViewDeletionInClassDiagramTest)  Time elapsed: 0 s
14:56:30 deleteAssociationViewFromClass:redo(org.eclipse.papyrus.infra.gmfdiag.canonical.tests.CanonicalViewDeletionInClassDiagramTest)  Time elapsed: 0 s
14:56:30 deleteClassViewFromPackage:execute(org.eclipse.papyrus.infra.gmfdiag.canonical.tests.CanonicalViewDeletionInClassDiagramTest)  Time elapsed: 2.452 s
14:56:30 deleteClassViewFromPackage:undo(org.eclipse.papyrus.infra.gmfdiag.canonical.tests.CanonicalViewDeletionInClassDiagramTest)  Time elapsed: 0 s
14:56:30 deleteClassViewFromPackage:redo(org.eclipse.papyrus.infra.gmfdiag.canonical.tests.CanonicalViewDeletionInClassDiagramTest)  Time elapsed: 0 s
14:56:30 deleteOperationViewFromClass:execute(org.eclipse.papyrus.infra.gmfdiag.canonical.tests.CanonicalViewDeletionInClassDiagramTest)  Time elapsed: 1.886 s
14:56:30 deleteOperationViewFromClass:undo(org.eclipse.papyrus.infra.gmfdiag.canonical.tests.CanonicalViewDeletionInClassDiagramTest)  Time elapsed: 0 s
14:56:30 deleteOperationViewFromClass:redo(org.eclipse.papyrus.infra.gmfdiag.canonical.tests.CanonicalViewDeletionInClassDiagramTest)  Time elapsed: 0 s
14:56:30 deleteDataTypeFromPackage:execute(org.eclipse.papyrus.infra.gmfdiag.canonical.tests.EditingInClassDiagramRegressionTest)  Time elapsed: 1.997 s
14:56:30 deleteDataTypeFromPackage:undo(org.eclipse.papyrus.infra.gmfdiag.canonical.tests.EditingInClassDiagramRegressionTest)  Time elapsed: 0 s
14:56:30 deleteDataTypeFromPackage:redo(org.eclipse.papyrus.infra.gmfdiag.canonical.tests.EditingInClassDiagramRegressionTest)  Time elapsed: 0 s
14:56:30 deleteAssociationFromClass:execute(org.eclipse.papyrus.infra.gmfdiag.canonical.tests.EditingInClassDiagramRegressionTest)  Time elapsed: 2.201 s
14:56:30 deleteAssociationFromClass:undo(org.eclipse.papyrus.infra.gmfdiag.canonical.tests.EditingInClassDiagramRegressionTest)  Time elapsed: 0 s
14:56:30 deleteAssociationFromClass:redo(org.eclipse.papyrus.infra.gmfdiag.canonical.tests.EditingInClassDiagramRegressionTest)  Time elapsed: 0 s
14:56:30 deleteLiteralInEnumeration:execute(org.eclipse.papyrus.infra.gmfdiag.canonical.tests.EditingInClassDiagramRegressionTest)  Time elapsed: 1.85 s
14:56:30 deleteLiteralInEnumeration:undo(org.eclipse.papyrus.infra.gmfdiag.canonical.tests.EditingInClassDiagramRegressionTest)  Time elapsed: 0 s
14:56:30 deleteLiteralInEnumeration:redo(org.eclipse.papyrus.infra.gmfdiag.canonical.tests.EditingInClassDiagramRegressionTest)  Time elapsed: 0 s
14:56:30 createPropertyInClass:execute(org.eclipse.papyrus.infra.gmfdiag.canonical.tests.EditingInClassDiagramRegressionTest)  Time elapsed: 1.675 s
14:56:30 createPropertyInClass:undo(org.eclipse.papyrus.infra.gmfdiag.canonical.tests.EditingInClassDiagramRegressionTest)  Time elapsed: 0 s
14:56:30 createPropertyInClass:redo(org.eclipse.papyrus.infra.gmfdiag.canonical.tests.EditingInClassDiagramRegressionTest)  Time elapsed: 0 s
14:56:30 createDependencyInClass:execute(org.eclipse.papyrus.infra.gmfdiag.canonical.tests.EditingInClassDiagramRegressionTest)  Time elapsed: 3.135 s
14:56:30 createDependencyInClass:undo(org.eclipse.papyrus.infra.gmfdiag.canonical.tests.EditingInClassDiagramRegressionTest)  Time elapsed: 0 s
14:56:30 createDependencyInClass:redo(org.eclipse.papyrus.infra.gmfdiag.canonical.tests.EditingInClassDiagramRegressionTest)  Time elapsed: 0 s
14:56:30 createInterfaceInPackage:execute(org.eclipse.papyrus.infra.gmfdiag.canonical.tests.EditingInClassDiagramRegressionTest)  Time elapsed: 2.117 s
14:56:30 createInterfaceInPackage:undo(org.eclipse.papyrus.infra.gmfdiag.canonical.tests.EditingInClassDiagramRegressionTest)  Time elapsed: 0 s
14:56:30 createInterfaceInPackage:redo(org.eclipse.papyrus.infra.gmfdiag.canonical.tests.EditingInClassDiagramRegressionTest)  Time elapsed: 0.001 s
14:56:30 canonicalEdgesInClassDiagram(org.eclipse.papyrus.infra.gmfdiag.canonical.tests.CSSCanonicalClassDiagramTest)  Time elapsed: 1.554 s
14:56:30 nestedCanonicalNodesByMetaclassSelectorInCanonicalView(org.eclipse.papyrus.infra.gmfdiag.canonical.tests.CSSCanonicalClassDiagramTest)  Time elapsed: 1.278 s
14:56:30 nestedCanonicalEdgesInCanonicalView(org.eclipse.papyrus.infra.gmfdiag.canonical.tests.CSSCanonicalClassDiagramTest)  Time elapsed: 1.866 s
14:56:30 canonicalNodesByMetaclassSelectorInClassDiagram(org.eclipse.papyrus.infra.gmfdiag.canonical.tests.CSSCanonicalClassDiagramTest)  Time elapsed: 1.883 s
14:56:30 canonicalNodesByExplicitStyleClassInClassDiagram(org.eclipse.papyrus.infra.gmfdiag.canonical.tests.CSSCanonicalClassDiagramTest)  Time elapsed: 1.641 s
14:56:30 controlTestForNothingCanonical(org.eclipse.papyrus.infra.gmfdiag.canonical.tests.CSSCanonicalStateInClassDiagramTest)  Time elapsed: 0.993 s
14:56:30 overrideSelectorRule(org.eclipse.papyrus.infra.gmfdiag.canonical.tests.CSSCanonicalStateInClassDiagramTest)  Time elapsed: 2.446 s
14:56:30 overrideExplicitClassRule(org.eclipse.papyrus.infra.gmfdiag.canonical.tests.CSSCanonicalStateInClassDiagramTest)  Time elapsed: 4.666 s
14:56:30 addStyleClass:execute(org.eclipse.papyrus.infra.gmfdiag.canonical.tests.CSSCanonicalStateInClassDiagramTest)  Time elapsed: 3.571 s
14:56:30 addStyleClass:undo(org.eclipse.papyrus.infra.gmfdiag.canonical.tests.CSSCanonicalStateInClassDiagramTest)  Time elapsed: 0 s
14:56:30 addStyleClass:redo(org.eclipse.papyrus.infra.gmfdiag.canonical.tests.CSSCanonicalStateInClassDiagramTest)  Time elapsed: 0 s
14:56:30 addStylesheet:execute(org.eclipse.papyrus.infra.gmfdiag.canonical.tests.CSSCanonicalStateInClassDiagramTest)  Time elapsed: 2.222 s
14:56:30 addStylesheet:undo(org.eclipse.papyrus.infra.gmfdiag.canonical.tests.CSSCanonicalStateInClassDiagramTest)  Time elapsed: 0 s
14:56:30 addStylesheet:redo(org.eclipse.papyrus.infra.gmfdiag.canonical.tests.CSSCanonicalStateInClassDiagramTest)  Time elapsed: 0 s
14:56:30 editStylesheetRefresh:initial(org.eclipse.papyrus.infra.gmfdiag.canonical.tests.CSSExternalStylesheetInClassDiagramTest)  Time elapsed: 2.62 s
14:56:30 editStylesheetRefresh:non-canonical(org.eclipse.papyrus.infra.gmfdiag.canonical.tests.CSSExternalStylesheetInClassDiagramTest)  Time elapsed: 0 s
14:56:30 editStylesheetRefresh:canonical(org.eclipse.papyrus.infra.gmfdiag.canonical.tests.CSSExternalStylesheetInClassDiagramTest)  Time elapsed: 0 s
14:56:30 editStylesheetRefresh:undo(org.eclipse.papyrus.infra.gmfdiag.canonical.tests.CSSExternalStylesheetInClassDiagramTest)  Time elapsed: 0 s
14:56:30 editStylesheetRefresh:redo(org.eclipse.papyrus.infra.gmfdiag.canonical.tests.CSSExternalStylesheetInClassDiagramTest)  Time elapsed: 0 s
14:56:30 editStylesheetRefresh_closeReopenDiagram_undo:initial(org.eclipse.papyrus.infra.gmfdiag.canonical.tests.CSSExternalStylesheetInClassDiagramTest)  Time elapsed: 2.184 s
14:56:30 editStylesheetRefresh_closeReopenDiagram_undo:close-reopen(org.eclipse.papyrus.infra.gmfdiag.canonical.tests.CSSExternalStylesheetInClassDiagramTest)  Time elapsed: 0 s
14:56:30 editStylesheetRefresh_closeReopenDiagram_undo:undo(org.eclipse.papyrus.infra.gmfdiag.canonical.tests.CSSExternalStylesheetInClassDiagramTest)  Time elapsed: 0 s
14:56:30 associationEndWhenNoAssociationEdge_bug473148(org.eclipse.papyrus.infra.gmfdiag.canonical.tests.RegressionTest) skipped
14:56:30 nestedClassifiersDontCauseLoopInCompositeDiagram_bug474489(org.eclipse.papyrus.infra.gmfdiag.canonical.tests.RegressionTest)  Time elapsed: 1.291 s
14:56:30 associationEndCanonicalPresentation_bug473148(org.eclipse.papyrus.infra.gmfdiag.canonical.tests.RegressionTest)  Time elapsed: 1.347 s
14:56:30 referenceConnectionNotDeleted_bug472155:initial(org.eclipse.papyrus.infra.gmfdiag.canonical.tests.RegressionTest)  Time elapsed: 0.825 s
14:56:30 referenceConnectionNotDeleted_bug472155:synch(org.eclipse.papyrus.infra.gmfdiag.canonical.tests.RegressionTest)  Time elapsed: 0 s
14:56:30 referenceConnectionNotDeleted_bug472155:undo(org.eclipse.papyrus.infra.gmfdiag.canonical.tests.RegressionTest)  Time elapsed: 0 s
14:56:30 referenceConnectionNotDeleted_bug472155:redo(org.eclipse.papyrus.infra.gmfdiag.canonical.tests.RegressionTest)  Time elapsed: 0 s
14:56:30 testReadOnlyAxisTransactionOption(org.eclipse.papyrus.infra.emf.readonly.PapyrusROTransactionalEditingDomainTest)  Time elapsed: 0.052 s
14:56:30 testReferenceToReadOnlyObjectWithOppositeRolledBackCommand(org.eclipse.papyrus.infra.emf.readonly.PapyrusROTransactionalEditingDomainTest)  Time elapsed: 0.096 s
14:56:30 testReferenceToReadOnlyObjectWithOppositeRolledBackOperation(org.eclipse.papyrus.infra.emf.readonly.PapyrusROTransactionalEditingDomainTest)  Time elapsed: 0.237 s
14:56:30 testIsReadOnlyEObject(org.eclipse.papyrus.infra.emf.readonly.ReadOnlyManagerTest)  Time elapsed: 0.035 s
14:56:30 testSashModelReadOnlyIfPermissionReadOnly(org.eclipse.papyrus.infra.emf.readonly.ReadOnlyManagerTest)  Time elapsed: 0.044 s
14:56:30 testAnyReadOnlyURIs(org.eclipse.papyrus.infra.emf.readonly.ReadOnlyManagerTest)  Time elapsed: 0.037 s
14:56:30 testCanMakeWritableEObject(org.eclipse.papyrus.infra.emf.readonly.ReadOnlyManagerTest)  Time elapsed: 0.033 s
14:56:30 testCanMakeWritableURIs(org.eclipse.papyrus.infra.emf.readonly.ReadOnlyManagerTest)  Time elapsed: 0.034 s
14:56:30 testCanMakeWritable(org.eclipse.papyrus.infra.emf.readonly.ReadOnlyTesterTest)  Time elapsed: 0.032 s
14:56:30 testAsBoolean(org.eclipse.papyrus.infra.emf.readonly.ReadOnlyTesterTest)  Time elapsed: 0.039 s
14:56:30 testIsReadOnly(org.eclipse.papyrus.infra.emf.readonly.ReadOnlyTesterTest)  Time elapsed: 0.031 s
14:56:30 testGetSashRow__int_int(org.eclipse.papyrus.infra.editor.welcome.tests.WelcomePageTest)  Time elapsed: 0.008 s
14:56:30 testGetVisibleSections(org.eclipse.papyrus.infra.editor.welcome.tests.WelcomePageTest)  Time elapsed: 0.002 s
14:56:30 testGetSashColumn__int(org.eclipse.papyrus.infra.editor.welcome.tests.WelcomePageTest)  Time elapsed: 0 s
14:56:30 testGetSection__String(org.eclipse.papyrus.infra.editor.welcome.tests.WelcomePageTest)  Time elapsed: 0.001 s
14:56:30 testIsIdentifiedBy__String(org.eclipse.papyrus.infra.editor.welcome.tests.WelcomeSectionTest)  Time elapsed: 0 s
14:56:30 testGetSashRow__int(org.eclipse.papyrus.infra.editor.welcome.tests.SashColumnTest)  Time elapsed: 0 s
14:56:30 openWelcomePage(org.eclipse.papyrus.infra.editor.welcome.tests.WelcomePageServiceTest)  Time elapsed: 0.617 s
14:56:30 closeWelcomePage(org.eclipse.papyrus.infra.editor.welcome.tests.WelcomePageServiceTest)  Time elapsed: 0.688 s
14:56:30 pageRemovalValidator(org.eclipse.papyrus.infra.editor.welcome.tests.WelcomePageServiceTest)  Time elapsed: 1.672 s
14:56:30 emptyModelShowsWelcomePage(org.eclipse.papyrus.infra.editor.welcome.tests.WelcomePageServiceTest)  Time elapsed: 0.549 s
14:56:30 emptyModelCannotCloseWelcomePage(org.eclipse.papyrus.infra.editor.welcome.tests.WelcomePageServiceTest)  Time elapsed: 0.512 s
14:56:30 canCloseWelcomePage(org.eclipse.papyrus.infra.editor.welcome.tests.WelcomePageServiceTest)  Time elapsed: 0.629 s
14:56:30 welcomeModelResource(org.eclipse.papyrus.infra.editor.welcome.tests.WelcomePageServiceTest)  Time elapsed: 0.493 s
14:56:30 welcomeModelElement(org.eclipse.papyrus.infra.editor.welcome.tests.WelcomePageServiceTest)  Time elapsed: 0.603 s
14:56:30 getOwner(org.eclipse.papyrus.infra.editor.welcome.tests.WelcomePageServiceTest)  Time elapsed: 0.606 s
14:56:30 languagesProperty(org.eclipse.papyrus.infra.editor.welcome.tests.WelcomeModelElementTest)  Time elapsed: 0.953 s
14:56:30 isEditableRestoreActivePage(org.eclipse.papyrus.infra.editor.welcome.tests.WelcomeModelElementTest)  Time elapsed: 1.008 s
14:56:30 privateLayoutProperty(org.eclipse.papyrus.infra.editor.welcome.tests.WelcomeModelElementTest)  Time elapsed: 0.786 s
14:56:30 restoreActivePageProperty(org.eclipse.papyrus.infra.editor.welcome.tests.WelcomeModelElementTest) skipped
14:56:30 isEditable(org.eclipse.papyrus.infra.editor.welcome.tests.WelcomeModelElementTest)  Time elapsed: 0.698 s
14:56:30 dispose_bug487027(org.eclipse.papyrus.infra.editor.welcome.tests.WelcomeModelElementTest)  Time elapsed: 0.709 s
14:56:30 viewsProperty(org.eclipse.papyrus.infra.gmfdiag.welcome.tests.WelcomeModelElementTest)  Time elapsed: 0.86 s
14:56:30 isEditable(org.eclipse.papyrus.infra.gmfdiag.welcome.tests.WelcomeModelElementTest)  Time elapsed: 0.791 s
14:56:30 createView(org.eclipse.papyrus.infra.gmfdiag.welcome.tests.WelcomeModelElementTest)  Time elapsed: 1.477 s
14:56:30 dispose_bug487027(org.eclipse.papyrus.infra.gmfdiag.welcome.tests.WelcomeModelElementTest)  Time elapsed: 1.937 s
14:56:30 deleteView(org.eclipse.papyrus.infra.gmfdiag.welcome.tests.WelcomeModelElementTest)  Time elapsed: 1.621 s
14:56:30 viewsPropertyExcludesPluginDeployedModels_bug493668(org.eclipse.papyrus.infra.gmfdiag.welcome.tests.NotationObservablePropertyTest)  Time elapsed: 0.935 s
14:56:30 labelProviderChange(org.eclipse.papyrus.infra.properties.ui.providers.tests.PropertiesHeaderLabelProviderTest)  Time elapsed: 0.056 s
14:56:30 createWithLocalFactory(org.eclipse.papyrus.infra.properties.ui.tests.EcorePropertyEditorFactoryTest)  Time elapsed: 0.024 s
14:56:30 testMatches__Object_not(org.eclipse.papyrus.infra.filters.tests.CompoundFilterTest)  Time elapsed: 0.003 s
14:56:30 testMatches__Object_xor(org.eclipse.papyrus.infra.filters.tests.CompoundFilterTest)  Time elapsed: 0 s
14:56:30 testMatches__Object(org.eclipse.papyrus.infra.filters.tests.CompoundFilterTest)  Time elapsed: 0 s
14:56:30 testMatches__Object_or(org.eclipse.papyrus.infra.filters.tests.CompoundFilterTest)  Time elapsed: 0 s
14:56:30 testValidateAcyclic__DiagnosticChain_Map(org.eclipse.papyrus.infra.filters.tests.CompoundFilterTest)  Time elapsed: 0.001 s
14:56:30 testMatches__Object(org.eclipse.papyrus.infra.filters.tests.EqualsTest)  Time elapsed: 0.001 s
14:56:30 testMatches__Object(org.eclipse.papyrus.infra.gmfdiag.assistant.tests.AssistedElementTypeFilterTest)  Time elapsed: 0.013 s
14:56:30 testGetProvider(org.eclipse.papyrus.infra.gmfdiag.assistant.tests.AssistedElementTypeFilterTest)  Time elapsed: 0.002 s
14:56:30 testGetRelTypesOnSourceAndTarget__IAdaptable_IAdaptable(org.eclipse.papyrus.infra.gmfdiag.assistant.tests.ModelingAssistantProviderTest)  Time elapsed: 0.004 s
14:56:30 testGetRelTypesForSREOnSource__IAdaptable(org.eclipse.papyrus.infra.gmfdiag.assistant.tests.ModelingAssistantProviderTest)  Time elapsed: 0.002 s
14:56:30 testRemoveProviderChangeListener__IProviderChangeListener(org.eclipse.papyrus.infra.gmfdiag.assistant.tests.ModelingAssistantProviderTest)  Time elapsed: 0.001 s
14:56:30 testGetTypesForTarget__IAdaptable_IElementType(org.eclipse.papyrus.infra.gmfdiag.assistant.tests.ModelingAssistantProviderTest)  Time elapsed: 0.003 s
14:56:30 testGetClientContext(org.eclipse.papyrus.infra.gmfdiag.assistant.tests.ModelingAssistantProviderTest)  Time elapsed: 0.002 s
14:56:30 testAddProviderChangeListener__IProviderChangeListener(org.eclipse.papyrus.infra.gmfdiag.assistant.tests.ModelingAssistantProviderTest)  Time elapsed: 0.001 s
14:56:30 testSelectExistingElementForTarget__IAdaptable_IElementType(org.eclipse.papyrus.infra.gmfdiag.assistant.tests.ModelingAssistantProviderTest)  Time elapsed: 0.002 s
14:56:30 testGetRelTypesOnSource__IAdaptable(org.eclipse.papyrus.infra.gmfdiag.assistant.tests.ModelingAssistantProviderTest)  Time elapsed: 0.003 s
14:56:30 testGetElementType__String(org.eclipse.papyrus.infra.gmfdiag.assistant.tests.ModelingAssistantProviderTest)  Time elapsed: 0.002 s
14:56:30 testGetExcludedElementTypes(org.eclipse.papyrus.infra.gmfdiag.assistant.tests.ModelingAssistantProviderTest)  Time elapsed: 0.001 s
14:56:30 testGetTypesForSource__IAdaptable_IElementType(org.eclipse.papyrus.infra.gmfdiag.assistant.tests.ModelingAssistantProviderTest)  Time elapsed: 0.003 s
14:56:30 testSelectExistingElementForSource__IAdaptable_IElementType(org.eclipse.papyrus.infra.gmfdiag.assistant.tests.ModelingAssistantProviderTest)  Time elapsed: 0.001 s
14:56:30 testGetTypesForPopupBar__IAdaptable(org.eclipse.papyrus.infra.gmfdiag.assistant.tests.ModelingAssistantProviderTest)  Time elapsed: 0.002 s
14:56:30 testGetRelTypesForSREOnTarget__IAdaptable(org.eclipse.papyrus.infra.gmfdiag.assistant.tests.ModelingAssistantProviderTest)  Time elapsed: 0.001 s
14:56:30 testGetElementTypes(org.eclipse.papyrus.infra.gmfdiag.assistant.tests.ModelingAssistantProviderTest)  Time elapsed: 0.001 s
14:56:30 testIsRelationshipType__IElementType(org.eclipse.papyrus.infra.gmfdiag.assistant.tests.ModelingAssistantProviderTest)  Time elapsed: 0.001 s
14:56:30 testGetTypes__String_IAdaptable(org.eclipse.papyrus.infra.gmfdiag.assistant.tests.ModelingAssistantProviderTest)  Time elapsed: 0.001 s
14:56:30 testGetRelationshipTypes(org.eclipse.papyrus.infra.gmfdiag.assistant.tests.ModelingAssistantProviderTest)  Time elapsed: 0.001 s
14:56:30 testGetRelTypesOnTarget__IAdaptable(org.eclipse.papyrus.infra.gmfdiag.assistant.tests.ModelingAssistantProviderTest)  Time elapsed: 0.003 s
14:56:30 testProvides__IOperation(org.eclipse.papyrus.infra.gmfdiag.assistant.tests.ModelingAssistantProviderTest)  Time elapsed: 0.002 s
14:56:30 testGetElementType(org.eclipse.papyrus.infra.gmfdiag.assistant.tests.PopupAssistantTest)  Time elapsed: 0 s
14:56:30 testGetElementType(org.eclipse.papyrus.infra.gmfdiag.assistant.tests.ConnectionAssistantTest)  Time elapsed: 0 s
14:56:30 testGetElementType(org.eclipse.papyrus.infra.gmfdiag.assistant.tests.ElementTypeFilterTest)  Time elapsed: 0 s
14:56:30 testMatches__Object(org.eclipse.papyrus.infra.gmfdiag.assistant.tests.ElementTypeFilterTest)  Time elapsed: 0 s
14:56:30 testGetProvider(org.eclipse.papyrus.infra.gmfdiag.assistant.tests.ElementTypeFilterTest)  Time elapsed: 0 s
14:56:30 sourceForConnectionToTarget(org.eclipse.papyrus.infra.gmfdiag.assistant.tests.GenericModelingAssistantIntegrationTest)  Time elapsed: 0.07 s  <<< FAILURE!
14:56:30 java.lang.AssertionError: 
14:56:30 
14:56:30 Expected: a collection containing (is identified by org.eclipse.papyrus.example.j2ee.WebScenario and is proxy type(is identified by org.eclipse.papyrus.example.j2ee.WebScenario, is identified by org.eclipse.papyrus.umldi.UseCase_Shape))
14:56:30      but: 
14:56:30 	at org.eclipse.papyrus.infra.gmfdiag.assistant.tests.GenericModelingAssistantIntegrationTest.sourceForConnectionToTarget(GenericModelingAssistantIntegrationTest.java:127)
14:56:30 
14:56:30 excludedConnectionFromSource(org.eclipse.papyrus.infra.gmfdiag.assistant.tests.GenericModelingAssistantIntegrationTest)  Time elapsed: 0.145 s
14:56:30 connectionToTarget(org.eclipse.papyrus.infra.gmfdiag.assistant.tests.GenericModelingAssistantIntegrationTest)  Time elapsed: 0.135 s
14:56:30 excludedConnectionToTarget(org.eclipse.papyrus.infra.gmfdiag.assistant.tests.GenericModelingAssistantIntegrationTest)  Time elapsed: 0.109 s
14:56:30 excludedTargetForConnectionFromSource(org.eclipse.papyrus.infra.gmfdiag.assistant.tests.GenericModelingAssistantIntegrationTest)  Time elapsed: 0.006 s
14:56:30 excludedSourceForConnectionToTarget(org.eclipse.papyrus.infra.gmfdiag.assistant.tests.GenericModelingAssistantIntegrationTest)  Time elapsed: 0.006 s
14:56:30 excludedConnectionFromSourceToTarget(org.eclipse.papyrus.infra.gmfdiag.assistant.tests.GenericModelingAssistantIntegrationTest)  Time elapsed: 0.089 s
14:56:30 targetForConnectionFromSource(org.eclipse.papyrus.infra.gmfdiag.assistant.tests.GenericModelingAssistantIntegrationTest)  Time elapsed: 0.006 s  <<< FAILURE!
14:56:30 java.lang.AssertionError: 
14:56:30 
14:56:30 Expected: a collection containing (is identified by org.eclipse.papyrus.example.j2ee.WebScenario and is proxy type(is identified by org.eclipse.papyrus.example.j2ee.WebScenario, is identified by org.eclipse.papyrus.umldi.UseCase_Shape))
14:56:30      but: 
14:56:30 	at org.eclipse.papyrus.infra.gmfdiag.assistant.tests.GenericModelingAssistantIntegrationTest.targetForConnectionFromSource(GenericModelingAssistantIntegrationTest.java:109)
14:56:30 
14:56:30 popupOnDiagramSurface(org.eclipse.papyrus.infra.gmfdiag.assistant.tests.GenericModelingAssistantIntegrationTest)  Time elapsed: 0.031 s
14:56:30 connectionFromSource(org.eclipse.papyrus.infra.gmfdiag.assistant.tests.GenericModelingAssistantIntegrationTest)  Time elapsed: 0.094 s
14:56:30 popupOnShape(org.eclipse.papyrus.infra.gmfdiag.assistant.tests.GenericModelingAssistantIntegrationTest)  Time elapsed: 0.086 s
14:56:30 excludedPopupOnDiagramSurface(org.eclipse.papyrus.infra.gmfdiag.assistant.tests.GenericModelingAssistantIntegrationTest)  Time elapsed: 0.033 s
14:56:30 connectionFromSourceToTarget(org.eclipse.papyrus.infra.gmfdiag.assistant.tests.GenericModelingAssistantIntegrationTest)  Time elapsed: 0.091 s
14:56:30 sourceForConnectionToTarget(org.eclipse.papyrus.infra.gmfdiag.assistant.tests.DiagramSpecificModelingAssistantIntegrationTest)  Time elapsed: 0.061 s
14:56:30 connectionToTarget(org.eclipse.papyrus.infra.gmfdiag.assistant.tests.DiagramSpecificModelingAssistantIntegrationTest)  Time elapsed: 0.142 s
14:56:30 targetForConnectionFromSource(org.eclipse.papyrus.infra.gmfdiag.assistant.tests.DiagramSpecificModelingAssistantIntegrationTest)  Time elapsed: 0.019 s
14:56:30 popupOnDiagramSurface(org.eclipse.papyrus.infra.gmfdiag.assistant.tests.DiagramSpecificModelingAssistantIntegrationTest)  Time elapsed: 0.037 s
14:56:30 connectionFromSource(org.eclipse.papyrus.infra.gmfdiag.assistant.tests.DiagramSpecificModelingAssistantIntegrationTest)  Time elapsed: 0.105 s
14:56:30 popupOnShape(org.eclipse.papyrus.infra.gmfdiag.assistant.tests.DiagramSpecificModelingAssistantIntegrationTest)  Time elapsed: 0.04 s
14:56:30 connectionFromSourceToTarget(org.eclipse.papyrus.infra.gmfdiag.assistant.tests.DiagramSpecificModelingAssistantIntegrationTest)  Time elapsed: 0.112 s
14:56:30 testGetObjectOfPathmapResource(org.eclipse.papyrus.infra.services.resourceloading.tests.testModel1.Strategy1TestModel1)  Time elapsed: 0.155 s
14:56:30 testGetObjectOfProfileResource(org.eclipse.papyrus.infra.services.resourceloading.tests.testModel1.Strategy1TestModel1)  Time elapsed: 0.167 s
14:56:30 testGetDanglingReferenceFromAControlledResource(org.eclipse.papyrus.infra.services.resourceloading.tests.testModel1.Strategy1TestModel1)  Time elapsed: 0.172 s
14:56:30 testGetObjectOfControlledResource(org.eclipse.papyrus.infra.services.resourceloading.tests.testModel1.Strategy1TestModel1)  Time elapsed: 0.107 s
14:56:30 testGetDiagramOfControlledResource(org.eclipse.papyrus.infra.services.resourceloading.tests.testModel1.Strategy1TestModel1)  Time elapsed: 0.659 s
14:56:30 testGetObjectOfPathmapResource(org.eclipse.papyrus.infra.services.resourceloading.tests.testModel1.Strategy2TestModel1)  Time elapsed: 0.556 s
14:56:30 testGetObjectOfProfileResource(org.eclipse.papyrus.infra.services.resourceloading.tests.testModel1.Strategy2TestModel1)  Time elapsed: 0.767 s
14:56:30 testGetDanglingReferenceFromAControlledResource(org.eclipse.papyrus.infra.services.resourceloading.tests.testModel1.Strategy2TestModel1)  Time elapsed: 0.767 s
14:56:30 testGetObjectOfControlledResource(org.eclipse.papyrus.infra.services.resourceloading.tests.testModel1.Strategy2TestModel1)  Time elapsed: 0.347 s
14:56:30 testGetDiagramOfControlledResource(org.eclipse.papyrus.infra.services.resourceloading.tests.testModel1.Strategy2TestModel1)  Time elapsed: 0.422 s
14:56:30 testGetObjectOfPathmapResource(org.eclipse.papyrus.infra.services.resourceloading.tests.testModel1.Strategy0TestModel1)  Time elapsed: 0.692 s
14:56:30 testGetObjectOfProfileResource(org.eclipse.papyrus.infra.services.resourceloading.tests.testModel1.Strategy0TestModel1)  Time elapsed: 0.483 s
14:56:30 testGetDanglingReferenceFromAControlledResource(org.eclipse.papyrus.infra.services.resourceloading.tests.testModel1.Strategy0TestModel1)  Time elapsed: 0.633 s
14:56:30 testGetObjectOfControlledResource(org.eclipse.papyrus.infra.services.resourceloading.tests.testModel1.Strategy0TestModel1)  Time elapsed: 0.53 s
14:56:30 testGetDiagramOfControlledResource(org.eclipse.papyrus.infra.services.resourceloading.tests.testModel1.Strategy0TestModel1)  Time elapsed: 0.42 s
14:56:30 testGetFigureInControlledRessource(org.eclipse.papyrus.infra.services.resourceloading.tests.testModel2.Strategy0TestModel2WithModel1)  Time elapsed: 0.025 s
14:56:30 testGetReferenceInControlledRessource(org.eclipse.papyrus.infra.services.resourceloading.tests.testModel2.Strategy0TestModel2WithModel1)  Time elapsed: 0.023 s
14:56:30 testGetFigureInControlledRessource(org.eclipse.papyrus.infra.services.resourceloading.tests.testModel2.Strategy0TestModel2WithPackage0)  Time elapsed: 0.091 s
14:56:30 testGetReferenceInControlledRessource(org.eclipse.papyrus.infra.services.resourceloading.tests.testModel2.Strategy0TestModel2WithPackage0)  Time elapsed: 0.02 s
14:56:30 testGetFigureInControlledRessource(org.eclipse.papyrus.infra.services.resourceloading.tests.testModel2.Strategy1TestModel2WithModel1)  Time elapsed: 0.016 s
14:56:30 testGetReferenceInControlledRessource(org.eclipse.papyrus.infra.services.resourceloading.tests.testModel2.Strategy1TestModel2WithModel1)  Time elapsed: 0.016 s
14:56:30 testGetFigureInControlledRessource(org.eclipse.papyrus.infra.services.resourceloading.tests.testModel2.Strategy1TestModel2WithPackage0)  Time elapsed: 0.05 s
14:56:30 testGetReferenceInControlledRessource(org.eclipse.papyrus.infra.services.resourceloading.tests.testModel2.Strategy1TestModel2WithPackage0)  Time elapsed: 0.021 s
14:56:30 testGetFigureInControlledRessource(org.eclipse.papyrus.infra.services.resourceloading.tests.testModel2.Strategy2TestModel2WithModel1)  Time elapsed: 0.023 s
14:56:30 testGetReferenceInControlledRessource(org.eclipse.papyrus.infra.services.resourceloading.tests.testModel2.Strategy2TestModel2WithModel1)  Time elapsed: 0.021 s
14:56:30 testGetFigureInControlledRessource(org.eclipse.papyrus.infra.services.resourceloading.tests.testModel2.Strategy2TestModel2WithPackage0)  Time elapsed: 0.017 s
14:56:30 testGetReferenceInControlledRessource(org.eclipse.papyrus.infra.services.resourceloading.tests.testModel2.Strategy2TestModel2WithPackage0)  Time elapsed: 0.094 s
14:56:30 testControlSeveralModelsWithProfile(org.eclipse.papyrus.infra.services.controlmode.tests.control.ControlModelWithProfileTest)  Time elapsed: 2.04 s
14:56:30 testUndoControlSeveralModelsWithProfileInSameResource(org.eclipse.papyrus.infra.services.controlmode.tests.control.ControlModelWithProfileTest)  Time elapsed: 1.774 s
14:56:30 testUndoControlModelWithProfile(org.eclipse.papyrus.infra.services.controlmode.tests.control.ControlModelWithProfileTest)  Time elapsed: 1.608 s
14:56:30 testControlSeveralModelsWithProfileInSameResource(org.eclipse.papyrus.infra.services.controlmode.tests.control.ControlModelWithProfileTest)  Time elapsed: 1.905 s
14:56:30 testControlModelWithProfile(org.eclipse.papyrus.infra.services.controlmode.tests.control.ControlModelWithProfileTest)  Time elapsed: 1.606 s
14:56:30 testUndoControlSeveralModelsWithProfile(org.eclipse.papyrus.infra.services.controlmode.tests.control.ControlModelWithProfileTest)  Time elapsed: 2.131 s
14:56:30 testUncontrolShardSubunit(org.eclipse.papyrus.infra.services.controlmode.tests.uncontrol.UncontrolModelTest)  Time elapsed: 1.273 s
14:56:30 testUncontrolOneSubmodel(org.eclipse.papyrus.infra.services.controlmode.tests.uncontrol.UncontrolModelTest)  Time elapsed: 1.643 s
14:56:30 testUncontrolSeveralSubmodelsInSameResource(org.eclipse.papyrus.infra.services.controlmode.tests.uncontrol.UncontrolModelTest)  Time elapsed: 1.846 s
14:56:30 testDeleteSubmodel(org.eclipse.papyrus.infra.services.controlmode.tests.uncontrol.UncontrolModelTest)  Time elapsed: 1.183 s
14:56:30 testUncontrolSeveralSubmodels(org.eclipse.papyrus.infra.services.controlmode.tests.uncontrol.UncontrolModelTest)  Time elapsed: 1.656 s
14:56:30 testUndoUncontrolOneSubmodel(org.eclipse.papyrus.infra.services.controlmode.tests.uncontrol.UncontrolModelTest)  Time elapsed: 1.914 s
14:56:30 testUndoUncontrolSeveralSubmodelsWithoutSave(org.eclipse.papyrus.infra.services.controlmode.tests.uncontrol.UncontrolModelTest)  Time elapsed: 1.19 s
14:56:30 testUndoUncontrolSeveralSubmodelsInSameResource(org.eclipse.papyrus.infra.services.controlmode.tests.uncontrol.UncontrolModelTest)  Time elapsed: 2.254 s
14:56:30 testUncontrolUpdatesReferencesToRootObject_bug480209(org.eclipse.papyrus.infra.services.controlmode.tests.uncontrol.UncontrolModelTest)  Time elapsed: 0.706 s
14:56:30 testUndoUncontrolSeveralSubmodels(org.eclipse.papyrus.infra.services.controlmode.tests.uncontrol.UncontrolModelTest)  Time elapsed: 1.809 s
14:56:30 testControlModeUseCase1(org.eclipse.papyrus.infra.services.controlmode.tests.control.ControlModelTest)  Time elapsed: 1.102 s
14:56:30 testControlModeUseCase2(org.eclipse.papyrus.infra.services.controlmode.tests.control.ControlModelTest)  Time elapsed: 1.143 s
14:56:30 testControlModeUseCase3(org.eclipse.papyrus.infra.services.controlmode.tests.control.ControlModelTest)  Time elapsed: 1.412 s
14:56:30 testControlSeveralModels(org.eclipse.papyrus.infra.services.controlmode.tests.control.ControlModelTest)  Time elapsed: 1.645 s
14:56:30 testUndoControlOneSubmodel(org.eclipse.papyrus.infra.services.controlmode.tests.control.ControlModelTest)  Time elapsed: 1.183 s
14:56:30 testUndoControlSeveralModels(org.eclipse.papyrus.infra.services.controlmode.tests.control.ControlModelTest)  Time elapsed: 1.593 s
14:56:30 testControlSeveralModelsInSameResource(org.eclipse.papyrus.infra.services.controlmode.tests.control.ControlModelTest)  Time elapsed: 1.635 s
14:56:30 testUndoControlSeveralModelsInSameResource(org.eclipse.papyrus.infra.services.controlmode.tests.control.ControlModelTest)  Time elapsed: 1.572 s
14:56:30 testControlOneSubmodel(org.eclipse.papyrus.infra.services.controlmode.tests.control.ControlModelTest)  Time elapsed: 1.093 s
14:56:30 testUncontrolModelWithProfile(org.eclipse.papyrus.infra.services.controlmode.tests.uncontrol.UncontrolModelWithProfileTest)  Time elapsed: 1.575 s
14:56:30 testUncontrolSeveralModelsWithProfileInSameResource(org.eclipse.papyrus.infra.services.controlmode.tests.uncontrol.UncontrolModelWithProfileTest)  Time elapsed: 1.877 s
14:56:30 testUndoUncontrolSeveralModelsWithProfile(org.eclipse.papyrus.infra.services.controlmode.tests.uncontrol.UncontrolModelWithProfileTest)  Time elapsed: 2.335 s
14:56:30 testUndoUncontrolSeveralModelsWithProfileInSameResource(org.eclipse.papyrus.infra.services.controlmode.tests.uncontrol.UncontrolModelWithProfileTest)  Time elapsed: 2.191 s
14:56:30 testUncontrolSeveralModelsWithProfile(org.eclipse.papyrus.infra.services.controlmode.tests.uncontrol.UncontrolModelWithProfileTest)  Time elapsed: 2.249 s
14:56:30 testUndoUncontrolModelWithProfile(org.eclipse.papyrus.infra.services.controlmode.tests.uncontrol.UncontrolModelWithProfileTest)  Time elapsed: 1.885 s
14:56:30 testControlLegacyModel(org.eclipse.papyrus.infra.services.controlmode.tests.control.ControlLegacyModelTest)  Time elapsed: 0.855 s
14:56:30 canCreateSubModel(org.eclipse.papyrus.infra.services.controlmode.tests.control.ControlModeManagerTest)  Time elapsed: 0.725 s
14:56:30 approveUncontrolRequest(org.eclipse.papyrus.infra.services.controlmode.tests.control.ControlModeManagerTest)  Time elapsed: 0.655 s
14:56:30 approveControlRequest(org.eclipse.papyrus.infra.services.controlmode.tests.control.ControlModeManagerTest)  Time elapsed: 1.57 s
14:56:30 disapproveUncontrolRequest(org.eclipse.papyrus.infra.services.controlmode.tests.control.ControlModeManagerTest)  Time elapsed: 0.687 s
14:56:30 disapproveControlRequest(org.eclipse.papyrus.infra.services.controlmode.tests.control.ControlModeManagerTest)  Time elapsed: 0.848 s
14:56:30 convertSubmodelToShard(org.eclipse.papyrus.infra.services.controlmode.tests.control.ShardModeTest)  Time elapsed: 1.034 s
14:56:30 convertShardToSubmodel(org.eclipse.papyrus.infra.services.controlmode.tests.control.ShardModeTest)  Time elapsed: 1.055 s
14:56:30 testIsCanonicalWithNote(org.eclipse.papyrus.infra.gmfdiag.menu.utils.DeleteActionUtilTest)  Time elapsed: 1.212 s
14:56:30 testDeleteNotOrphanElement(org.eclipse.papyrus.infra.gmfdiag.menu.utils.DeleteActionUtilTest)  Time elapsed: 0.98 s
14:56:30 testIsCanonicalViewWithNotOrphan(org.eclipse.papyrus.infra.gmfdiag.menu.utils.DeleteActionUtilTest)  Time elapsed: 0.972 s
14:56:30 testIsSupportViewWithOrphan(org.eclipse.papyrus.infra.gmfdiag.menu.utils.DeleteActionUtilTest)  Time elapsed: 1.114 s
14:56:30 testIsCanonicalWithConnection(org.eclipse.papyrus.infra.gmfdiag.menu.utils.DeleteActionUtilTest)  Time elapsed: 1.174 s
14:56:30 testIsCanonicalViewWithOrphan(org.eclipse.papyrus.infra.gmfdiag.menu.utils.DeleteActionUtilTest)  Time elapsed: 1.103 s
14:56:30 testDeleteTextNode(org.eclipse.papyrus.infra.gmfdiag.menu.utils.DeleteActionUtilTest)  Time elapsed: 0.807 s
14:56:30 testDeleteOrphan(org.eclipse.papyrus.infra.gmfdiag.menu.utils.DeleteActionUtilTest)  Time elapsed: 0.986 s
14:56:30 testIsCanonicalWithNotOrphan(org.eclipse.papyrus.infra.gmfdiag.menu.utils.DeleteActionUtilTest)  Time elapsed: 0.889 s
14:56:30 testIsSupportViewWithNote(org.eclipse.papyrus.infra.gmfdiag.menu.utils.DeleteActionUtilTest)  Time elapsed: 1.037 s
14:56:30 testIsSupportViews(org.eclipse.papyrus.infra.gmfdiag.menu.utils.DeleteActionUtilTest)  Time elapsed: 0.832 s
14:56:30 testIsCanonicalWithOrphan(org.eclipse.papyrus.infra.gmfdiag.menu.utils.DeleteActionUtilTest)  Time elapsed: 0.955 s
14:56:30 testIsCanonical(org.eclipse.papyrus.infra.gmfdiag.menu.utils.DeleteActionUtilTest)  Time elapsed: 1.074 s
14:56:30 testIsCanonicalViewWithNote(org.eclipse.papyrus.infra.gmfdiag.menu.utils.DeleteActionUtilTest)  Time elapsed: 0.895 s
14:56:30 testIsSupportViewWithNotOrphan(org.eclipse.papyrus.infra.gmfdiag.menu.utils.DeleteActionUtilTest)  Time elapsed: 0.907 s
14:56:30 testCSSClassContentProvider(org.eclipse.papyrus.infra.gmfdiag.css.tests.tests.CSSClassProviderTest)  Time elapsed: 0.016 s
14:56:30 testPackage(org.eclipse.papyrus.infra.gmfdiag.css.tests.tests.CSSStylesheetTest)  Time elapsed: 0.01 s
14:56:30 testClassStyle(org.eclipse.papyrus.infra.gmfdiag.css.tests.tests.CSSStylesheetTest)  Time elapsed: 0.006 s
14:56:30 testCSSClassStyle(org.eclipse.papyrus.infra.gmfdiag.css.tests.tests.CSSStylesheetTest)  Time elapsed: 0.007 s
14:56:30 testPriorities(org.eclipse.papyrus.infra.gmfdiag.css.tests.tests.CSSStylesheetTest)  Time elapsed: 0.008 s
14:56:30 testInterfaceStyle(org.eclipse.papyrus.infra.gmfdiag.css.tests.tests.CSSStylesheetTest)  Time elapsed: 0.005 s
14:56:30 testStyleSheetsPriorities(org.eclipse.papyrus.infra.gmfdiag.css.tests.tests.CSSModelStylesheetTest)  Time elapsed: 0.009 s
14:56:30 testPackage(org.eclipse.papyrus.infra.gmfdiag.css.tests.tests.CSSModelStylesheetTest)  Time elapsed: 0.005 s
14:56:30 testClassStyle(org.eclipse.papyrus.infra.gmfdiag.css.tests.tests.CSSModelStylesheetTest)  Time elapsed: 0.005 s
14:56:30 testCSSClassStyle(org.eclipse.papyrus.infra.gmfdiag.css.tests.tests.CSSModelStylesheetTest)  Time elapsed: 0.005 s
14:56:30 testPriorities(org.eclipse.papyrus.infra.gmfdiag.css.tests.tests.CSSModelStylesheetTest)  Time elapsed: 0.006 s
14:56:30 testInterfaceStyle(org.eclipse.papyrus.infra.gmfdiag.css.tests.tests.CSSModelStylesheetTest)  Time elapsed: 0.006 s
14:56:30 testStylesDisabled(org.eclipse.papyrus.infra.gmfdiag.css.tests.tests.CSSNamedStyleTest)  Time elapsed: 0.004 s
14:56:30 testShowAllCompartmentsTitles(org.eclipse.papyrus.infra.gmfdiag.css.tests.tests.CSSCompartmentsTests)  Time elapsed: 0.018 s
14:56:30 testCaseInsensitiveForEnumeration(org.eclipse.papyrus.infra.gmfdiag.css.tests.tests.CSSCompartmentsTests) skipped
14:56:30 testAttributeCompartment(org.eclipse.papyrus.infra.gmfdiag.css.tests.tests.CSSCompartmentsTests)  Time elapsed: 0.01 s
14:56:30 testCompartmentForceValue(org.eclipse.papyrus.infra.gmfdiag.css.tests.tests.CSSCompartmentsTests)  Time elapsed: 0.019 s
14:56:30 testAttributeCompartmentForInterface(org.eclipse.papyrus.infra.gmfdiag.css.tests.tests.CSSCompartmentsTests)  Time elapsed: 0.006 s
14:56:30 testWithoutCSSSupport(org.eclipse.papyrus.infra.gmfdiag.css.tests.tests.CSSSupportTest)  Time elapsed: 0.003 s
14:56:30 testCSSSupport(org.eclipse.papyrus.infra.gmfdiag.css.tests.tests.CSSSupportTest)  Time elapsed: 0.003 s
14:56:30 testProjectStylesheets(org.eclipse.papyrus.infra.gmfdiag.css.tests.tests.CSSProjectStylesheetsTest)  Time elapsed: 0.015 s
14:56:30 testPackage(org.eclipse.papyrus.infra.gmfdiag.css.tests.tests.CSSProjectStylesheetsTest)  Time elapsed: 0.005 s
14:56:30 testClassStyle(org.eclipse.papyrus.infra.gmfdiag.css.tests.tests.CSSProjectStylesheetsTest)  Time elapsed: 0.004 s
14:56:30 testCSSClassStyle(org.eclipse.papyrus.infra.gmfdiag.css.tests.tests.CSSProjectStylesheetsTest)  Time elapsed: 0.004 s
14:56:30 testPriorities(org.eclipse.papyrus.infra.gmfdiag.css.tests.tests.CSSProjectStylesheetsTest)  Time elapsed: 0.005 s
14:56:30 testInterfaceStyle(org.eclipse.papyrus.infra.gmfdiag.css.tests.tests.CSSProjectStylesheetsTest)  Time elapsed: 0.004 s
14:56:30 testWorkspaceTheme(org.eclipse.papyrus.infra.gmfdiag.css.tests.tests.CSSWorkspaceThemeTest)  Time elapsed: 0.026 s
14:56:30 testPackage(org.eclipse.papyrus.infra.gmfdiag.css.tests.tests.CSSWorkspaceThemeTest)  Time elapsed: 0.006 s
14:56:30 testClassStyle(org.eclipse.papyrus.infra.gmfdiag.css.tests.tests.CSSWorkspaceThemeTest)  Time elapsed: 0.003 s
14:56:30 testCSSClassStyle(org.eclipse.papyrus.infra.gmfdiag.css.tests.tests.CSSWorkspaceThemeTest)  Time elapsed: 0.007 s
14:56:30 testPriorities(org.eclipse.papyrus.infra.gmfdiag.css.tests.tests.CSSWorkspaceThemeTest)  Time elapsed: 0.006 s
14:56:30 testInterfaceStyle(org.eclipse.papyrus.infra.gmfdiag.css.tests.tests.CSSWorkspaceThemeTest)  Time elapsed: 0.004 s
14:56:30 canonicalStyleNotInferred(org.eclipse.papyrus.infra.gmfdiag.css.tests.tests.InferredNotationStylesTest)  Time elapsed: 0.146 s
14:56:30 canonicalStyleInferred(org.eclipse.papyrus.infra.gmfdiag.css.tests.tests.InferredNotationStylesTest)  Time elapsed: 0.065 s
14:56:30 overrideInferredStyle(org.eclipse.papyrus.infra.gmfdiag.css.tests.tests.InferredNotationStylesTest)  Time elapsed: 0.059 s
14:56:30 testUnnamedReference(org.eclipse.papyrus.infra.gmfdiag.css.tests.tests.CSSNamedElementsTest)  Time elapsed: 0.005 s
14:56:30 testNamedReference(org.eclipse.papyrus.infra.gmfdiag.css.tests.tests.CSSNamedElementsTest)  Time elapsed: 0.003 s
14:56:30 testEmptyNameReference(org.eclipse.papyrus.infra.gmfdiag.css.tests.tests.CSSNamedElementsTest)  Time elapsed: 0.003 s
14:56:30 testUntypedReference(org.eclipse.papyrus.infra.gmfdiag.css.tests.tests.CSSNamedElementsTest)  Time elapsed: 0.003 s
14:56:30 testKindSelectorForCompartment(org.eclipse.papyrus.infra.gmfdiag.css.tests.tests.CSSKindSelectorTest)  Time elapsed: 0.714 s
14:56:30 testKindSelectorForLabel(org.eclipse.papyrus.infra.gmfdiag.css.tests.tests.CSSKindSelectorTest)  Time elapsed: 0.876 s
14:56:30 testLabels(org.eclipse.papyrus.infra.internationalization.tests.tests.InternationalizationLabelProviderTest)  Time elapsed: 0.583 s
14:56:30 testUseInternationalizationModification(org.eclipse.papyrus.infra.internationalization.tests.tests.InternationalizationChangePreferencesTest)  Time elapsed: 0.518 s
14:56:30 testLanguageModification(org.eclipse.papyrus.infra.internationalization.tests.tests.InternationalizationChangePreferencesTest)  Time elapsed: 0.564 s
14:56:30 enablementNotification(org.eclipse.papyrus.infra.internationalization.tests.tests.InternationalizationPreferenceChangeEventTest)  Time elapsed: 0.687 s
14:56:30 localeNotificationByPreferences(org.eclipse.papyrus.infra.internationalization.tests.tests.InternationalizationPreferenceChangeEventTest)  Time elapsed: 0.778 s
14:56:30 localeNotification(org.eclipse.papyrus.infra.internationalization.tests.tests.InternationalizationPreferenceChangeEventTest)  Time elapsed: 0.508 s
14:56:30 removePreferenceListener(org.eclipse.papyrus.infra.internationalization.tests.tests.InternationalizationPreferenceChangeEventTest)  Time elapsed: 0.572 s
14:56:30 enablementNotificationByPreferences(org.eclipse.papyrus.infra.internationalization.tests.tests.InternationalizationPreferenceChangeEventTest)  Time elapsed: 0.61 s
14:56:30 getViewCountOn(org.eclipse.papyrus.infra.viewpoints.policy.tests.ViewPrototypeTest)  Time elapsed: 0.105 s
14:56:30 getOwnedViewCount(org.eclipse.papyrus.infra.viewpoints.policy.tests.ViewPrototypeTest)  Time elapsed: 0.051 s
14:56:30 testIsInViewpoint(org.eclipse.papyrus.infra.viewpoints.policy.tests.PolicyCheckerTest)  Time elapsed: 0.002 s
14:56:30 testMergeContextSameName(org.eclipse.papyrus.infra.architecture.tests.merged.MergedArchitectureDomainTest)  Time elapsed: 0 s
14:56:30 testMergeContextDifferentName(org.eclipse.papyrus.infra.architecture.tests.merged.MergedArchitectureDomainTest)  Time elapsed: 0 s
14:56:30 switchViewpoints(org.eclipse.papyrus.infra.ui.architecture.tests.editors.SwitchViewpointsTest)  Time elapsed: 1.404 s
14:56:30 revealDiagramsAndTables(org.eclipse.papyrus.infra.ui.architecture.tests.editors.ModelExplorerViewpointFilterTest)  Time elapsed: 0.762 s
14:56:30 checkIcons(org.eclipse.papyrus.infra.ui.architecture.tests.editors.GrayedIconTest)  Time elapsed: 0.573 s
14:56:30 
14:56:30 Results:
14:56:30 
14:56:30 Failures: 
14:56:30   GenericModelingAssistantIntegrationTest.sourceForConnectionToTarget:127 
14:56:30 Expected: a collection containing (is identified by org.eclipse.papyrus.example.j2ee.WebScenario and is proxy type(is identified by org.eclipse.papyrus.example.j2ee.WebScenario, is identified by org.eclipse.papyrus.umldi.UseCase_Shape))
14:56:30      but: 
14:56:30   GenericModelingAssistantIntegrationTest.targetForConnectionFromSource:109 
14:56:30 Expected: a collection containing (is identified by org.eclipse.papyrus.example.j2ee.WebScenario and is proxy type(is identified by org.eclipse.papyrus.example.j2ee.WebScenario, is identified by org.eclipse.papyrus.umldi.UseCase_Shape))
14:56:30      but: 
14:56:30 
14:56:30 Tests run: 922, Failures: 2, Errors: 0, Skipped: 27
14:56:30 
14:56:31 ***WARNING: GTK+ version too old (micro mismatch)
14:56:31 ***WARNING: SWT requires GTK 3.20.0
14:56:31 ***WARNING: Detected: 3.10.9
14:56:31 
14:56:31 (Eclipse:28758): Gtk-WARNING **: Theme parsing error: <data>:31:11: 'min-height' is not a valid property name
14:56:32 [ERROR] There are test failures.
14:56:32 
14:56:32 Please refer to /jobs/genie.papyrus/Papyrus-Gerrit-Master-With-Tests/workspace/source/tests/junit/plugins/infra/org.eclipse.papyrus.infra.suite.tests/target/surefire-reports for the individual test results.
14:56:32 [INFO] 
14:56:32 [INFO] --- jacoco-maven-plugin:0.8.2:report (default-report) @ org.eclipse.papyrus.infra.suite.tests ---
14:56:32 [INFO] Loading execution data file /jobs/genie.papyrus/Papyrus-Gerrit-Master-With-Tests/workspace/source/tests/junit/plugins/infra/org.eclipse.papyrus.infra.suite.tests/target/jacoco.exec
14:56:32 [INFO] Analyzed bundle 'org.eclipse.papyrus.infra.suite.tests' with 0 classes
14:56:32 [INFO] 
14:56:32 [INFO] --< org.eclipse.papyrus.tests:org.eclipse.papyrus.infra.newchild.tests >--
14:56:32 [INFO] Building org.eclipse.papyrus.infra.newchild.tests 2.0.0-SNAPSHOT [674/700]
14:56:32 [INFO] ---------------------------[ eclipse-plugin ]---------------------------
14:56:32 [INFO] 
14:56:32 [INFO] --- maven-clean-plugin:3.1.0:clean (default-clean) @ org.eclipse.papyrus.infra.newchild.tests ---
14:56:32 [INFO] 
14:56:32 [INFO] --- tycho-packaging-plugin:1.3.0:build-qualifier (default-build-qualifier) @ org.eclipse.papyrus.infra.newchild.tests ---
14:56:32 [INFO] The project's OSGi version is 2.0.0.202007311749
14:56:32 [INFO] 
14:56:32 [INFO] --- tycho-packaging-plugin:1.3.0:validate-id (default-validate-id) @ org.eclipse.papyrus.infra.newchild.tests ---
14:56:32 [INFO] 
14:56:32 [INFO] --- tycho-packaging-plugin:1.3.0:validate-version (default-validate-version) @ org.eclipse.papyrus.infra.newchild.tests ---
14:56:32 [INFO] 
14:56:32 [INFO] --- jacoco-maven-plugin:0.8.2:prepare-agent (default-prepare-agent) @ org.eclipse.papyrus.infra.newchild.tests ---
14:56:32 [INFO] argLine set to -javaagent:/home/hudson/genie.papyrus/.jenkins/jobs/Papyrus-Gerrit-Master-With-Tests/workspace/.repository/org/jacoco/org.jacoco.agent/0.8.2/org.jacoco.agent-0.8.2-runtime.jar=destfile=/jobs/genie.papyrus/Papyrus-Gerrit-Master-With-Tests/workspace/source/tests/junit/plugins/infra/org.eclipse.papyrus.infra.newchild.tests/target/jacoco.exec,includes=org.eclipse.papyrus.*,excludes=org.eclipse.uml2
14:56:32 [INFO] 
14:56:32 [INFO] --- maven-resources-plugin:3.1.0:resources (default-resources) @ org.eclipse.papyrus.infra.newchild.tests ---
14:56:32 [INFO] Using 'UTF-8' encoding to copy filtered resources.
14:56:32 [INFO] skip non existing resourceDirectory /jobs/genie.papyrus/Papyrus-Gerrit-Master-With-Tests/workspace/source/tests/junit/plugins/infra/org.eclipse.papyrus.infra.newchild.tests/src/main/resources
14:56:32 [INFO] 
14:56:32 [INFO] --- tycho-compiler-plugin:1.3.0:compile (default-compile) @ org.eclipse.papyrus.infra.newchild.tests ---
14:56:32 [INFO] Compiling 3 source files to /jobs/genie.papyrus/Papyrus-Gerrit-Master-With-Tests/workspace/source/tests/junit/plugins/infra/org.eclipse.papyrus.infra.newchild.tests/bin
14:56:33 [INFO] 
14:56:33 [INFO] --- maven-resources-plugin:3.1.0:testResources (default-testResources) @ org.eclipse.papyrus.infra.newchild.tests ---
14:56:33 [INFO] Using 'UTF-8' encoding to copy filtered resources.
14:56:33 [INFO] skip non existing resourceDirectory /jobs/genie.papyrus/Papyrus-Gerrit-Master-With-Tests/workspace/source/tests/junit/plugins/infra/org.eclipse.papyrus.infra.newchild.tests/src/test/resources
14:56:33 [INFO] 
14:56:33 [INFO] --- target-platform-configuration:1.3.0:target-platform (default-target-platform) @ org.eclipse.papyrus.infra.newchild.tests ---
14:56:33 [INFO] 
14:56:33 [INFO] --- tycho-packaging-plugin:1.3.0:package-plugin (default-package-plugin) @ org.eclipse.papyrus.infra.newchild.tests ---
14:56:33 [INFO] Building jar: /jobs/genie.papyrus/Papyrus-Gerrit-Master-With-Tests/workspace/source/tests/junit/plugins/infra/org.eclipse.papyrus.infra.newchild.tests/target/org.eclipse.papyrus.infra.newchild.tests-2.0.0-SNAPSHOT.jar
14:56:33 [INFO] 
14:56:33 [INFO] --- tycho-p2-plugin:1.3.0:p2-metadata-default (default-p2-metadata-default) @ org.eclipse.papyrus.infra.newchild.tests ---
14:56:33 [INFO] 
14:56:33 [INFO] --- tycho-p2-plugin:1.3.0:p2-metadata (attach-p2-metadata) @ org.eclipse.papyrus.infra.newchild.tests ---
14:56:33 [INFO] 
14:56:33 [INFO] --- jacoco-maven-plugin:0.8.2:report (default-report) @ org.eclipse.papyrus.infra.newchild.tests ---
14:56:33 [INFO] Skipping JaCoCo execution due to missing execution data file.
14:56:33 [INFO] 
14:56:33 [INFO] --< org.eclipse.papyrus.tests:org.eclipse.papyrus.uml.diagram.communication.tests >--
14:56:33 [INFO] Building org.eclipse.papyrus.uml.diagram.communication.tests 2.0.0-SNAPSHOT [675/700]
14:56:33 [INFO] ------------------------[ eclipse-test-plugin ]-------------------------
14:56:33 [INFO] 
14:56:33 [INFO] --- maven-clean-plugin:3.1.0:clean (default-clean) @ org.eclipse.papyrus.uml.diagram.communication.tests ---
14:56:33 [INFO] 
14:56:33 [INFO] --- tycho-packaging-plugin:1.3.0:build-qualifier (default-build-qualifier) @ org.eclipse.papyrus.uml.diagram.communication.tests ---
14:56:33 [INFO] The project's OSGi version is 2.0.0.202007311749
14:56:33 [INFO] 
14:56:33 [INFO] --- tycho-packaging-plugin:1.3.0:validate-id (default-validate-id) @ org.eclipse.papyrus.uml.diagram.communication.tests ---
14:56:33 [INFO] 
14:56:33 [INFO] --- tycho-packaging-plugin:1.3.0:validate-version (default-validate-version) @ org.eclipse.papyrus.uml.diagram.communication.tests ---
14:56:33 [INFO] 
14:56:33 [INFO] --- jacoco-maven-plugin:0.8.2:prepare-agent (default-prepare-agent) @ org.eclipse.papyrus.uml.diagram.communication.tests ---
14:56:33 [INFO] tycho.testArgLine set to -javaagent:/home/hudson/genie.papyrus/.jenkins/jobs/Papyrus-Gerrit-Master-With-Tests/workspace/.repository/org/jacoco/org.jacoco.agent/0.8.2/org.jacoco.agent-0.8.2-runtime.jar=destfile=/jobs/genie.papyrus/Papyrus-Gerrit-Master-With-Tests/workspace/source/tests/junit/plugins/uml/diagram/org.eclipse.papyrus.uml.diagram.communication.tests/target/jacoco.exec,includes=org.eclipse.papyrus.*,excludes=org.eclipse.uml2
14:56:33 [INFO] 
14:56:33 [INFO] --- maven-resources-plugin:3.1.0:resources (default-resources) @ org.eclipse.papyrus.uml.diagram.communication.tests ---
14:56:33 [INFO] Using 'UTF-8' encoding to copy filtered resources.
14:56:33 [INFO] skip non existing resourceDirectory /jobs/genie.papyrus/Papyrus-Gerrit-Master-With-Tests/workspace/source/tests/junit/plugins/uml/diagram/org.eclipse.papyrus.uml.diagram.communication.tests/src/main/resources
14:56:33 [INFO] 
14:56:33 [INFO] --- tycho-compiler-plugin:1.3.0:compile (default-compile) @ org.eclipse.papyrus.uml.diagram.communication.tests ---
14:56:33 [WARNING] The effective compiler target level 1.8 is incompatible with the following OSGi execution environments: [JavaSE-1.7 (assumes 1.7)] @ MavenProject: org.eclipse.papyrus.tests:org.eclipse.papyrus.uml.diagram.communication.tests:2.0.0-SNAPSHOT @ /jobs/genie.papyrus/Papyrus-Gerrit-Master-With-Tests/workspace/source/tests/junit/plugins/uml/diagram/org.eclipse.papyrus.uml.diagram.communication.tests/pom.xml
14:56:33 [INFO] Compiling 7 source files to /jobs/genie.papyrus/Papyrus-Gerrit-Master-With-Tests/workspace/source/tests/junit/plugins/uml/diagram/org.eclipse.papyrus.uml.diagram.communication.tests/bin
14:56:34 [INFO] 
14:56:34 [INFO] --- maven-resources-plugin:3.1.0:testResources (default-testResources) @ org.eclipse.papyrus.uml.diagram.communication.tests ---
14:56:34 [INFO] Using 'UTF-8' encoding to copy filtered resources.
14:56:34 [INFO] skip non existing resourceDirectory /jobs/genie.papyrus/Papyrus-Gerrit-Master-With-Tests/workspace/source/tests/junit/plugins/uml/diagram/org.eclipse.papyrus.uml.diagram.communication.tests/src/test/resources
14:56:34 [INFO] 
14:56:34 [INFO] --- target-platform-configuration:1.3.0:target-platform (default-target-platform) @ org.eclipse.papyrus.uml.diagram.communication.tests ---
14:56:34 [INFO] 
14:56:34 [INFO] --- tycho-packaging-plugin:1.3.0:package-plugin (default-package-plugin) @ org.eclipse.papyrus.uml.diagram.communication.tests ---
14:56:34 [INFO] Building jar: /jobs/genie.papyrus/Papyrus-Gerrit-Master-With-Tests/workspace/source/tests/junit/plugins/uml/diagram/org.eclipse.papyrus.uml.diagram.communication.tests/target/org.eclipse.papyrus.uml.diagram.communication.tests-2.0.0-SNAPSHOT.jar
14:56:34 [INFO] 
14:56:34 [INFO] --- tycho-p2-plugin:1.3.0:p2-metadata-default (default-p2-metadata-default) @ org.eclipse.papyrus.uml.diagram.communication.tests ---
14:56:34 [INFO] 
14:56:34 [INFO] --- tycho-p2-plugin:1.3.0:p2-metadata (attach-p2-metadata) @ org.eclipse.papyrus.uml.diagram.communication.tests ---
14:56:34 [INFO] 
14:56:34 [INFO] --- tycho-surefire-plugin:1.3.0:test (default-test) @ org.eclipse.papyrus.uml.diagram.communication.tests ---
14:56:34 [INFO] Skipping tests
14:56:34 [INFO] 
14:56:34 [INFO] --- jacoco-maven-plugin:0.8.2:report (default-report) @ org.eclipse.papyrus.uml.diagram.communication.tests ---
14:56:34 [INFO] Skipping JaCoCo execution due to missing execution data file.
14:56:34 [INFO] 
14:56:34 [INFO] --< org.eclipse.papyrus.tests:org.eclipse.papyrus.uml.diagram.interactionoverview.tests >--
14:56:34 [INFO] Building org.eclipse.papyrus.uml.diagram.interactionoverview.tests 2.0.0-SNAPSHOT [676/700]
14:56:34 [INFO] ------------------------[ eclipse-test-plugin ]-------------------------
14:56:34 [INFO] 
14:56:34 [INFO] --- maven-clean-plugin:3.1.0:clean (default-clean) @ org.eclipse.papyrus.uml.diagram.interactionoverview.tests ---
14:56:34 [INFO] 
14:56:34 [INFO] --- tycho-packaging-plugin:1.3.0:build-qualifier (default-build-qualifier) @ org.eclipse.papyrus.uml.diagram.interactionoverview.tests ---
14:56:34 [INFO] The project's OSGi version is 2.0.0.202007311749
14:56:34 [INFO] 
14:56:34 [INFO] --- tycho-packaging-plugin:1.3.0:validate-id (default-validate-id) @ org.eclipse.papyrus.uml.diagram.interactionoverview.tests ---
14:56:34 [INFO] 
14:56:34 [INFO] --- tycho-packaging-plugin:1.3.0:validate-version (default-validate-version) @ org.eclipse.papyrus.uml.diagram.interactionoverview.tests ---
14:56:34 [INFO] 
14:56:34 [INFO] --- jacoco-maven-plugin:0.8.2:prepare-agent (default-prepare-agent) @ org.eclipse.papyrus.uml.diagram.interactionoverview.tests ---
14:56:34 [INFO] tycho.testArgLine set to -javaagent:/home/hudson/genie.papyrus/.jenkins/jobs/Papyrus-Gerrit-Master-With-Tests/workspace/.repository/org/jacoco/org.jacoco.agent/0.8.2/org.jacoco.agent-0.8.2-runtime.jar=destfile=/jobs/genie.papyrus/Papyrus-Gerrit-Master-With-Tests/workspace/source/tests/junit/plugins/uml/diagram/org.eclipse.papyrus.uml.diagram.interactionoverview.tests/target/jacoco.exec,includes=org.eclipse.papyrus.*,excludes=org.eclipse.uml2
14:56:34 [INFO] 
14:56:34 [INFO] --- maven-resources-plugin:3.1.0:resources (default-resources) @ org.eclipse.papyrus.uml.diagram.interactionoverview.tests ---
14:56:34 [INFO] Using 'UTF-8' encoding to copy filtered resources.
14:56:34 [INFO] skip non existing resourceDirectory /jobs/genie.papyrus/Papyrus-Gerrit-Master-With-Tests/workspace/source/tests/junit/plugins/uml/diagram/org.eclipse.papyrus.uml.diagram.interactionoverview.tests/src/main/resources
14:56:34 [INFO] 
14:56:34 [INFO] --- tycho-compiler-plugin:1.3.0:compile (default-compile) @ org.eclipse.papyrus.uml.diagram.interactionoverview.tests ---
14:56:34 [WARNING] The effective compiler target level 1.8 is incompatible with the following OSGi execution environments: [J2SE-1.5 (assumes 1.5)] @ MavenProject: org.eclipse.papyrus.tests:org.eclipse.papyrus.uml.diagram.interactionoverview.tests:2.0.0-SNAPSHOT @ /jobs/genie.papyrus/Papyrus-Gerrit-Master-With-Tests/workspace/source/tests/junit/plugins/uml/diagram/org.eclipse.papyrus.uml.diagram.interactionoverview.tests/pom.xml
14:56:34 [INFO] Compiling 10 source files to /jobs/genie.papyrus/Papyrus-Gerrit-Master-With-Tests/workspace/source/tests/junit/plugins/uml/diagram/org.eclipse.papyrus.uml.diagram.interactionoverview.tests/bin
14:56:34 [WARNING] /jobs/genie.papyrus/Papyrus-Gerrit-Master-With-Tests/workspace/source/tests/junit/plugins/uml/diagram/org.eclipse.papyrus.uml.diagram.interactionoverview.tests/src/org/eclipse/papyrus/uml/diagram/interactionoverview/tests/canonical/TestInteractionOverviewDiagramActivityTN.java:[31] 
14:56:34 	import org.eclipse.papyrus.uml.diagram.timing.custom.utils.EditPartUtils;
14:56:34 	       ^^^^^^^^^^^^^^^^^^^^^^^^^^^^^^^^^^^^^^^^^^^^^^^^^^^^^^^^^^^^^^^^^
14:56:34 Discouraged access: The type 'EditPartUtils' is not API (restriction on classpath entry '/jobs/genie.papyrus/Papyrus-Gerrit-Master-With-Tests/workspace/source/plugins/uml/diagram/org.eclipse.papyrus.uml.diagram.timing/bin')
14:56:34 [WARNING] /jobs/genie.papyrus/Papyrus-Gerrit-Master-With-Tests/workspace/source/tests/junit/plugins/uml/diagram/org.eclipse.papyrus.uml.diagram.interactionoverview.tests/src/org/eclipse/papyrus/uml/diagram/interactionoverview/tests/canonical/TestInteractionOverviewDiagramActivityTN.java:[101] 
14:56:34 	final ActivityNameEditPart activityNameEditPart = (ActivityNameEditPart) EditPartUtils.findFirstChildEditPartWithId(activityEditPart, ActivityNameEditPart.VISUAL_ID);
14:56:34 	                                                                         ^^^^^^^^^^^^^
14:56:34 Discouraged access: The type 'EditPartUtils' is not API (restriction on classpath entry '/jobs/genie.papyrus/Papyrus-Gerrit-Master-With-Tests/workspace/source/plugins/uml/diagram/org.eclipse.papyrus.uml.diagram.timing/bin')
14:56:34 [WARNING] /jobs/genie.papyrus/Papyrus-Gerrit-Master-With-Tests/workspace/source/tests/junit/plugins/uml/diagram/org.eclipse.papyrus.uml.diagram.interactionoverview.tests/src/org/eclipse/papyrus/uml/diagram/interactionoverview/tests/canonical/TestInteractionOverviewDiagramActivityTN.java:[101] 
14:56:34 	final ActivityNameEditPart activityNameEditPart = (ActivityNameEditPart) EditPartUtils.findFirstChildEditPartWithId(activityEditPart, ActivityNameEditPart.VISUAL_ID);
14:56:34 	                                                                         ^^^^^^^^^^^^^^^^^^^^^^^^^^^^^^^^^^^^^^^^^^^^^^^^^^^^^^^^^^^^^^^^^^^^^^^^^^^^^^^^^^^^^^^^^^^^
14:56:34 Discouraged access: The method 'EditPartUtils.findFirstChildEditPartWithId(EditPart, String)' is not API (restriction on classpath entry '/jobs/genie.papyrus/Papyrus-Gerrit-Master-With-Tests/workspace/source/plugins/uml/diagram/org.eclipse.papyrus.uml.diagram.timing/bin')
14:56:34 [WARNING] /jobs/genie.papyrus/Papyrus-Gerrit-Master-With-Tests/workspace/source/tests/junit/plugins/uml/diagram/org.eclipse.papyrus.uml.diagram.interactionoverview.tests/src/org/eclipse/papyrus/uml/diagram/interactionoverview/tests/canonical/TestInteractionUse.java:[25] 
14:56:34 	import org.eclipse.papyrus.uml.diagram.timing.custom.utils.EditPartUtils;
14:56:34 	       ^^^^^^^^^^^^^^^^^^^^^^^^^^^^^^^^^^^^^^^^^^^^^^^^^^^^^^^^^^^^^^^^^
14:56:34 Discouraged access: The type 'EditPartUtils' is not API (restriction on classpath entry '/jobs/genie.papyrus/Papyrus-Gerrit-Master-With-Tests/workspace/source/plugins/uml/diagram/org.eclipse.papyrus.uml.diagram.timing/bin')
14:56:34 [WARNING] /jobs/genie.papyrus/Papyrus-Gerrit-Master-With-Tests/workspace/source/tests/junit/plugins/uml/diagram/org.eclipse.papyrus.uml.diagram.interactionoverview.tests/src/org/eclipse/papyrus/uml/diagram/interactionoverview/tests/canonical/TestInteractionUse.java:[79] 
14:56:34 	final CustomInteractionUseNameEditPart callBehaviorNameEditPart = (CustomInteractionUseNameEditPart)EditPartUtils.findFirstChildEditPartWithId(interactionUse, CustomInteractionUseNameEditPart.VISUAL_ID);
14:56:34 	                                                                                                    ^^^^^^^^^^^^^
14:56:34 Discouraged access: The type 'EditPartUtils' is not API (restriction on classpath entry '/jobs/genie.papyrus/Papyrus-Gerrit-Master-With-Tests/workspace/source/plugins/uml/diagram/org.eclipse.papyrus.uml.diagram.timing/bin')
14:56:34 [WARNING] /jobs/genie.papyrus/Papyrus-Gerrit-Master-With-Tests/workspace/source/tests/junit/plugins/uml/diagram/org.eclipse.papyrus.uml.diagram.interactionoverview.tests/src/org/eclipse/papyrus/uml/diagram/interactionoverview/tests/canonical/TestInteractionUse.java:[79] 
14:56:34 	final CustomInteractionUseNameEditPart callBehaviorNameEditPart = (CustomInteractionUseNameEditPart)EditPartUtils.findFirstChildEditPartWithId(interactionUse, CustomInteractionUseNameEditPart.VISUAL_ID);
14:56:34 	                                                                                                    ^^^^^^^^^^^^^^^^^^^^^^^^^^^^^^^^^^^^^^^^^^^^^^^^^^^^^^^^^^^^^^^^^^^^^^^^^^^^^^^^^^^^^^^^^^^^^^^^^^^^^^
14:56:34 Discouraged access: The method 'EditPartUtils.findFirstChildEditPartWithId(EditPart, String)' is not API (restriction on classpath entry '/jobs/genie.papyrus/Papyrus-Gerrit-Master-With-Tests/workspace/source/plugins/uml/diagram/org.eclipse.papyrus.uml.diagram.timing/bin')
14:56:34 6 problems (6 warnings)
14:56:34 [INFO] 
14:56:34 [INFO] --- maven-resources-plugin:3.1.0:testResources (default-testResources) @ org.eclipse.papyrus.uml.diagram.interactionoverview.tests ---
14:56:34 [INFO] Using 'UTF-8' encoding to copy filtered resources.
14:56:34 [INFO] skip non existing resourceDirectory /jobs/genie.papyrus/Papyrus-Gerrit-Master-With-Tests/workspace/source/tests/junit/plugins/uml/diagram/org.eclipse.papyrus.uml.diagram.interactionoverview.tests/src/test/resources
14:56:34 [INFO] 
14:56:34 [INFO] --- target-platform-configuration:1.3.0:target-platform (default-target-platform) @ org.eclipse.papyrus.uml.diagram.interactionoverview.tests ---
14:56:34 [INFO] 
14:56:34 [INFO] --- tycho-packaging-plugin:1.3.0:package-plugin (default-package-plugin) @ org.eclipse.papyrus.uml.diagram.interactionoverview.tests ---
14:56:34 [INFO] Building jar: /jobs/genie.papyrus/Papyrus-Gerrit-Master-With-Tests/workspace/source/tests/junit/plugins/uml/diagram/org.eclipse.papyrus.uml.diagram.interactionoverview.tests/target/org.eclipse.papyrus.uml.diagram.interactionoverview.tests-2.0.0-SNAPSHOT.jar
14:56:34 [INFO] 
14:56:34 [INFO] --- tycho-p2-plugin:1.3.0:p2-metadata-default (default-p2-metadata-default) @ org.eclipse.papyrus.uml.diagram.interactionoverview.tests ---
14:56:34 [INFO] 
14:56:34 [INFO] --- tycho-p2-plugin:1.3.0:p2-metadata (attach-p2-metadata) @ org.eclipse.papyrus.uml.diagram.interactionoverview.tests ---
14:56:34 [INFO] 
14:56:34 [INFO] --- tycho-surefire-plugin:1.3.0:test (default-test) @ org.eclipse.papyrus.uml.diagram.interactionoverview.tests ---
14:56:34 [INFO] Skipping tests
14:56:34 [INFO] 
14:56:34 [INFO] --- jacoco-maven-plugin:0.8.2:report (default-report) @ org.eclipse.papyrus.uml.diagram.interactionoverview.tests ---
14:56:34 [INFO] Skipping JaCoCo execution due to missing execution data file.
14:56:34 [INFO] 
14:56:34 [INFO] --< org.eclipse.papyrus.tests:org.eclipse.papyrus.uml.diagram.statemachine.tests >--
14:56:34 [INFO] Building org.eclipse.papyrus.uml.diagram.statemachine.tests 2.0.0-SNAPSHOT [677/700]
14:56:34 [INFO] ------------------------[ eclipse-test-plugin ]-------------------------
14:56:35 [INFO] 
14:56:35 [INFO] --- maven-clean-plugin:3.1.0:clean (default-clean) @ org.eclipse.papyrus.uml.diagram.statemachine.tests ---
14:56:35 [INFO] 
14:56:35 [INFO] --- tycho-packaging-plugin:1.3.0:build-qualifier (default-build-qualifier) @ org.eclipse.papyrus.uml.diagram.statemachine.tests ---
14:56:35 [INFO] The project's OSGi version is 2.0.0.202007311749
14:56:35 [INFO] 
14:56:35 [INFO] --- tycho-packaging-plugin:1.3.0:validate-id (default-validate-id) @ org.eclipse.papyrus.uml.diagram.statemachine.tests ---
14:56:35 [INFO] 
14:56:35 [INFO] --- tycho-packaging-plugin:1.3.0:validate-version (default-validate-version) @ org.eclipse.papyrus.uml.diagram.statemachine.tests ---
14:56:35 [INFO] 
14:56:35 [INFO] --- jacoco-maven-plugin:0.8.2:prepare-agent (default-prepare-agent) @ org.eclipse.papyrus.uml.diagram.statemachine.tests ---
14:56:35 [INFO] tycho.testArgLine set to -javaagent:/home/hudson/genie.papyrus/.jenkins/jobs/Papyrus-Gerrit-Master-With-Tests/workspace/.repository/org/jacoco/org.jacoco.agent/0.8.2/org.jacoco.agent-0.8.2-runtime.jar=destfile=/jobs/genie.papyrus/Papyrus-Gerrit-Master-With-Tests/workspace/source/tests/junit/plugins/uml/diagram/org.eclipse.papyrus.uml.diagram.statemachine.tests/target/jacoco.exec,includes=org.eclipse.papyrus.*,excludes=org.eclipse.uml2
14:56:35 [INFO] 
14:56:35 [INFO] --- maven-resources-plugin:3.1.0:resources (default-resources) @ org.eclipse.papyrus.uml.diagram.statemachine.tests ---
14:56:35 [INFO] Using 'UTF-8' encoding to copy filtered resources.
14:56:35 [INFO] skip non existing resourceDirectory /jobs/genie.papyrus/Papyrus-Gerrit-Master-With-Tests/workspace/source/tests/junit/plugins/uml/diagram/org.eclipse.papyrus.uml.diagram.statemachine.tests/src/main/resources
14:56:35 [INFO] 
14:56:35 [INFO] --- tycho-compiler-plugin:1.3.0:compile (default-compile) @ org.eclipse.papyrus.uml.diagram.statemachine.tests ---
14:56:35 [WARNING] The effective compiler target level 1.8 is incompatible with the following OSGi execution environments: [JavaSE-1.7 (assumes 1.7)] @ MavenProject: org.eclipse.papyrus.tests:org.eclipse.papyrus.uml.diagram.statemachine.tests:2.0.0-SNAPSHOT @ /jobs/genie.papyrus/Papyrus-Gerrit-Master-With-Tests/workspace/source/tests/junit/plugins/uml/diagram/org.eclipse.papyrus.uml.diagram.statemachine.tests/pom.xml
14:56:35 [INFO] Compiling 17 source files to /jobs/genie.papyrus/Papyrus-Gerrit-Master-With-Tests/workspace/source/tests/junit/plugins/uml/diagram/org.eclipse.papyrus.uml.diagram.statemachine.tests/bin
14:56:35 [WARNING] /jobs/genie.papyrus/Papyrus-Gerrit-Master-With-Tests/workspace/source/tests/junit/plugins/uml/diagram/org.eclipse.papyrus.uml.diagram.statemachine.tests/src/org/eclipse/papyrus/uml/diagram/statemachine/custom/helpers/tests/ZoneTest.java:[60] 
14:56:35 	assertThat(smDiagram.eResource(), nullValue());
14:56:35 	^^^^^^^^^^^^^^^^^^^^^^^^^^^^^^^^^^^^^^^^^^^^^^
14:56:35 The method assertThat(Resource, Matcher<? super Resource>) from the type Assert is deprecated
14:56:35 1 problem (1 warning)
14:56:35 [INFO] 
14:56:35 [INFO] --- maven-resources-plugin:3.1.0:testResources (default-testResources) @ org.eclipse.papyrus.uml.diagram.statemachine.tests ---
14:56:35 [INFO] Using 'UTF-8' encoding to copy filtered resources.
14:56:35 [INFO] skip non existing resourceDirectory /jobs/genie.papyrus/Papyrus-Gerrit-Master-With-Tests/workspace/source/tests/junit/plugins/uml/diagram/org.eclipse.papyrus.uml.diagram.statemachine.tests/src/test/resources
14:56:35 [INFO] 
14:56:35 [INFO] --- target-platform-configuration:1.3.0:target-platform (default-target-platform) @ org.eclipse.papyrus.uml.diagram.statemachine.tests ---
14:56:35 [INFO] 
14:56:35 [INFO] --- tycho-packaging-plugin:1.3.0:package-plugin (default-package-plugin) @ org.eclipse.papyrus.uml.diagram.statemachine.tests ---
14:56:35 [INFO] Building jar: /jobs/genie.papyrus/Papyrus-Gerrit-Master-With-Tests/workspace/source/tests/junit/plugins/uml/diagram/org.eclipse.papyrus.uml.diagram.statemachine.tests/target/org.eclipse.papyrus.uml.diagram.statemachine.tests-2.0.0-SNAPSHOT.jar
14:56:35 [INFO] 
14:56:35 [INFO] --- tycho-p2-plugin:1.3.0:p2-metadata-default (default-p2-metadata-default) @ org.eclipse.papyrus.uml.diagram.statemachine.tests ---
14:56:35 [INFO] 
14:56:35 [INFO] --- tycho-p2-plugin:1.3.0:p2-metadata (attach-p2-metadata) @ org.eclipse.papyrus.uml.diagram.statemachine.tests ---
14:56:35 [INFO] 
14:56:35 [INFO] --- tycho-surefire-plugin:1.3.0:test (default-test) @ org.eclipse.papyrus.uml.diagram.statemachine.tests ---
14:56:35 [INFO] Skipping tests
14:56:35 [INFO] 
14:56:35 [INFO] --- jacoco-maven-plugin:0.8.2:report (default-report) @ org.eclipse.papyrus.uml.diagram.statemachine.tests ---
14:56:35 [INFO] Skipping JaCoCo execution due to missing execution data file.
14:56:35 [INFO] 
14:56:35 [INFO] --< org.eclipse.papyrus.tests:org.eclipse.papyrus.uml.diagram.suite.tests >--
14:56:35 [INFO] Building org.eclipse.papyrus.uml.diagram.suite.tests 1.0.0-SNAPSHOT [678/700]
14:56:35 [INFO] ------------------------[ eclipse-test-plugin ]-------------------------
14:56:38 [INFO] 
14:56:38 [INFO] --- maven-clean-plugin:3.1.0:clean (default-clean) @ org.eclipse.papyrus.uml.diagram.suite.tests ---
14:56:38 [INFO] 
14:56:38 [INFO] --- tycho-packaging-plugin:1.3.0:build-qualifier (default-build-qualifier) @ org.eclipse.papyrus.uml.diagram.suite.tests ---
14:56:38 [INFO] The project's OSGi version is 1.0.0.202007311749
14:56:38 [INFO] 
14:56:38 [INFO] --- tycho-packaging-plugin:1.3.0:validate-id (default-validate-id) @ org.eclipse.papyrus.uml.diagram.suite.tests ---
14:56:38 [INFO] 
14:56:38 [INFO] --- tycho-packaging-plugin:1.3.0:validate-version (default-validate-version) @ org.eclipse.papyrus.uml.diagram.suite.tests ---
14:56:38 [INFO] 
14:56:38 [INFO] --- jacoco-maven-plugin:0.8.2:prepare-agent (default-prepare-agent) @ org.eclipse.papyrus.uml.diagram.suite.tests ---
14:56:38 [INFO] tycho.testArgLine set to -javaagent:/home/hudson/genie.papyrus/.jenkins/jobs/Papyrus-Gerrit-Master-With-Tests/workspace/.repository/org/jacoco/org.jacoco.agent/0.8.2/org.jacoco.agent-0.8.2-runtime.jar=destfile=/jobs/genie.papyrus/Papyrus-Gerrit-Master-With-Tests/workspace/source/tests/junit/plugins/uml/diagram/org.eclipse.papyrus.uml.diagram.suite.tests/target/jacoco.exec,includes=org.eclipse.papyrus.*,excludes=org.eclipse.uml2
14:56:38 [INFO] 
14:56:38 [INFO] --- maven-resources-plugin:3.1.0:resources (default-resources) @ org.eclipse.papyrus.uml.diagram.suite.tests ---
14:56:38 [INFO] Using 'UTF-8' encoding to copy filtered resources.
14:56:38 [INFO] skip non existing resourceDirectory /jobs/genie.papyrus/Papyrus-Gerrit-Master-With-Tests/workspace/source/tests/junit/plugins/uml/diagram/org.eclipse.papyrus.uml.diagram.suite.tests/src/main/resources
14:56:38 [INFO] 
14:56:38 [INFO] --- tycho-compiler-plugin:1.3.0:compile (default-compile) @ org.eclipse.papyrus.uml.diagram.suite.tests ---
14:56:38 [INFO] Compiling 2 source files to /jobs/genie.papyrus/Papyrus-Gerrit-Master-With-Tests/workspace/source/tests/junit/plugins/uml/diagram/org.eclipse.papyrus.uml.diagram.suite.tests/bin
14:56:38 [INFO] 
14:56:38 [INFO] --- maven-resources-plugin:3.1.0:testResources (default-testResources) @ org.eclipse.papyrus.uml.diagram.suite.tests ---
14:56:38 [INFO] Using 'UTF-8' encoding to copy filtered resources.
14:56:38 [INFO] skip non existing resourceDirectory /jobs/genie.papyrus/Papyrus-Gerrit-Master-With-Tests/workspace/source/tests/junit/plugins/uml/diagram/org.eclipse.papyrus.uml.diagram.suite.tests/src/test/resources
14:56:38 [INFO] 
14:56:38 [INFO] --- target-platform-configuration:1.3.0:target-platform (default-target-platform) @ org.eclipse.papyrus.uml.diagram.suite.tests ---
14:56:38 [INFO] 
14:56:38 [INFO] --- tycho-packaging-plugin:1.3.0:package-plugin (default-package-plugin) @ org.eclipse.papyrus.uml.diagram.suite.tests ---
14:56:38 [INFO] Building jar: /jobs/genie.papyrus/Papyrus-Gerrit-Master-With-Tests/workspace/source/tests/junit/plugins/uml/diagram/org.eclipse.papyrus.uml.diagram.suite.tests/target/org.eclipse.papyrus.uml.diagram.suite.tests-1.0.0-SNAPSHOT.jar
14:56:38 [INFO] 
14:56:38 [INFO] --- tycho-p2-plugin:1.3.0:p2-metadata-default (default-p2-metadata-default) @ org.eclipse.papyrus.uml.diagram.suite.tests ---
14:56:38 [INFO] 
14:56:38 [INFO] --- tycho-p2-plugin:1.3.0:p2-metadata (attach-p2-metadata) @ org.eclipse.papyrus.uml.diagram.suite.tests ---
14:56:38 [INFO] 
14:56:38 [INFO] --- tycho-surefire-plugin:1.3.0:test (default-test) @ org.eclipse.papyrus.uml.diagram.suite.tests ---
14:56:48 [INFO] Expected eclipse log file: /jobs/genie.papyrus/Papyrus-Gerrit-Master-With-Tests/workspace/source/tests/junit/plugins/uml/diagram/org.eclipse.papyrus.uml.diagram.suite.tests/target/work/data/.metadata/.log
14:56:48 [INFO] Command line:
14:56:48 	[/opt/public/common/java/oracle/jdk1.8.0_202_x64/jre/bin/java, -Dosgi.noShutdown=false, -Dosgi.os=linux, -Dosgi.ws=gtk, -Dosgi.arch=x86_64, -javaagent:/home/hudson/genie.papyrus/.jenkins/jobs/Papyrus-Gerrit-Master-With-Tests/workspace/.repository/org/jacoco/org.jacoco.agent/0.8.2/org.jacoco.agent-0.8.2-runtime.jar=destfile=/jobs/genie.papyrus/Papyrus-Gerrit-Master-With-Tests/workspace/source/tests/junit/plugins/uml/diagram/org.eclipse.papyrus.uml.diagram.suite.tests/target/jacoco.exec,includes=org.eclipse.papyrus.*,excludes=org.eclipse.uml2, -Xms512m, -Xmx2048m, -XX:SoftRefLRUPolicyMSPerMB=100, -Dosgi.clean=true, -jar, /jobs/genie.papyrus/Papyrus-Gerrit-Master-With-Tests/workspace/.repository/p2/osgi/bundle/org.eclipse.equinox.launcher/1.5.700.v20200207-2156/org.eclipse.equinox.launcher-1.5.700.v20200207-2156.jar, -data, /jobs/genie.papyrus/Papyrus-Gerrit-Master-With-Tests/workspace/source/tests/junit/plugins/uml/diagram/org.eclipse.papyrus.uml.diagram.suite.tests/target/work/data, -install, /jobs/genie.papyrus/Papyrus-Gerrit-Master-With-Tests/workspace/source/tests/junit/plugins/uml/diagram/org.eclipse.papyrus.uml.diagram.suite.tests/target/work, -configuration, /jobs/genie.papyrus/Papyrus-Gerrit-Master-With-Tests/workspace/source/tests/junit/plugins/uml/diagram/org.eclipse.papyrus.uml.diagram.suite.tests/target/work/configuration, -application, org.eclipse.tycho.surefire.osgibooter.uitest, -testproperties, /jobs/genie.papyrus/Papyrus-Gerrit-Master-With-Tests/workspace/source/tests/junit/plugins/uml/diagram/org.eclipse.papyrus.uml.diagram.suite.tests/target/surefire.properties, -product, org.eclipse.sdk.ide, -testConfig=CI_TESTS_CONFIG]
14:56:48 Picked up JAVA_TOOL_OPTIONS: -Xmx2G -Djava.io.tmpdir=/tmp/genie.papyrus -DforkCount=1
14:56:51 ***WARNING: GTK+ version too old (micro mismatch)
14:56:51 ***WARNING: SWT requires GTK 3.20.0
14:56:51 ***WARNING: Detected: 3.10.9
14:56:51 
14:56:51 (Eclipse:3465): Gtk-WARNING **: Theme parsing error: <data>:31:11: 'min-height' is not a valid property name
14:56:58 SWT Webkit: Warning, You are using an old version of webkitgtk. (pre 2.4) BrowserFunction functionality will not be avaliable
14:56:58 SWT WebKit: error initializing DBus server, dBusServer == 0
14:56:59 Running org.eclipse.papyrus.uml.diagram.suite.tests.AllTests
14:57:07 No JFaces support for org.eclipse.jface.viewers.TableTreeViewer
16:49:53 Build timed out (after 180 minutes). Marking the build as aborted.
16:49:54 [INFO] ------------------------------------------------------------------------
16:49:54 [INFO] Reactor Summary:
16:49:54 [INFO] 
16:49:54 [INFO] org.eclipse.papyrus.all.releng 0.0.1-SNAPSHOT ...... SUCCESS [  0.797 s]
16:49:54 [INFO] org.eclipse.papyrus.releng 0.0.1-SNAPSHOT .......... SUCCESS [  0.028 s]
16:49:54 [INFO] Papyrus Main Plugins 0.0.1-SNAPSHOT ................ SUCCESS [  0.004 s]
16:49:54 [INFO] Papyrus EMF 0.0.1-SNAPSHOT ......................... SUCCESS [  0.004 s]
16:49:54 [INFO] org.eclipse.papyrus.emf 2.0.0-SNAPSHOT ............. SUCCESS [  9.895 s]
16:49:54 [INFO] org.eclipse.papyrus.emf.ui 2.0.0-SNAPSHOT .......... SUCCESS [  0.409 s]
16:49:54 [INFO] EMF Facet, the Papyrus Edition 0.0.1-SNAPSHOT ...... SUCCESS [  0.003 s]
16:49:54 [INFO] Papyrus EMF Facet Editors 0.0.1-SNAPSHOT ........... SUCCESS [  0.003 s]
16:49:54 [INFO] org.eclipse.papyrus.emf.facet.custom.doc 2.0.0-SNAPSHOT SUCCESS [  0.037 s]
16:49:54 [INFO] org.eclipse.papyrus.emf.facet.common.core 2.0.0-SNAPSHOT SUCCESS [  0.116 s]
16:49:54 [INFO] org.eclipse.papyrus.emf.facet.util.core 2.0.0-SNAPSHOT SUCCESS [  0.186 s]
16:49:54 [INFO] org.eclipse.papyrus.emf.facet.common.sdk.core 2.0.0-SNAPSHOT SUCCESS [  0.177 s]
16:49:54 [INFO] org.eclipse.papyrus.emf.facet.common.ui 2.0.0-SNAPSHOT SUCCESS [  0.290 s]
16:49:54 [INFO] org.eclipse.papyrus.emf.facet.util.emf.catalog 2.0.0-SNAPSHOT SUCCESS [  0.148 s]
16:49:54 [INFO] org.eclipse.papyrus.emf.facet.efacet.metamodel 2.0.0-SNAPSHOT SUCCESS [  0.515 s]
16:49:54 [INFO] org.eclipse.papyrus.emf.facet.custom.metamodel 2.0.0-SNAPSHOT SUCCESS [  0.240 s]
16:49:54 [INFO] org.eclipse.papyrus.emf.facet.efacet 2.0.0-SNAPSHOT  SUCCESS [  0.205 s]
16:49:54 [INFO] org.eclipse.papyrus.emf.facet.efacet.catalog 2.0.0-SNAPSHOT SUCCESS [  0.119 s]
16:49:54 [INFO] org.eclipse.papyrus.emf.facet.util.pde.core 2.0.0-SNAPSHOT SUCCESS [  0.191 s]
16:49:54 [INFO] org.eclipse.papyrus.emf.facet.util.emf.core 2.0.0-SNAPSHOT SUCCESS [  0.203 s]
16:49:54 [INFO] org.eclipse.papyrus.emf.facet.efacet.core 3.0.0-SNAPSHOT SUCCESS [  0.455 s]
16:49:54 [INFO] org.eclipse.papyrus.emf.facet.custom.core 4.0.0-SNAPSHOT SUCCESS [  0.232 s]
16:49:54 [INFO] org.eclipse.papyrus.emf.facet.efacet.metamodel.edit 2.0.0-SNAPSHOT SUCCESS [  0.249 s]
16:49:54 [INFO] org.eclipse.papyrus.emf.facet.custom.metamodel.edit 2.0.0-SNAPSHOT SUCCESS [  0.123 s]
16:49:54 [INFO] org.eclipse.papyrus.emf.facet.custom.sdk.core 2.0.0-SNAPSHOT SUCCESS [  0.180 s]
16:49:54 [INFO] org.eclipse.papyrus.emf.facet.query.java 2.0.0-SNAPSHOT SUCCESS [  0.132 s]
16:49:54 [INFO] Papyrus Infra 0.0.1-SNAPSHOT ....................... SUCCESS [  0.002 s]
16:49:54 [INFO] Papyrus Infra Core 0.0.1-SNAPSHOT .................. SUCCESS [  0.002 s]
16:49:54 [INFO] org.eclipse.papyrus.infra.core.log 2.0.0-SNAPSHOT .. SUCCESS [  0.071 s]
16:49:54 [INFO] org.eclipse.papyrus.infra.tools 4.0.0-SNAPSHOT ..... SUCCESS [  0.470 s]
16:49:54 [INFO] org.eclipse.papyrus.emf.facet.query.java.metamodel 2.0.0-SNAPSHOT SUCCESS [  0.178 s]
16:49:54 [INFO] org.eclipse.papyrus.emf.facet.query.java.core 3.0.0-SNAPSHOT SUCCESS [  0.231 s]
16:49:54 [INFO] org.eclipse.papyrus.emf.facet.util.swt 2.0.0-SNAPSHOT SUCCESS [  0.130 s]
16:49:54 [INFO] org.eclipse.papyrus.emf.facet.util.jface.ui 3.0.0-SNAPSHOT SUCCESS [  0.134 s]
16:49:54 [INFO] org.eclipse.papyrus.emf.facet.util.ui 3.0.0-SNAPSHOT SUCCESS [  0.390 s]
16:49:54 [INFO] org.eclipse.papyrus.emf.facet.custom.ui 4.0.0-SNAPSHOT SUCCESS [  0.544 s]
16:49:54 [INFO] org.eclipse.papyrus.emf.facet.util.emf.ui 3.0.0-SNAPSHOT SUCCESS [  0.306 s]
16:49:54 [INFO] org.eclipse.papyrus.emf.facet.efacet.sdk.ui 3.0.0-SNAPSHOT SUCCESS [  0.476 s]
16:49:54 [INFO] org.eclipse.papyrus.emf.facet.widgets 2.0.0-SNAPSHOT SUCCESS [  0.125 s]
16:49:54 [INFO] org.eclipse.papyrus.emf.facet.widgets.celleditors 2.0.0-SNAPSHOT SUCCESS [  0.346 s]
16:49:54 [INFO] org.eclipse.papyrus.emf.facet.custom.sdk.ui 2.0.0-SNAPSHOT SUCCESS [  0.286 s]
16:49:54 [INFO] org.eclipse.papyrus.emf.facet.query.ocl.metamodel 2.0.0-SNAPSHOT SUCCESS [  0.093 s]
16:49:54 [INFO] org.eclipse.papyrus.emf.facet.custom.metamodel.editor 2.0.0-SNAPSHOT SUCCESS [  0.304 s]
16:49:54 [INFO] org.eclipse.papyrus.emf.facet.custom.metamodel.editor.doc 2.0.0-SNAPSHOT SUCCESS [  0.032 s]
16:49:54 [INFO] org.eclipse.papyrus.emf.facet.doc 2.0.0-SNAPSHOT ... SUCCESS [  0.104 s]
16:49:54 [INFO] org.eclipse.papyrus.emf.facet.aggregate.doc 2.0.0-SNAPSHOT SUCCESS [  0.039 s]
16:49:54 [INFO] org.eclipse.papyrus.emf.facet.efacet.doc 2.0.0-SNAPSHOT SUCCESS [  0.030 s]
16:49:54 [INFO] org.eclipse.papyrus.emf.facet.efacet.edit 2.0.0-SNAPSHOT SUCCESS [  0.173 s]
16:49:54 [INFO] org.eclipse.papyrus.emf.facet.efacet.editor 2.0.0-SNAPSHOT SUCCESS [  0.233 s]
16:49:54 [INFO] org.eclipse.papyrus.emf.facet.efacet.ui 4.0.0-SNAPSHOT SUCCESS [  0.449 s]
16:49:54 [INFO] org.eclipse.papyrus.emf.facet.query.java.sdk.ui 2.0.0-SNAPSHOT SUCCESS [  0.284 s]
16:49:54 [INFO] org.eclipse.papyrus.emf.facet.query.ocl.core 2.0.0-SNAPSHOT SUCCESS [  0.123 s]
16:49:54 [INFO] org.eclipse.papyrus.emf.facet.query.ocl.sdk.ui 3.0.0-SNAPSHOT SUCCESS [  0.160 s]
16:49:54 [INFO] org.eclipse.papyrus.emf.facet.util.emf.doc 2.0.0-SNAPSHOT SUCCESS [  0.039 s]
16:49:54 [INFO] org.eclipse.papyrus.emf.facet.widgets.celleditors.ecore 2.0.0-SNAPSHOT SUCCESS [  0.230 s]
16:49:54 [INFO] Papyrus Infra Architecture 0.0.1-SNAPSHOT .......... SUCCESS [  0.004 s]
16:49:54 [INFO] Papyrus Infra Element Types Configurations 0.0.1-SNAPSHOT SUCCESS [  0.002 s]
16:49:54 [INFO] org.eclipse.papyrus.infra.types 5.0.0-SNAPSHOT ..... SUCCESS [  0.195 s]
16:49:54 [INFO] org.eclipse.papyrus.infra.core.architecture 3.0.0-SNAPSHOT SUCCESS [  0.182 s]
16:49:54 [INFO] org.eclipse.papyrus.infra.core.sashwindows.di 2.0.0-SNAPSHOT SUCCESS [  0.201 s]
16:49:54 [INFO] org.eclipse.papyrus.infra.core 4.0.0-SNAPSHOT ...... SUCCESS [  0.563 s]
16:49:54 [INFO] Papyrus EMF Infrastructure 0.0.1-SNAPSHOT .......... SUCCESS [  0.004 s]
16:49:54 [INFO] org.eclipse.papyrus.infra.emf 4.0.0-SNAPSHOT ....... SUCCESS [  0.620 s]
16:49:54 [INFO] Papyrus Infra Services 0.0.1-SNAPSHOT .............. SUCCESS [  0.004 s]
16:49:54 [INFO] org.eclipse.papyrus.infra.services.markerlistener 3.0.0-SNAPSHOT SUCCESS [  0.249 s]
16:49:54 [INFO] org.eclipse.papyrus.infra.services.edit 4.0.0-SNAPSHOT SUCCESS [  0.237 s]
16:49:54 [INFO] org.eclipse.papyrus.infra.architecture 3.0.0-SNAPSHOT SUCCESS [  0.201 s]
16:49:54 [INFO] Papyrus Infra Constraints 0.0.1-SNAPSHOT ........... SUCCESS [  0.002 s]
16:49:54 [INFO] org.eclipse.papyrus.infra.constraints 3.0.0-SNAPSHOT SUCCESS [  0.301 s]
16:49:54 [INFO] org.eclipse.papyrus.infra.architecture.representation 3.0.0-SNAPSHOT SUCCESS [  0.300 s]
16:49:54 [INFO] org.eclipse.papyrus.infra.constraints.edit 3.0.0-SNAPSHOT SUCCESS [  0.193 s]
16:49:54 [INFO] org.eclipse.papyrus.infra.types.edit 5.0.0-SNAPSHOT  SUCCESS [  0.102 s]
16:49:54 [INFO] org.eclipse.papyrus.infra.core.architecture.edit 3.0.0-SNAPSHOT SUCCESS [  0.154 s]
16:49:54 [INFO] org.eclipse.papyrus.infra.architecture.representation.edit 2.0.0-SNAPSHOT SUCCESS [  0.171 s]
16:49:54 [INFO] org.eclipse.papyrus.infra.core.sasheditor 3.0.0-SNAPSHOT SUCCESS [  0.356 s]
16:49:54 [INFO] org.eclipse.papyrus.infra.core.sasheditor.di 3.0.0-SNAPSHOT SUCCESS [  0.221 s]
16:49:54 [INFO] Papyrus Infra One-file 0.0.1-SNAPSHOT .............. SUCCESS [  0.003 s]
16:49:54 [INFO] Papyrus EMF Expressions Infrastructure 0.0.1-SNAPSHOT SUCCESS [  0.003 s]
16:49:54 [INFO] org.eclipse.papyrus.infra.emf.expressions 2.0.0-SNAPSHOT SUCCESS [  0.223 s]
16:49:54 [INFO] org.eclipse.papyrus.infra.emf.gmf 2.0.0-SNAPSHOT ... SUCCESS [  0.194 s]
16:49:54 [INFO] org.eclipse.papyrus.infra.services.labelprovider 3.0.0-SNAPSHOT SUCCESS [  0.163 s]
16:49:54 [INFO] Papyrus Infra UI 0.0.1-SNAPSHOT .................... SUCCESS [  0.003 s]
16:49:54 [INFO] org.eclipse.papyrus.infra.widgets 4.0.0-SNAPSHOT ... SUCCESS [  0.860 s]
16:49:54 [INFO] org.eclipse.papyrus.infra.widgets.toolbox 3.0.0-SNAPSHOT SUCCESS [  0.218 s]
16:49:54 [INFO] org.eclipse.papyrus.infra.ui 3.0.0-SNAPSHOT ........ SUCCESS [  0.601 s]
16:49:54 [INFO] Papyrus Internationalization 0.0.1-SNAPSHOT ........ SUCCESS [  0.004 s]
16:49:54 [INFO] org.eclipse.papyrus.infra.internationalization.common 2.0.0-SNAPSHOT SUCCESS [  0.197 s]
16:49:54 [INFO] Papyrus Nattable 0.0.1-SNAPSHOT .................... SUCCESS [  0.003 s]
16:49:54 [INFO] org.eclipse.papyrus.infra.nattable.model 5.0.0-SNAPSHOT SUCCESS [ 15.922 s]
16:49:54 [INFO] org.eclipse.papyrus.infra.internationalization 2.0.0-SNAPSHOT SUCCESS [  0.330 s]
16:49:54 [INFO] org.eclipse.papyrus.infra.onefile 3.0.0-SNAPSHOT ... SUCCESS [  0.195 s]
16:49:54 [INFO] org.eclipse.papyrus.infra.constraints.editor 3.0.0-SNAPSHOT SUCCESS [  0.402 s]
16:49:54 [INFO] org.eclipse.papyrus.infra.constraints.ui 3.0.0-SNAPSHOT SUCCESS [  0.181 s]
16:49:54 [INFO] Papyrus Editor Welcome Page 0.0.1-SNAPSHOT ......... SUCCESS [  0.004 s]
16:49:54 [INFO] Papyrus Infra Properties Framework 0.0.1-SNAPSHOT .. SUCCESS [  0.003 s]
16:49:54 [INFO] org.eclipse.papyrus.infra.properties 4.0.0-SNAPSHOT  SUCCESS [  0.313 s]
16:49:54 [INFO] org.eclipse.papyrus.infra.emf.readonly 4.0.0-SNAPSHOT SUCCESS [  0.280 s]
16:49:54 [INFO] org.eclipse.papyrus.infra.ui.emf 3.0.0-SNAPSHOT .... SUCCESS [  0.346 s]
16:49:54 [INFO] org.eclipse.papyrus.infra.properties.ui 4.0.0-SNAPSHOT SUCCESS [  0.503 s]
16:49:54 [INFO] org.eclipse.papyrus.infra.editor.welcome 3.0.0-SNAPSHOT SUCCESS [  0.414 s]
16:49:54 [INFO] org.eclipse.papyrus.infra.services.navigation 4.0.0-SNAPSHOT SUCCESS [  0.168 s]
16:49:54 [INFO] org.eclipse.papyrus.infra.editor.welcome.nattable 4.0.0-SNAPSHOT SUCCESS [  0.275 s]
16:49:54 [INFO] org.eclipse.papyrus.infra.emf.appearance 3.0.0-SNAPSHOT SUCCESS [  0.162 s]
16:49:54 [INFO] org.eclipse.papyrus.infra.emf.diagram.common 3.0.0-SNAPSHOT SUCCESS [  0.198 s]
16:49:54 [INFO] org.eclipse.papyrus.infra.types.core 5.0.0-SNAPSHOT  SUCCESS [  0.261 s]
16:49:54 [INFO] org.eclipse.papyrus.infra.types.rulebased 5.0.0-SNAPSHOT SUCCESS [  0.252 s]
16:49:54 [INFO] org.eclipse.papyrus.infra.emf.types 5.0.0-SNAPSHOT . SUCCESS [  0.283 s]
16:49:54 [INFO] org.eclipse.papyrus.infra.properties.edit 4.0.0-SNAPSHOT SUCCESS [  0.230 s]
16:49:54 [INFO] org.eclipse.papyrus.infra.emf.types.ui 5.0.0-SNAPSHOT SUCCESS [  0.270 s]
16:49:54 [INFO] org.eclipse.papyrus.infra.emf.expressions.edit 2.0.0-SNAPSHOT SUCCESS [  0.164 s]
16:49:54 [INFO] org.eclipse.papyrus.infra.emf.expressions.editor 2.0.0-SNAPSHOT SUCCESS [  0.186 s]
16:49:54 [INFO] org.eclipse.papyrus.infra.emf.expressions.properties 2.0.0-SNAPSHOT SUCCESS [  0.208 s]
16:49:54 [INFO] Papyrus Infra Filters Model 0.0.1-SNAPSHOT ......... SUCCESS [  0.003 s]
16:49:54 [INFO] org.eclipse.papyrus.infra.filters 2.0.0-SNAPSHOT ... SUCCESS [  0.101 s]
16:49:54 [INFO] org.eclipse.papyrus.infra.filters.edit 2.0.0-SNAPSHOT SUCCESS [  0.090 s]
16:49:54 [INFO] org.eclipse.papyrus.infra.properties.editor 4.0.0-SNAPSHOT SUCCESS [  0.310 s]
16:49:54 [INFO] org.eclipse.papyrus.infra.services.architecture 2.0.0-SNAPSHOT SUCCESS [  0.140 s]
16:49:54 [INFO] org.eclipse.papyrus.infra.services.controlmode 3.0.0-SNAPSHOT SUCCESS [  0.358 s]
16:49:54 [INFO] org.eclipse.papyrus.infra.services.controlmode.history 3.0.0-SNAPSHOT SUCCESS [  0.134 s]
16:49:54 [INFO] org.eclipse.papyrus.infra.services.decoration 3.0.0-SNAPSHOT SUCCESS [  0.164 s]
16:49:54 [INFO] org.eclipse.papyrus.infra.services.edit.ui 4.0.0-SNAPSHOT SUCCESS [  0.302 s]
16:49:54 [INFO] org.eclipse.papyrus.infra.services.localizer 3.0.0-SNAPSHOT SUCCESS [  0.152 s]
16:49:54 [INFO] org.eclipse.papyrus.infra.services.openelement 4.0.0-SNAPSHOT SUCCESS [  0.136 s]
16:49:54 [INFO] org.eclipse.papyrus.infra.services.resourceloading 4.0.0-SNAPSHOT SUCCESS [  0.176 s]
16:49:54 [INFO] org.eclipse.papyrus.infra.services.resourceloading.ui 2.0.0-SNAPSHOT SUCCESS [  0.213 s]
16:49:54 [INFO] org.eclipse.papyrus.infra.services.semantic 3.0.0-SNAPSHOT SUCCESS [  0.131 s]
16:49:54 [INFO] org.eclipse.papyrus.infra.services.validation 4.0.0-SNAPSHOT SUCCESS [  0.240 s]
16:49:54 [INFO] org.eclipse.papyrus.infra.services.viewersearch 4.0.0-SNAPSHOT SUCCESS [  0.099 s]
16:49:54 [INFO] org.eclipse.papyrus.infra.services.viewlabelprovider 2.0.0-SNAPSHOT SUCCESS [  0.136 s]
16:49:54 [INFO] Papyrus Infra New-Child Model 0.0.1-SNAPSHOT ....... SUCCESS [  0.003 s]
16:49:54 [INFO] Papyrus Diagram Infrastructure 0.0.1-SNAPSHOT ...... SUCCESS [  0.002 s]
16:49:54 [INFO] Papyrus UML Diagram PaletteConfiguration 0.0.1-SNAPSHOT SUCCESS [  0.002 s]
16:49:54 [INFO] org.eclipse.papyrus.infra.gmfdiag.paletteconfiguration 5.0.0-SNAPSHOT SUCCESS [  0.343 s]
16:49:54 [INFO] org.eclipse.papyrus.infra.gmfdiag.representation 3.0.0-SNAPSHOT SUCCESS [  0.278 s]
16:49:54 [INFO] org.eclipse.papyrus.infra.internationalization.utils 2.0.0-SNAPSHOT SUCCESS [  0.178 s]
16:49:54 [INFO] org.eclipse.papyrus.infra.nattable.representation 3.0.0-SNAPSHOT SUCCESS [  0.186 s]
16:49:54 [INFO] Papyrus Infra Viewpoints 0.0.1-SNAPSHOT ............ SUCCESS [  0.003 s]
16:49:54 [INFO] org.eclipse.papyrus.infra.viewpoints.policy 4.0.0-SNAPSHOT SUCCESS [  0.480 s]
16:49:54 [INFO] org.eclipse.papyrus.infra.gmfdiag.commands 4.0.0-SNAPSHOT SUCCESS [  0.349 s]
16:49:54 [INFO] org.eclipse.papyrus.infra.newchild 5.0.0-SNAPSHOT .. SUCCESS [  0.392 s]
16:49:54 [INFO] org.eclipse.papyrus.infra.newchild.edit 5.0.0-SNAPSHOT SUCCESS [  0.321 s]
16:49:54 [INFO] org.eclipse.papyrus.infra.newchild.editor 4.0.0-SNAPSHOT SUCCESS [  0.315 s]
16:49:54 [INFO] org.eclipse.papyrus.infra.types.editor 4.0.0-SNAPSHOT SUCCESS [  0.245 s]
16:49:54 [INFO] org.eclipse.papyrus.infra.types.ui 4.0.0-SNAPSHOT .. SUCCESS [  0.254 s]
16:49:54 [INFO] org.eclipse.papyrus.infra.nattable 7.0.0-SNAPSHOT .. SUCCESS [  1.516 s]
16:49:54 [INFO] org.eclipse.papyrus.infra.emf.nattable 6.0.0-SNAPSHOT SUCCESS [  0.363 s]
16:49:54 [INFO] org.eclipse.papyrus.infra.nattable.common 6.0.0-SNAPSHOT SUCCESS [  0.396 s]
16:49:54 [INFO] org.eclipse.papyrus.infra.nattable.controlmode 3.0.0-SNAPSHOT SUCCESS [  0.267 s]
16:49:54 [INFO] org.eclipse.papyrus.infra.nattable.model.edit 5.0.0-SNAPSHOT SUCCESS [  0.259 s]
16:49:54 [INFO] org.eclipse.papyrus.infra.nattable.model.editor 6.0.0-SNAPSHOT SUCCESS [  0.415 s]
16:49:54 [INFO] org.eclipse.papyrus.infra.gmfdiag.style 3.0.0-SNAPSHOT SUCCESS [  0.083 s]
16:49:54 [INFO] org.eclipse.papyrus.infra.gmfdiag.tooling.runtime 4.0.0-SNAPSHOT SUCCESS [ 14.396 s]
16:49:54 [INFO] Papyrus Infra Other Bundles 0.0.1-SNAPSHOT ......... SUCCESS [  0.005 s]
16:49:54 [INFO] org.eclipse.papyrus.infra.sync 3.0.0-SNAPSHOT ...... SUCCESS [  0.280 s]
16:49:54 [INFO] org.eclipse.papyrus.infra.gmfdiag.common 4.0.0-SNAPSHOT SUCCESS [  1.819 s]
16:49:54 [INFO] org.eclipse.papyrus.infra.gmfdiag.extensionpoints.editors 2.0.0-SNAPSHOT SUCCESS [  0.232 s]
16:49:54 [INFO] Papyrus Views 0.0.1-SNAPSHOT ....................... SUCCESS [  0.002 s]
16:49:54 [INFO] Papyrus Model Explorer View 0.0.1-SNAPSHOT ......... SUCCESS [  0.001 s]
16:49:54 [INFO] org.eclipse.papyrus.views.modelexplorer 4.0.0-SNAPSHOT SUCCESS [  0.551 s]
16:49:54 [INFO] org.eclipse.papyrus.infra.nattable.modelexplorer 5.0.0-SNAPSHOT SUCCESS [  0.341 s]
16:49:54 [INFO] org.eclipse.papyrus.infra.nattable.properties 3.0.0-SNAPSHOT SUCCESS [  0.393 s]
16:49:54 [INFO] org.eclipse.papyrus.infra.nattable.views.config 6.0.0-SNAPSHOT SUCCESS [  0.326 s]
16:49:54 [INFO] org.eclipse.papyrus.infra.nattable.views.editor 2.0.0-SNAPSHOT SUCCESS [  0.027 s]
16:49:54 [INFO] org.eclipse.papyrus.infra.nattable.representation.edit 3.0.0-SNAPSHOT SUCCESS [  0.167 s]
16:49:54 [INFO] org.eclipse.papyrus.infra.nattable.gmfdiag 2.0.0-SNAPSHOT SUCCESS [  0.275 s]
16:49:54 [INFO] org.eclipse.papyrus.infra.ui.fonts 2.0.0-SNAPSHOT .. SUCCESS [  0.112 s]
16:49:54 [INFO] org.eclipse.papyrus.infra.ui.architecture 3.0.0-SNAPSHOT SUCCESS [  0.443 s]
16:49:54 [INFO] org.eclipse.papyrus.infra.ui.resources 2.0.0-SNAPSHOT SUCCESS [  0.183 s]
16:49:54 [INFO] org.eclipse.papyrus.infra.onefile.ui 2.0.0-SNAPSHOT  SUCCESS [  0.308 s]
16:49:54 [INFO] org.eclipse.papyrus.infra.newchild.ui 3.0.0-SNAPSHOT SUCCESS [  0.255 s]
16:49:54 [INFO] org.eclipse.papyrus.infra.hyperlink 4.0.0-SNAPSHOT . SUCCESS [  0.337 s]
16:49:54 [INFO] org.eclipse.papyrus.infra.psf 2.0.0-SNAPSHOT ....... SUCCESS [  0.122 s]
16:49:54 [INFO] org.eclipse.papyrus.infra.internationalization.edit 2.0.0-SNAPSHOT SUCCESS [  0.197 s]
16:49:54 [INFO] org.eclipse.papyrus.infra.internationalization.ui 2.0.0-SNAPSHOT SUCCESS [  0.338 s]
16:49:54 [INFO] org.eclipse.papyrus.infra.internationalization.controlmode 2.0.0-SNAPSHOT SUCCESS [  0.338 s]
16:49:54 [INFO] org.eclipse.papyrus.infra.internationalization.readonly 2.0.0-SNAPSHOT SUCCESS [  0.183 s]
16:49:54 [INFO] org.eclipse.papyrus.infra.editor.welcome.internationalization 3.0.0-SNAPSHOT SUCCESS [  0.393 s]
16:49:54 [INFO] org.eclipse.papyrus.extensionpoints.editors 4.0.0-SNAPSHOT SUCCESS [  0.228 s]
16:49:54 [INFO] org.eclipse.papyrus.infra.gmfdiag.canonical 3.0.0-SNAPSHOT SUCCESS [  0.508 s]
16:49:54 [INFO] org.eclipse.papyrus.infra.gmfdiag.controlmode 2.0.0-SNAPSHOT SUCCESS [  0.326 s]
16:49:54 [INFO] org.eclipse.papyrus.infra.gmfdiag.css.model 2.0.0-SNAPSHOT SUCCESS [  0.181 s]
16:49:54 [INFO] org.eclipse.papyrus.infra.gmfdiag.css.model.edit 2.0.0-SNAPSHOT SUCCESS [  0.135 s]
16:49:54 [INFO] Papyrus Diagram Expansion 0.0.1-SNAPSHOT ........... SUCCESS [  0.002 s]
16:49:54 [INFO] org.eclipse.papyrus.infra.gmfdiag.expansion 4.0.0-SNAPSHOT SUCCESS [  0.492 s]
16:49:54 [INFO] org.eclipse.papyrus.infra.gmfdiag.dnd 2.0.0-SNAPSHOT SUCCESS [  0.515 s]
16:49:54 [INFO] Papyrus Diagram CSS Support 0.0.1-SNAPSHOT ......... SUCCESS [  0.004 s]
16:49:54 [INFO] org.eclipse.papyrus.infra.gmfdiag.css 3.0.0-SNAPSHOT SUCCESS [  0.803 s]
16:49:54 [INFO] org.eclipse.papyrus.infra.gmfdiag.export 3.0.0-SNAPSHOT SUCCESS [  0.391 s]
16:49:54 [INFO] org.eclipse.papyrus.infra.gmfdiag.gef 2.0.0-SNAPSHOT SUCCESS [  0.185 s]
16:49:54 [INFO] org.eclipse.papyrus.infra.gmfdiag.gmfmenu.filter 2.0.0-SNAPSHOT SUCCESS [  0.161 s]
16:49:54 [INFO] org.eclipse.papyrus.infra.gmfdiag.preferences 4.0.0-SNAPSHOT SUCCESS [  0.449 s]
16:49:54 [INFO] org.eclipse.papyrus.infra.gmfdiag.navigation 3.0.0-SNAPSHOT SUCCESS [  0.383 s]
16:49:54 [INFO] org.eclipse.papyrus.infra.gmfdiag.hyperlink 4.0.0-SNAPSHOT SUCCESS [  0.413 s]
16:49:54 [INFO] org.eclipse.papyrus.infra.gmfdiag.menu 2.0.0-SNAPSHOT SUCCESS [  0.275 s]
16:49:54 [INFO] org.eclipse.papyrus.infra.gmfdiag.modelexplorer 2.0.0-SNAPSHOT SUCCESS [  0.295 s]
16:49:54 [INFO] org.eclipse.papyrus.infra.gmfdiag.outline 3.0.0-SNAPSHOT SUCCESS [  0.231 s]
16:49:54 [INFO] org.eclipse.papyrus.infra.gmfdiag.properties 5.0.0-SNAPSHOT SUCCESS [  0.428 s]
16:49:54 [INFO] org.eclipse.papyrus.infra.gmfdiag.viewersearcher 2.0.0-SNAPSHOT SUCCESS [  0.199 s]
16:49:54 [INFO] org.eclipse.papyrus.infra.gmfdiag.welcome 2.0.0-SNAPSHOT SUCCESS [  0.299 s]
16:49:54 [INFO] org.eclipse.papyrus.infra.gmfdiag.widgets 2.0.0-SNAPSHOT SUCCESS [  0.209 s]
16:49:54 [INFO] org.eclipse.papyrus.infra.gmfdiag.paletteconfiguration.edit 5.0.0-SNAPSHOT SUCCESS [  5.960 s]
16:49:54 [INFO] org.eclipse.papyrus.infra.gmfdiag.representation.edit 3.0.0-SNAPSHOT SUCCESS [  0.376 s]
16:49:54 [INFO] org.eclipse.papyrus.infra.gmfdiag.style.edit 3.0.0-SNAPSHOT SUCCESS [  0.101 s]
16:49:54 [INFO] Papyrus Diagram Assistants 0.0.1-SNAPSHOT .......... SUCCESS [  0.002 s]
16:49:54 [INFO] org.eclipse.papyrus.infra.gmfdiag.assistant 2.0.0-SNAPSHOT SUCCESS [  0.586 s]
16:49:54 [INFO] org.eclipse.papyrus.infra.gmfdiag.assistant.edit 2.0.0-SNAPSHOT SUCCESS [  0.344 s]
16:49:54 [INFO] org.eclipse.papyrus.infra.gmfdiag.assistant.editor 2.0.0-SNAPSHOT SUCCESS [  0.390 s]
16:49:54 [INFO] org.eclipse.papyrus.infra.gmfdiag.assistant.ui 2.0.0-SNAPSHOT SUCCESS [  0.273 s]
16:49:54 [INFO] org.eclipse.papyrus.infra.gmfdiag.css.properties 4.0.0-SNAPSHOT SUCCESS [  0.427 s]
16:49:54 [INFO] org.eclipse.papyrus.infra.gmfdiag.css3.xtext 4.0.0-SNAPSHOT SUCCESS [01:24 min]
16:49:54 [INFO] org.eclipse.papyrus.infra.gmfdiag.css.configuration 3.0.0-SNAPSHOT SUCCESS [  0.644 s]
16:49:54 [INFO] org.eclipse.papyrus.infra.gmfdiag.css.theme 2.0.0-SNAPSHOT SUCCESS [  0.034 s]
16:49:54 [INFO] org.eclipse.papyrus.infra.gmfdiag.css3.xtext.ui 4.0.0-SNAPSHOT SUCCESS [  2.366 s]
16:49:54 [INFO] org.eclipse.papyrus.views.modelexplorer.newchild 2.0.0-SNAPSHOT SUCCESS [  0.407 s]
16:49:54 [INFO] org.eclipse.papyrus.views.modelexplorer.resourceloading 3.0.0-SNAPSHOT SUCCESS [  0.160 s]
16:49:54 [INFO] org.eclipse.papyrus.views.modelexplorer.widgets 3.0.0-SNAPSHOT SUCCESS [  0.144 s]
16:49:54 [INFO] Papyrus Properties View 0.0.1-SNAPSHOT ............. SUCCESS [  0.001 s]
16:49:54 [INFO] org.eclipse.papyrus.views.properties 5.0.0-SNAPSHOT  SUCCESS [  0.309 s]
16:49:54 [INFO] org.eclipse.papyrus.views.properties.model.xwt 3.0.0-SNAPSHOT SUCCESS [  0.321 s]
16:49:54 [INFO] Papyrus Validation View 0.0.1-SNAPSHOT ............. SUCCESS [  0.003 s]
16:49:54 [INFO] org.eclipse.papyrus.views.validation 3.0.0-SNAPSHOT  SUCCESS [  0.218 s]
16:49:54 [INFO] org.eclipse.papyrus.views.search 3.0.0-SNAPSHOT .... SUCCESS [  0.223 s]
16:49:54 [INFO] Papyrus References View 0.0.1-SNAPSHOT ............. SUCCESS [  0.002 s]
16:49:54 [INFO] org.eclipse.papyrus.views.references 3.0.0-SNAPSHOT  SUCCESS [  0.231 s]
16:49:54 [INFO] Papyrus Documentation View 0.0.1-SNAPSHOT .......... SUCCESS [  0.003 s]
16:49:54 [INFO] Papyrus UML 0.0.1-SNAPSHOT ......................... SUCCESS [  0.003 s]
16:49:54 [INFO] org.eclipse.papyrus.uml.appearance 3.0.0-SNAPSHOT .. SUCCESS [  0.159 s]
16:49:54 [INFO] Papyrus UML Internationalization 0.0.1-SNAPSHOT .... SUCCESS [  0.002 s]
16:49:54 [INFO] org.eclipse.papyrus.uml.internationalization.utils 2.0.0-SNAPSHOT SUCCESS [  0.177 s]
16:49:54 [INFO] org.eclipse.papyrus.uml.internationalization.edit 2.0.0-SNAPSHOT SUCCESS [  0.312 s]
16:49:54 [INFO] org.eclipse.papyrus.uml.extensionpoints 2.0.0-SNAPSHOT SUCCESS [  0.226 s]
16:49:54 [INFO] Papyrus UML Tools 0.0.1-SNAPSHOT ................... SUCCESS [  0.002 s]
16:49:54 [INFO] org.eclipse.papyrus.uml.tools.utils 4.0.0-SNAPSHOT . SUCCESS [  0.368 s]
16:49:54 [INFO] org.eclipse.papyrus.uml.tools 5.0.0-SNAPSHOT ....... SUCCESS [  0.584 s]
16:49:54 [INFO] Papyrus UML Diagrams 0.0.1-SNAPSHOT ................ SUCCESS [  0.002 s]
16:49:54 [INFO] org.eclipse.papyrus.uml.diagram.common 4.0.0-SNAPSHOT SUCCESS [  2.714 s]
16:49:54 [INFO] org.eclipse.papyrus.uml.types.core 5.0.0-SNAPSHOT .. SUCCESS [  0.675 s]
16:49:54 [INFO] org.eclipse.papyrus.uml.ui 2.0.0-SNAPSHOT .......... SUCCESS [  0.324 s]
16:49:54 [INFO] org.eclipse.papyrus.views.documentation 2.0.0-SNAPSHOT SUCCESS [  0.429 s]
16:49:54 [INFO] Papyrus Editor 0.0.1-SNAPSHOT ...................... SUCCESS [  0.002 s]
16:49:54 [INFO] org.eclipse.papyrus.eclipse.project.editors 3.0.0-SNAPSHOT SUCCESS [  0.244 s]
16:49:54 [INFO] org.eclipse.papyrus.editor 3.0.0-SNAPSHOT .......... SUCCESS [  0.217 s]
16:49:54 [INFO] org.eclipse.papyrus.editor.perspectiveconfiguration 2.0.0-SNAPSHOT SUCCESS [  0.148 s]
16:49:54 [INFO] org.eclipse.papyrus.uml.commands 2.0.0-SNAPSHOT .... SUCCESS [  0.316 s]
16:49:54 [INFO] org.eclipse.papyrus.uml.controlmode.profile 3.0.0-SNAPSHOT SUCCESS [  0.336 s]
16:49:54 [INFO] org.eclipse.papyrus.uml.documentation.profile 2.0.0-SNAPSHOT SUCCESS [  0.100 s]
16:49:54 [INFO] org.eclipse.papyrus.uml.filters 2.0.0-SNAPSHOT ..... SUCCESS [  0.143 s]
16:49:54 [INFO] org.eclipse.papyrus.uml.filters.edit 2.0.0-SNAPSHOT  SUCCESS [  0.130 s]
16:49:54 [INFO] org.eclipse.papyrus.uml.icons 2.0.0-SNAPSHOT ....... SUCCESS [  0.150 s]
16:49:54 [INFO] org.eclipse.papyrus.uml.modelrepair 3.0.0-SNAPSHOT . SUCCESS [  0.453 s]
16:49:54 [INFO] org.eclipse.papyrus.uml.profile 4.0.0-SNAPSHOT ..... SUCCESS [  0.825 s]
16:49:54 [INFO] org.eclipse.papyrus.uml.import 2.0.0-SNAPSHOT ...... SUCCESS [  0.205 s]
16:49:54 [INFO] org.eclipse.papyrus.uml.export 2.0.0-SNAPSHOT ...... SUCCESS [  0.446 s]
16:49:54 [INFO] org.eclipse.papyrus.uml.navigation 2.0.0-SNAPSHOT .. SUCCESS [  0.264 s]
16:49:54 [INFO] org.eclipse.papyrus.uml.oclconstraintevaluation 2.0.0-SNAPSHOT SUCCESS [  0.128 s]
16:49:54 [INFO] org.eclipse.papyrus.uml.diagram.wizards 4.0.0-SNAPSHOT SUCCESS [  0.489 s]
16:49:54 [INFO] org.eclipse.papyrus.uml.perspective 2.0.0-SNAPSHOT . SUCCESS [  0.243 s]
16:49:54 [INFO] org.eclipse.papyrus.uml.resourceloading.profile 2.0.0-SNAPSHOT SUCCESS [  0.234 s]
16:49:54 [INFO] org.eclipse.papyrus.uml.search.ui 3.0.0-SNAPSHOT ... SUCCESS [  0.517 s]
16:49:54 [INFO] org.eclipse.papyrus.uml.service.types 5.0.0-SNAPSHOT SUCCESS [  0.785 s]
16:49:54 [INFO] org.eclipse.papyrus.uml.service.types.ui 3.0.0-SNAPSHOT SUCCESS [  0.523 s]
16:49:54 [INFO] org.eclipse.papyrus.uml.service.validation 3.0.0-SNAPSHOT SUCCESS [  0.328 s]
16:49:54 [INFO] org.eclipse.papyrus.uml.services.decoration 2.0.0-SNAPSHOT SUCCESS [  0.162 s]
16:49:54 [INFO] org.eclipse.papyrus.uml.templaterepository 3.0.0-SNAPSHOT SUCCESS [  0.298 s]
16:49:54 [INFO] Papyrus UML ALF 0.0.1-SNAPSHOT ..................... SUCCESS [  0.002 s]
16:49:54 [INFO] org.eclipse.papyrus.uml.alf 4.0.0-SNAPSHOT ......... SUCCESS [  6.311 s]
16:49:54 [INFO] org.eclipse.papyrus.uml.alf.common 3.0.0-SNAPSHOT .. SUCCESS [  0.164 s]
16:49:54 [INFO] org.eclipse.papyrus.uml.alf.common.ui 3.0.0-SNAPSHOT SUCCESS [  0.245 s]
16:49:54 [INFO] org.eclipse.papyrus.uml.alf.libraries 3.0.0-SNAPSHOT SUCCESS [  0.235 s]
16:49:54 [INFO] org.eclipse.papyrus.uml.alf.to.fuml 2.0.0-SNAPSHOT . SUCCESS [  0.288 s]
16:49:54 [INFO] org.eclipse.papyrus.uml.alf.ui 4.0.0-SNAPSHOT ...... SUCCESS [  7.757 s]
16:49:54 [INFO] Papyrus UML Architecture 0.0.1-SNAPSHOT ............ SUCCESS [  0.004 s]
16:49:54 [INFO] Papyrus UML Nattable 0.0.1-SNAPSHOT ................ SUCCESS [  0.003 s]
16:49:54 [INFO] org.eclipse.papyrus.uml.nattable 6.0.0-SNAPSHOT .... SUCCESS [  2.255 s]
16:49:54 [INFO] org.eclipse.papyrus.uml.nattable.clazz.config 6.0.0-SNAPSHOT SUCCESS [  0.246 s]
16:49:54 [INFO] org.eclipse.papyrus.uml.nattable.generic.config 2.0.0-SNAPSHOT SUCCESS [  0.124 s]
16:49:54 [INFO] org.eclipse.papyrus.uml.diagram.clazz 4.0.0-SNAPSHOT SUCCESS [  2.238 s]
16:49:54 [INFO] org.eclipse.papyrus.uml.diagram.communication 5.0.0-SNAPSHOT SUCCESS [  1.494 s]
16:49:54 [INFO] org.eclipse.papyrus.uml.diagram.component 4.0.0-SNAPSHOT SUCCESS [  1.257 s]
16:49:54 [INFO] org.eclipse.papyrus.uml.diagram.composite 4.0.0-SNAPSHOT SUCCESS [  2.753 s]
16:49:54 [INFO] org.eclipse.papyrus.uml.diagram.deployment 4.0.0-SNAPSHOT SUCCESS [  1.858 s]
16:49:54 [INFO] org.eclipse.papyrus.uml.diagram.activity 4.0.0-SNAPSHOT SUCCESS [  7.866 s]
16:49:54 [INFO] org.eclipse.papyrus.uml.diagram.interactionoverview 4.0.0-SNAPSHOT SUCCESS [  0.693 s]
16:49:54 [INFO] org.eclipse.papyrus.uml.diagram.profile 4.0.0-SNAPSHOT SUCCESS [  1.658 s]
16:49:54 [INFO] org.eclipse.papyrus.uml.diagram.menu 3.0.0-SNAPSHOT  SUCCESS [  0.746 s]
16:49:54 [INFO] org.eclipse.papyrus.uml.diagram.stereotype.edition 3.0.0-SNAPSHOT SUCCESS [  0.540 s]
16:49:54 [INFO] org.eclipse.papyrus.uml.diagram.sequence 6.0.0-SNAPSHOT SUCCESS [  8.689 s]
16:49:54 [INFO] org.eclipse.papyrus.uml.diagram.statemachine 4.0.0-SNAPSHOT SUCCESS [  1.383 s]
16:49:54 [INFO] org.eclipse.papyrus.uml.diagram.timing 2.0.0-SNAPSHOT SUCCESS [  1.688 s]
16:49:54 [INFO] org.eclipse.papyrus.uml.diagram.usecase 5.0.0-SNAPSHOT SUCCESS [  1.429 s]
16:49:54 [INFO] org.eclipse.papyrus.uml.architecture 2.0.0-SNAPSHOT  SUCCESS [  0.592 s]
16:49:54 [INFO] Papyrus UML Decorator Models 0.0.1-SNAPSHOT ........ SUCCESS [  0.003 s]
16:49:54 [INFO] org.eclipse.papyrus.uml.decoratormodel 3.0.0-SNAPSHOT SUCCESS [  0.506 s]
16:49:54 [INFO] org.eclipse.papyrus.uml.decoratormodel.controlmode 2.0.0-SNAPSHOT SUCCESS [  0.381 s]
16:49:54 [INFO] org.eclipse.papyrus.uml.decoratormodel.ui 3.0.0-SNAPSHOT SUCCESS [  0.454 s]
16:49:54 [INFO] Papyrus UML Properties 0.0.1-SNAPSHOT .............. SUCCESS [  0.003 s]
16:49:54 [INFO] org.eclipse.papyrus.uml.properties 4.0.0-SNAPSHOT .. SUCCESS [  1.190 s]
16:49:54 [INFO] org.eclipse.papyrus.uml.decoratormodel.properties 5.0.0-SNAPSHOT SUCCESS [  0.572 s]
16:49:54 [INFO] org.eclipse.papyrus.uml.diagram.common.groups 3.0.0-SNAPSHOT SUCCESS [  0.462 s]
16:49:54 [INFO] org.eclipse.papyrus.uml.diagram.css 3.0.0-SNAPSHOT . SUCCESS [  0.432 s]
16:49:54 [INFO] org.eclipse.papyrus.uml.diagram.dnd 2.0.0-SNAPSHOT . SUCCESS [  0.587 s]
16:49:54 [INFO] org.eclipse.papyrus.uml.diagram.icons 2.0.0-SNAPSHOT SUCCESS [  0.110 s]
16:49:54 [INFO] org.eclipse.papyrus.uml.diagram.linklf 3.0.0-SNAPSHOT SUCCESS [  0.497 s]
16:49:54 [INFO] org.eclipse.papyrus.uml.diagram.modelexplorer 2.0.0-SNAPSHOT SUCCESS [  0.262 s]
16:49:54 [INFO] org.eclipse.papyrus.uml.diagram.navigation 3.0.0-SNAPSHOT SUCCESS [  0.365 s]
16:49:54 [INFO] org.eclipse.papyrus.uml.diagram.symbols 2.0.0-SNAPSHOT SUCCESS [  0.452 s]
16:49:54 [INFO] org.eclipse.papyrus.uml.diagram.sequence.restrictions 2.0.0-SNAPSHOT SUCCESS [  0.426 s]
16:49:54 [INFO] org.eclipse.papyrus.uml.diagram.symbols.properties 2.0.0-SNAPSHOT SUCCESS [  0.200 s]
16:49:54 [INFO] Papyrus UML Expressions Infrastructure 0.0.1-SNAPSHOT SUCCESS [  0.002 s]
16:49:54 [INFO] org.eclipse.papyrus.uml.expressions 3.0.0-SNAPSHOT . SUCCESS [  0.134 s]
16:49:54 [INFO] org.eclipse.papyrus.uml.expressions.edit 3.0.0-SNAPSHOT SUCCESS [  0.184 s]
16:49:54 [INFO] org.eclipse.papyrus.uml.expressions.properties 2.0.0-SNAPSHOT SUCCESS [  0.242 s]
16:49:54 [INFO] Papyrus UML Model Explorer 0.0.1-SNAPSHOT .......... SUCCESS [  0.004 s]
16:49:54 [INFO] org.eclipse.papyrus.uml.modelexplorer 3.0.0-SNAPSHOT SUCCESS [  0.789 s]
16:49:54 [INFO] org.eclipse.papyrus.uml.modelexplorer.widgets 3.0.0-SNAPSHOT SUCCESS [  0.163 s]
16:49:54 [INFO] org.eclipse.papyrus.uml.nattable.generic 2.0.0-SNAPSHOT SUCCESS [  0.128 s]
16:49:54 [INFO] org.eclipse.papyrus.uml.nattable.matrix 2.0.0-SNAPSHOT SUCCESS [  0.393 s]
16:49:54 [INFO] org.eclipse.papyrus.uml.nattable.menu 2.0.0-SNAPSHOT SUCCESS [  0.583 s]
16:49:54 [INFO] org.eclipse.papyrus.uml.nattable.properties 2.0.0-SNAPSHOT SUCCESS [  0.360 s]
16:49:54 [INFO] org.eclipse.papyrus.uml.nattable.richtext 3.0.0-SNAPSHOT SUCCESS [  0.350 s]
16:49:54 [INFO] org.eclipse.papyrus.uml.nattable.stereotype.display 4.0.0-SNAPSHOT SUCCESS [  0.448 s]
16:49:54 [INFO] Papyrus UML Xtext Integration 0.0.1-SNAPSHOT ....... SUCCESS [  0.002 s]
16:49:54 [INFO] org.eclipse.papyrus.uml.xtext.integration.core 3.0.0-SNAPSHOT SUCCESS [  0.080 s]
16:49:54 [INFO] org.eclipse.papyrus.uml.xtext.integration.ui 3.0.0-SNAPSHOT SUCCESS [  0.484 s]
16:49:54 [INFO] org.eclipse.papyrus.uml.nattable.xtext.integration 3.0.0-SNAPSHOT SUCCESS [  0.375 s]
16:49:54 [INFO] Papyrus UML Textual Edit 0.0.1-SNAPSHOT ............ SUCCESS [  0.003 s]
16:49:54 [INFO] org.eclipse.papyrus.uml.textedit.valuespecification.xtext 2.0.0-SNAPSHOT SUCCESS [  1.076 s]
16:49:54 [INFO] org.eclipse.papyrus.uml.textedit.valuespecification.xtext.utils 2.0.0-SNAPSHOT SUCCESS [  0.284 s]
16:49:54 [INFO] org.eclipse.papyrus.uml.textedit.valuespecification.xtext.ui 3.0.0-SNAPSHOT SUCCESS [  0.492 s]
16:49:54 [INFO] org.eclipse.papyrus.uml.nattable.xtext.valuespecification 6.0.0-SNAPSHOT SUCCESS [  0.597 s]
16:49:54 [INFO] Papyrus UML Profile 0.0.1-SNAPSHOT ................. SUCCESS [  0.007 s]
16:49:54 [INFO] org.eclipse.papyrus.uml.profile.drafter 2.0.0-SNAPSHOT SUCCESS [  0.760 s]
16:49:54 [INFO] org.eclipse.papyrus.uml.profile.drafter.documentation 2.0.0-SNAPSHOT SUCCESS [  0.038 s]
16:49:54 [INFO] org.eclipse.papyrus.uml.properties.xtext 2.0.0-SNAPSHOT SUCCESS [  0.613 s]
16:49:54 [INFO] org.eclipse.papyrus.uml.textedit.common.xtext 3.0.0-SNAPSHOT SUCCESS [  0.928 s]
16:49:54 [INFO] org.eclipse.papyrus.uml.textedit.collaborationuse.xtext 3.0.0-SNAPSHOT SUCCESS [  0.811 s]
16:49:54 [INFO] org.eclipse.papyrus.uml.textedit.common.xtext.ui 3.0.0-SNAPSHOT SUCCESS [  1.077 s]
16:49:54 [INFO] org.eclipse.papyrus.uml.textedit.collaborationuse.xtext.ui 3.0.0-SNAPSHOT SUCCESS [  0.649 s]
16:49:54 [INFO] org.eclipse.papyrus.uml.textedit.connectionpointreference.xtext 3.0.0-SNAPSHOT SUCCESS [  0.881 s]
16:49:54 [INFO] org.eclipse.papyrus.uml.textedit.connectionpointreference.xtext.ui 3.0.0-SNAPSHOT SUCCESS [  0.565 s]
16:49:54 [INFO] org.eclipse.papyrus.uml.textedit.constraintwithessentialocl.xtext 2.0.0-SNAPSHOT SUCCESS [  0.444 s]
16:49:54 [INFO] org.eclipse.papyrus.uml.textedit.javaconstraint 3.0.0-SNAPSHOT SUCCESS [  0.176 s]
16:49:54 [INFO] org.eclipse.papyrus.uml.textedit.message.xtext 3.0.0-SNAPSHOT SUCCESS [  0.884 s]
16:49:54 [INFO] org.eclipse.papyrus.uml.textedit.message.xtext.ui 3.0.0-SNAPSHOT SUCCESS [  0.742 s]
16:49:54 [INFO] org.eclipse.papyrus.uml.textedit.parameter.xtext 3.0.0-SNAPSHOT SUCCESS [  1.034 s]
16:49:54 [INFO] org.eclipse.papyrus.uml.textedit.parameter.xtext.ui 3.0.0-SNAPSHOT SUCCESS [  0.778 s]
16:49:54 [INFO] org.eclipse.papyrus.uml.textedit.port.xtext 2.0.0-SNAPSHOT SUCCESS [  1.002 s]
16:49:54 [INFO] org.eclipse.papyrus.uml.textedit.port.xtext.ui 3.0.0-SNAPSHOT SUCCESS [  0.945 s]
16:49:54 [INFO] org.eclipse.papyrus.uml.textedit.property.xtext 3.0.0-SNAPSHOT SUCCESS [  1.204 s]
16:49:54 [INFO] org.eclipse.papyrus.uml.textedit.property.xtext.ui 3.0.0-SNAPSHOT SUCCESS [  0.647 s]
16:49:54 [INFO] org.eclipse.papyrus.uml.textedit.state.xtext 3.0.0-SNAPSHOT SUCCESS [  1.086 s]
16:49:54 [INFO] org.eclipse.papyrus.uml.textedit.state.xtext.ui 3.0.0-SNAPSHOT SUCCESS [  0.514 s]
16:49:54 [INFO] org.eclipse.papyrus.uml.textedit.stereotypeproperty.xtext 4.0.0-SNAPSHOT SUCCESS [  1.524 s]
16:49:54 [INFO] org.eclipse.papyrus.uml.textedit.stereotypeproperty.xtext.ui 4.0.0-SNAPSHOT SUCCESS [  1.010 s]
16:49:54 [INFO] org.eclipse.papyrus.uml.textedit.transition.xtext 2.0.0-SNAPSHOT SUCCESS [  0.315 s]
16:49:54 [INFO] org.eclipse.papyrus.uml.textedit.transition.xtext.ui 3.0.0-SNAPSHOT SUCCESS [  0.553 s]
16:49:54 [INFO] org.eclipse.papyrus.uml.xtext.integration.validation 3.0.0-SNAPSHOT SUCCESS [  0.275 s]
16:49:54 [INFO] org.eclipse.papyrus.uml.internationalization 2.0.0-SNAPSHOT SUCCESS [  0.302 s]
16:49:54 [INFO] Papyrus M2M QvTo 0.0.1-SNAPSHOT .................... SUCCESS [  0.004 s]
16:49:54 [INFO] org.eclipse.papyrus.uml.m2m.qvto.common 2.0.0-SNAPSHOT SUCCESS [  0.488 s]
16:49:54 [INFO] org.eclipse.papyrus.uml.m2m.qvto.common.blackboxes 2.0.0-SNAPSHOT SUCCESS [  0.123 s]
16:49:54 [INFO] org.eclipse.papyrus.plugins-doc 0.0.1-SNAPSHOT ..... SUCCESS [  0.003 s]
16:49:54 [INFO] Papyrus - API migration documentation 2.0.0-SNAPSHOT SUCCESS [  4.719 s]
16:49:54 [INFO] Papyrus Copypaste UI doc 2.0.0-SNAPSHOT ............ SUCCESS [  0.087 s]
16:49:54 [INFO] Papyrus Developer doc 2.0.0-SNAPSHOT ............... SUCCESS [  0.616 s]
16:49:54 [INFO] Papyrus DSML Validation doc 2.0.0-SNAPSHOT ......... SUCCESS [  0.065 s]
16:49:54 [INFO] Papyrus Infra doc 2.0.0-SNAPSHOT ................... SUCCESS [  0.034 s]
16:49:54 [INFO] Papyrus Infra GmfDiag Common doc 2.0.0-SNAPSHOT .... SUCCESS [  0.269 s]
16:49:54 [INFO] Papyrus Infra GmfDiag Css doc 2.0.0-SNAPSHOT ....... SUCCESS [  0.185 s]
16:49:54 [INFO] Papyrus Infra Expression doc 2.0.0-SNAPSHOT ........ SUCCESS [  0.067 s]
16:49:54 [INFO] Papyrus Internationalization doc 2.0.0-SNAPSHOT .... SUCCESS [  0.118 s]
16:49:54 [INFO] Papyrus Infra Nattable doc 2.0.0-SNAPSHOT .......... SUCCESS [  0.500 s]
16:49:54 [INFO] Papyrus Infra Newchild doc 2.0.0-SNAPSHOT .......... SUCCESS [  0.071 s]
16:49:54 [INFO] Papyrus Infra Services ControlMode doc 2.0.0-SNAPSHOT SUCCESS [  0.105 s]
16:49:54 [INFO] Papyrus Infra Service decoration doc 2.0.0-SNAPSHOT  SUCCESS [  0.132 s]
16:49:54 [INFO] Papyrus Infra Service decoration doc 2.0.0-SNAPSHOT  SUCCESS [  0.064 s]
16:49:54 [INFO] Papyrus Infra Architecture doc 2.0.0-SNAPSHOT ...... SUCCESS [  0.113 s]
16:49:54 [INFO] Papyrus Infra Types doc 4.0.0-SNAPSHOT ............. SUCCESS [  0.120 s]
16:49:54 [INFO] Papyrus Req Reqif doc 2.0.0-SNAPSHOT ............... SUCCESS [  0.122 s]
16:49:54 [INFO] Papyrus Uml DecoratorModel doc 2.0.0-SNAPSHOT ...... SUCCESS [  0.136 s]
16:49:54 [INFO] Papyrus Uml Diagram Common doc 2.0.0-SNAPSHOT ...... SUCCESS [  0.154 s]
16:49:54 [INFO] Papyrus Uml Diagram profile doc 2.0.0-SNAPSHOT ..... SUCCESS [  0.200 s]
16:49:54 [INFO] Papyrus Uml doc 2.0.0-SNAPSHOT ..................... SUCCESS [  0.406 s]
16:49:54 [INFO] Papyrus Uml Search UI doc 2.0.0-SNAPSHOT ........... SUCCESS [  0.089 s]
16:49:54 [INFO] Papyrus ModelRepair doc 2.0.0-SNAPSHOT ............. SUCCESS [  0.038 s]
16:49:54 [INFO] Papyrus Uml Profile Assistants doc 2.0.0-SNAPSHOT .. SUCCESS [  0.076 s]
16:49:54 [INFO] Papyrus Uml Search UI doc 2.0.0-SNAPSHOT ........... SUCCESS [  0.109 s]
16:49:54 [INFO] Papyrus Views Properties doc 2.0.0-SNAPSHOT ........ SUCCESS [  0.086 s]
16:49:54 [INFO] Papyrus Views References doc 2.0.0-SNAPSHOT ........ SUCCESS [  0.034 s]
16:49:54 [INFO] Papyrus Views References doc 2.0.0-SNAPSHOT ........ SUCCESS [  0.036 s]
16:49:54 [INFO] Papyrus Views References doc 2.0.0-SNAPSHOT ........ SUCCESS [  0.048 s]
16:49:54 [INFO] org.eclipse.papyrus.toolsmiths.profilemigration.doc 1.0.0-SNAPSHOT SUCCESS [  0.064 s]
16:49:54 [INFO] org.eclipse.papyrus.toolsmiths.architecture.doc 2.0.0-SNAPSHOT SUCCESS [  0.033 s]
16:49:54 [INFO] org.eclipse.papyrus.toolsmiths.validation.doc 2.0.0-SNAPSHOT SUCCESS [  0.038 s]
16:49:54 [INFO] Papyrus SDK 0.0.1-SNAPSHOT ......................... SUCCESS [  0.002 s]
16:49:54 [INFO] org.eclipse.papyrus.sdk 6.0.0-SNAPSHOT ............. SUCCESS [  0.023 s]
16:49:54 [INFO] Papyrus Examples Plugins 1.0.1-SNAPSHOT ............ SUCCESS [  0.002 s]
16:49:54 [INFO] org.eclipse.papyrus.examples.core 1.0.1-SNAPSHOT ... SUCCESS [  0.001 s]
16:49:54 [INFO] org.eclipse.papyrus.example.core.lifecycleevents 2.0.0-SNAPSHOT SUCCESS [  0.166 s]
16:49:54 [INFO] org.eclipse.papyrus.example.core.sashwindows.fulleditor 2.0.0-SNAPSHOT SUCCESS [  0.258 s]
16:49:54 [INFO] org.eclipse.papyrus.example.core.sashwindows.simpleeditor 2.0.0-SNAPSHOT SUCCESS [  0.251 s]
16:49:54 [INFO] org.eclipse.papyrus.examples.emf 1.0.1-SNAPSHOT .... SUCCESS [  0.004 s]
16:49:54 [INFO] org.eclipse.papyrus.outline.emftree 2.0.0-SNAPSHOT . SUCCESS [  0.255 s]
16:49:54 [INFO] org.eclipse.papyrus.examples.infra 1.0.1-SNAPSHOT .. SUCCESS [  0.005 s]
16:49:54 [INFO] org.eclipse.papyrus.example.infra.servicesregistry.retrieval 2.0.0-SNAPSHOT SUCCESS [  0.208 s]
16:49:54 [INFO] org.eclipse.papyrus.infra.gmfdiag.connectionpoint.preferences 2.0.0-SNAPSHOT SUCCESS [  0.301 s]
16:49:54 [INFO] org.eclipse.papyrus.examples.others 1.0.1-SNAPSHOT . SUCCESS [  0.002 s]
16:49:54 [INFO] org.eclipse.papyrus.example.diagram.simplediagram 2.0.0-SNAPSHOT SUCCESS [  0.651 s]
16:49:54 [INFO] org.eclipse.papyrus.example.text.instance 2.0.0-SNAPSHOT SUCCESS [  0.094 s]
16:49:54 [INFO] org.eclipse.papyrus.examples.uml 1.0.1-SNAPSHOT .... SUCCESS [  0.004 s]
16:49:54 [INFO] org.eclipse.papyrus.example.uml.comment.editor.newresource 2.0.0-SNAPSHOT SUCCESS [  0.262 s]
16:49:54 [INFO] org.eclipse.papyrus.example.uml.comment.editor.sharedresource 2.0.0-SNAPSHOT SUCCESS [  0.265 s]
16:49:54 [INFO] org.eclipse.papyrus.uml.diagram.emftree 2.0.0-SNAPSHOT SUCCESS [  0.237 s]
16:49:54 [INFO] org.eclipse.papyrus.uml.textual.editors.example 2.0.0-SNAPSHOT SUCCESS [  5.766 s]
16:49:54 [INFO] org.eclipse.papyrus.uml.disable.helper.advices.example 2.0.0-SNAPSHOT SUCCESS [  0.280 s]
16:49:54 [INFO] org.eclipse.papyrus.examples.uml.diagrams 2.0.0-SNAPSHOT SUCCESS [  0.058 s]
16:49:54 [INFO] org.eclipse.papyrus.example.uml.nattable.actions 2.0.0-SNAPSHOT SUCCESS [  0.211 s]
16:49:54 [INFO] org.eclipse.papyrus.example.uml.nattable.empty.line 2.0.0-SNAPSHOT SUCCESS [  0.752 s]
16:49:54 [INFO] org.eclipse.papyrus.example.uml.services.decorator 2.0.0-SNAPSHOT SUCCESS [  0.040 s]
16:49:54 [INFO] org.eclipse.papyrus.examples-user 1.0.1-SNAPSHOT ... SUCCESS [  0.002 s]
16:49:54 [INFO] org.eclipse.papyrus.examples.user.qvto 2.0.0-SNAPSHOT SUCCESS [  0.039 s]
16:49:54 [INFO] Papyrus Main Features 0.0.1-SNAPSHOT ............... SUCCESS [  0.003 s]
16:49:54 [INFO] org.eclipse.papyrus.doc.feature 3.1.0-SNAPSHOT ..... SUCCESS [  0.806 s]
16:49:54 [INFO] org.eclipse.papyrus.editor.feature 2.0.0-SNAPSHOT .. SUCCESS [  0.105 s]
16:49:54 [INFO] org.eclipse.papyrus.emf.facet.feature 3.0.0-SNAPSHOT SUCCESS [  0.740 s]
16:49:54 [INFO] org.eclipse.papyrus.emf.feature 1.1.0-SNAPSHOT ..... SUCCESS [  0.072 s]
16:49:54 [INFO] org.eclipse.papyrus.infra.architecture.feature 1.0.0-SNAPSHOT SUCCESS [  0.108 s]
16:49:54 [INFO] org.eclipse.papyrus.infra.core.feature 3.0.0-SNAPSHOT SUCCESS [  0.131 s]
16:49:54 [INFO] org.eclipse.papyrus.infra.emf.expressions.feature 1.0.0-SNAPSHOT SUCCESS [  0.088 s]
16:49:54 [INFO] org.eclipse.papyrus.infra.emf.feature 3.0.0-SNAPSHOT SUCCESS [  0.147 s]
16:49:54 [INFO] org.eclipse.papyrus.infra.gmfdiag.feature 3.0.0-SNAPSHOT SUCCESS [  0.526 s]
16:49:54 [INFO] org.eclipse.papyrus.infra.services.feature 3.0.0-SNAPSHOT SUCCESS [  0.184 s]
16:49:54 [INFO] org.eclipse.papyrus.infra.ui.feature 3.0.0-SNAPSHOT  SUCCESS [  0.392 s]
16:49:54 [INFO] org.eclipse.papyrus.infra.widget.feature 3.0.0-SNAPSHOT SUCCESS [  0.265 s]
16:49:54 [INFO] org.eclipse.papyrus.infra.internationalization.feature 1.0.0-SNAPSHOT SUCCESS [  0.191 s]
16:49:54 [INFO] org.eclipse.papyrus.infra.nattable.feature 4.0.0-SNAPSHOT SUCCESS [  0.991 s]
16:49:54 [INFO] org.eclipse.papyrus.infra.gmfdiag.css.feature 3.0.0-SNAPSHOT SUCCESS [  0.442 s]
16:49:54 [INFO] org.eclipse.papyrus.infra.viewpoints.feature 3.0.0-SNAPSHOT SUCCESS [  0.133 s]
16:49:54 [INFO] org.eclipse.papyrus.infra.feature 3.0.0-SNAPSHOT ... SUCCESS [  0.803 s]
16:49:54 [INFO] org.eclipse.papyrus.uml.alf.feature 3.0.0-SNAPSHOT . SUCCESS [  0.117 s]
16:49:54 [INFO] org.eclipse.papyrus.uml.architecture.feature 1.0.0-SNAPSHOT SUCCESS [  0.394 s]
16:49:54 [INFO] org.eclipse.papyrus.uml.decoratormodel.feature 3.0.0-SNAPSHOT SUCCESS [  0.182 s]
16:49:54 [INFO] org.eclipse.papyrus.uml.diagram.css.feature 2.0.0-SNAPSHOT SUCCESS [  0.229 s]
16:49:54 [INFO] org.eclipse.papyrus.uml.diagram.feature 3.0.0-SNAPSHOT SUCCESS [  0.530 s]
16:49:54 [INFO] org.eclipse.papyrus.uml.expressions.feature 1.0.0-SNAPSHOT SUCCESS [  0.135 s]
16:49:54 [INFO] org.eclipse.papyrus.uml.internationalization.feature 1.0.0-SNAPSHOT SUCCESS [  0.078 s]
16:49:54 [INFO] org.eclipse.papyrus.uml.modelexplorer.feature 2.0.0-SNAPSHOT SUCCESS [  0.187 s]
16:49:54 [INFO] org.eclipse.papyrus.uml.properties.feature 3.0.0-SNAPSHOT SUCCESS [  0.220 s]
16:49:54 [INFO] org.eclipse.papyrus.uml.tools.feature 3.0.0-SNAPSHOT SUCCESS [  0.093 s]
16:49:54 [INFO] org.eclipse.papyrus.uml.ui.feature 1.2.0-SNAPSHOT .. SUCCESS [  0.077 s]
16:49:54 [INFO] org.eclipse.papyrus.uml.textedit.feature 2.0.0-SNAPSHOT SUCCESS [  0.517 s]
16:49:54 [INFO] org.eclipse.papyrus.uml.search.feature 2.0.0-SNAPSHOT SUCCESS [  0.100 s]
16:49:54 [INFO] org.eclipse.papyrus.uml.xtext.integration.feature 2.0.0-SNAPSHOT SUCCESS [  0.168 s]
16:49:54 [INFO] org.eclipse.papyrus.uml.m2m.qvto.feature 1.0.0-SNAPSHOT SUCCESS [  0.116 s]
16:49:54 [INFO] org.eclipse.papyrus.uml.nattable.feature 4.0.0-SNAPSHOT SUCCESS [  0.443 s]
16:49:54 [INFO] org.eclipse.papyrus.uml.feature 4.0.0-SNAPSHOT ..... SUCCESS [  1.111 s]
16:49:54 [INFO] org.eclipse.papyrus.views.documentation.feature 1.0.0-SNAPSHOT SUCCESS [  0.127 s]
16:49:54 [INFO] org.eclipse.papyrus.views.search.feature 2.0.0-SNAPSHOT SUCCESS [  0.121 s]
16:49:54 [INFO] org.eclipse.papyrus.views.modelexplorer.feature 3.0.0-SNAPSHOT SUCCESS [  0.191 s]
16:49:54 [INFO] org.eclipse.papyrus.views.properties.feature 3.0.0-SNAPSHOT SUCCESS [  0.083 s]
16:49:54 [INFO] org.eclipse.papyrus.views.references.feature 2.0.0-SNAPSHOT SUCCESS [  0.090 s]
16:49:54 [INFO] org.eclipse.papyrus.views.validation.feature 2.0.0-SNAPSHOT SUCCESS [  0.062 s]
16:49:54 [INFO] org.eclipse.papyrus.views.feature 1.0.0-SNAPSHOT ... SUCCESS [  0.237 s]
16:49:54 [INFO] org.eclipse.papyrus.sdk.feature 5.0.0-SNAPSHOT ..... SUCCESS [  1.375 s]
16:49:54 [INFO] Papyrus Examples Features 0.0.1-SNAPSHOT ........... SUCCESS [  0.002 s]
16:49:54 [INFO] org.eclipse.papyrus.user.examples.feature 0.0.3-SNAPSHOT SUCCESS [  0.356 s]
16:49:54 [INFO] org.eclipse.papyrus.main.target.parent 0.0.1-SNAPSHOT SUCCESS [  0.002 s]
16:49:54 [INFO] org.eclipse.papyrus.main.portable.target 0.0.1-SNAPSHOT SUCCESS [  0.003 s]
16:49:54 [INFO] org.eclipse.papyrus.p2 5.0.0-SNAPSHOT .............. SUCCESS [01:11 min]
16:49:54 [INFO] org.eclipse.papyrus.toolsmiths.releng 1.0.0-SNAPSHOT SUCCESS [  0.582 s]
16:49:54 [INFO] Papyrus Toolsmiths Features 0.0.1-SNAPSHOT ......... SUCCESS [  0.007 s]
16:49:54 [INFO] Papyrus Toolsmiths Plugins 0.0.1-SNAPSHOT .......... SUCCESS [  0.006 s]
16:49:54 [INFO] org.eclipse.papyrus.architectureview 2.0.0-SNAPSHOT  SUCCESS [  0.509 s]
16:49:54 [INFO] org.eclipse.papyrus.dev.ui 1.0.0-SNAPSHOT .......... SUCCESS [  0.125 s]
16:49:54 [INFO] org.eclipse.papyrus.dev.view.services.edit.request 2.0.0-SNAPSHOT SUCCESS [  0.115 s]
16:49:54 [INFO] org.eclipse.papyrus.gmf.editpoliciesstates 2.0.0-SNAPSHOT SUCCESS [  0.269 s]
16:49:54 [INFO] org.eclipse.papyrus.gmf.editpartview 2.0.0-SNAPSHOT  SUCCESS [  0.181 s]
16:49:54 [INFO] org.eclipse.papyrus.gmf.figureview 2.0.0-SNAPSHOT .. SUCCESS [  0.170 s]
16:49:54 [INFO] org.eclipse.papyrus.infra.gmfdiag.css.debug 2.0.0-SNAPSHOT SUCCESS [  0.383 s]
16:49:54 [INFO] org.eclipse.papyrus.infra.emf.commandstack 2.0.0-SNAPSHOT SUCCESS [  0.132 s]
16:49:54 [INFO] org.eclipse.papyrus.dev.types 4.0.0-SNAPSHOT ....... SUCCESS [  1.095 s]
16:49:54 [INFO] org.eclipse.papyrus.dev.pluginexplorer 2.0.0-SNAPSHOT SUCCESS [  0.188 s]
16:49:54 [INFO] org.eclipse.papyrus.debug.feature 1.0.0-SNAPSHOT ... SUCCESS [  0.295 s]
16:49:54 [INFO] org.eclipse.papyrus.codegen 2.0.0-SNAPSHOT ......... SUCCESS [  0.368 s]
16:49:54 [INFO] org.eclipse.papyrus.gmfgenextension 3.0.0-SNAPSHOT . SUCCESS [  0.485 s]
16:49:54 [INFO] org.eclipse.papyrus.def 2.0.0-SNAPSHOT ............. SUCCESS [  6.752 s]
16:49:54 [INFO] Papyrus UML Assistants 0.0.1-SNAPSHOT .............. SUCCESS [  0.004 s]
16:49:54 [INFO] org.eclipse.papyrus.uml.profile.types.generator 3.0.0-SNAPSHOT SUCCESS [  1.981 s]
16:49:54 [INFO] org.eclipse.papyrus.uml.profile.assistants.generator 5.0.0-SNAPSHOT SUCCESS [  1.366 s]
16:49:54 [INFO] org.eclipse.papyrus.dev.assistants.codegen 2.0.0-SNAPSHOT SUCCESS [  4.548 s]
16:49:54 [INFO] org.eclipse.papyrus.mwe2.utils 2.0.0-SNAPSHOT ...... SUCCESS [  0.221 s]
16:49:54 [INFO] org.eclipse.papyrus.diagramgen.feature 1.0.0-SNAPSHOT SUCCESS [  0.312 s]
16:49:54 [INFO] org.eclipse.papyrus.tests.junit-framework 0.0.1-SNAPSHOT SUCCESS [  0.003 s]
16:49:54 [INFO] org.eclipse.papyrus.junit.framework 2.0.0-SNAPSHOT . SUCCESS [  0.380 s]
16:49:54 [INFO] org.eclipse.papyrus.junit.utils 3.0.0-SNAPSHOT ..... SUCCESS [  1.005 s]
16:49:54 [INFO] org.eclipse.papyrus.bundles.tests 2.0.0-SNAPSHOT ... SUCCESS [  0.769 s]
16:49:54 [INFO] org.eclipse.papyrus.junit.feature 1.0.0-SNAPSHOT ... SUCCESS [  0.283 s]
16:49:54 [INFO] org.eclipse.papyrus.dev.project.management 2.0.0-SNAPSHOT SUCCESS [  0.971 s]
16:49:54 [INFO] org.eclipse.papyrus.releng.tools 3.0.0-SNAPSHOT .... SUCCESS [  0.519 s]
16:49:54 [INFO] org.eclipse.papyrus.releng.feature 1.0.0-SNAPSHOT .. SUCCESS [  1.031 s]
16:49:54 [INFO] org.eclipse.papyrus.customization.nattableconfiguration 3.0.0-SNAPSHOT SUCCESS [  0.832 s]
16:49:54 [INFO] org.eclipse.papyrus.infra.emf.types.ui.properties 4.0.0-SNAPSHOT SUCCESS [  0.352 s]
16:49:54 [INFO] org.eclipse.papyrus.infra.gmfdiag.expansion.edit 3.0.0-SNAPSHOT SUCCESS [  0.422 s]
16:49:54 [INFO] org.eclipse.papyrus.infra.gmfdiag.expansion.editor 3.0.0-SNAPSHOT SUCCESS [  0.453 s]
16:49:54 [INFO] org.eclipse.papyrus.infra.gmfdiag.paletteconfiguration.editor 4.0.0-SNAPSHOT SUCCESS [  0.715 s]
16:49:54 [INFO] org.eclipse.papyrus.toolsmiths 2.0.0-SNAPSHOT ...... SUCCESS [  0.440 s]
16:49:54 [INFO] org.eclipse.papyrus.toolsmiths.ecore 2.0.0-SNAPSHOT  SUCCESS [  0.209 s]
16:49:54 [INFO] org.eclipse.papyrus.toolsmiths.expressions 2.0.0-SNAPSHOT SUCCESS [  1.864 s]
16:49:54 [INFO] org.eclipse.papyrus.uml.m2m.qvto.tests.tools 2.0.0-SNAPSHOT SUCCESS [  0.625 s]
16:49:54 [INFO] org.eclipse.papyrus.uml.m2m.qvto.tests.tools.feature 1.0.0-SNAPSHOT SUCCESS [  0.559 s]
16:49:54 [INFO] org.eclipse.papyrus.toolsmiths.palette 4.0.0-SNAPSHOT SUCCESS [  0.705 s]
16:49:54 [INFO] org.eclipse.papyrus.views.properties.toolsmiths 3.0.0-SNAPSHOT SUCCESS [  0.571 s]
16:49:54 [INFO] org.eclipse.papyrus.uml.properties.generation 3.0.0-SNAPSHOT SUCCESS [  0.638 s]
16:49:54 [INFO] org.eclipse.papyrus.toolsmiths.nattable 2.0.0-SNAPSHOT SUCCESS [  0.556 s]
16:49:54 [INFO] org.eclipse.papyrus.uml.types.ui.properties 4.0.0-SNAPSHOT SUCCESS [  0.549 s]
16:49:54 [INFO] org.eclipse.papyrus.toolsmiths.profile-migration 0.0.1-SNAPSHOT SUCCESS [  0.002 s]
16:49:54 [INFO] org.eclipse.papyrus.toolsmiths.profilemigration.ui 1.0.0-SNAPSHOT SUCCESS [  0.538 s]
16:49:54 [INFO] org.eclipse.papyrus.toolsmiths.profilemigration 1.0.0-SNAPSHOT SUCCESS [  0.587 s]
16:49:54 [INFO] org.eclipse.papyrus.toolsmiths.feature 1.2.0-SNAPSHOT SUCCESS [  1.942 s]
16:49:54 [INFO] org.eclipse.papyrus.uml.profile.types.generator.ui 2.0.0-SNAPSHOT SUCCESS [  0.639 s]
16:49:54 [INFO] org.eclipse.papyrus.uml.profile.assistants.generator.ui 2.0.0-SNAPSHOT SUCCESS [  0.397 s]
16:49:54 [INFO] org.eclipse.papyrus.uml.profile.newchildmenu.generator 2.0.0-SNAPSHOT SUCCESS [  0.753 s]
16:49:54 [INFO] org.eclipse.papyrus.uml.profile.newchildmenu.generator.ui 2.0.0-SNAPSHOT SUCCESS [  0.204 s]
16:49:54 [INFO] org.eclipse.papyrus.uml.assistants.feature 4.0.0-SNAPSHOT SUCCESS [  0.170 s]
16:49:54 [INFO] org.eclipse.papyrus.toolsmiths.validations 0.0.1-SNAPSHOT SUCCESS [  0.003 s]
16:49:54 [INFO] org.eclipse.papyrus.toolsmiths.validation.common 2.0.0-SNAPSHOT SUCCESS [  0.167 s]
16:49:54 [INFO] org.eclipse.papyrus.toolsmiths.validation.architecture 2.0.0-SNAPSHOT SUCCESS [  0.247 s]
16:49:54 [INFO] org.eclipse.papyrus.toolsmiths.validation.elementtypes 2.0.0-SNAPSHOT SUCCESS [  0.181 s]
16:49:54 [INFO] org.eclipse.papyrus.toolsmiths.validation.profile 2.0.0-SNAPSHOT SUCCESS [  0.388 s]
16:49:54 [INFO] org.eclipse.papyrus.toolsmiths.validation.feature 1.0.0-SNAPSHOT SUCCESS [  0.139 s]
16:49:54 [INFO] org.eclipse.papyrus.p2.toolsmiths 1.0.0-SNAPSHOT ... SUCCESS [ 20.751 s]
16:49:54 [INFO] org.eclipse.papyrus.toolsmiths.targetplatform.parent 0.0.1-SNAPSHOT SUCCESS [  0.007 s]
16:49:54 [INFO] org.eclipse.papyrus.toolsmiths.portable.targetplatform 0.0.1-SNAPSHOT SUCCESS [  0.003 s]
16:49:54 [INFO] org.eclipse.papyrus.tests.releng 0.0.1-SNAPSHOT .... SUCCESS [ 23.389 s]
16:49:54 [INFO] org.eclipse.papyrus.plugins.tests.releng 0.0.1-SNAPSHOT SUCCESS [  0.006 s]
16:49:54 [INFO] org.eclipse.papyrus.editor.tests.releng 0.0.1-SNAPSHOT SUCCESS [  0.003 s]
16:49:54 [INFO] org.eclipse.papyrus.editor.integration.tests 2.0.0-SNAPSHOT SUCCESS [  0.705 s]
16:49:54 [INFO] org.eclipse.papyrus.infra.tests.releng 0.0.1-SNAPSHOT SUCCESS [  0.006 s]
16:49:54 [INFO] org.eclipse.papyrus.infra.core.tests.releng 0.0.1-SNAPSHOT SUCCESS [  0.006 s]
16:49:54 [INFO] org.eclipse.papyrus.infra.core.clipboard.tests 2.0.0-SNAPSHOT SUCCESS [  0.392 s]
16:49:54 [INFO] org.eclipse.papyrus.infra.core.sasheditor.tests 2.0.0-SNAPSHOT SUCCESS [  0.381 s]
16:49:54 [INFO] org.eclipse.papyrus.infra.core.sasheditor.di.tests 2.0.0-SNAPSHOT SUCCESS [  0.267 s]
16:49:54 [INFO] org.eclipse.papyrus.infra.core.tests 4.0.0-SNAPSHOT  SUCCESS [  0.576 s]
16:49:54 [INFO] org.eclipse.papyrus.infra.editor.tests.releng 0.0.1-SNAPSHOT SUCCESS [  0.002 s]
16:49:54 [INFO] org.eclipse.papyrus.infra.editor.welcome.tests 2.0.0-SNAPSHOT SUCCESS [  0.609 s]
16:49:54 [INFO] org.eclipse.papyrus.infra.emf.tests.releng 0.0.1-SNAPSHOT SUCCESS [  0.005 s]
16:49:54 [INFO] org.eclipse.papyrus.infra.emf.gmf.tests 2.0.0-SNAPSHOT SUCCESS [  0.153 s]
16:49:54 [INFO] org.eclipse.papyrus.infra.emf.readonly.tests 2.0.0-SNAPSHOT SUCCESS [  0.382 s]
16:49:54 [INFO] org.eclipse.papyrus.infra.emf.tests 2.0.0-SNAPSHOT . SUCCESS [  1.868 s]
16:49:54 [INFO] org.eclipse.papyrus.infra.filters.tests 2.0.0-SNAPSHOT SUCCESS [  0.128 s]
16:49:54 [INFO] org.eclipse.papyrus.infra.gmfdiag.tests.releng 0.0.1-SNAPSHOT SUCCESS [  0.004 s]
16:49:54 [INFO] org.eclipse.papyrus.infra.gmfdiag.assistant.tests.releng 0.0.1-SNAPSHOT SUCCESS [  0.003 s]
16:49:54 [INFO] org.eclipse.papyrus.infra.gmfdiag.assistant.tests 2.0.0-SNAPSHOT SUCCESS [  0.708 s]
16:49:54 [INFO] org.eclipse.papyrus.infra.gmfdiag.canonical.tests 2.0.0-SNAPSHOT SUCCESS [  0.717 s]
16:49:54 [INFO] org.eclipse.papyrus.infra.gmfdiag.commands.tests 2.0.0-SNAPSHOT SUCCESS [  0.695 s]
16:49:54 [INFO] org.eclipse.papyrus.infra.gmfdiag.common.tests 4.0.0-SNAPSHOT SUCCESS [  0.806 s]
16:49:54 [INFO] org.eclipse.papyrus.infra.gmfdiag.css.tests 2.0.0-SNAPSHOT SUCCESS [  0.645 s]
16:49:54 [INFO] org.eclipse.papyrus.infra.gmfdiag.menu.tests 2.0.0-SNAPSHOT SUCCESS [  0.409 s]
16:49:54 [INFO] org.eclipse.papyrus.infra.gmfdiag.paletteconfiguration.tests 2.0.0-SNAPSHOT SUCCESS [  0.459 s]
16:49:54 [INFO] org.eclipse.papyrus.infra.gmfdiag.welcome.tests 2.0.0-SNAPSHOT SUCCESS [  0.673 s]
16:49:54 [INFO] org.eclipse.papyrus.infra.nattable.main.test 1.2.0-SNAPSHOT SUCCESS [  0.006 s]
16:49:54 [INFO] org.eclipse.papyrus.infra.nattable.common.tests 2.0.0-SNAPSHOT SUCCESS [  0.692 s]
16:49:54 [INFO] org.eclipse.papyrus.infra.nattable.model.tests 2.0.0-SNAPSHOT SUCCESS [  0.185 s]
16:49:54 [INFO] org.eclipse.papyrus.infra.nattable.tests 2.0.0-SNAPSHOT SUCCESS [  0.634 s]
16:49:54 [INFO] org.eclipse.papyrus.infra.nattable.views.tests 2.0.0-SNAPSHOT SUCCESS [  0.698 s]
16:49:54 [INFO] org.eclipse.papyrus.infra.properties.tests.releng 0.0.1-SNAPSHOT SUCCESS [  0.004 s]
16:49:54 [INFO] org.eclipse.papyrus.infra.properties.ui.tests 3.0.0-SNAPSHOT SUCCESS [  1.787 s]
16:49:54 [INFO] org.eclipse.papyrus.infra.services.tests.releng 0.0.1-SNAPSHOT SUCCESS [  0.004 s]
16:49:54 [INFO] org.eclipse.papyrus.infra.services.controlmode.tests 2.0.0-SNAPSHOT SUCCESS [  0.501 s]
16:49:54 [INFO] org.eclipse.papyrus.infra.services.edit.tests 2.0.0-SNAPSHOT SUCCESS [  0.502 s]
16:49:54 [INFO] org.eclipse.papyrus.infra.services.edit.ui.tests 2.0.0-SNAPSHOT SUCCESS [  0.312 s]
16:49:54 [INFO] org.eclipse.papyrus.infra.services.resourceloading.tests 2.0.0-SNAPSHOT SUCCESS [  0.378 s]
16:49:54 [INFO] org.eclipse.papyrus.infra.services.semantic.tests 2.0.0-SNAPSHOT SUCCESS [  0.482 s]
16:49:54 [INFO] org.eclipse.papyrus.infra.tools.tests 2.0.0-SNAPSHOT SUCCESS [  0.600 s]
16:49:54 [INFO] org.eclipse.papyrus.infra.types.tests.releng 0.0.1-SNAPSHOT SUCCESS [  0.003 s]
16:49:54 [INFO] org.eclipse.papyrus.infra.types.tests 4.0.0-SNAPSHOT SUCCESS [  0.484 s]
16:49:54 [INFO] org.eclipse.papyrus.infra.types.ui.tests 4.0.0-SNAPSHOT SUCCESS [  0.421 s]
16:49:54 [INFO] org.eclipse.papyrus.infra.ui.emf.tests 2.0.0-SNAPSHOT SUCCESS [  0.557 s]
16:49:54 [INFO] org.eclipse.papyrus.infra.ui.tests 2.0.0-SNAPSHOT .. SUCCESS [  0.530 s]
16:49:54 [INFO] org.eclipse.papyrus.infra.viewpoints.tests.releng 0.0.1-SNAPSHOT SUCCESS [  0.005 s]
16:49:54 [INFO] org.eclipse.papyrus.infra.viewpoints.policy.tests 2.0.0-SNAPSHOT SUCCESS [  0.412 s]
16:49:54 [INFO] org.eclipse.papyrus.uml.tests.releng 0.0.1-SNAPSHOT  SUCCESS [  0.008 s]
16:49:54 [INFO] org.eclipse.papyrus.uml.diagram.tests.releng 1.2.0-SNAPSHOT SUCCESS [  0.006 s]
16:49:54 [INFO] org.eclipse.papyrus.uml.diagram.tests 2.0.0-SNAPSHOT SUCCESS [  0.932 s]
16:49:54 [INFO] org.eclipse.papyrus.uml.diagram.clazz.tests 2.0.0-SNAPSHOT SUCCESS [  0.686 s]
16:49:54 [INFO] org.eclipse.papyrus.uml.diagram.activity.tests 2.0.0-SNAPSHOT SUCCESS [  1.017 s]
16:49:54 [INFO] org.eclipse.papyrus.uml.diagram.usecase.tests 5.0.0-SNAPSHOT SUCCESS [  0.677 s]
16:49:54 [INFO] org.eclipse.papyrus.uml.diagram.deployment.tests 2.0.0-SNAPSHOT SUCCESS [  0.643 s]
16:49:54 [INFO] org.eclipse.papyrus.uml.diagram.component.tests 2.0.0-SNAPSHOT SUCCESS [  0.677 s]
16:49:54 [INFO] org.eclipse.papyrus.uml.diagram.timing.tests 2.0.0-SNAPSHOT SUCCESS [  0.515 s]
16:49:54 [INFO] org.eclipse.papyrus.uml.diagram.sequence.tests 2.0.0-SNAPSHOT SUCCESS [  1.107 s]
16:49:54 [INFO] org.eclipse.papyrus.uml.diagram.composite.tests 2.0.0-SNAPSHOT SUCCESS [  0.717 s]
16:49:54 [INFO] org.eclipse.papyrus.uml.diagram.profile.tests 2.0.0-SNAPSHOT SUCCESS [  0.785 s]
16:49:54 [INFO] org.eclipse.papyrus.uml.diagram.common.tests 2.0.0-SNAPSHOT SUCCESS [  0.996 s]
16:49:54 [INFO] org.eclipse.papyrus.uml.diagram.wizards.tests 2.0.0-SNAPSHOT SUCCESS [  0.703 s]
16:49:54 [INFO] org.eclipse.papyrus.tests.uml.diagram.feature 1.2.0-SNAPSHOT SUCCESS [  0.406 s]
16:49:54 [INFO] org.eclipse.papyrus.tests.infra.services.feature 1.2.0-SNAPSHOT SUCCESS [  0.315 s]
16:49:54 [INFO] org.eclipse.papyrus.views.tests.releng 0.0.1-SNAPSHOT SUCCESS [  0.007 s]
16:49:54 [INFO] org.eclipse.papyrus.views.modelexplorer.tests 2.0.0-SNAPSHOT SUCCESS [  0.441 s]
16:49:54 [INFO] org.eclipse.papyrus.uml.modelexplorer.tests.releng 0.0.1-SNAPSHOT SUCCESS [  0.003 s]
16:49:54 [INFO] org.eclipse.papyrus.uml.modelexplorer.tests 2.0.0-SNAPSHOT SUCCESS [  0.555 s]
16:49:54 [INFO] org.eclipse.papyrus.uml.modelrepair.tests 2.0.0-SNAPSHOT SUCCESS [  0.713 s]
16:49:54 [INFO] org.eclipse.papyrus.uml.properties.tests 2.0.0-SNAPSHOT SUCCESS [  0.734 s]
16:49:54 [INFO] org.eclipse.papyrus.uml.service.types.tests 2.0.0-SNAPSHOT SUCCESS [  0.703 s]
16:49:54 [INFO] org.eclipse.papyrus.uml.service.types.ui.tests 2.0.0-SNAPSHOT SUCCESS [  0.608 s]
16:49:54 [INFO] org.eclipse.papyrus.uml.profile.tests.releng 0.0.1-SNAPSHOT SUCCESS [  0.007 s]
16:49:54 [INFO] org.eclipse.papyrus.uml.profile.drafter.tests 2.0.0-SNAPSHOT SUCCESS [  1.998 s]
16:49:54 [INFO] org.eclipse.papyrus.uml.filters.tests 2.0.0-SNAPSHOT SUCCESS [  0.636 s]
16:49:54 [INFO] org.eclipse.papyrus.uml.profile.tests 2.0.0-SNAPSHOT SUCCESS [  0.468 s]
16:49:54 [INFO] org.eclipse.papyrus.uml.dynamic.profile.tests 2.0.0-SNAPSHOT SUCCESS [  0.031 s]
16:49:54 [INFO] org.eclipse.papyrus.tests.uml.feature 1.2.0-SNAPSHOT SUCCESS [  0.307 s]
16:49:54 [INFO] org.eclipse.papyrus.views.documentation.tests 2.0.0-SNAPSHOT SUCCESS [  0.575 s]
16:49:54 [INFO] org.eclipse.papyrus.tests.views.feature 1.2.0-SNAPSHOT SUCCESS [  0.198 s]
16:49:54 [INFO] org.eclipse.papyrus.tests.infra.nattable.feature 1.4.0-SNAPSHOT SUCCESS [  0.547 s]
16:49:54 [INFO] org.eclipse.papyrus.uml.nattable.main.test 1.2.0-SNAPSHOT SUCCESS [  0.006 s]
16:49:54 [INFO] org.eclipse.papyrus.uml.nattable.tests 2.0.0-SNAPSHOT SUCCESS [  0.605 s]
16:49:54 [INFO] org.eclipse.papyrus.uml.nattable.generic.tests 2.0.0-SNAPSHOT SUCCESS [  0.923 s]
16:49:54 [INFO] org.eclipse.papyrus.uml.nattable.clazz.config.tests 2.0.0-SNAPSHOT SUCCESS [  1.048 s]
16:49:54 [INFO] org.eclipse.papyrus.uml.nattable.stereotyped.elements.tests 2.0.0-SNAPSHOT SUCCESS [  0.766 s]
16:49:54 [INFO] org.eclipse.papyrus.uml.nattable.matrix.tests 2.0.0-SNAPSHOT SUCCESS [  0.604 s]
16:49:54 [INFO] org.eclipse.papyrus.tests.uml.nattable.feature 1.3.0-SNAPSHOT SUCCESS [  0.381 s]
16:49:54 [INFO] org.eclipse.papyrus.tests.infra.feature 1.2.0-SNAPSHOT SUCCESS [  0.385 s]
16:49:54 [INFO] org.eclipse.papyrus.tests.infra.core.feature 1.2.0-SNAPSHOT SUCCESS [  0.139 s]
16:49:54 [INFO] org.eclipse.papyrus.uml.tools.tests.releng 0.0.1-SNAPSHOT SUCCESS [  0.003 s]
16:49:54 [INFO] org.eclipse.papyrus.uml.tools.tests 4.0.0-SNAPSHOT . SUCCESS [  0.798 s]
16:49:54 [INFO] org.eclipse.papyrus.uml.tools.utils.tests 2.0.0-SNAPSHOT SUCCESS [  0.598 s]
16:49:54 [INFO] org.eclipse.papyrus.tests.uml.tools.feature 1.2.0-SNAPSHOT SUCCESS [  0.178 s]
16:49:54 [INFO] org.eclipse.papyrus.uml.decoratormodel.tests.releng 0.0.1-SNAPSHOT SUCCESS [  0.004 s]
16:49:54 [INFO] org.eclipse.papyrus.uml.decoratormodel.controlmode.tests 2.0.0-SNAPSHOT SUCCESS [  0.518 s]
16:49:54 [INFO] org.eclipse.papyrus.uml.decoratormodel.tests 2.0.0-SNAPSHOT SUCCESS [  0.838 s]
16:49:54 [INFO] org.eclipse.papyrus.tests.uml.decoratormodel.feature 1.2.0-SNAPSHOT SUCCESS [  0.162 s]
16:49:54 [INFO] org.eclipse.papyrus.uml.textedit.tests.releng 0.0.1-SNAPSHOT SUCCESS [  0.005 s]
16:49:54 [INFO] org.eclipse.papyrus.uml.textedit.parameter.tests 2.0.0-SNAPSHOT SUCCESS [  0.612 s]
16:49:54 [INFO] org.eclipse.papyrus.uml.textedit.port.tests 2.0.0-SNAPSHOT SUCCESS [  0.585 s]
16:49:54 [INFO] org.eclipse.papyrus.uml.textedit.property.tests 2.0.0-SNAPSHOT SUCCESS [  0.706 s]
16:49:54 [INFO] org.eclipse.papyrus.uml.textedit.tests 2.0.0-SNAPSHOT SUCCESS [  0.468 s]
16:49:54 [INFO] org.eclipse.papyrus.uml.textedit.tests.feature 1.2.0-SNAPSHOT SUCCESS [  0.254 s]
16:49:54 [INFO] org.eclipse.papyrus.uml.assistants.tests.releng 0.0.1-SNAPSHOT SUCCESS [  0.007 s]
16:49:54 [INFO] org.eclipse.papyrus.uml.profile.types.generator.tests 2.0.0-SNAPSHOT SUCCESS [  0.997 s]
16:49:54 [INFO] org.eclipse.papyrus.uml.profile.assistants.generator.tests 2.0.0-SNAPSHOT SUCCESS [  0.623 s]
16:49:54 [INFO] org.eclipse.papyrus.tests.uml.assistants.feature 1.2.0-SNAPSHOT SUCCESS [  0.204 s]
16:49:54 [INFO] org.eclipse.papyrus.toolsmiths.tests.releng 0.0.1-SNAPSHOT SUCCESS [  0.003 s]
16:49:54 [INFO] org.eclipse.papyrus.toolsmiths.profilemigration.tests 1.0.0-SNAPSHOT SUCCESS [  0.577 s]
16:49:54 [INFO] org.eclipse.papyrus.toolsmiths.validation.profile.tests 2.0.0-SNAPSHOT SUCCESS [  0.441 s]
16:49:54 [INFO] org.eclipse.papyrus.toolsmiths.validation.elementtypes.tests 2.0.0-SNAPSHOT SUCCESS [  0.544 s]
16:49:54 [INFO] org.eclipse.papyrus.tests.toolsmiths.feature 1.0.0-SNAPSHOT SUCCESS [  0.223 s]
16:49:54 [INFO] org.eclipse.papyrus.tests.feature 2.0.0-SNAPSHOT ... SUCCESS [  1.051 s]
16:49:54 [INFO] org.eclipse.papyrus.infra.emf.expressions.main.tests 0.0.1-SNAPSHOT SUCCESS [  0.007 s]
16:49:54 [INFO] org.eclipse.papyrus.infra.emf.expressions.tests 2.0.0-SNAPSHOT SUCCESS [  0.140 s]
16:49:54 [INFO] org.eclipse.papyrus.tests.infra.emf.expressions.feature 1.0.0-SNAPSHOT SUCCESS [  0.039 s]
16:49:54 [INFO] org.eclipse.papyrus.infra.internationalization.main.test 1.0.0-SNAPSHOT SUCCESS [  0.006 s]
16:49:54 [INFO] org.eclipse.papyrus.infra.internationalization.tests 2.0.0-SNAPSHOT SUCCESS [  0.445 s]
16:49:54 [INFO] org.eclipse.papyrus.tests.infra.internationalization.feature 1.0.0-SNAPSHOT SUCCESS [  0.170 s]
16:49:54 [INFO] org.eclipse.papyrus.uml.expressions.tests.releng 0.0.1-SNAPSHOT SUCCESS [  0.006 s]
16:49:54 [INFO] org.eclipse.papyrus.uml.expressions.tests 2.0.0-SNAPSHOT SUCCESS [  0.515 s]
16:49:54 [INFO] org.eclipse.papyrus.tests.uml.expressions.feature 1.0.0-SNAPSHOT SUCCESS [  0.119 s]
16:49:54 [INFO] org.eclipse.papyrus.uml.internationalization.main.test 1.0.0-SNAPSHOT SUCCESS [  0.006 s]
16:49:54 [INFO] org.eclipse.papyrus.uml.internationalization.tests 2.0.0-SNAPSHOT SUCCESS [  0.804 s]
16:49:54 [INFO] org.eclipse.papyrus.uml.internationalization.controlmode.tests 2.0.0-SNAPSHOT SUCCESS [  0.537 s]
16:49:54 [INFO] org.eclipse.papyrus.tests.uml.internationalization.feature 1.0.0-SNAPSHOT SUCCESS [  0.206 s]
16:49:54 [INFO] org.eclipse.papyrus.uml.alf.tests 2.0.0-SNAPSHOT ... SUCCESS [  2.140 s]
16:49:54 [INFO] org.eclipse.papyrus.uml.alf.tests.feature 1.2.0-SNAPSHOT SUCCESS [  0.090 s]
16:49:54 [INFO] Papyrus Tests Features 0.0.1-SNAPSHOT .............. SUCCESS [  0.003 s]
16:49:54 [INFO] org.eclipse.papyrus.developer.suite.tests 1.0.0-SNAPSHOT SUCCESS [ 28.428 s]
16:49:54 [INFO] org.eclipse.papyrus.bundles.tests 0.0.1-SNAPSHOT ... SUCCESS [  0.007 s]
16:49:54 [INFO] org.eclipse.papyrus.eclipse.project.editors.tests 3.0.0-SNAPSHOT SUCCESS [  0.658 s]
16:49:54 [INFO] org.eclipse.papyrus.editors.suite.tests 1.0.0-SNAPSHOT SUCCESS [05:40 min]
16:49:54 [INFO] org.eclipse.papyrus.infra.core.suite.tests 1.0.0-SNAPSHOT SUCCESS [01:03 min]
16:49:54 [INFO] org.eclipse.papyrus.infra.nattable.suite.tests 1.0.0-SNAPSHOT SUCCESS [ 53.450 s]
16:49:54 [INFO] org.eclipse.papyrus.infra.architecture.tests 2.0.0-SNAPSHOT SUCCESS [  0.188 s]
16:49:54 [INFO] org.eclipse.papyrus.infra.services.labelprovider.tests 2.0.0-SNAPSHOT SUCCESS [  0.339 s]
16:49:54 [INFO] org.eclipse.papyrus.infra.ui.architecture.tests 2.0.0-SNAPSHOT SUCCESS [  1.478 s]
16:49:54 [INFO] org.eclipse.papyrus.infra.suite.tests 1.0.0-SNAPSHOT SUCCESS [11:05 min]
16:49:54 [INFO] org.eclipse.papyrus.infra.newchild.tests 2.0.0-SNAPSHOT SUCCESS [  0.343 s]
16:49:54 [INFO] org.eclipse.papyrus.uml.diagram.communication.tests 2.0.0-SNAPSHOT SUCCESS [  0.975 s]
16:49:54 [INFO] org.eclipse.papyrus.uml.diagram.interactionoverview.tests 2.0.0-SNAPSHOT SUCCESS [  0.732 s]
16:49:54 [INFO] org.eclipse.papyrus.uml.diagram.statemachine.tests 2.0.0-SNAPSHOT SUCCESS [  0.872 s]
16:49:54 [INFO] org.eclipse.papyrus.uml.diagram.suite.tests 1.0.0-SNAPSHOT FAILURE [  01:53 h]
16:49:54 [INFO] org.eclipse.papyrus.uml.diagram.stereotypeproperty.tests 2.0.0-SNAPSHOT SKIPPED
16:49:54 [INFO] org.eclipse.papyrus.uml.diagram.dnd.tests 2.0.0-SNAPSHOT SKIPPED
16:49:54 [INFO] org.eclipse.papyrus.uml.diagram.properties.tests 2.0.0-SNAPSHOT SKIPPED
16:49:54 [INFO] org.eclipse.papyrus.uml.nattable.stereotype.display.tests 2.0.0-SNAPSHOT SKIPPED
16:49:54 [INFO] org.eclipse.papyrus.uml.nattable.suite.tests 1.0.0-SNAPSHOT SKIPPED
16:49:54 [INFO] org.eclipse.papyrus.uml.textedit.valuespecification.tests 2.0.0-SNAPSHOT SKIPPED
16:49:54 [INFO] org.eclipse.papyrus.uml.textedit.suite.tests 1.0.0-SNAPSHOT SKIPPED
16:49:54 [INFO] org.eclipse.papyrus.uml.architecture.tests 2.0.0-SNAPSHOT SKIPPED
16:49:54 [INFO] org.eclipse.papyrus.uml.validation.tests.releng 0.0.1-SNAPSHOT SKIPPED
16:49:54 [INFO] org.eclipse.papyrus.uml.validation.tests 2.0.0-SNAPSHOT SKIPPED
16:49:54 [INFO] org.eclipse.papyrus.uml.suite.tests 1.0.0-SNAPSHOT . SKIPPED
16:49:54 [INFO] org.eclipse.papyrus.uml.alf.tests.releng 0.0.1-SNAPSHOT SKIPPED
16:49:54 [INFO] org.eclipse.papyrus.uml.alf.backend.tests 2.0.0-SNAPSHOT SKIPPED
16:49:54 [INFO] org.eclipse.papyrus.uml.validation.tests.staticprofile 2.0.0-SNAPSHOT SKIPPED
16:49:54 [INFO] org.eclipse.papyrus.uml.validation.tests.genvalidation 2.0.0-SNAPSHOT SKIPPED
16:49:54 [INFO] org.eclipse.papyrus.views.properties.toolsmiths.tests 2.0.0-SNAPSHOT SKIPPED
16:49:54 [INFO] org.eclipse.papyrus.views.suite.tests 1.0.0-SNAPSHOT SKIPPED
16:49:54 [INFO] org.eclipse.papyrus.views.documentation.tests.releng 0.0.1-SNAPSHOT SKIPPED
16:49:54 [INFO] org.eclipse.papyrus.toolsmiths.suite.tests 1.0.0-SNAPSHOT SKIPPED
16:49:54 [INFO] org.eclipse.papyrus.tests.main.releng 1.2.0-SNAPSHOT SKIPPED
16:49:54 [INFO] org.eclipse.papyrus.main.tests.target.parent 0.0.1-SNAPSHOT SKIPPED
16:49:54 [INFO] org.eclipse.papyrus.main.tests.portable.target 0.0.1-SNAPSHOT SKIPPED
16:49:54 [INFO] ------------------------------------------------------------------------
16:49:54 [INFO] BUILD FAILURE
16:49:54 [INFO] ------------------------------------------------------------------------
16:49:54 [INFO] Total time:  02:59 h
16:49:54 [INFO] Finished at: 2020-07-31T16:49:54-04:00
16:49:54 [INFO] ------------------------------------------------------------------------
16:49:54 [ERROR] Failed to execute goal org.eclipse.tycho:tycho-surefire-plugin:1.3.0:test (default-test) on project org.eclipse.papyrus.uml.diagram.suite.tests: An unexpected error occured while launching the test runtime (return code 143). See log /jobs/genie.papyrus/Papyrus-Gerrit-Master-With-Tests/workspace/source/tests/junit/plugins/uml/diagram/org.eclipse.papyrus.uml.diagram.suite.tests/target/work/data/.metadata/.log for details. -> [Help 1]
16:49:54 [ERROR] 
16:49:54 [ERROR] To see the full stack trace of the errors, re-run Maven with the -e switch.
16:49:54 [ERROR] Re-run Maven using the -X switch to enable full debug logging.
16:49:54 [ERROR] 
16:49:54 [ERROR] For more information about the errors and possible solutions, please read the following articles:
16:49:54 [ERROR] [Help 1] http://cwiki.apache.org/confluence/display/MAVEN/MojoFailureException
16:49:54 [ERROR] 
16:49:54 [ERROR] After correcting the problems, you can resume the build with the command
16:49:54 [ERROR]   mvn <args> -rf :org.eclipse.papyrus.uml.diagram.suite.tests
16:49:58 Terminating xvnc.
16:50:23 Build was aborted
16:50:23 Recording test results
16:50:25 Started calculate disk usage of build
16:50:25 Finished Calculation of disk usage of build in 0 seconds
16:50:25 Started calculate disk usage of workspace
16:50:27 Finished Calculation of disk usage of workspace in  2 second
16:50:27 [WS-CLEANUP] Deleting project workspace...
16:50:27 [WS-CLEANUP] Deferred wipeout is used...
16:50:27 [WS-CLEANUP] done
16:50:27 Finished: ABORTED