FailedConsole Output

Skipping 880 KB.. Full Log
 3.2/5.8 MB
Progress (1): 3.2/5.8 MB
Progress (1): 3.2/5.8 MB
Progress (1): 3.2/5.8 MB
Progress (1): 3.2/5.8 MB
Progress (1): 3.2/5.8 MB
Progress (1): 3.2/5.8 MB
Progress (1): 3.2/5.8 MB
Progress (1): 3.2/5.8 MB
Progress (1): 3.3/5.8 MB
Progress (1): 3.3/5.8 MB
Progress (1): 3.3/5.8 MB
Progress (1): 3.3/5.8 MB
Progress (1): 3.3/5.8 MB
Progress (1): 3.3/5.8 MB
Progress (1): 3.3/5.8 MB
Progress (1): 3.3/5.8 MB
Progress (1): 3.3/5.8 MB
Progress (1): 3.3/5.8 MB
Progress (1): 3.3/5.8 MB
Progress (1): 3.3/5.8 MB
Progress (1): 3.3/5.8 MB
Progress (1): 3.3/5.8 MB
Progress (1): 3.3/5.8 MB
Progress (1): 3.3/5.8 MB
Progress (1): 3.3/5.8 MB
Progress (1): 3.3/5.8 MB
Progress (1): 3.3/5.8 MB
Progress (1): 3.3/5.8 MB
Progress (1): 3.3/5.8 MB
Progress (1): 3.3/5.8 MB
Progress (1): 3.3/5.8 MB
Progress (1): 3.3/5.8 MB
Progress (1): 3.3/5.8 MB
Progress (1): 3.4/5.8 MB
Progress (1): 3.4/5.8 MB
Progress (1): 3.4/5.8 MB
Progress (1): 3.4/5.8 MB
Progress (1): 3.4/5.8 MB
Progress (1): 3.4/5.8 MB
Progress (1): 3.4/5.8 MB
Progress (1): 3.4/5.8 MB
Progress (1): 3.4/5.8 MB
Progress (1): 3.4/5.8 MB
Progress (1): 3.4/5.8 MB
Progress (1): 3.4/5.8 MB
Progress (1): 3.4/5.8 MB
Progress (1): 3.4/5.8 MB
Progress (1): 3.4/5.8 MB
Progress (1): 3.4/5.8 MB
Progress (1): 3.4/5.8 MB
Progress (1): 3.4/5.8 MB
Progress (1): 3.4/5.8 MB
Progress (1): 3.4/5.8 MB
Progress (1): 3.4/5.8 MB
Progress (1): 3.4/5.8 MB
Progress (1): 3.4/5.8 MB
Progress (1): 3.4/5.8 MB
Progress (1): 3.4/5.8 MB
Progress (1): 3.5/5.8 MB
Progress (1): 3.5/5.8 MB
Progress (1): 3.5/5.8 MB
Progress (1): 3.5/5.8 MB
Progress (1): 3.5/5.8 MB
Progress (1): 3.5/5.8 MB
Progress (1): 3.5/5.8 MB
Progress (1): 3.5/5.8 MB
Progress (1): 3.5/5.8 MB
Progress (1): 3.5/5.8 MB
Progress (1): 3.5/5.8 MB
Progress (1): 3.5/5.8 MB
Progress (1): 3.5/5.8 MB
Progress (1): 3.5/5.8 MB
Progress (1): 3.5/5.8 MB
Progress (1): 3.5/5.8 MB
Progress (1): 3.5/5.8 MB
Progress (1): 3.5/5.8 MB
Progress (1): 3.5/5.8 MB
Progress (1): 3.5/5.8 MB
Progress (1): 3.5/5.8 MB
Progress (1): 3.5/5.8 MB
Progress (1): 3.5/5.8 MB
Progress (1): 3.5/5.8 MB
Progress (1): 3.5/5.8 MB
Progress (1): 3.6/5.8 MB
Progress (1): 3.6/5.8 MB
Progress (1): 3.6/5.8 MB
Progress (1): 3.6/5.8 MB
Progress (1): 3.6/5.8 MB
Progress (1): 3.6/5.8 MB
Progress (1): 3.6/5.8 MB
Progress (1): 3.6/5.8 MB
Progress (1): 3.6/5.8 MB
Progress (1): 3.6/5.8 MB
Progress (1): 3.6/5.8 MB
Progress (1): 3.6/5.8 MB
Progress (1): 3.6/5.8 MB
Progress (1): 3.6/5.8 MB
Progress (1): 3.6/5.8 MB
Progress (1): 3.6/5.8 MB
Progress (1): 3.6/5.8 MB
Progress (1): 3.6/5.8 MB
Progress (1): 3.6/5.8 MB
Progress (1): 3.6/5.8 MB
Progress (1): 3.6/5.8 MB
Progress (1): 3.6/5.8 MB
Progress (1): 3.6/5.8 MB
Progress (1): 3.6/5.8 MB
Progress (1): 3.6/5.8 MB
Progress (1): 3.7/5.8 MB
Progress (1): 3.7/5.8 MB
Progress (1): 3.7/5.8 MB
Progress (1): 3.7/5.8 MB
Progress (1): 3.7/5.8 MB
Progress (1): 3.7/5.8 MB
Progress (1): 3.7/5.8 MB
Progress (1): 3.7/5.8 MB
Progress (1): 3.7/5.8 MB
Progress (1): 3.7/5.8 MB
Progress (1): 3.7/5.8 MB
Progress (1): 3.7/5.8 MB
Progress (1): 3.7/5.8 MB
Progress (1): 3.7/5.8 MB
Progress (1): 3.7/5.8 MB
Progress (1): 3.7/5.8 MB
Progress (1): 3.7/5.8 MB
Progress (1): 3.7/5.8 MB
Progress (1): 3.7/5.8 MB
Progress (1): 3.7/5.8 MB
Progress (1): 3.7/5.8 MB
Progress (1): 3.7/5.8 MB
Progress (1): 3.7/5.8 MB
Progress (1): 3.7/5.8 MB
Progress (1): 3.7/5.8 MB
Progress (1): 3.8/5.8 MB
Progress (1): 3.8/5.8 MB
Progress (1): 3.8/5.8 MB
Progress (1): 3.8/5.8 MB
Progress (1): 3.8/5.8 MB
Progress (1): 3.8/5.8 MB
Progress (1): 3.8/5.8 MB
Progress (1): 3.8/5.8 MB
Progress (1): 3.8/5.8 MB
Progress (1): 3.8/5.8 MB
Progress (1): 3.8/5.8 MB
Progress (1): 3.8/5.8 MB
Progress (1): 3.8/5.8 MB
Progress (1): 3.8/5.8 MB
Progress (1): 3.8/5.8 MB
Progress (1): 3.8/5.8 MB
Progress (1): 3.8/5.8 MB
Progress (1): 3.8/5.8 MB
Progress (1): 3.8/5.8 MB
Progress (1): 3.8/5.8 MB
Progress (1): 3.8/5.8 MB
Progress (1): 3.8/5.8 MB
Progress (1): 3.8/5.8 MB
Progress (1): 3.8/5.8 MB
Progress (1): 3.8/5.8 MB
Progress (1): 3.9/5.8 MB
Progress (1): 3.9/5.8 MB
Progress (1): 3.9/5.8 MB
Progress (1): 3.9/5.8 MB
Progress (1): 3.9/5.8 MB
Progress (1): 3.9/5.8 MB
Progress (1): 3.9/5.8 MB
Progress (1): 3.9/5.8 MB
Progress (1): 3.9/5.8 MB
Progress (1): 3.9/5.8 MB
Progress (1): 3.9/5.8 MB
Progress (1): 3.9/5.8 MB
Progress (1): 3.9/5.8 MB
Progress (1): 3.9/5.8 MB
Progress (1): 3.9/5.8 MB
Progress (1): 3.9/5.8 MB
Progress (1): 3.9/5.8 MB
Progress (1): 3.9/5.8 MB
Progress (1): 3.9/5.8 MB
Progress (1): 3.9/5.8 MB
Progress (1): 3.9/5.8 MB
Progress (1): 3.9/5.8 MB
Progress (1): 3.9/5.8 MB
Progress (1): 3.9/5.8 MB
Progress (1): 3.9/5.8 MB
Progress (1): 4.0/5.8 MB
Progress (1): 4.0/5.8 MB
Progress (1): 4.0/5.8 MB
Progress (1): 4.0/5.8 MB
Progress (1): 4.0/5.8 MB
Progress (1): 4.0/5.8 MB
Progress (1): 4.0/5.8 MB
Progress (1): 4.0/5.8 MB
Progress (1): 4.0/5.8 MB
Progress (1): 4.0/5.8 MB
Progress (1): 4.0/5.8 MB
Progress (1): 4.0/5.8 MB
Progress (1): 4.0/5.8 MB
Progress (1): 4.0/5.8 MB
Progress (1): 4.0/5.8 MB
Progress (1): 4.0/5.8 MB
Progress (1): 4.0/5.8 MB
Progress (1): 4.0/5.8 MB
Progress (1): 4.0/5.8 MB
Progress (1): 4.0/5.8 MB
Progress (1): 4.0/5.8 MB
Progress (1): 4.0/5.8 MB
Progress (1): 4.0/5.8 MB
Progress (1): 4.0/5.8 MB
Progress (1): 4.0/5.8 MB
Progress (1): 4.1/5.8 MB
Progress (1): 4.1/5.8 MB
Progress (1): 4.1/5.8 MB
Progress (1): 4.1/5.8 MB
Progress (1): 4.1/5.8 MB
Progress (1): 4.1/5.8 MB
Progress (1): 4.1/5.8 MB
Progress (1): 4.1/5.8 MB
Progress (1): 4.1/5.8 MB
Progress (1): 4.1/5.8 MB
Progress (1): 4.1/5.8 MB
Progress (1): 4.1/5.8 MB
Progress (1): 4.1/5.8 MB
Progress (1): 4.1/5.8 MB
Progress (1): 4.1/5.8 MB
Progress (1): 4.1/5.8 MB
Progress (1): 4.1/5.8 MB
Progress (1): 4.1/5.8 MB
Progress (1): 4.1/5.8 MB
Progress (1): 4.1/5.8 MB
Progress (1): 4.1/5.8 MB
Progress (1): 4.1/5.8 MB
Progress (1): 4.1/5.8 MB
Progress (1): 4.1/5.8 MB
Progress (1): 4.1/5.8 MB
Progress (1): 4.2/5.8 MB
Progress (1): 4.2/5.8 MB
Progress (1): 4.2/5.8 MB
Progress (1): 4.2/5.8 MB
Progress (1): 4.2/5.8 MB
Progress (1): 4.2/5.8 MB
Progress (1): 4.2/5.8 MB
Progress (1): 4.2/5.8 MB
Progress (1): 4.2/5.8 MB
Progress (1): 4.2/5.8 MB
Progress (1): 4.2/5.8 MB
Progress (1): 4.2/5.8 MB
Progress (1): 4.2/5.8 MB
Progress (1): 4.2/5.8 MB
Progress (1): 4.2/5.8 MB
Progress (1): 4.2/5.8 MB
Progress (1): 4.2/5.8 MB
Progress (1): 4.2/5.8 MB
Progress (1): 4.2/5.8 MB
Progress (1): 4.2/5.8 MB
Progress (1): 4.2/5.8 MB
Progress (1): 4.2/5.8 MB
Progress (1): 4.2/5.8 MB
Progress (1): 4.2/5.8 MB
Progress (1): 4.2/5.8 MB
Progress (1): 4.3/5.8 MB
Progress (1): 4.3/5.8 MB
Progress (1): 4.3/5.8 MB
Progress (1): 4.3/5.8 MB
Progress (1): 4.3/5.8 MB
Progress (1): 4.3/5.8 MB
Progress (1): 4.3/5.8 MB
Progress (1): 4.3/5.8 MB
Progress (1): 4.3/5.8 MB
Progress (1): 4.3/5.8 MB
Progress (1): 4.3/5.8 MB
Progress (1): 4.3/5.8 MB
Progress (1): 4.3/5.8 MB
Progress (1): 4.3/5.8 MB
Progress (1): 4.3/5.8 MB
Progress (1): 4.3/5.8 MB
Progress (1): 4.3/5.8 MB
Progress (1): 4.3/5.8 MB
Progress (1): 4.3/5.8 MB
Progress (1): 4.3/5.8 MB
Progress (1): 4.3/5.8 MB
Progress (1): 4.3/5.8 MB
Progress (1): 4.3/5.8 MB
Progress (1): 4.3/5.8 MB
Progress (1): 4.3/5.8 MB
Progress (1): 4.4/5.8 MB
Progress (1): 4.4/5.8 MB
Progress (1): 4.4/5.8 MB
Progress (1): 4.4/5.8 MB
Progress (1): 4.4/5.8 MB
Progress (1): 4.4/5.8 MB
Progress (1): 4.4/5.8 MB
Progress (1): 4.4/5.8 MB
Progress (1): 4.4/5.8 MB
Progress (1): 4.4/5.8 MB
Progress (1): 4.4/5.8 MB
Progress (1): 4.4/5.8 MB
Progress (1): 4.4/5.8 MB
Progress (1): 4.4/5.8 MB
Progress (1): 4.4/5.8 MB
Progress (1): 4.4/5.8 MB
Progress (1): 4.4/5.8 MB
Progress (1): 4.4/5.8 MB
Progress (1): 4.4/5.8 MB
Progress (1): 4.4/5.8 MB
Progress (1): 4.4/5.8 MB
Progress (1): 4.4/5.8 MB
Progress (1): 4.4/5.8 MB
Progress (1): 4.4/5.8 MB
Progress (1): 4.4/5.8 MB
Progress (1): 4.5/5.8 MB
Progress (1): 4.5/5.8 MB
Progress (1): 4.5/5.8 MB
Progress (1): 4.5/5.8 MB
Progress (1): 4.5/5.8 MB
Progress (1): 4.5/5.8 MB
Progress (1): 4.5/5.8 MB
Progress (1): 4.5/5.8 MB
Progress (1): 4.5/5.8 MB
Progress (1): 4.5/5.8 MB
Progress (1): 4.5/5.8 MB
Progress (1): 4.5/5.8 MB
Progress (1): 4.5/5.8 MB
Progress (1): 4.5/5.8 MB
Progress (1): 4.5/5.8 MB
Progress (1): 4.5/5.8 MB
Progress (1): 4.5/5.8 MB
Progress (1): 4.5/5.8 MB
Progress (1): 4.5/5.8 MB
Progress (1): 4.5/5.8 MB
Progress (1): 4.5/5.8 MB
Progress (1): 4.5/5.8 MB
Progress (1): 4.5/5.8 MB
Progress (1): 4.5/5.8 MB
Progress (1): 4.5/5.8 MB
Progress (1): 4.6/5.8 MB
Progress (1): 4.6/5.8 MB
Progress (1): 4.6/5.8 MB
Progress (1): 4.6/5.8 MB
Progress (1): 4.6/5.8 MB
Progress (1): 4.6/5.8 MB
Progress (1): 4.6/5.8 MB
Progress (1): 4.6/5.8 MB
Progress (1): 4.6/5.8 MB
Progress (1): 4.6/5.8 MB
Progress (1): 4.6/5.8 MB
Progress (1): 4.6/5.8 MB
Progress (1): 4.6/5.8 MB
Progress (1): 4.6/5.8 MB
Progress (1): 4.6/5.8 MB
Progress (1): 4.6/5.8 MB
Progress (1): 4.6/5.8 MB
Progress (1): 4.6/5.8 MB
Progress (1): 4.6/5.8 MB
Progress (1): 4.6/5.8 MB
Progress (1): 4.6/5.8 MB
Progress (1): 4.6/5.8 MB
Progress (1): 4.6/5.8 MB
Progress (1): 4.6/5.8 MB
Progress (1): 4.6/5.8 MB
Progress (1): 4.7/5.8 MB
Progress (1): 4.7/5.8 MB
Progress (1): 4.7/5.8 MB
Progress (1): 4.7/5.8 MB
Progress (1): 4.7/5.8 MB
Progress (1): 4.7/5.8 MB
Progress (1): 4.7/5.8 MB
Progress (1): 4.7/5.8 MB
Progress (1): 4.7/5.8 MB
Progress (1): 4.7/5.8 MB
Progress (1): 4.7/5.8 MB
Progress (1): 4.7/5.8 MB
Progress (1): 4.7/5.8 MB
Progress (1): 4.7/5.8 MB
Progress (1): 4.7/5.8 MB
Progress (1): 4.7/5.8 MB
Progress (1): 4.7/5.8 MB
Progress (1): 4.7/5.8 MB
Progress (1): 4.7/5.8 MB
Progress (1): 4.7/5.8 MB
Progress (1): 4.7/5.8 MB
Progress (1): 4.7/5.8 MB
Progress (1): 4.7/5.8 MB
Progress (1): 4.7/5.8 MB
Progress (1): 4.7/5.8 MB
Progress (1): 4.8/5.8 MB
Progress (1): 4.8/5.8 MB
Progress (1): 4.8/5.8 MB
Progress (1): 4.8/5.8 MB
Progress (1): 4.8/5.8 MB
Progress (1): 4.8/5.8 MB
Progress (1): 4.8/5.8 MB
Progress (1): 4.8/5.8 MB
Progress (1): 4.8/5.8 MB
Progress (1): 4.8/5.8 MB
Progress (1): 4.8/5.8 MB
Progress (1): 4.8/5.8 MB
Progress (1): 4.8/5.8 MB
Progress (1): 4.8/5.8 MB
Progress (1): 4.8/5.8 MB
Progress (1): 4.8/5.8 MB
Progress (1): 4.8/5.8 MB
Progress (1): 4.8/5.8 MB
Progress (1): 4.8/5.8 MB
Progress (1): 4.8/5.8 MB
Progress (1): 4.8/5.8 MB
Progress (1): 4.8/5.8 MB
Progress (1): 4.8/5.8 MB
Progress (1): 4.8/5.8 MB
Progress (1): 4.8/5.8 MB
Progress (1): 4.9/5.8 MB
Progress (1): 4.9/5.8 MB
Progress (1): 4.9/5.8 MB
Progress (1): 4.9/5.8 MB
Progress (1): 4.9/5.8 MB
Progress (1): 4.9/5.8 MB
Progress (1): 4.9/5.8 MB
Progress (1): 4.9/5.8 MB
Progress (1): 4.9/5.8 MB
Progress (1): 4.9/5.8 MB
Progress (1): 4.9/5.8 MB
Progress (1): 4.9/5.8 MB
Progress (1): 4.9/5.8 MB
Progress (1): 4.9/5.8 MB
Progress (1): 4.9/5.8 MB
Progress (1): 4.9/5.8 MB
Progress (1): 4.9/5.8 MB
Progress (1): 4.9/5.8 MB
Progress (1): 4.9/5.8 MB
Progress (1): 4.9/5.8 MB
Progress (1): 4.9/5.8 MB
Progress (1): 4.9/5.8 MB
Progress (1): 4.9/5.8 MB
Progress (1): 4.9/5.8 MB
Progress (1): 4.9/5.8 MB
Progress (1): 5.0/5.8 MB
Progress (1): 5.0/5.8 MB
Progress (1): 5.0/5.8 MB
Progress (1): 5.0/5.8 MB
Progress (1): 5.0/5.8 MB
Progress (1): 5.0/5.8 MB
Progress (1): 5.0/5.8 MB
Progress (1): 5.0/5.8 MB
Progress (1): 5.0/5.8 MB
Progress (1): 5.0/5.8 MB
Progress (1): 5.0/5.8 MB
Progress (1): 5.0/5.8 MB
Progress (1): 5.0/5.8 MB
Progress (1): 5.0/5.8 MB
Progress (1): 5.0/5.8 MB
Progress (1): 5.0/5.8 MB
Progress (1): 5.0/5.8 MB
Progress (1): 5.0/5.8 MB
Progress (1): 5.0/5.8 MB
Progress (1): 5.0/5.8 MB
Progress (1): 5.0/5.8 MB
Progress (1): 5.0/5.8 MB
Progress (1): 5.0/5.8 MB
Progress (1): 5.0/5.8 MB
Progress (1): 5.0/5.8 MB
Progress (1): 5.1/5.8 MB
Progress (1): 5.1/5.8 MB
Progress (1): 5.1/5.8 MB
Progress (1): 5.1/5.8 MB
Progress (1): 5.1/5.8 MB
Progress (1): 5.1/5.8 MB
Progress (1): 5.1/5.8 MB
Progress (1): 5.1/5.8 MB
Progress (1): 5.1/5.8 MB
Progress (1): 5.1/5.8 MB
Progress (1): 5.1/5.8 MB
Progress (1): 5.1/5.8 MB
Progress (1): 5.1/5.8 MB
Progress (1): 5.1/5.8 MB
Progress (1): 5.1/5.8 MB
Progress (1): 5.1/5.8 MB
Progress (1): 5.1/5.8 MB
Progress (1): 5.1/5.8 MB
Progress (1): 5.1/5.8 MB
Progress (1): 5.1/5.8 MB
Progress (1): 5.1/5.8 MB
Progress (1): 5.1/5.8 MB
Progress (1): 5.1/5.8 MB
Progress (1): 5.1/5.8 MB
Progress (1): 5.1/5.8 MB
Progress (1): 5.2/5.8 MB
Progress (1): 5.2/5.8 MB
Progress (1): 5.2/5.8 MB
Progress (1): 5.2/5.8 MB
Progress (1): 5.2/5.8 MB
Progress (1): 5.2/5.8 MB
Progress (1): 5.2/5.8 MB
Progress (1): 5.2/5.8 MB
Progress (1): 5.2/5.8 MB
Progress (1): 5.2/5.8 MB
Progress (1): 5.2/5.8 MB
Progress (1): 5.2/5.8 MB
Progress (1): 5.2/5.8 MB
Progress (1): 5.2/5.8 MB
Progress (1): 5.2/5.8 MB
Progress (1): 5.2/5.8 MB
Progress (1): 5.2/5.8 MB
Progress (1): 5.2/5.8 MB
Progress (1): 5.2/5.8 MB
Progress (1): 5.2/5.8 MB
Progress (1): 5.2/5.8 MB
Progress (1): 5.2/5.8 MB
Progress (1): 5.2/5.8 MB
Progress (1): 5.2/5.8 MB
Progress (1): 5.2/5.8 MB
Progress (1): 5.3/5.8 MB
Progress (1): 5.3/5.8 MB
Progress (1): 5.3/5.8 MB
Progress (1): 5.3/5.8 MB
Progress (1): 5.3/5.8 MB
Progress (1): 5.3/5.8 MB
Progress (1): 5.3/5.8 MB
Progress (1): 5.3/5.8 MB
Progress (1): 5.3/5.8 MB
Progress (1): 5.3/5.8 MB
Progress (1): 5.3/5.8 MB
Progress (1): 5.3/5.8 MB
Progress (1): 5.3/5.8 MB
Progress (1): 5.3/5.8 MB
Progress (1): 5.3/5.8 MB
Progress (1): 5.3/5.8 MB
Progress (1): 5.3/5.8 MB
Progress (1): 5.3/5.8 MB
Progress (1): 5.3/5.8 MB
Progress (1): 5.3/5.8 MB
Progress (1): 5.3/5.8 MB
Progress (1): 5.3/5.8 MB
Progress (1): 5.3/5.8 MB
Progress (1): 5.3/5.8 MB
Progress (1): 5.3/5.8 MB
Progress (1): 5.4/5.8 MB
Progress (1): 5.4/5.8 MB
Progress (1): 5.4/5.8 MB
Progress (1): 5.4/5.8 MB
Progress (1): 5.4/5.8 MB
Progress (1): 5.4/5.8 MB
Progress (1): 5.4/5.8 MB
Progress (1): 5.4/5.8 MB
Progress (1): 5.4/5.8 MB
Progress (1): 5.4/5.8 MB
Progress (1): 5.4/5.8 MB
Progress (1): 5.4/5.8 MB
Progress (1): 5.4/5.8 MB
Progress (1): 5.4/5.8 MB
Progress (1): 5.4/5.8 MB
Progress (1): 5.4/5.8 MB
Progress (1): 5.4/5.8 MB
Progress (1): 5.4/5.8 MB
Progress (1): 5.4/5.8 MB
Progress (1): 5.4/5.8 MB
Progress (1): 5.4/5.8 MB
Progress (1): 5.4/5.8 MB
Progress (1): 5.4/5.8 MB
Progress (1): 5.4/5.8 MB
Progress (1): 5.4/5.8 MB
Progress (1): 5.5/5.8 MB
Progress (1): 5.5/5.8 MB
Progress (1): 5.5/5.8 MB
Progress (1): 5.5/5.8 MB
Progress (1): 5.5/5.8 MB
Progress (1): 5.5/5.8 MB
Progress (1): 5.5/5.8 MB
Progress (1): 5.5/5.8 MB
Progress (1): 5.5/5.8 MB
Progress (1): 5.5/5.8 MB
Progress (1): 5.5/5.8 MB
Progress (1): 5.5/5.8 MB
Progress (1): 5.5/5.8 MB
Progress (1): 5.5/5.8 MB
Progress (1): 5.5/5.8 MB
Progress (1): 5.5/5.8 MB
Progress (1): 5.5/5.8 MB
Progress (1): 5.5/5.8 MB
Progress (1): 5.5/5.8 MB
Progress (1): 5.5/5.8 MB
Progress (1): 5.5/5.8 MB
Progress (1): 5.5/5.8 MB
Progress (1): 5.5/5.8 MB
Progress (1): 5.5/5.8 MB
Progress (1): 5.5/5.8 MB
Progress (1): 5.6/5.8 MB
Progress (1): 5.6/5.8 MB
Progress (1): 5.6/5.8 MB
Progress (1): 5.6/5.8 MB
Progress (1): 5.6/5.8 MB
Progress (1): 5.6/5.8 MB
Progress (1): 5.6/5.8 MB
Progress (1): 5.6/5.8 MB
Progress (1): 5.6/5.8 MB
Progress (1): 5.6/5.8 MB
Progress (1): 5.6/5.8 MB
Progress (1): 5.6/5.8 MB
Progress (1): 5.6/5.8 MB
Progress (1): 5.6/5.8 MB
Progress (1): 5.6/5.8 MB
Progress (1): 5.6/5.8 MB
Progress (1): 5.6/5.8 MB
Progress (1): 5.6/5.8 MB
Progress (1): 5.6/5.8 MB
Progress (1): 5.6/5.8 MB
Progress (1): 5.6/5.8 MB
Progress (1): 5.6/5.8 MB
Progress (1): 5.6/5.8 MB
Progress (1): 5.6/5.8 MB
Progress (1): 5.6/5.8 MB
Progress (1): 5.7/5.8 MB
Progress (1): 5.7/5.8 MB
Progress (1): 5.7/5.8 MB
Progress (1): 5.7/5.8 MB
Progress (1): 5.7/5.8 MB
Progress (1): 5.7/5.8 MB
Progress (1): 5.7/5.8 MB
Progress (1): 5.7/5.8 MB
Progress (1): 5.7/5.8 MB
Progress (1): 5.7/5.8 MB
Progress (1): 5.7/5.8 MB
Progress (1): 5.7/5.8 MB
Progress (1): 5.7/5.8 MB
Progress (1): 5.7/5.8 MB
Progress (1): 5.7/5.8 MB
Progress (1): 5.7/5.8 MB
Progress (1): 5.7/5.8 MB
Progress (1): 5.7/5.8 MB
Progress (1): 5.7/5.8 MB
Progress (1): 5.7/5.8 MB
Progress (1): 5.7/5.8 MB
Progress (1): 5.7/5.8 MB
Progress (1): 5.7/5.8 MB
Progress (1): 5.7/5.8 MB
Progress (1): 5.7/5.8 MB
Progress (1): 5.8/5.8 MB
Progress (1): 5.8/5.8 MB
Progress (1): 5.8/5.8 MB
Progress (1): 5.8/5.8 MB
Progress (1): 5.8/5.8 MB
Progress (1): 5.8/5.8 MB
Progress (1): 5.8/5.8 MB
Progress (1): 5.8/5.8 MB
Progress (1): 5.8/5.8 MB
Progress (1): 5.8/5.8 MB
Progress (1): 5.8/5.8 MB
Progress (1): 5.8/5.8 MB
Progress (1): 5.8/5.8 MB
Progress (1): 5.8/5.8 MB
Progress (1): 5.8/5.8 MB
Progress (1): 5.8/5.8 MB
Progress (1): 5.8/5.8 MB
Progress (1): 5.8/5.8 MB
Progress (1): 5.8/5.8 MB
Progress (1): 5.8 MB    
                    
Downloaded from eclipse.maven.central.mirror: https://repo.eclipse.org/content/repositories/maven_central/org/eclipse/tycho/org.eclipse.jdt.core/3.12.2.v20161117-1814/org.eclipse.jdt.core-3.12.2.v20161117-1814.jar (5.8 MB at 15 MB/s)
[INFO] Compiling 184 source files to /jobs/genie.papyrus/papyrus-sysml-gerrit/workspace/core/org.eclipse.papyrus.sysml14/target/classes
[WARNING] /jobs/genie.papyrus/papyrus-sysml-gerrit/workspace/core/org.eclipse.papyrus.sysml14/src-gen/org/eclipse/papyrus/sysml14/blocks/internal/impl/BoundReferenceImpl.java:[175] 
	@SuppressWarnings("unchecked")
	                  ^^^^^^^^^^^
Unnecessary @SuppressWarnings("unchecked")
[WARNING] /jobs/genie.papyrus/papyrus-sysml-gerrit/workspace/core/org.eclipse.papyrus.sysml14/src-gen/org/eclipse/papyrus/sysml14/blocks/internal/impl/BlockImpl.java:[262] 
	@SuppressWarnings("unchecked")
	                  ^^^^^^^^^^^
Unnecessary @SuppressWarnings("unchecked")
[WARNING] /jobs/genie.papyrus/papyrus-sysml-gerrit/workspace/core/org.eclipse.papyrus.sysml14/src-gen/org/eclipse/papyrus/sysml14/requirements/internal/impl/RequirementImpl.java:[431] 
	@SuppressWarnings("unchecked")
	                  ^^^^^^^^^^^
Unnecessary @SuppressWarnings("unchecked")
[WARNING] /jobs/genie.papyrus/papyrus-sysml-gerrit/workspace/core/org.eclipse.papyrus.sysml14/src-gen/org/eclipse/papyrus/sysml14/modelelements/internal/impl/ViewImpl.java:[173] 
	@SuppressWarnings("unchecked")
	                  ^^^^^^^^^^^
Unnecessary @SuppressWarnings("unchecked")
4 problems (4 warnings)
[INFO] 
[INFO] --- maven-resources-plugin:2.7:testResources (default-testResources) @ org.eclipse.papyrus.sysml14 ---
[INFO] Using 'UTF-8' encoding to copy filtered resources.
[INFO] skip non existing resourceDirectory /jobs/genie.papyrus/papyrus-sysml-gerrit/workspace/core/org.eclipse.papyrus.sysml14/src/test/resources
[INFO] 
[INFO] --- tycho-source-plugin:1.0.0:plugin-source (plugin-source) @ org.eclipse.papyrus.sysml14 ---
[INFO] Building jar: /jobs/genie.papyrus/papyrus-sysml-gerrit/workspace/core/org.eclipse.papyrus.sysml14/target/org.eclipse.papyrus.sysml14-1.3.1-SNAPSHOT-sources.jar
[INFO] 
[INFO] --- target-platform-configuration:1.0.0:target-platform (default-target-platform) @ org.eclipse.papyrus.sysml14 ---
[INFO] 
[INFO] --- tycho-packaging-plugin:1.0.0:package-plugin (default-package-plugin) @ org.eclipse.papyrus.sysml14 ---
[INFO] Building jar: /jobs/genie.papyrus/papyrus-sysml-gerrit/workspace/core/org.eclipse.papyrus.sysml14/target/org.eclipse.papyrus.sysml14-1.3.1-SNAPSHOT.jar
[INFO] 
[INFO] --- tycho-p2-plugin:1.0.0:p2-metadata-default (default-p2-metadata-default) @ org.eclipse.papyrus.sysml14 ---
[INFO] 
[INFO] --- tycho-source-feature-plugin:1.0.0:source-feature (source-feature) @ org.eclipse.papyrus.sysml14 ---
[INFO] 
[INFO] --- tycho-p2-plugin:1.0.0:p2-metadata (attach-p2-metadata) @ org.eclipse.papyrus.sysml14 ---
[INFO] 
[INFO] --- maven-assembly-plugin:2.6:single (default) @ org.eclipse.papyrus.sysml14 ---
Downloading from eclipse-maven-releases: https://repo.eclipse.org/content/repositories/releases/org/eclipse/papyrus/tools/org.eclipse.papyrus.tools.assemblies/0.0.1/org.eclipse.papyrus.tools.assemblies-0.0.1.pom
Progress (1): 2.0 kB
                    
Downloaded from eclipse-maven-releases: https://repo.eclipse.org/content/repositories/releases/org/eclipse/papyrus/tools/org.eclipse.papyrus.tools.assemblies/0.0.1/org.eclipse.papyrus.tools.assemblies-0.0.1.pom (2.0 kB at 26 kB/s)
Downloading from eclipse-maven-releases: https://repo.eclipse.org/content/repositories/releases/org/apache/maven/shared/maven-common-artifact-filters/1.4/maven-common-artifact-filters-1.4.pom
Downloading from jboss-public-repository-group: http://repository.jboss.org/nexus/content/groups/public/org/apache/maven/shared/maven-common-artifact-filters/1.4/maven-common-artifact-filters-1.4.pom
Downloading from rcptt-releases: https://repo.eclipse.org/content/repositories/rcptt-releases/org/apache/maven/shared/maven-common-artifact-filters/1.4/maven-common-artifact-filters-1.4.pom
Downloading from eclipse.maven.central.mirror: https://repo.eclipse.org/content/repositories/maven_central/org/apache/maven/shared/maven-common-artifact-filters/1.4/maven-common-artifact-filters-1.4.pom
Progress (1): 3.8 kB
                    
Downloaded from eclipse.maven.central.mirror: https://repo.eclipse.org/content/repositories/maven_central/org/apache/maven/shared/maven-common-artifact-filters/1.4/maven-common-artifact-filters-1.4.pom (3.8 kB at 99 kB/s)
Downloading from eclipse-maven-releases: https://repo.eclipse.org/content/repositories/releases/org/apache/maven/maven-artifact/2.0.8/maven-artifact-2.0.8.pom
Downloading from jboss-public-repository-group: http://repository.jboss.org/nexus/content/groups/public/org/apache/maven/maven-artifact/2.0.8/maven-artifact-2.0.8.pom
Downloading from rcptt-releases: https://repo.eclipse.org/content/repositories/rcptt-releases/org/apache/maven/maven-artifact/2.0.8/maven-artifact-2.0.8.pom
Downloading from eclipse.maven.central.mirror: https://repo.eclipse.org/content/repositories/maven_central/org/apache/maven/maven-artifact/2.0.8/maven-artifact-2.0.8.pom
Progress (1): 1.6 kB
                    
Downloaded from eclipse.maven.central.mirror: https://repo.eclipse.org/content/repositories/maven_central/org/apache/maven/maven-artifact/2.0.8/maven-artifact-2.0.8.pom (1.6 kB at 44 kB/s)
Downloading from eclipse-maven-releases: https://repo.eclipse.org/content/repositories/releases/org/apache/maven/maven/2.0.8/maven-2.0.8.pom
Downloading from jboss-public-repository-group: http://repository.jboss.org/nexus/content/groups/public/org/apache/maven/maven/2.0.8/maven-2.0.8.pom
Downloading from rcptt-releases: https://repo.eclipse.org/content/repositories/rcptt-releases/org/apache/maven/maven/2.0.8/maven-2.0.8.pom
Downloading from eclipse.maven.central.mirror: https://repo.eclipse.org/content/repositories/maven_central/org/apache/maven/maven/2.0.8/maven-2.0.8.pom
Progress (1): 4.1/12 kB
Progress (1): 7.7/12 kB
Progress (1): 12/12 kB 
Progress (1): 12 kB   
                   
Downloaded from eclipse.maven.central.mirror: https://repo.eclipse.org/content/repositories/maven_central/org/apache/maven/maven/2.0.8/maven-2.0.8.pom (12 kB at 367 kB/s)
Downloading from eclipse-maven-releases: https://repo.eclipse.org/content/repositories/releases/org/apache/maven/maven-parent/6/maven-parent-6.pom
Downloading from jboss-public-repository-group: http://repository.jboss.org/nexus/content/groups/public/org/apache/maven/maven-parent/6/maven-parent-6.pom
Downloading from rcptt-releases: https://repo.eclipse.org/content/repositories/rcptt-releases/org/apache/maven/maven-parent/6/maven-parent-6.pom
Downloading from eclipse.maven.central.mirror: https://repo.eclipse.org/content/repositories/maven_central/org/apache/maven/maven-parent/6/maven-parent-6.pom
Progress (1): 4.1/20 kB
Progress (1): 7.7/20 kB
Progress (1): 12/20 kB 
Progress (1): 16/20 kB
Progress (1): 20/20 kB
Progress (1): 20 kB   
                   
Downloaded from eclipse.maven.central.mirror: https://repo.eclipse.org/content/repositories/maven_central/org/apache/maven/maven-parent/6/maven-parent-6.pom (20 kB at 542 kB/s)
Downloading from eclipse-maven-releases: https://repo.eclipse.org/content/repositories/releases/org/codehaus/plexus/plexus-utils/1.4.6/plexus-utils-1.4.6.pom
Downloading from jboss-public-repository-group: http://repository.jboss.org/nexus/content/groups/public/org/codehaus/plexus/plexus-utils/1.4.6/plexus-utils-1.4.6.pom
Downloading from rcptt-releases: https://repo.eclipse.org/content/repositories/rcptt-releases/org/codehaus/plexus/plexus-utils/1.4.6/plexus-utils-1.4.6.pom
Downloading from eclipse.maven.central.mirror: https://repo.eclipse.org/content/repositories/maven_central/org/codehaus/plexus/plexus-utils/1.4.6/plexus-utils-1.4.6.pom
Progress (1): 2.3 kB
                    
Downloaded from eclipse.maven.central.mirror: https://repo.eclipse.org/content/repositories/maven_central/org/codehaus/plexus/plexus-utils/1.4.6/plexus-utils-1.4.6.pom (2.3 kB at 54 kB/s)
Downloading from eclipse-maven-releases: https://repo.eclipse.org/content/repositories/releases/org/apache/maven/maven-model/2.0.8/maven-model-2.0.8.pom
Downloading from jboss-public-repository-group: http://repository.jboss.org/nexus/content/groups/public/org/apache/maven/maven-model/2.0.8/maven-model-2.0.8.pom
Downloading from rcptt-releases: https://repo.eclipse.org/content/repositories/rcptt-releases/org/apache/maven/maven-model/2.0.8/maven-model-2.0.8.pom
Downloading from eclipse.maven.central.mirror: https://repo.eclipse.org/content/repositories/maven_central/org/apache/maven/maven-model/2.0.8/maven-model-2.0.8.pom
Progress (1): 3.1 kB
                    
Downloaded from eclipse.maven.central.mirror: https://repo.eclipse.org/content/repositories/maven_central/org/apache/maven/maven-model/2.0.8/maven-model-2.0.8.pom (3.1 kB at 98 kB/s)
Downloading from eclipse-maven-releases: https://repo.eclipse.org/content/repositories/releases/org/apache/maven/maven-project/2.0.8/maven-project-2.0.8.pom
Downloading from jboss-public-repository-group: http://repository.jboss.org/nexus/content/groups/public/org/apache/maven/maven-project/2.0.8/maven-project-2.0.8.pom
Downloading from rcptt-releases: https://repo.eclipse.org/content/repositories/rcptt-releases/org/apache/maven/maven-project/2.0.8/maven-project-2.0.8.pom
Downloading from eclipse.maven.central.mirror: https://repo.eclipse.org/content/repositories/maven_central/org/apache/maven/maven-project/2.0.8/maven-project-2.0.8.pom
Progress (1): 2.7 kB
                    
Downloaded from eclipse.maven.central.mirror: https://repo.eclipse.org/content/repositories/maven_central/org/apache/maven/maven-project/2.0.8/maven-project-2.0.8.pom (2.7 kB at 73 kB/s)
Downloading from eclipse-maven-releases: https://repo.eclipse.org/content/repositories/releases/org/apache/maven/maven-settings/2.0.8/maven-settings-2.0.8.pom
Downloading from jboss-public-repository-group: http://repository.jboss.org/nexus/content/groups/public/org/apache/maven/maven-settings/2.0.8/maven-settings-2.0.8.pom
Downloading from rcptt-releases: https://repo.eclipse.org/content/repositories/rcptt-releases/org/apache/maven/maven-settings/2.0.8/maven-settings-2.0.8.pom
Downloading from eclipse.maven.central.mirror: https://repo.eclipse.org/content/repositories/maven_central/org/apache/maven/maven-settings/2.0.8/maven-settings-2.0.8.pom
Progress (1): 2.1 kB
                    
Downloaded from eclipse.maven.central.mirror: https://repo.eclipse.org/content/repositories/maven_central/org/apache/maven/maven-settings/2.0.8/maven-settings-2.0.8.pom (2.1 kB at 41 kB/s)
Downloading from eclipse-maven-releases: https://repo.eclipse.org/content/repositories/releases/org/apache/maven/maven-profile/2.0.8/maven-profile-2.0.8.pom
Downloading from jboss-public-repository-group: http://repository.jboss.org/nexus/content/groups/public/org/apache/maven/maven-profile/2.0.8/maven-profile-2.0.8.pom
Downloading from rcptt-releases: https://repo.eclipse.org/content/repositories/rcptt-releases/org/apache/maven/maven-profile/2.0.8/maven-profile-2.0.8.pom
Downloading from eclipse.maven.central.mirror: https://repo.eclipse.org/content/repositories/maven_central/org/apache/maven/maven-profile/2.0.8/maven-profile-2.0.8.pom
Progress (1): 2.0 kB
                    
Downloaded from eclipse.maven.central.mirror: https://repo.eclipse.org/content/repositories/maven_central/org/apache/maven/maven-profile/2.0.8/maven-profile-2.0.8.pom (2.0 kB at 57 kB/s)
Downloading from eclipse-maven-releases: https://repo.eclipse.org/content/repositories/releases/org/apache/maven/maven-artifact-manager/2.0.8/maven-artifact-manager-2.0.8.pom
Downloading from jboss-public-repository-group: http://repository.jboss.org/nexus/content/groups/public/org/apache/maven/maven-artifact-manager/2.0.8/maven-artifact-manager-2.0.8.pom
Downloading from rcptt-releases: https://repo.eclipse.org/content/repositories/rcptt-releases/org/apache/maven/maven-artifact-manager/2.0.8/maven-artifact-manager-2.0.8.pom
Downloading from eclipse.maven.central.mirror: https://repo.eclipse.org/content/repositories/maven_central/org/apache/maven/maven-artifact-manager/2.0.8/maven-artifact-manager-2.0.8.pom
Progress (1): 2.7 kB
                    
Downloaded from eclipse.maven.central.mirror: https://repo.eclipse.org/content/repositories/maven_central/org/apache/maven/maven-artifact-manager/2.0.8/maven-artifact-manager-2.0.8.pom (2.7 kB at 53 kB/s)
Downloading from eclipse-maven-releases: https://repo.eclipse.org/content/repositories/releases/org/apache/maven/maven-repository-metadata/2.0.8/maven-repository-metadata-2.0.8.pom
Downloading from jboss-public-repository-group: http://repository.jboss.org/nexus/content/groups/public/org/apache/maven/maven-repository-metadata/2.0.8/maven-repository-metadata-2.0.8.pom
Downloading from rcptt-releases: https://repo.eclipse.org/content/repositories/rcptt-releases/org/apache/maven/maven-repository-metadata/2.0.8/maven-repository-metadata-2.0.8.pom
Downloading from eclipse.maven.central.mirror: https://repo.eclipse.org/content/repositories/maven_central/org/apache/maven/maven-repository-metadata/2.0.8/maven-repository-metadata-2.0.8.pom
Progress (1): 1.9 kB
                    
Downloaded from eclipse.maven.central.mirror: https://repo.eclipse.org/content/repositories/maven_central/org/apache/maven/maven-repository-metadata/2.0.8/maven-repository-metadata-2.0.8.pom (1.9 kB at 40 kB/s)
Downloading from eclipse-maven-releases: https://repo.eclipse.org/content/repositories/releases/org/apache/maven/maven-plugin-registry/2.0.8/maven-plugin-registry-2.0.8.pom
Downloading from jboss-public-repository-group: http://repository.jboss.org/nexus/content/groups/public/org/apache/maven/maven-plugin-registry/2.0.8/maven-plugin-registry-2.0.8.pom
Downloading from rcptt-releases: https://repo.eclipse.org/content/repositories/rcptt-releases/org/apache/maven/maven-plugin-registry/2.0.8/maven-plugin-registry-2.0.8.pom
Downloading from eclipse.maven.central.mirror: https://repo.eclipse.org/content/repositories/maven_central/org/apache/maven/maven-plugin-registry/2.0.8/maven-plugin-registry-2.0.8.pom
Progress (1): 2.0 kB
                    
Downloaded from eclipse.maven.central.mirror: https://repo.eclipse.org/content/repositories/maven_central/org/apache/maven/maven-plugin-registry/2.0.8/maven-plugin-registry-2.0.8.pom (2.0 kB at 38 kB/s)
Downloading from eclipse-maven-releases: https://repo.eclipse.org/content/repositories/releases/org/apache/maven/maven-plugin-api/2.0.8/maven-plugin-api-2.0.8.pom
Downloading from jboss-public-repository-group: http://repository.jboss.org/nexus/content/groups/public/org/apache/maven/maven-plugin-api/2.0.8/maven-plugin-api-2.0.8.pom
Downloading from rcptt-releases: https://repo.eclipse.org/content/repositories/rcptt-releases/org/apache/maven/maven-plugin-api/2.0.8/maven-plugin-api-2.0.8.pom
Downloading from eclipse.maven.central.mirror: https://repo.eclipse.org/content/repositories/maven_central/org/apache/maven/maven-plugin-api/2.0.8/maven-plugin-api-2.0.8.pom
Progress (1): 1.5 kB
                    
Downloaded from eclipse.maven.central.mirror: https://repo.eclipse.org/content/repositories/maven_central/org/apache/maven/maven-plugin-api/2.0.8/maven-plugin-api-2.0.8.pom (1.5 kB at 65 kB/s)
Downloading from eclipse-maven-releases: https://repo.eclipse.org/content/repositories/releases/junit/junit/3.8.2/junit-3.8.2.pom
Downloading from jboss-public-repository-group: http://repository.jboss.org/nexus/content/groups/public/junit/junit/3.8.2/junit-3.8.2.pom
Downloading from rcptt-releases: https://repo.eclipse.org/content/repositories/rcptt-releases/junit/junit/3.8.2/junit-3.8.2.pom
Downloading from eclipse.maven.central.mirror: https://repo.eclipse.org/content/repositories/maven_central/junit/junit/3.8.2/junit-3.8.2.pom
Progress (1): 747 B
                   
Downloaded from eclipse.maven.central.mirror: https://repo.eclipse.org/content/repositories/maven_central/junit/junit/3.8.2/junit-3.8.2.pom (747 B at 16 kB/s)
Downloading from eclipse-maven-releases: https://repo.eclipse.org/content/repositories/releases/org/codehaus/plexus/plexus-utils/2.1/plexus-utils-2.1.pom
Downloading from jboss-public-repository-group: http://repository.jboss.org/nexus/content/groups/public/org/codehaus/plexus/plexus-utils/2.1/plexus-utils-2.1.pom
Downloading from rcptt-releases: https://repo.eclipse.org/content/repositories/rcptt-releases/org/codehaus/plexus/plexus-utils/2.1/plexus-utils-2.1.pom
Downloading from eclipse.maven.central.mirror: https://repo.eclipse.org/content/repositories/maven_central/org/codehaus/plexus/plexus-utils/2.1/plexus-utils-2.1.pom
Progress (1): 4.0 kB
                    
Downloaded from eclipse.maven.central.mirror: https://repo.eclipse.org/content/repositories/maven_central/org/codehaus/plexus/plexus-utils/2.1/plexus-utils-2.1.pom (4.0 kB at 79 kB/s)
Downloading from eclipse-maven-releases: https://repo.eclipse.org/content/repositories/releases/org/sonatype/spice/spice-parent/16/spice-parent-16.pom
Downloading from jboss-public-repository-group: http://repository.jboss.org/nexus/content/groups/public/org/sonatype/spice/spice-parent/16/spice-parent-16.pom
Downloading from rcptt-releases: https://repo.eclipse.org/content/repositories/rcptt-releases/org/sonatype/spice/spice-parent/16/spice-parent-16.pom
Downloading from eclipse.maven.central.mirror: https://repo.eclipse.org/content/repositories/maven_central/org/sonatype/spice/spice-parent/16/spice-parent-16.pom
Progress (1): 4.1/8.4 kB
Progress (1): 7.7/8.4 kB
Progress (1): 8.4 kB    
                    
Downloaded from eclipse.maven.central.mirror: https://repo.eclipse.org/content/repositories/maven_central/org/sonatype/spice/spice-parent/16/spice-parent-16.pom (8.4 kB at 161 kB/s)
Downloading from eclipse-maven-releases: https://repo.eclipse.org/content/repositories/releases/org/codehaus/plexus/plexus-interpolation/1.22/plexus-interpolation-1.22.pom
Downloading from jboss-public-repository-group: http://repository.jboss.org/nexus/content/groups/public/org/codehaus/plexus/plexus-interpolation/1.22/plexus-interpolation-1.22.pom
Downloading from rcptt-releases: https://repo.eclipse.org/content/repositories/rcptt-releases/org/codehaus/plexus/plexus-interpolation/1.22/plexus-interpolation-1.22.pom
Downloading from eclipse.maven.central.mirror: https://repo.eclipse.org/content/repositories/maven_central/org/codehaus/plexus/plexus-interpolation/1.22/plexus-interpolation-1.22.pom
Progress (1): 1.5 kB
                    
Downloaded from eclipse.maven.central.mirror: https://repo.eclipse.org/content/repositories/maven_central/org/codehaus/plexus/plexus-interpolation/1.22/plexus-interpolation-1.22.pom (1.5 kB at 48 kB/s)
Downloading from eclipse-maven-releases: https://repo.eclipse.org/content/repositories/releases/org/codehaus/plexus/plexus-archiver/3.0.1/plexus-archiver-3.0.1.pom
Downloading from jboss-public-repository-group: http://repository.jboss.org/nexus/content/groups/public/org/codehaus/plexus/plexus-archiver/3.0.1/plexus-archiver-3.0.1.pom
Downloading from rcptt-releases: https://repo.eclipse.org/content/repositories/rcptt-releases/org/codehaus/plexus/plexus-archiver/3.0.1/plexus-archiver-3.0.1.pom
Downloading from eclipse.maven.central.mirror: https://repo.eclipse.org/content/repositories/maven_central/org/codehaus/plexus/plexus-archiver/3.0.1/plexus-archiver-3.0.1.pom
Progress (1): 4.1/5.8 kB
Progress (1): 5.8 kB    
                    
Downloaded from eclipse.maven.central.mirror: https://repo.eclipse.org/content/repositories/maven_central/org/codehaus/plexus/plexus-archiver/3.0.1/plexus-archiver-3.0.1.pom (5.8 kB at 175 kB/s)
Downloading from eclipse-maven-releases: https://repo.eclipse.org/content/repositories/releases/org/codehaus/plexus/plexus-utils/3.0.20/plexus-utils-3.0.20.pom
Downloading from jboss-public-repository-group: http://repository.jboss.org/nexus/content/groups/public/org/codehaus/plexus/plexus-utils/3.0.20/plexus-utils-3.0.20.pom
Downloading from rcptt-releases: https://repo.eclipse.org/content/repositories/rcptt-releases/org/codehaus/plexus/plexus-utils/3.0.20/plexus-utils-3.0.20.pom
Downloading from eclipse.maven.central.mirror: https://repo.eclipse.org/content/repositories/maven_central/org/codehaus/plexus/plexus-utils/3.0.20/plexus-utils-3.0.20.pom
Progress (1): 3.8 kB
                    
Downloaded from eclipse.maven.central.mirror: https://repo.eclipse.org/content/repositories/maven_central/org/codehaus/plexus/plexus-utils/3.0.20/plexus-utils-3.0.20.pom (3.8 kB at 112 kB/s)
Downloading from eclipse-maven-releases: https://repo.eclipse.org/content/repositories/releases/org/codehaus/plexus/plexus-io/2.6/plexus-io-2.6.pom
Downloading from jboss-public-repository-group: http://repository.jboss.org/nexus/content/groups/public/org/codehaus/plexus/plexus-io/2.6/plexus-io-2.6.pom
Downloading from rcptt-releases: https://repo.eclipse.org/content/repositories/rcptt-releases/org/codehaus/plexus/plexus-io/2.6/plexus-io-2.6.pom
Downloading from eclipse.maven.central.mirror: https://repo.eclipse.org/content/repositories/maven_central/org/codehaus/plexus/plexus-io/2.6/plexus-io-2.6.pom
Progress (1): 3.9 kB
                    
Downloaded from eclipse.maven.central.mirror: https://repo.eclipse.org/content/repositories/maven_central/org/codehaus/plexus/plexus-io/2.6/plexus-io-2.6.pom (3.9 kB at 136 kB/s)
Downloading from eclipse-maven-releases: https://repo.eclipse.org/content/repositories/releases/org/iq80/snappy/snappy/0.3/snappy-0.3.pom
Downloading from jboss-public-repository-group: http://repository.jboss.org/nexus/content/groups/public/org/iq80/snappy/snappy/0.3/snappy-0.3.pom
Downloading from rcptt-releases: https://repo.eclipse.org/content/repositories/rcptt-releases/org/iq80/snappy/snappy/0.3/snappy-0.3.pom
Downloading from eclipse.maven.central.mirror: https://repo.eclipse.org/content/repositories/maven_central/org/iq80/snappy/snappy/0.3/snappy-0.3.pom
Progress (1): 4.1/14 kB
Progress (1): 7.7/14 kB
Progress (1): 12/14 kB 
Progress (1): 14 kB   
                   
Downloaded from eclipse.maven.central.mirror: https://repo.eclipse.org/content/repositories/maven_central/org/iq80/snappy/snappy/0.3/snappy-0.3.pom (14 kB at 465 kB/s)
Downloading from eclipse-maven-releases: https://repo.eclipse.org/content/repositories/releases/org/apache/maven/shared/file-management/1.1/file-management-1.1.pom
Downloading from jboss-public-repository-group: http://repository.jboss.org/nexus/content/groups/public/org/apache/maven/shared/file-management/1.1/file-management-1.1.pom
Downloading from rcptt-releases: https://repo.eclipse.org/content/repositories/rcptt-releases/org/apache/maven/shared/file-management/1.1/file-management-1.1.pom
Downloading from eclipse.maven.central.mirror: https://repo.eclipse.org/content/repositories/maven_central/org/apache/maven/shared/file-management/1.1/file-management-1.1.pom
Progress (1): 2.7 kB
                    
Downloaded from eclipse.maven.central.mirror: https://repo.eclipse.org/content/repositories/maven_central/org/apache/maven/shared/file-management/1.1/file-management-1.1.pom (2.7 kB at 11 kB/s)
Downloading from eclipse-maven-releases: https://repo.eclipse.org/content/repositories/releases/org/apache/maven/shared/maven-shared-components/4/maven-shared-components-4.pom
Downloading from jboss-public-repository-group: http://repository.jboss.org/nexus/content/groups/public/org/apache/maven/shared/maven-shared-components/4/maven-shared-components-4.pom
Downloading from rcptt-releases: https://repo.eclipse.org/content/repositories/rcptt-releases/org/apache/maven/shared/maven-shared-components/4/maven-shared-components-4.pom
Downloading from eclipse.maven.central.mirror: https://repo.eclipse.org/content/repositories/maven_central/org/apache/maven/shared/maven-shared-components/4/maven-shared-components-4.pom
Progress (1): 2.2 kB
                    
Downloaded from eclipse.maven.central.mirror: https://repo.eclipse.org/content/repositories/maven_central/org/apache/maven/shared/maven-shared-components/4/maven-shared-components-4.pom (2.2 kB at 61 kB/s)
Downloading from eclipse-maven-releases: https://repo.eclipse.org/content/repositories/releases/org/apache/maven/maven-parent/4/maven-parent-4.pom
Downloading from jboss-public-repository-group: http://repository.jboss.org/nexus/content/groups/public/org/apache/maven/maven-parent/4/maven-parent-4.pom
Downloading from rcptt-releases: https://repo.eclipse.org/content/repositories/rcptt-releases/org/apache/maven/maven-parent/4/maven-parent-4.pom
Downloading from eclipse.maven.central.mirror: https://repo.eclipse.org/content/repositories/maven_central/org/apache/maven/maven-parent/4/maven-parent-4.pom
Progress (1): 4.1/10.0 kB
Progress (1): 7.7/10.0 kB
Progress (1): 10.0 kB    
                     
Downloaded from eclipse.maven.central.mirror: https://repo.eclipse.org/content/repositories/maven_central/org/apache/maven/maven-parent/4/maven-parent-4.pom (10.0 kB at 250 kB/s)
Downloading from eclipse-maven-releases: https://repo.eclipse.org/content/repositories/releases/org/apache/maven/maven-plugin-api/2.0/maven-plugin-api-2.0.pom
Downloading from jboss-public-repository-group: http://repository.jboss.org/nexus/content/groups/public/org/apache/maven/maven-plugin-api/2.0/maven-plugin-api-2.0.pom
Downloading from rcptt-releases: https://repo.eclipse.org/content/repositories/rcptt-releases/org/apache/maven/maven-plugin-api/2.0/maven-plugin-api-2.0.pom
Downloading from eclipse.maven.central.mirror: https://repo.eclipse.org/content/repositories/maven_central/org/apache/maven/maven-plugin-api/2.0/maven-plugin-api-2.0.pom
Progress (1): 601 B
                   
Downloaded from eclipse.maven.central.mirror: https://repo.eclipse.org/content/repositories/maven_central/org/apache/maven/maven-plugin-api/2.0/maven-plugin-api-2.0.pom (601 B at 18 kB/s)
Downloading from eclipse-maven-releases: https://repo.eclipse.org/content/repositories/releases/org/apache/maven/maven/2.0/maven-2.0.pom
Downloading from jboss-public-repository-group: http://repository.jboss.org/nexus/content/groups/public/org/apache/maven/maven/2.0/maven-2.0.pom
Downloading from rcptt-releases: https://repo.eclipse.org/content/repositories/rcptt-releases/org/apache/maven/maven/2.0/maven-2.0.pom
Downloading from eclipse.maven.central.mirror: https://repo.eclipse.org/content/repositories/maven_central/org/apache/maven/maven/2.0/maven-2.0.pom
Progress (1): 4.1/8.8 kB
Progress (1): 7.7/8.8 kB
Progress (1): 8.8 kB    
                    
Downloaded from eclipse.maven.central.mirror: https://repo.eclipse.org/content/repositories/maven_central/org/apache/maven/maven/2.0/maven-2.0.pom (8.8 kB at 175 kB/s)
Downloading from eclipse-maven-releases: https://repo.eclipse.org/content/repositories/releases/org/apache/maven/shared/maven-shared-io/1.0/maven-shared-io-1.0.pom
Downloading from jboss-public-repository-group: http://repository.jboss.org/nexus/content/groups/public/org/apache/maven/shared/maven-shared-io/1.0/maven-shared-io-1.0.pom
Downloading from rcptt-releases: https://repo.eclipse.org/content/repositories/rcptt-releases/org/apache/maven/shared/maven-shared-io/1.0/maven-shared-io-1.0.pom
Downloading from eclipse.maven.central.mirror: https://repo.eclipse.org/content/repositories/maven_central/org/apache/maven/shared/maven-shared-io/1.0/maven-shared-io-1.0.pom
Progress (1): 3.0 kB
                    
Downloaded from eclipse.maven.central.mirror: https://repo.eclipse.org/content/repositories/maven_central/org/apache/maven/shared/maven-shared-io/1.0/maven-shared-io-1.0.pom (3.0 kB at 92 kB/s)
Downloading from eclipse-maven-releases: https://repo.eclipse.org/content/repositories/releases/org/apache/maven/maven-artifact/2.0.2/maven-artifact-2.0.2.pom
Downloading from jboss-public-repository-group: http://repository.jboss.org/nexus/content/groups/public/org/apache/maven/maven-artifact/2.0.2/maven-artifact-2.0.2.pom
Downloading from rcptt-releases: https://repo.eclipse.org/content/repositories/rcptt-releases/org/apache/maven/maven-artifact/2.0.2/maven-artifact-2.0.2.pom
Downloading from eclipse.maven.central.mirror: https://repo.eclipse.org/content/repositories/maven_central/org/apache/maven/maven-artifact/2.0.2/maven-artifact-2.0.2.pom
Progress (1): 765 B
                   
Downloaded from eclipse.maven.central.mirror: https://repo.eclipse.org/content/repositories/maven_central/org/apache/maven/maven-artifact/2.0.2/maven-artifact-2.0.2.pom (765 B at 15 kB/s)
Downloading from eclipse-maven-releases: https://repo.eclipse.org/content/repositories/releases/org/apache/maven/maven/2.0.2/maven-2.0.2.pom
Downloading from jboss-public-repository-group: http://repository.jboss.org/nexus/content/groups/public/org/apache/maven/maven/2.0.2/maven-2.0.2.pom
Downloading from rcptt-releases: https://repo.eclipse.org/content/repositories/rcptt-releases/org/apache/maven/maven/2.0.2/maven-2.0.2.pom
Downloading from eclipse.maven.central.mirror: https://repo.eclipse.org/content/repositories/maven_central/org/apache/maven/maven/2.0.2/maven-2.0.2.pom
Progress (1): 4.1/13 kB
Progress (1): 7.7/13 kB
Progress (1): 12/13 kB 
Progress (1): 13 kB   
                   
Downloaded from eclipse.maven.central.mirror: https://repo.eclipse.org/content/repositories/maven_central/org/apache/maven/maven/2.0.2/maven-2.0.2.pom (13 kB at 454 kB/s)
Downloading from eclipse-maven-releases: https://repo.eclipse.org/content/repositories/releases/org/codehaus/plexus/plexus-utils/1.1/plexus-utils-1.1.pom
Downloading from jboss-public-repository-group: http://repository.jboss.org/nexus/content/groups/public/org/codehaus/plexus/plexus-utils/1.1/plexus-utils-1.1.pom
Downloading from rcptt-releases: https://repo.eclipse.org/content/repositories/rcptt-releases/org/codehaus/plexus/plexus-utils/1.1/plexus-utils-1.1.pom
Downloading from eclipse.maven.central.mirror: https://repo.eclipse.org/content/repositories/maven_central/org/codehaus/plexus/plexus-utils/1.1/plexus-utils-1.1.pom
Progress (1): 767 B
                   
Downloaded from eclipse.maven.central.mirror: https://repo.eclipse.org/content/repositories/maven_central/org/codehaus/plexus/plexus-utils/1.1/plexus-utils-1.1.pom (767 B at 20 kB/s)
Downloading from eclipse-maven-releases: https://repo.eclipse.org/content/repositories/releases/org/apache/maven/maven-artifact-manager/2.0.2/maven-artifact-manager-2.0.2.pom
Downloading from jboss-public-repository-group: http://repository.jboss.org/nexus/content/groups/public/org/apache/maven/maven-artifact-manager/2.0.2/maven-artifact-manager-2.0.2.pom
Downloading from rcptt-releases: https://repo.eclipse.org/content/repositories/rcptt-releases/org/apache/maven/maven-artifact-manager/2.0.2/maven-artifact-manager-2.0.2.pom
Downloading from eclipse.maven.central.mirror: https://repo.eclipse.org/content/repositories/maven_central/org/apache/maven/maven-artifact-manager/2.0.2/maven-artifact-manager-2.0.2.pom
Progress (1): 1.4 kB
                    
Downloaded from eclipse.maven.central.mirror: https://repo.eclipse.org/content/repositories/maven_central/org/apache/maven/maven-artifact-manager/2.0.2/maven-artifact-manager-2.0.2.pom (1.4 kB at 39 kB/s)
Downloading from eclipse-maven-releases: https://repo.eclipse.org/content/repositories/releases/org/apache/maven/maven-repository-metadata/2.0.2/maven-repository-metadata-2.0.2.pom
Downloading from jboss-public-repository-group: http://repository.jboss.org/nexus/content/groups/public/org/apache/maven/maven-repository-metadata/2.0.2/maven-repository-metadata-2.0.2.pom
Downloading from rcptt-releases: https://repo.eclipse.org/content/repositories/rcptt-releases/org/apache/maven/maven-repository-metadata/2.0.2/maven-repository-metadata-2.0.2.pom
Downloading from eclipse.maven.central.mirror: https://repo.eclipse.org/content/repositories/maven_central/org/apache/maven/maven-repository-metadata/2.0.2/maven-repository-metadata-2.0.2.pom
Progress (1): 1.3 kB
                    
Downloaded from eclipse.maven.central.mirror: https://repo.eclipse.org/content/repositories/maven_central/org/apache/maven/maven-repository-metadata/2.0.2/maven-repository-metadata-2.0.2.pom (1.3 kB at 37 kB/s)
Downloading from eclipse-maven-releases: https://repo.eclipse.org/content/repositories/releases/org/codehaus/plexus/plexus-container-default/1.0-alpha-9/plexus-container-default-1.0-alpha-9.pom
Downloading from jboss-public-repository-group: http://repository.jboss.org/nexus/content/groups/public/org/codehaus/plexus/plexus-container-default/1.0-alpha-9/plexus-container-default-1.0-alpha-9.pom
Downloading from rcptt-releases: https://repo.eclipse.org/content/repositories/rcptt-releases/org/codehaus/plexus/plexus-container-default/1.0-alpha-9/plexus-container-default-1.0-alpha-9.pom
Downloading from eclipse.maven.central.mirror: https://repo.eclipse.org/content/repositories/maven_central/org/codehaus/plexus/plexus-container-default/1.0-alpha-9/plexus-container-default-1.0-alpha-9.pom
Progress (1): 1.2 kB
                    
Downloaded from eclipse.maven.central.mirror: https://repo.eclipse.org/content/repositories/maven_central/org/codehaus/plexus/plexus-container-default/1.0-alpha-9/plexus-container-default-1.0-alpha-9.pom (1.2 kB at 43 kB/s)
Downloading from eclipse-maven-releases: https://repo.eclipse.org/content/repositories/releases/org/apache/maven/wagon/wagon-provider-api/1.0-alpha-6/wagon-provider-api-1.0-alpha-6.pom
Downloading from jboss-public-repository-group: http://repository.jboss.org/nexus/content/groups/public/org/apache/maven/wagon/wagon-provider-api/1.0-alpha-6/wagon-provider-api-1.0-alpha-6.pom
Downloading from rcptt-releases: https://repo.eclipse.org/content/repositories/rcptt-releases/org/apache/maven/wagon/wagon-provider-api/1.0-alpha-6/wagon-provider-api-1.0-alpha-6.pom
Downloading from eclipse.maven.central.mirror: https://repo.eclipse.org/content/repositories/maven_central/org/apache/maven/wagon/wagon-provider-api/1.0-alpha-6/wagon-provider-api-1.0-alpha-6.pom
Progress (1): 588 B
                   
Downloaded from eclipse.maven.central.mirror: https://repo.eclipse.org/content/repositories/maven_central/org/apache/maven/wagon/wagon-provider-api/1.0-alpha-6/wagon-provider-api-1.0-alpha-6.pom (588 B at 19 kB/s)
Downloading from eclipse-maven-releases: https://repo.eclipse.org/content/repositories/releases/org/apache/maven/wagon/wagon/1.0-alpha-6/wagon-1.0-alpha-6.pom
Downloading from jboss-public-repository-group: http://repository.jboss.org/nexus/content/groups/public/org/apache/maven/wagon/wagon/1.0-alpha-6/wagon-1.0-alpha-6.pom
Downloading from rcptt-releases: https://repo.eclipse.org/content/repositories/rcptt-releases/org/apache/maven/wagon/wagon/1.0-alpha-6/wagon-1.0-alpha-6.pom
Downloading from eclipse.maven.central.mirror: https://repo.eclipse.org/content/repositories/maven_central/org/apache/maven/wagon/wagon/1.0-alpha-6/wagon-1.0-alpha-6.pom
Progress (1): 4.1/6.4 kB
Progress (1): 6.4 kB    
                    
Downloaded from eclipse.maven.central.mirror: https://repo.eclipse.org/content/repositories/maven_central/org/apache/maven/wagon/wagon/1.0-alpha-6/wagon-1.0-alpha-6.pom (6.4 kB at 200 kB/s)
Downloading from eclipse-maven-releases: https://repo.eclipse.org/content/repositories/releases/org/codehaus/plexus/plexus-utils/1.2/plexus-utils-1.2.pom
Downloading from jboss-public-repository-group: http://repository.jboss.org/nexus/content/groups/public/org/codehaus/plexus/plexus-utils/1.2/plexus-utils-1.2.pom
Downloading from rcptt-releases: https://repo.eclipse.org/content/repositories/rcptt-releases/org/codehaus/plexus/plexus-utils/1.2/plexus-utils-1.2.pom
Downloading from eclipse.maven.central.mirror: https://repo.eclipse.org/content/repositories/maven_central/org/codehaus/plexus/plexus-utils/1.2/plexus-utils-1.2.pom
Progress (1): 767 B
                   
Downloaded from eclipse.maven.central.mirror: https://repo.eclipse.org/content/repositories/maven_central/org/codehaus/plexus/plexus-utils/1.2/plexus-utils-1.2.pom (767 B at 21 kB/s)
Downloading from eclipse-maven-releases: https://repo.eclipse.org/content/repositories/releases/org/codehaus/plexus/plexus/1.0.5/plexus-1.0.5.pom
Downloading from jboss-public-repository-group: http://repository.jboss.org/nexus/content/groups/public/org/codehaus/plexus/plexus/1.0.5/plexus-1.0.5.pom
Downloading from rcptt-releases: https://repo.eclipse.org/content/repositories/rcptt-releases/org/codehaus/plexus/plexus/1.0.5/plexus-1.0.5.pom
Downloading from eclipse.maven.central.mirror: https://repo.eclipse.org/content/repositories/maven_central/org/codehaus/plexus/plexus/1.0.5/plexus-1.0.5.pom
Progress (1): 4.1/5.9 kB
Progress (1): 5.9 kB    
                    
Downloaded from eclipse.maven.central.mirror: https://repo.eclipse.org/content/repositories/maven_central/org/codehaus/plexus/plexus/1.0.5/plexus-1.0.5.pom (5.9 kB at 126 kB/s)
Downloading from eclipse-maven-releases: https://repo.eclipse.org/content/repositories/releases/org/apache/maven/shared/maven-shared-io/1.1/maven-shared-io-1.1.pom
Downloading from jboss-public-repository-group: http://repository.jboss.org/nexus/content/groups/public/org/apache/maven/shared/maven-shared-io/1.1/maven-shared-io-1.1.pom
Downloading from rcptt-releases: https://repo.eclipse.org/content/repositories/rcptt-releases/org/apache/maven/shared/maven-shared-io/1.1/maven-shared-io-1.1.pom
Downloading from eclipse.maven.central.mirror: https://repo.eclipse.org/content/repositories/maven_central/org/apache/maven/shared/maven-shared-io/1.1/maven-shared-io-1.1.pom
Progress (1): 4.1 kB
                    
Downloaded from eclipse.maven.central.mirror: https://repo.eclipse.org/content/repositories/maven_central/org/apache/maven/shared/maven-shared-io/1.1/maven-shared-io-1.1.pom (4.1 kB at 150 kB/s)
Downloading from eclipse-maven-releases: https://repo.eclipse.org/content/repositories/releases/org/apache/maven/shared/maven-shared-components/8/maven-shared-components-8.pom
Downloading from jboss-public-repository-group: http://repository.jboss.org/nexus/content/groups/public/org/apache/maven/shared/maven-shared-components/8/maven-shared-components-8.pom
Downloading from rcptt-releases: https://repo.eclipse.org/content/repositories/rcptt-releases/org/apache/maven/shared/maven-shared-components/8/maven-shared-components-8.pom
Downloading from eclipse.maven.central.mirror: https://repo.eclipse.org/content/repositories/maven_central/org/apache/maven/shared/maven-shared-components/8/maven-shared-components-8.pom
Progress (1): 2.7 kB
                    
Downloaded from eclipse.maven.central.mirror: https://repo.eclipse.org/content/repositories/maven_central/org/apache/maven/shared/maven-shared-components/8/maven-shared-components-8.pom (2.7 kB at 64 kB/s)
Downloading from eclipse-maven-releases: https://repo.eclipse.org/content/repositories/releases/org/apache/maven/maven-parent/7/maven-parent-7.pom
Downloading from jboss-public-repository-group: http://repository.jboss.org/nexus/content/groups/public/org/apache/maven/maven-parent/7/maven-parent-7.pom
Downloading from rcptt-releases: https://repo.eclipse.org/content/repositories/rcptt-releases/org/apache/maven/maven-parent/7/maven-parent-7.pom
Downloading from eclipse.maven.central.mirror: https://repo.eclipse.org/content/repositories/maven_central/org/apache/maven/maven-parent/7/maven-parent-7.pom
Progress (1): 4.1/21 kB
Progress (1): 7.7/21 kB
Progress (1): 12/21 kB 
Progress (1): 16/21 kB
Progress (1): 20/21 kB
Progress (1): 21 kB   
                   
Downloaded from eclipse.maven.central.mirror: https://repo.eclipse.org/content/repositories/maven_central/org/apache/maven/maven-parent/7/maven-parent-7.pom (21 kB at 733 kB/s)
Downloading from eclipse-maven-releases: https://repo.eclipse.org/content/repositories/releases/org/apache/maven/shared/maven-filtering/1.3/maven-filtering-1.3.pom
Downloading from jboss-public-repository-group: http://repository.jboss.org/nexus/content/groups/public/org/apache/maven/shared/maven-filtering/1.3/maven-filtering-1.3.pom
Downloading from rcptt-releases: https://repo.eclipse.org/content/repositories/rcptt-releases/org/apache/maven/shared/maven-filtering/1.3/maven-filtering-1.3.pom
Downloading from eclipse.maven.central.mirror: https://repo.eclipse.org/content/repositories/maven_central/org/apache/maven/shared/maven-filtering/1.3/maven-filtering-1.3.pom
Progress (1): 4.1/6.2 kB
Progress (1): 6.2 kB    
                    
Downloaded from eclipse.maven.central.mirror: https://repo.eclipse.org/content/repositories/maven_central/org/apache/maven/shared/maven-filtering/1.3/maven-filtering-1.3.pom (6.2 kB at 248 kB/s)
Downloading from eclipse-maven-releases: https://repo.eclipse.org/content/repositories/releases/org/apache/maven/shared/maven-shared-components/20/maven-shared-components-20.pom
Downloading from jboss-public-repository-group: http://repository.jboss.org/nexus/content/groups/public/org/apache/maven/shared/maven-shared-components/20/maven-shared-components-20.pom
Downloading from rcptt-releases: https://repo.eclipse.org/content/repositories/rcptt-releases/org/apache/maven/shared/maven-shared-components/20/maven-shared-components-20.pom
Downloading from eclipse.maven.central.mirror: https://repo.eclipse.org/content/repositories/maven_central/org/apache/maven/shared/maven-shared-components/20/maven-shared-components-20.pom
Progress (1): 4.1/5.1 kB
Progress (1): 5.1 kB    
                    
Downloaded from eclipse.maven.central.mirror: https://repo.eclipse.org/content/repositories/maven_central/org/apache/maven/shared/maven-shared-components/20/maven-shared-components-20.pom (5.1 kB at 189 kB/s)
Downloading from eclipse-maven-releases: https://repo.eclipse.org/content/repositories/releases/org/apache/maven/shared/maven-shared-utils/0.6/maven-shared-utils-0.6.pom
Downloading from jboss-public-repository-group: http://repository.jboss.org/nexus/content/groups/public/org/apache/maven/shared/maven-shared-utils/0.6/maven-shared-utils-0.6.pom
Downloading from rcptt-releases: https://repo.eclipse.org/content/repositories/rcptt-releases/org/apache/maven/shared/maven-shared-utils/0.6/maven-shared-utils-0.6.pom
Downloading from eclipse.maven.central.mirror: https://repo.eclipse.org/content/repositories/maven_central/org/apache/maven/shared/maven-shared-utils/0.6/maven-shared-utils-0.6.pom
Progress (1): 4.1/4.9 kB
Progress (1): 4.9 kB    
                    
Downloaded from eclipse.maven.central.mirror: https://repo.eclipse.org/content/repositories/maven_central/org/apache/maven/shared/maven-shared-utils/0.6/maven-shared-utils-0.6.pom (4.9 kB at 148 kB/s)
Downloading from eclipse-maven-releases: https://repo.eclipse.org/content/repositories/releases/org/codehaus/plexus/plexus-utils/3.0.18/plexus-utils-3.0.18.pom
Downloading from jboss-public-repository-group: http://repository.jboss.org/nexus/content/groups/public/org/codehaus/plexus/plexus-utils/3.0.18/plexus-utils-3.0.18.pom
Downloading from rcptt-releases: https://repo.eclipse.org/content/repositories/rcptt-releases/org/codehaus/plexus/plexus-utils/3.0.18/plexus-utils-3.0.18.pom
Downloading from eclipse.maven.central.mirror: https://repo.eclipse.org/content/repositories/maven_central/org/codehaus/plexus/plexus-utils/3.0.18/plexus-utils-3.0.18.pom
Progress (1): 3.4 kB
                    
Downloaded from eclipse.maven.central.mirror: https://repo.eclipse.org/content/repositories/maven_central/org/codehaus/plexus/plexus-utils/3.0.18/plexus-utils-3.0.18.pom (3.4 kB at 121 kB/s)
Downloading from eclipse-maven-releases: https://repo.eclipse.org/content/repositories/releases/org/codehaus/plexus/plexus-archiver/2.1/plexus-archiver-2.1.pom
Downloading from jboss-public-repository-group: http://repository.jboss.org/nexus/content/groups/public/org/codehaus/plexus/plexus-archiver/2.1/plexus-archiver-2.1.pom
Downloading from rcptt-releases: https://repo.eclipse.org/content/repositories/rcptt-releases/org/codehaus/plexus/plexus-archiver/2.1/plexus-archiver-2.1.pom
Downloading from eclipse.maven.central.mirror: https://repo.eclipse.org/content/repositories/maven_central/org/codehaus/plexus/plexus-archiver/2.1/plexus-archiver-2.1.pom
Progress (1): 2.8 kB
                    
Downloaded from eclipse.maven.central.mirror: https://repo.eclipse.org/content/repositories/maven_central/org/codehaus/plexus/plexus-archiver/2.1/plexus-archiver-2.1.pom (2.8 kB at 94 kB/s)
Downloading from eclipse-maven-releases: https://repo.eclipse.org/content/repositories/releases/org/codehaus/plexus/plexus-utils/3.0/plexus-utils-3.0.pom
Downloading from jboss-public-repository-group: http://repository.jboss.org/nexus/content/groups/public/org/codehaus/plexus/plexus-utils/3.0/plexus-utils-3.0.pom
Downloading from rcptt-releases: https://repo.eclipse.org/content/repositories/rcptt-releases/org/codehaus/plexus/plexus-utils/3.0/plexus-utils-3.0.pom
Downloading from eclipse.maven.central.mirror: https://repo.eclipse.org/content/repositories/maven_central/org/codehaus/plexus/plexus-utils/3.0/plexus-utils-3.0.pom
Progress (1): 4.1 kB
                    
Downloaded from eclipse.maven.central.mirror: https://repo.eclipse.org/content/repositories/maven_central/org/codehaus/plexus/plexus-utils/3.0/plexus-utils-3.0.pom (4.1 kB at 120 kB/s)
Downloading from eclipse-maven-releases: https://repo.eclipse.org/content/repositories/releases/org/codehaus/plexus/plexus-io/2.0.2/plexus-io-2.0.2.pom
Downloading from jboss-public-repository-group: http://repository.jboss.org/nexus/content/groups/public/org/codehaus/plexus/plexus-io/2.0.2/plexus-io-2.0.2.pom
Downloading from rcptt-releases: https://repo.eclipse.org/content/repositories/rcptt-releases/org/codehaus/plexus/plexus-io/2.0.2/plexus-io-2.0.2.pom
Downloading from eclipse.maven.central.mirror: https://repo.eclipse.org/content/repositories/maven_central/org/codehaus/plexus/plexus-io/2.0.2/plexus-io-2.0.2.pom
Progress (1): 1.7 kB
                    
Downloaded from eclipse.maven.central.mirror: https://repo.eclipse.org/content/repositories/maven_central/org/codehaus/plexus/plexus-io/2.0.2/plexus-io-2.0.2.pom (1.7 kB at 53 kB/s)
Downloading from eclipse-maven-releases: https://repo.eclipse.org/content/repositories/releases/org/codehaus/plexus/plexus-components/1.1.19/plexus-components-1.1.19.pom
Downloading from jboss-public-repository-group: http://repository.jboss.org/nexus/content/groups/public/org/codehaus/plexus/plexus-components/1.1.19/plexus-components-1.1.19.pom
Downloading from rcptt-releases: https://repo.eclipse.org/content/repositories/rcptt-releases/org/codehaus/plexus/plexus-components/1.1.19/plexus-components-1.1.19.pom
Downloading from eclipse.maven.central.mirror: https://repo.eclipse.org/content/repositories/maven_central/org/codehaus/plexus/plexus-components/1.1.19/plexus-components-1.1.19.pom
Progress (1): 2.7 kB
                    
Downloaded from eclipse.maven.central.mirror: https://repo.eclipse.org/content/repositories/maven_central/org/codehaus/plexus/plexus-components/1.1.19/plexus-components-1.1.19.pom (2.7 kB at 79 kB/s)
Downloading from eclipse-maven-releases: https://repo.eclipse.org/content/repositories/releases/org/codehaus/plexus/plexus-utils/3.0.21/plexus-utils-3.0.21.pom
Downloading from jboss-public-repository-group: http://repository.jboss.org/nexus/content/groups/public/org/codehaus/plexus/plexus-utils/3.0.21/plexus-utils-3.0.21.pom
Downloading from rcptt-releases: https://repo.eclipse.org/content/repositories/rcptt-releases/org/codehaus/plexus/plexus-utils/3.0.21/plexus-utils-3.0.21.pom
Downloading from eclipse.maven.central.mirror: https://repo.eclipse.org/content/repositories/maven_central/org/codehaus/plexus/plexus-utils/3.0.21/plexus-utils-3.0.21.pom
Progress (1): 3.8 kB
                    
Downloaded from eclipse.maven.central.mirror: https://repo.eclipse.org/content/repositories/maven_central/org/codehaus/plexus/plexus-utils/3.0.21/plexus-utils-3.0.21.pom (3.8 kB at 115 kB/s)
Downloading from eclipse-maven-releases: https://repo.eclipse.org/content/repositories/releases/org/apache/maven/shared/maven-repository-builder/1.0/maven-repository-builder-1.0.pom
Downloading from jboss-public-repository-group: http://repository.jboss.org/nexus/content/groups/public/org/apache/maven/shared/maven-repository-builder/1.0/maven-repository-builder-1.0.pom
Downloading from rcptt-releases: https://repo.eclipse.org/content/repositories/rcptt-releases/org/apache/maven/shared/maven-repository-builder/1.0/maven-repository-builder-1.0.pom
Downloading from eclipse.maven.central.mirror: https://repo.eclipse.org/content/repositories/maven_central/org/apache/maven/shared/maven-repository-builder/1.0/maven-repository-builder-1.0.pom
Progress (1): 4.1/4.6 kB
Progress (1): 4.6 kB    
                    
Downloaded from eclipse.maven.central.mirror: https://repo.eclipse.org/content/repositories/maven_central/org/apache/maven/shared/maven-repository-builder/1.0/maven-repository-builder-1.0.pom (4.6 kB at 108 kB/s)
Downloading from eclipse-maven-releases: https://repo.eclipse.org/content/repositories/releases/org/apache/maven/maven-artifact/2.0.4/maven-artifact-2.0.4.pom
Downloading from jboss-public-repository-group: http://repository.jboss.org/nexus/content/groups/public/org/apache/maven/maven-artifact/2.0.4/maven-artifact-2.0.4.pom
Downloading from rcptt-releases: https://repo.eclipse.org/content/repositories/rcptt-releases/org/apache/maven/maven-artifact/2.0.4/maven-artifact-2.0.4.pom
Downloading from eclipse.maven.central.mirror: https://repo.eclipse.org/content/repositories/maven_central/org/apache/maven/maven-artifact/2.0.4/maven-artifact-2.0.4.pom
Progress (1): 765 B
                   
Downloaded from eclipse.maven.central.mirror: https://repo.eclipse.org/content/repositories/maven_central/org/apache/maven/maven-artifact/2.0.4/maven-artifact-2.0.4.pom (765 B at 22 kB/s)
Downloading from eclipse-maven-releases: https://repo.eclipse.org/content/repositories/releases/org/apache/maven/maven/2.0.4/maven-2.0.4.pom
Downloading from jboss-public-repository-group: http://repository.jboss.org/nexus/content/groups/public/org/apache/maven/maven/2.0.4/maven-2.0.4.pom
Downloading from rcptt-releases: https://repo.eclipse.org/content/repositories/rcptt-releases/org/apache/maven/maven/2.0.4/maven-2.0.4.pom
Downloading from eclipse.maven.central.mirror: https://repo.eclipse.org/content/repositories/maven_central/org/apache/maven/maven/2.0.4/maven-2.0.4.pom
Progress (1): 4.1/12 kB
Progress (1): 7.7/12 kB
Progress (1): 12/12 kB 
Progress (1): 12 kB   
                   
Downloaded from eclipse.maven.central.mirror: https://repo.eclipse.org/content/repositories/maven_central/org/apache/maven/maven/2.0.4/maven-2.0.4.pom (12 kB at 380 kB/s)
Downloading from eclipse-maven-releases: https://repo.eclipse.org/content/repositories/releases/org/apache/maven/maven-artifact-manager/2.0.4/maven-artifact-manager-2.0.4.pom
Downloading from jboss-public-repository-group: http://repository.jboss.org/nexus/content/groups/public/org/apache/maven/maven-artifact-manager/2.0.4/maven-artifact-manager-2.0.4.pom
Downloading from rcptt-releases: https://repo.eclipse.org/content/repositories/rcptt-releases/org/apache/maven/maven-artifact-manager/2.0.4/maven-artifact-manager-2.0.4.pom
Downloading from eclipse.maven.central.mirror: https://repo.eclipse.org/content/repositories/maven_central/org/apache/maven/maven-artifact-manager/2.0.4/maven-artifact-manager-2.0.4.pom
Progress (1): 1.4 kB
                    
Downloaded from eclipse.maven.central.mirror: https://repo.eclipse.org/content/repositories/maven_central/org/apache/maven/maven-artifact-manager/2.0.4/maven-artifact-manager-2.0.4.pom (1.4 kB at 37 kB/s)
Downloading from eclipse-maven-releases: https://repo.eclipse.org/content/repositories/releases/org/apache/maven/maven-repository-metadata/2.0.4/maven-repository-metadata-2.0.4.pom
Downloading from jboss-public-repository-group: http://repository.jboss.org/nexus/content/groups/public/org/apache/maven/maven-repository-metadata/2.0.4/maven-repository-metadata-2.0.4.pom
Downloading from rcptt-releases: https://repo.eclipse.org/content/repositories/rcptt-releases/org/apache/maven/maven-repository-metadata/2.0.4/maven-repository-metadata-2.0.4.pom
Downloading from eclipse.maven.central.mirror: https://repo.eclipse.org/content/repositories/maven_central/org/apache/maven/maven-repository-metadata/2.0.4/maven-repository-metadata-2.0.4.pom
Progress (1): 1.5 kB
                    
Downloaded from eclipse.maven.central.mirror: https://repo.eclipse.org/content/repositories/maven_central/org/apache/maven/maven-repository-metadata/2.0.4/maven-repository-metadata-2.0.4.pom (1.5 kB at 48 kB/s)
Downloading from eclipse-maven-releases: https://repo.eclipse.org/content/repositories/releases/org/apache/maven/maven-project/2.0.4/maven-project-2.0.4.pom
Downloading from jboss-public-repository-group: http://repository.jboss.org/nexus/content/groups/public/org/apache/maven/maven-project/2.0.4/maven-project-2.0.4.pom
Downloading from rcptt-releases: https://repo.eclipse.org/content/repositories/rcptt-releases/org/apache/maven/maven-project/2.0.4/maven-project-2.0.4.pom
Downloading from eclipse.maven.central.mirror: https://repo.eclipse.org/content/repositories/maven_central/org/apache/maven/maven-project/2.0.4/maven-project-2.0.4.pom
Progress (1): 1.8 kB
                    
Downloaded from eclipse.maven.central.mirror: https://repo.eclipse.org/content/repositories/maven_central/org/apache/maven/maven-project/2.0.4/maven-project-2.0.4.pom (1.8 kB at 54 kB/s)
Downloading from eclipse-maven-releases: https://repo.eclipse.org/content/repositories/releases/org/apache/maven/maven-settings/2.0.4/maven-settings-2.0.4.pom
Downloading from jboss-public-repository-group: http://repository.jboss.org/nexus/content/groups/public/org/apache/maven/maven-settings/2.0.4/maven-settings-2.0.4.pom
Downloading from rcptt-releases: https://repo.eclipse.org/content/repositories/rcptt-releases/org/apache/maven/maven-settings/2.0.4/maven-settings-2.0.4.pom
Downloading from eclipse.maven.central.mirror: https://repo.eclipse.org/content/repositories/maven_central/org/apache/maven/maven-settings/2.0.4/maven-settings-2.0.4.pom
Progress (1): 1.6 kB
                    
Downloaded from eclipse.maven.central.mirror: https://repo.eclipse.org/content/repositories/maven_central/org/apache/maven/maven-settings/2.0.4/maven-settings-2.0.4.pom (1.6 kB at 51 kB/s)
Downloading from eclipse-maven-releases: https://repo.eclipse.org/content/repositories/releases/org/apache/maven/maven-model/2.0.4/maven-model-2.0.4.pom
Downloading from jboss-public-repository-group: http://repository.jboss.org/nexus/content/groups/public/org/apache/maven/maven-model/2.0.4/maven-model-2.0.4.pom
Downloading from rcptt-releases: https://repo.eclipse.org/content/repositories/rcptt-releases/org/apache/maven/maven-model/2.0.4/maven-model-2.0.4.pom
Downloading from eclipse.maven.central.mirror: https://repo.eclipse.org/content/repositories/maven_central/org/apache/maven/maven-model/2.0.4/maven-model-2.0.4.pom
Progress (1): 2.7 kB
                    
Downloaded from eclipse.maven.central.mirror: https://repo.eclipse.org/content/repositories/maven_central/org/apache/maven/maven-model/2.0.4/maven-model-2.0.4.pom (2.7 kB at 85 kB/s)
Downloading from eclipse-maven-releases: https://repo.eclipse.org/content/repositories/releases/org/apache/maven/maven-profile/2.0.4/maven-profile-2.0.4.pom
Downloading from jboss-public-repository-group: http://repository.jboss.org/nexus/content/groups/public/org/apache/maven/maven-profile/2.0.4/maven-profile-2.0.4.pom
Downloading from rcptt-releases: https://repo.eclipse.org/content/repositories/rcptt-releases/org/apache/maven/maven-profile/2.0.4/maven-profile-2.0.4.pom
Downloading from eclipse.maven.central.mirror: https://repo.eclipse.org/content/repositories/maven_central/org/apache/maven/maven-profile/2.0.4/maven-profile-2.0.4.pom
Progress (1): 1.6 kB
                    
Downloaded from eclipse.maven.central.mirror: https://repo.eclipse.org/content/repositories/maven_central/org/apache/maven/maven-profile/2.0.4/maven-profile-2.0.4.pom (1.6 kB at 48 kB/s)
Downloading from eclipse-maven-releases: https://repo.eclipse.org/content/repositories/releases/commons-codec/commons-codec/1.6/commons-codec-1.6.pom
Downloading from jboss-public-repository-group: http://repository.jboss.org/nexus/content/groups/public/commons-codec/commons-codec/1.6/commons-codec-1.6.pom
Downloading from rcptt-releases: https://repo.eclipse.org/content/repositories/rcptt-releases/commons-codec/commons-codec/1.6/commons-codec-1.6.pom
Downloading from eclipse.maven.central.mirror: https://repo.eclipse.org/content/repositories/maven_central/commons-codec/commons-codec/1.6/commons-codec-1.6.pom
Progress (1): 4.1/11 kB
Progress (1): 7.7/11 kB
Progress (1): 11 kB    
                   
Downloaded from eclipse.maven.central.mirror: https://repo.eclipse.org/content/repositories/maven_central/commons-codec/commons-codec/1.6/commons-codec-1.6.pom (11 kB at 40 kB/s)
Downloading from eclipse-maven-releases: https://repo.eclipse.org/content/repositories/releases/org/eclipse/papyrus/tools/org.eclipse.papyrus.tools.assemblies/0.0.1/org.eclipse.papyrus.tools.assemblies-0.0.1.jar
Downloading from eclipse-maven-releases: https://repo.eclipse.org/content/repositories/releases/org/apache/maven/shared/maven-common-artifact-filters/1.4/maven-common-artifact-filters-1.4.jar
Downloading from eclipse-maven-releases: https://repo.eclipse.org/content/repositories/releases/org/iq80/snappy/snappy/0.3/snappy-0.3.jar
Downloading from eclipse-maven-releases: https://repo.eclipse.org/content/repositories/releases/org/codehaus/plexus/plexus-archiver/3.0.1/plexus-archiver-3.0.1.jar
Downloading from eclipse-maven-releases: https://repo.eclipse.org/content/repositories/releases/org/codehaus/plexus/plexus-interpolation/1.22/plexus-interpolation-1.22.jar
Downloading from eclipse-maven-releases: https://repo.eclipse.org/content/repositories/releases/org/apache/maven/shared/file-management/1.1/file-management-1.1.jar
Downloading from eclipse-maven-releases: https://repo.eclipse.org/content/repositories/releases/org/apache/maven/shared/maven-shared-io/1.1/maven-shared-io-1.1.jar
Downloading from eclipse-maven-releases: https://repo.eclipse.org/content/repositories/releases/org/apache/maven/wagon/wagon-provider-api/1.0-alpha-6/wagon-provider-api-1.0-alpha-6.jar
Downloading from eclipse-maven-releases: https://repo.eclipse.org/content/repositories/releases/org/apache/maven/shared/maven-filtering/1.3/maven-filtering-1.3.jar
Downloading from eclipse-maven-releases: https://repo.eclipse.org/content/repositories/releases/org/apache/maven/shared/maven-shared-utils/0.6/maven-shared-utils-0.6.jar
Downloading from eclipse-maven-releases: https://repo.eclipse.org/content/repositories/releases/org/codehaus/plexus/plexus-io/2.6/plexus-io-2.6.jar
Downloading from eclipse-maven-releases: https://repo.eclipse.org/content/repositories/releases/org/codehaus/plexus/plexus-utils/3.0.21/plexus-utils-3.0.21.jar
Downloading from eclipse-maven-releases: https://repo.eclipse.org/content/repositories/releases/org/apache/maven/shared/maven-repository-builder/1.0/maven-repository-builder-1.0.jar
Downloading from eclipse-maven-releases: https://repo.eclipse.org/content/repositories/releases/commons-codec/commons-codec/1.6/commons-codec-1.6.jar
Progress (1): 2.8 kB
                    
Downloaded from eclipse-maven-releases: https://repo.eclipse.org/content/repositories/releases/org/eclipse/papyrus/tools/org.eclipse.papyrus.tools.assemblies/0.0.1/org.eclipse.papyrus.tools.assemblies-0.0.1.jar (2.8 kB at 8.6 kB/s)
Downloading from jboss-public-repository-group: http://repository.jboss.org/nexus/content/groups/public/org/apache/maven/shared/maven-common-artifact-filters/1.4/maven-common-artifact-filters-1.4.jar
Downloading from jboss-public-repository-group: http://repository.jboss.org/nexus/content/groups/public/org/codehaus/plexus/plexus-archiver/3.0.1/plexus-archiver-3.0.1.jar
Downloading from jboss-public-repository-group: http://repository.jboss.org/nexus/content/groups/public/org/apache/maven/shared/file-management/1.1/file-management-1.1.jar
Downloading from jboss-public-repository-group: http://repository.jboss.org/nexus/content/groups/public/org/iq80/snappy/snappy/0.3/snappy-0.3.jar
Downloading from jboss-public-repository-group: http://repository.jboss.org/nexus/content/groups/public/org/codehaus/plexus/plexus-interpolation/1.22/plexus-interpolation-1.22.jar
Downloading from jboss-public-repository-group: http://repository.jboss.org/nexus/content/groups/public/org/apache/maven/shared/maven-shared-io/1.1/maven-shared-io-1.1.jar
Downloading from jboss-public-repository-group: http://repository.jboss.org/nexus/content/groups/public/org/apache/maven/wagon/wagon-provider-api/1.0-alpha-6/wagon-provider-api-1.0-alpha-6.jar
Downloading from jboss-public-repository-group: http://repository.jboss.org/nexus/content/groups/public/org/apache/maven/shared/maven-filtering/1.3/maven-filtering-1.3.jar
Downloading from jboss-public-repository-group: http://repository.jboss.org/nexus/content/groups/public/org/apache/maven/shared/maven-shared-utils/0.6/maven-shared-utils-0.6.jar
Downloading from jboss-public-repository-group: http://repository.jboss.org/nexus/content/groups/public/org/codehaus/plexus/plexus-io/2.6/plexus-io-2.6.jar
Downloading from jboss-public-repository-group: http://repository.jboss.org/nexus/content/groups/public/org/codehaus/plexus/plexus-utils/3.0.21/plexus-utils-3.0.21.jar
Downloading from jboss-public-repository-group: http://repository.jboss.org/nexus/content/groups/public/org/apache/maven/shared/maven-repository-builder/1.0/maven-repository-builder-1.0.jar
Downloading from jboss-public-repository-group: http://repository.jboss.org/nexus/content/groups/public/commons-codec/commons-codec/1.6/commons-codec-1.6.jar
Downloading from rcptt-releases: https://repo.eclipse.org/content/repositories/rcptt-releases/org/apache/maven/shared/maven-common-artifact-filters/1.4/maven-common-artifact-filters-1.4.jar
Downloading from rcptt-releases: https://repo.eclipse.org/content/repositories/rcptt-releases/org/codehaus/plexus/plexus-interpolation/1.22/plexus-interpolation-1.22.jar
Downloading from rcptt-releases: https://repo.eclipse.org/content/repositories/rcptt-releases/org/apache/maven/shared/file-management/1.1/file-management-1.1.jar
Downloading from rcptt-releases: https://repo.eclipse.org/content/repositories/rcptt-releases/org/codehaus/plexus/plexus-archiver/3.0.1/plexus-archiver-3.0.1.jar
Downloading from rcptt-releases: https://repo.eclipse.org/content/repositories/rcptt-releases/org/iq80/snappy/snappy/0.3/snappy-0.3.jar
Downloading from rcptt-releases: https://repo.eclipse.org/content/repositories/rcptt-releases/org/apache/maven/shared/maven-shared-io/1.1/maven-shared-io-1.1.jar
Downloading from rcptt-releases: https://repo.eclipse.org/content/repositories/rcptt-releases/org/apache/maven/wagon/wagon-provider-api/1.0-alpha-6/wagon-provider-api-1.0-alpha-6.jar
Downloading from rcptt-releases: https://repo.eclipse.org/content/repositories/rcptt-releases/org/apache/maven/shared/maven-filtering/1.3/maven-filtering-1.3.jar
Downloading from rcptt-releases: https://repo.eclipse.org/content/repositories/rcptt-releases/org/apache/maven/shared/maven-shared-utils/0.6/maven-shared-utils-0.6.jar
Downloading from rcptt-releases: https://repo.eclipse.org/content/repositories/rcptt-releases/org/codehaus/plexus/plexus-io/2.6/plexus-io-2.6.jar
Downloading from rcptt-releases: https://repo.eclipse.org/content/repositories/rcptt-releases/org/codehaus/plexus/plexus-utils/3.0.21/plexus-utils-3.0.21.jar
Downloading from rcptt-releases: https://repo.eclipse.org/content/repositories/rcptt-releases/org/apache/maven/shared/maven-repository-builder/1.0/maven-repository-builder-1.0.jar
Downloading from rcptt-releases: https://repo.eclipse.org/content/repositories/rcptt-releases/commons-codec/commons-codec/1.6/commons-codec-1.6.jar
Downloading from eclipse.maven.central.mirror: https://repo.eclipse.org/content/repositories/maven_central/org/apache/maven/shared/maven-common-artifact-filters/1.4/maven-common-artifact-filters-1.4.jar
Downloading from eclipse.maven.central.mirror: https://repo.eclipse.org/content/repositories/maven_central/org/apache/maven/shared/file-management/1.1/file-management-1.1.jar
Downloading from eclipse.maven.central.mirror: https://repo.eclipse.org/content/repositories/maven_central/org/iq80/snappy/snappy/0.3/snappy-0.3.jar
Downloading from eclipse.maven.central.mirror: https://repo.eclipse.org/content/repositories/maven_central/org/codehaus/plexus/plexus-archiver/3.0.1/plexus-archiver-3.0.1.jar
Downloading from eclipse.maven.central.mirror: https://repo.eclipse.org/content/repositories/maven_central/org/codehaus/plexus/plexus-interpolation/1.22/plexus-interpolation-1.22.jar
Progress (1): 4.1/381 kB
Progress (1): 7.7/381 kB
Progress (1): 12/381 kB 
Progress (1): 16/381 kB
Progress (1): 20/381 kB
Progress (1): 24/381 kB
Progress (2): 24/381 kB | 4.1/31 kB
Progress (2): 28/381 kB | 4.1/31 kB
Progress (2): 28/381 kB | 7.7/31 kB
Progress (2): 32/381 kB | 7.7/31 kB
Progress (2): 32/381 kB | 12/31 kB 
Progress (2): 36/381 kB | 12/31 kB
Progress (2): 36/381 kB | 16/31 kB
Progress (2): 40/381 kB | 16/31 kB
Progress (2): 40/381 kB | 20/31 kB
Progress (2): 44/381 kB | 20/31 kB
Progress (2): 44/381 kB | 24/31 kB
Progress (2): 48/381 kB | 24/31 kB
Progress (2): 48/381 kB | 28/31 kB
Progress (2): 52/381 kB | 28/31 kB
Progress (2): 52/381 kB | 31 kB   
Progress (2): 56/381 kB | 31 kB
Progress (2): 60/381 kB | 31 kB
Progress (2): 64/381 kB | 31 kB
Progress (2): 68/381 kB | 31 kB
Progress (2): 72/381 kB | 31 kB
Progress (2): 76/381 kB | 31 kB
Progress (2): 80/381 kB | 31 kB
Progress (2): 84/381 kB | 31 kB
Progress (2): 88/381 kB | 31 kB
Progress (3): 88/381 kB | 31 kB | 4.1/49 kB
Progress (3): 88/381 kB | 31 kB | 7.7/49 kB
Progress (3): 88/381 kB | 31 kB | 12/49 kB 
Progress (3): 88/381 kB | 31 kB | 16/49 kB
Progress (3): 88/381 kB | 31 kB | 20/49 kB
Progress (3): 88/381 kB | 31 kB | 24/49 kB
Progress (3): 88/381 kB | 31 kB | 28/49 kB
Progress (3): 88/381 kB | 31 kB | 32/49 kB
Progress (3): 88/381 kB | 31 kB | 36/49 kB
Progress (3): 88/381 kB | 31 kB | 40/49 kB
Progress (3): 88/381 kB | 31 kB | 44/49 kB
Progress (3): 88/381 kB | 31 kB | 48/49 kB
Progress (3): 88/381 kB | 31 kB | 49 kB   
                                       
Downloaded from eclipse.maven.central.mirror: https://repo.eclipse.org/content/repositories/maven_central/org/apache/maven/shared/file-management/1.1/file-management-1.1.jar (31 kB at 663 kB/s)
Downloading from eclipse.maven.central.mirror: https://repo.eclipse.org/content/repositories/maven_central/org/apache/maven/shared/maven-shared-io/1.1/maven-shared-io-1.1.jar
Downloaded from eclipse.maven.central.mirror: https://repo.eclipse.org/content/repositories/maven_central/org/iq80/snappy/snappy/0.3/snappy-0.3.jar (49 kB at 956 kB/s)
Downloading from eclipse.maven.central.mirror: https://repo.eclipse.org/content/repositories/maven_central/org/apache/maven/wagon/wagon-provider-api/1.0-alpha-6/wagon-provider-api-1.0-alpha-6.jar
Progress (2): 88/381 kB | 4.1/32 kB
Progress (2): 88/381 kB | 7.7/32 kB
Progress (3): 88/381 kB | 7.7/32 kB | 4.1/77 kB
Progress (3): 88/381 kB | 12/32 kB | 4.1/77 kB 
Progress (3): 88/381 kB | 12/32 kB | 7.7/77 kB
Progress (3): 88/381 kB | 16/32 kB | 7.7/77 kB
Progress (3): 88/381 kB | 20/32 kB | 7.7/77 kB
Progress (3): 88/381 kB | 20/32 kB | 12/77 kB 
Progress (3): 88/381 kB | 24/32 kB | 12/77 kB
Progress (3): 88/381 kB | 24/32 kB | 16/77 kB
Progress (3): 88/381 kB | 28/32 kB | 16/77 kB
Progress (3): 88/381 kB | 32 kB | 16/77 kB   
Progress (3): 88/381 kB | 32 kB | 20/77 kB
Progress (3): 88/381 kB | 32 kB | 24/77 kB
Progress (3): 88/381 kB | 32 kB | 28/77 kB
Progress (3): 88/381 kB | 32 kB | 32/77 kB
Progress (3): 88/381 kB | 32 kB | 36/77 kB
Progress (3): 88/381 kB | 32 kB | 40/77 kB
Progress (3): 88/381 kB | 32 kB | 44/77 kB
Progress (4): 88/381 kB | 32 kB | 44/77 kB | 4.1/39 kB
Progress (4): 88/381 kB | 32 kB | 48/77 kB | 4.1/39 kB
Progress (4): 88/381 kB | 32 kB | 48/77 kB | 7.7/39 kB
Progress (4): 88/381 kB | 32 kB | 52/77 kB | 7.7/39 kB
Progress (4): 88/381 kB | 32 kB | 52/77 kB | 12/39 kB 
Progress (4): 88/381 kB | 32 kB | 56/77 kB | 12/39 kB
Progress (4): 88/381 kB | 32 kB | 56/77 kB | 16/39 kB
Progress (4): 88/381 kB | 32 kB | 60/77 kB | 16/39 kB
Progress (4): 88/381 kB | 32 kB | 60/77 kB | 20/39 kB
Progress (4): 88/381 kB | 32 kB | 64/77 kB | 20/39 kB
Progress (4): 88/381 kB | 32 kB | 64/77 kB | 24/39 kB
Progress (4): 88/381 kB | 32 kB | 68/77 kB | 24/39 kB
Progress (4): 88/381 kB | 32 kB | 68/77 kB | 28/39 kB
Progress (4): 88/381 kB | 32 kB | 72/77 kB | 28/39 kB
Progress (4): 88/381 kB | 32 kB | 72/77 kB | 32/39 kB
Progress (4): 88/381 kB | 32 kB | 76/77 kB | 32/39 kB
Progress (4): 88/381 kB | 32 kB | 77 kB | 32/39 kB   
Progress (4): 88/381 kB | 32 kB | 77 kB | 36/39 kB
Progress (4): 88/381 kB | 32 kB | 77 kB | 39 kB   
                                               
Downloaded from eclipse.maven.central.mirror: https://repo.eclipse.org/content/repositories/maven_central/org/apache/maven/shared/maven-common-artifact-filters/1.4/maven-common-artifact-filters-1.4.jar (32 kB at 545 kB/s)
Downloading from eclipse.maven.central.mirror: https://repo.eclipse.org/content/repositories/maven_central/org/apache/maven/shared/maven-filtering/1.3/maven-filtering-1.3.jar
Progress (4): 88/381 kB | 77 kB | 39 kB | 4.1/43 kB
Progress (4): 88/381 kB | 77 kB | 39 kB | 7.7/43 kB
Progress (4): 88/381 kB | 77 kB | 39 kB | 12/43 kB 
Progress (4): 88/381 kB | 77 kB | 39 kB | 16/43 kB
Progress (4): 88/381 kB | 77 kB | 39 kB | 20/43 kB
Progress (4): 88/381 kB | 77 kB | 39 kB | 24/43 kB
Progress (4): 88/381 kB | 77 kB | 39 kB | 28/43 kB
Progress (4): 88/381 kB | 77 kB | 39 kB | 32/43 kB
Progress (4): 88/381 kB | 77 kB | 39 kB | 36/43 kB
Progress (4): 88/381 kB | 77 kB | 39 kB | 40/43 kB
Progress (4): 88/381 kB | 77 kB | 39 kB | 43 kB   
Progress (5): 88/381 kB | 77 kB | 39 kB | 43 kB | 4.1/51 kB
Progress (5): 88/381 kB | 77 kB | 39 kB | 43 kB | 7.7/51 kB
Progress (5): 88/381 kB | 77 kB | 39 kB | 43 kB | 12/51 kB 
                                                          
Downloaded from eclipse.maven.central.mirror: https://repo.eclipse.org/content/repositories/maven_central/org/codehaus/plexus/plexus-interpolation/1.22/plexus-interpolation-1.22.jar (77 kB at 1.1 MB/s)
Progress (4): 88/381 kB | 39 kB | 43 kB | 16/51 kB
                                                  
Downloading from eclipse.maven.central.mirror: https://repo.eclipse.org/content/repositories/maven_central/org/apache/maven/shared/maven-shared-utils/0.6/maven-shared-utils-0.6.jar
Progress (4): 88/381 kB | 39 kB | 43 kB | 20/51 kB
Progress (4): 88/381 kB | 39 kB | 43 kB | 24/51 kB
                                                  
Downloaded from eclipse.maven.central.mirror: https://repo.eclipse.org/content/repositories/maven_central/org/apache/maven/wagon/wagon-provider-api/1.0-alpha-6/wagon-provider-api-1.0-alpha-6.jar (43 kB at 638 kB/s)
Progress (3): 88/381 kB | 39 kB | 28/51 kB
                                          
Downloading from eclipse.maven.central.mirror: https://repo.eclipse.org/content/repositories/maven_central/org/codehaus/plexus/plexus-io/2.6/plexus-io-2.6.jar
Progress (3): 88/381 kB | 39 kB | 32/51 kB
Progress (3): 88/381 kB | 39 kB | 36/51 kB
Progress (3): 88/381 kB | 39 kB | 40/51 kB
Progress (3): 88/381 kB | 39 kB | 44/51 kB
Progress (3): 88/381 kB | 39 kB | 48/51 kB
Progress (3): 88/381 kB | 39 kB | 49/51 kB
Progress (3): 88/381 kB | 39 kB | 51 kB   
                                       
Downloaded from eclipse.maven.central.mirror: https://repo.eclipse.org/content/repositories/maven_central/org/apache/maven/shared/maven-shared-io/1.1/maven-shared-io-1.1.jar (39 kB at 556 kB/s)
Downloading from eclipse.maven.central.mirror: https://repo.eclipse.org/content/repositories/maven_central/org/codehaus/plexus/plexus-utils/3.0.21/plexus-utils-3.0.21.jar
Progress (3): 88/381 kB | 51 kB | 4.1/165 kB
Progress (3): 88/381 kB | 51 kB | 7.7/165 kB
Progress (3): 88/381 kB | 51 kB | 12/165 kB 
Progress (3): 88/381 kB | 51 kB | 16/165 kB
Progress (3): 88/381 kB | 51 kB | 20/165 kB
Progress (3): 88/381 kB | 51 kB | 24/165 kB
Progress (3): 88/381 kB | 51 kB | 28/165 kB
Progress (3): 88/381 kB | 51 kB | 32/165 kB
Progress (3): 88/381 kB | 51 kB | 33/165 kB
Progress (4): 88/381 kB | 51 kB | 33/165 kB | 4.1/84 kB
Progress (4): 88/381 kB | 51 kB | 37/165 kB | 4.1/84 kB
Progress (4): 88/381 kB | 51 kB | 37/165 kB | 7.7/84 kB
Progress (4): 88/381 kB | 51 kB | 41/165 kB | 7.7/84 kB
Progress (4): 88/381 kB | 51 kB | 41/165 kB | 12/84 kB 
Progress (4): 88/381 kB | 51 kB | 41/165 kB | 16/84 kB
Progress (4): 88/381 kB | 51 kB | 45/165 kB | 16/84 kB
Progress (4): 88/381 kB | 51 kB | 45/165 kB | 20/84 kB
Progress (4): 88/381 kB | 51 kB | 49/165 kB | 20/84 kB
Progress (4): 88/381 kB | 51 kB | 49/165 kB | 24/84 kB
Progress (4): 88/381 kB | 51 kB | 49/165 kB | 28/84 kB
Progress (4): 88/381 kB | 51 kB | 53/165 kB | 28/84 kB
Progress (4): 88/381 kB | 51 kB | 53/165 kB | 32/84 kB
Progress (4): 88/381 kB | 51 kB | 57/165 kB | 32/84 kB
Progress (4): 88/381 kB | 51 kB | 57/165 kB | 33/84 kB
Progress (4): 88/381 kB | 51 kB | 57/165 kB | 37/84 kB
Progress (4): 88/381 kB | 51 kB | 61/165 kB | 37/84 kB
Progress (4): 88/381 kB | 51 kB | 61/165 kB | 41/84 kB
Progress (4): 88/381 kB | 51 kB | 65/165 kB | 41/84 kB
Progress (4): 88/381 kB | 51 kB | 65/165 kB | 45/84 kB
Progress (4): 88/381 kB | 51 kB | 66/165 kB | 45/84 kB
Progress (4): 88/381 kB | 51 kB | 66/165 kB | 49/84 kB
Progress (4): 88/381 kB | 51 kB | 66/165 kB | 53/84 kB
Progress (4): 88/381 kB | 51 kB | 70/165 kB | 53/84 kB
Progress (4): 88/381 kB | 51 kB | 70/165 kB | 57/84 kB
Progress (4): 88/381 kB | 51 kB | 74/165 kB | 57/84 kB
Progress (4): 88/381 kB | 51 kB | 74/165 kB | 61/84 kB
Progress (4): 88/381 kB | 51 kB | 74/165 kB | 65/84 kB
Progress (4): 88/381 kB | 51 kB | 78/165 kB | 65/84 kB
Progress (5): 88/381 kB | 51 kB | 78/165 kB | 65/84 kB | 4.1/245 kB
Progress (5): 88/381 kB | 51 kB | 82/165 kB | 65/84 kB | 4.1/245 kB
Progress (5): 88/381 kB | 51 kB | 82/165 kB | 65/84 kB | 7.7/245 kB
Progress (5): 88/381 kB | 51 kB | 82/165 kB | 69/84 kB | 7.7/245 kB
Progress (5): 88/381 kB | 51 kB | 82/165 kB | 73/84 kB | 7.7/245 kB
Progress (5): 88/381 kB | 51 kB | 86/165 kB | 73/84 kB | 7.7/245 kB
Progress (5): 88/381 kB | 51 kB | 86/165 kB | 73/84 kB | 12/245 kB 
Progress (5): 88/381 kB | 51 kB | 90/165 kB | 73/84 kB | 12/245 kB
Progress (5): 88/381 kB | 51 kB | 90/165 kB | 77/84 kB | 12/245 kB
Progress (5): 88/381 kB | 51 kB | 90/165 kB | 77/84 kB | 16/245 kB
Progress (5): 88/381 kB | 51 kB | 90/165 kB | 81/84 kB | 16/245 kB
Progress (5): 88/381 kB | 51 kB | 94/165 kB | 81/84 kB | 16/245 kB
Progress (5): 88/381 kB | 51 kB | 94/165 kB | 81/84 kB | 20/245 kB
Progress (5): 88/381 kB | 51 kB | 94/165 kB | 84 kB | 20/245 kB   
Progress (5): 88/381 kB | 51 kB | 94/165 kB | 84 kB | 24/245 kB
Progress (5): 88/381 kB | 51 kB | 98/165 kB | 84 kB | 24/245 kB
Progress (5): 88/381 kB | 51 kB | 98/165 kB | 84 kB | 28/245 kB
Progress (5): 88/381 kB | 51 kB | 98/165 kB | 84 kB | 32/245 kB
Progress (5): 88/381 kB | 51 kB | 98/165 kB | 84 kB | 33/245 kB
Progress (5): 88/381 kB | 51 kB | 102/165 kB | 84 kB | 33/245 kB
Progress (5): 88/381 kB | 51 kB | 102/165 kB | 84 kB | 37/245 kB
Progress (5): 88/381 kB | 51 kB | 106/165 kB | 84 kB | 37/245 kB
Progress (5): 88/381 kB | 51 kB | 106/165 kB | 84 kB | 41/245 kB
Progress (5): 88/381 kB | 51 kB | 106/165 kB | 84 kB | 45/245 kB
Progress (5): 88/381 kB | 51 kB | 110/165 kB | 84 kB | 45/245 kB
Progress (5): 88/381 kB | 51 kB | 110/165 kB | 84 kB | 49/245 kB
Progress (5): 88/381 kB | 51 kB | 114/165 kB | 84 kB | 49/245 kB
Progress (5): 88/381 kB | 51 kB | 114/165 kB | 84 kB | 53/245 kB
Progress (5): 88/381 kB | 51 kB | 114/165 kB | 84 kB | 57/245 kB
Progress (5): 88/381 kB | 51 kB | 118/165 kB | 84 kB | 57/245 kB
Progress (5): 88/381 kB | 51 kB | 118/165 kB | 84 kB | 61/245 kB
Progress (5): 88/381 kB | 51 kB | 122/165 kB | 84 kB | 61/245 kB
Progress (5): 88/381 kB | 51 kB | 122/165 kB | 84 kB | 65/245 kB
Progress (5): 88/381 kB | 51 kB | 122/165 kB | 84 kB | 66/245 kB
Progress (5): 88/381 kB | 51 kB | 126/165 kB | 84 kB | 66/245 kB
Progress (5): 88/381 kB | 51 kB | 126/165 kB | 84 kB | 70/245 kB
Progress (5): 88/381 kB | 51 kB | 130/165 kB | 84 kB | 70/245 kB
Progress (5): 88/381 kB | 51 kB | 130/165 kB | 84 kB | 74/245 kB
Progress (5): 88/381 kB | 51 kB | 130/165 kB | 84 kB | 78/245 kB
Progress (5): 88/381 kB | 51 kB | 134/165 kB | 84 kB | 78/245 kB
                                                                
Downloaded from eclipse.maven.central.mirror: https://repo.eclipse.org/content/repositories/maven_central/org/codehaus/plexus/plexus-io/2.6/plexus-io-2.6.jar (84 kB at 956 kB/s)
Progress (4): 88/381 kB | 51 kB | 134/165 kB | 82/245 kB
                                                        
Downloading from eclipse.maven.central.mirror: https://repo.eclipse.org/content/repositories/maven_central/org/apache/maven/shared/maven-repository-builder/1.0/maven-repository-builder-1.0.jar
Progress (4): 88/381 kB | 51 kB | 138/165 kB | 82/245 kB
Progress (4): 88/381 kB | 51 kB | 138/165 kB | 86/245 kB
                                                        
Downloaded from eclipse.maven.central.mirror: https://repo.eclipse.org/content/repositories/maven_central/org/apache/maven/shared/maven-filtering/1.3/maven-filtering-1.3.jar (51 kB at 582 kB/s)
Progress (3): 88/381 kB | 142/165 kB | 86/245 kB
Progress (3): 88/381 kB | 142/165 kB | 90/245 kB
Progress (3): 88/381 kB | 146/165 kB | 90/245 kB
                                                
Downloading from eclipse.maven.central.mirror: https://repo.eclipse.org/content/repositories/maven_central/commons-codec/commons-codec/1.6/commons-codec-1.6.jar
Progress (3): 88/381 kB | 146/165 kB | 94/245 kB
Progress (3): 88/381 kB | 150/165 kB | 94/245 kB
Progress (3): 88/381 kB | 150/165 kB | 98/245 kB
Progress (3): 88/381 kB | 154/165 kB | 98/245 kB
Progress (3): 88/381 kB | 154/165 kB | 102/245 kB
Progress (3): 88/381 kB | 154/165 kB | 106/245 kB
Progress (3): 88/381 kB | 158/165 kB | 106/245 kB
Progress (3): 88/381 kB | 158/165 kB | 110/245 kB
Progress (3): 88/381 kB | 162/165 kB | 110/245 kB
Progress (3): 88/381 kB | 162/165 kB | 114/245 kB
Progress (3): 88/381 kB | 165 kB | 114/245 kB    
Progress (3): 88/381 kB | 165 kB | 118/245 kB
Progress (3): 88/381 kB | 165 kB | 122/245 kB
Progress (3): 88/381 kB | 165 kB | 126/245 kB
Progress (3): 88/381 kB | 165 kB | 130/245 kB
Progress (3): 88/381 kB | 165 kB | 134/245 kB
Progress (3): 88/381 kB | 165 kB | 138/245 kB
Progress (3): 88/381 kB | 165 kB | 142/245 kB
Progress (3): 88/381 kB | 165 kB | 146/245 kB
Progress (3): 88/381 kB | 165 kB | 150/245 kB
Progress (3): 88/381 kB | 165 kB | 154/245 kB
Progress (3): 88/381 kB | 165 kB | 158/245 kB
Progress (3): 88/381 kB | 165 kB | 162/245 kB
Progress (3): 88/381 kB | 165 kB | 166/245 kB
Progress (3): 88/381 kB | 165 kB | 170/245 kB
Progress (3): 88/381 kB | 165 kB | 174/245 kB
Progress (3): 88/381 kB | 165 kB | 178/245 kB
Progress (3): 88/381 kB | 165 kB | 182/245 kB
Progress (3): 88/381 kB | 165 kB | 186/245 kB
Progress (3): 88/381 kB | 165 kB | 190/245 kB
Progress (3): 88/381 kB | 165 kB | 194/245 kB
Progress (3): 88/381 kB | 165 kB | 198/245 kB
Progress (3): 88/381 kB | 165 kB | 202/245 kB
Progress (3): 88/381 kB | 165 kB | 206/245 kB
Progress (3): 88/381 kB | 165 kB | 210/245 kB
Progress (3): 88/381 kB | 165 kB | 214/245 kB
Progress (3): 88/381 kB | 165 kB | 218/245 kB
Progress (4): 88/381 kB | 165 kB | 218/245 kB | 4.1/22 kB
Progress (4): 88/381 kB | 165 kB | 222/245 kB | 4.1/22 kB
Progress (4): 88/381 kB | 165 kB | 222/245 kB | 7.7/22 kB
Progress (4): 88/381 kB | 165 kB | 226/245 kB | 7.7/22 kB
Progress (4): 88/381 kB | 165 kB | 226/245 kB | 12/22 kB 
Progress (4): 88/381 kB | 165 kB | 230/245 kB | 12/22 kB
Progress (4): 88/381 kB | 165 kB | 230/245 kB | 16/22 kB
Progress (4): 88/381 kB | 165 kB | 234/245 kB | 16/22 kB
Progress (4): 88/381 kB | 165 kB | 234/245 kB | 20/22 kB
Progress (4): 88/381 kB | 165 kB | 234/245 kB | 22 kB   
Progress (4): 88/381 kB | 165 kB | 238/245 kB | 22 kB
Progress (4): 88/381 kB | 165 kB | 242/245 kB | 22 kB
Progress (5): 88/381 kB | 165 kB | 242/245 kB | 22 kB | 4.1/233 kB
Progress (5): 88/381 kB | 165 kB | 245 kB | 22 kB | 4.1/233 kB    
Progress (5): 88/381 kB | 165 kB | 245 kB | 22 kB | 7.7/233 kB
                                                              
Downloaded from eclipse.maven.central.mirror: https://repo.eclipse.org/content/repositories/maven_central/org/apache/maven/shared/maven-shared-utils/0.6/maven-shared-utils-0.6.jar (165 kB at 1.7 MB/s)
Progress (4): 88/381 kB | 245 kB | 22 kB | 12/233 kB
Progress (4): 88/381 kB | 245 kB | 22 kB | 16/233 kB
Progress (4): 88/381 kB | 245 kB | 22 kB | 20/233 kB
Progress (4): 88/381 kB | 245 kB | 22 kB | 24/233 kB
Progress (4): 88/381 kB | 245 kB | 22 kB | 28/233 kB
Progress (4): 88/381 kB | 245 kB | 22 kB | 32/233 kB
Progress (4): 88/381 kB | 245 kB | 22 kB | 33/233 kB
Progress (4): 88/381 kB | 245 kB | 22 kB | 37/233 kB
Progress (4): 88/381 kB | 245 kB | 22 kB | 41/233 kB
Progress (4): 88/381 kB | 245 kB | 22 kB | 45/233 kB
Progress (4): 88/381 kB | 245 kB | 22 kB | 49/233 kB
Progress (4): 88/381 kB | 245 kB | 22 kB | 53/233 kB
Progress (4): 88/381 kB | 245 kB | 22 kB | 57/233 kB
Progress (4): 88/381 kB | 245 kB | 22 kB | 61/233 kB
Progress (4): 88/381 kB | 245 kB | 22 kB | 65/233 kB
Progress (4): 88/381 kB | 245 kB | 22 kB | 69/233 kB
Progress (4): 88/381 kB | 245 kB | 22 kB | 73/233 kB
                                                    
Downloaded from eclipse.maven.central.mirror: https://repo.eclipse.org/content/repositories/maven_central/org/apache/maven/shared/maven-repository-builder/1.0/maven-repository-builder-1.0.jar (22 kB at 221 kB/s)
Progress (3): 88/381 kB | 245 kB | 77/233 kB
Progress (3): 88/381 kB | 245 kB | 81/233 kB
Progress (3): 88/381 kB | 245 kB | 85/233 kB
Progress (3): 88/381 kB | 245 kB | 89/233 kB
Progress (3): 88/381 kB | 245 kB | 93/233 kB
Progress (3): 88/381 kB | 245 kB | 97/233 kB
Progress (3): 88/381 kB | 245 kB | 101/233 kB
Progress (3): 88/381 kB | 245 kB | 105/233 kB
Progress (3): 88/381 kB | 245 kB | 109/233 kB
Progress (3): 88/381 kB | 245 kB | 113/233 kB
Progress (3): 88/381 kB | 245 kB | 117/233 kB
Progress (3): 88/381 kB | 245 kB | 121/233 kB
Progress (3): 88/381 kB | 245 kB | 125/233 kB
Progress (3): 88/381 kB | 245 kB | 129/233 kB
Progress (3): 88/381 kB | 245 kB | 133/233 kB
Progress (3): 88/381 kB | 245 kB | 137/233 kB
Progress (3): 88/381 kB | 245 kB | 141/233 kB
Progress (3): 88/381 kB | 245 kB | 145/233 kB
Progress (3): 88/381 kB | 245 kB | 149/233 kB
Progress (3): 88/381 kB | 245 kB | 153/233 kB
Progress (3): 88/381 kB | 245 kB | 157/233 kB
Progress (3): 88/381 kB | 245 kB | 161/233 kB
Progress (3): 88/381 kB | 245 kB | 165/233 kB
Progress (3): 88/381 kB | 245 kB | 169/233 kB
Progress (3): 88/381 kB | 245 kB | 173/233 kB
Progress (3): 88/381 kB | 245 kB | 177/233 kB
Progress (3): 88/381 kB | 245 kB | 181/233 kB
Progress (3): 88/381 kB | 245 kB | 185/233 kB
Progress (3): 88/381 kB | 245 kB | 189/233 kB
Progress (3): 88/381 kB | 245 kB | 193/233 kB
Progress (3): 88/381 kB | 245 kB | 197/233 kB
Progress (3): 88/381 kB | 245 kB | 201/233 kB
Progress (3): 88/381 kB | 245 kB | 205/233 kB
Progress (3): 88/381 kB | 245 kB | 209/233 kB
Progress (3): 88/381 kB | 245 kB | 213/233 kB
Progress (3): 88/381 kB | 245 kB | 217/233 kB
Progress (3): 88/381 kB | 245 kB | 221/233 kB
Progress (3): 88/381 kB | 245 kB | 225/233 kB
Progress (3): 88/381 kB | 245 kB | 229/233 kB
Progress (3): 88/381 kB | 245 kB | 233/233 kB
Progress (3): 88/381 kB | 245 kB | 233 kB    
                                         
Downloaded from eclipse.maven.central.mirror: https://repo.eclipse.org/content/repositories/maven_central/org/codehaus/plexus/plexus-utils/3.0.21/plexus-utils-3.0.21.jar (245 kB at 2.2 MB/s)
Downloaded from eclipse.maven.central.mirror: https://repo.eclipse.org/content/repositories/maven_central/commons-codec/commons-codec/1.6/commons-codec-1.6.jar (233 kB at 2.0 MB/s)
Progress (1): 92/381 kB
Progress (1): 96/381 kB
Progress (1): 100/381 kB
Progress (1): 104/381 kB
Progress (1): 108/381 kB
Progress (1): 112/381 kB
Progress (1): 116/381 kB
Progress (1): 120/381 kB
Progress (1): 124/381 kB
Progress (1): 128/381 kB
Progress (1): 132/381 kB
Progress (1): 136/381 kB
Progress (1): 140/381 kB
Progress (1): 144/381 kB
Progress (1): 148/381 kB
Progress (1): 152/381 kB
Progress (1): 156/381 kB
Progress (1): 160/381 kB
Progress (1): 164/381 kB
Progress (1): 168/381 kB
Progress (1): 172/381 kB
Progress (1): 176/381 kB
Progress (1): 180/381 kB
Progress (1): 184/381 kB
Progress (1): 188/381 kB
Progress (1): 192/381 kB
Progress (1): 196/381 kB
Progress (1): 200/381 kB
Progress (1): 204/381 kB
Progress (1): 208/381 kB
Progress (1): 212/381 kB
Progress (1): 216/381 kB
Progress (1): 220/381 kB
Progress (1): 224/381 kB
Progress (1): 228/381 kB
Progress (1): 232/381 kB
Progress (1): 236/381 kB
Progress (1): 240/381 kB
Progress (1): 244/381 kB
Progress (1): 248/381 kB
Progress (1): 252/381 kB
Progress (1): 256/381 kB
Progress (1): 260/381 kB
Progress (1): 264/381 kB
Progress (1): 268/381 kB
Progress (1): 272/381 kB
Progress (1): 276/381 kB
Progress (1): 280/381 kB
Progress (1): 284/381 kB
Progress (1): 288/381 kB
Progress (1): 292/381 kB
Progress (1): 296/381 kB
Progress (1): 300/381 kB
Progress (1): 304/381 kB
Progress (1): 308/381 kB
Progress (1): 312/381 kB
Progress (1): 316/381 kB
Progress (1): 320/381 kB
Progress (1): 324/381 kB
Progress (1): 328/381 kB
Progress (1): 332/381 kB
Progress (1): 336/381 kB
Progress (1): 340/381 kB
Progress (1): 344/381 kB
Progress (1): 348/381 kB
Progress (1): 352/381 kB
Progress (1): 356/381 kB
Progress (1): 360/381 kB
Progress (1): 364/381 kB
Progress (1): 368/381 kB
Progress (1): 372/381 kB
Progress (1): 376/381 kB
Progress (1): 380/381 kB
Progress (1): 381 kB    
                    
Downloaded from eclipse.maven.central.mirror: https://repo.eclipse.org/content/repositories/maven_central/org/codehaus/plexus/plexus-archiver/3.0.1/plexus-archiver-3.0.1.jar (381 kB at 1.5 MB/s)
[WARNING] The assembly descriptor contains a filesystem-root relative reference, which is not cross platform compatible /
[INFO] Building zip: /jobs/genie.papyrus/papyrus-sysml-gerrit/workspace/core/org.eclipse.papyrus.sysml14/target/org.eclipse.papyrus.sysml14-1.3.1-SNAPSHOT-mde.zip
[INFO] 
[INFO] --- build-helper-maven-plugin:1.10:attach-artifact (attach-artifacts) @ org.eclipse.papyrus.sysml14 ---
Downloading from eclipse-maven-releases: https://repo.eclipse.org/content/repositories/releases/junit/junit/4.12/junit-4.12.pom
Downloading from jboss-public-repository-group: http://repository.jboss.org/nexus/content/groups/public/junit/junit/4.12/junit-4.12.pom
Downloading from rcptt-releases: https://repo.eclipse.org/content/repositories/rcptt-releases/junit/junit/4.12/junit-4.12.pom
Downloading from eclipse.maven.central.mirror: https://repo.eclipse.org/content/repositories/maven_central/junit/junit/4.12/junit-4.12.pom
Progress (1): 4.1/24 kB
Progress (1): 7.7/24 kB
Progress (1): 12/24 kB 
Progress (1): 16/24 kB
Progress (1): 20/24 kB
Progress (1): 24/24 kB
Progress (1): 24 kB   
                   
Downloaded from eclipse.maven.central.mirror: https://repo.eclipse.org/content/repositories/maven_central/junit/junit/4.12/junit-4.12.pom (24 kB at 1.3 MB/s)
Downloading from eclipse-maven-releases: https://repo.eclipse.org/content/repositories/releases/org/codehaus/plexus/plexus-utils/3.0.22/plexus-utils-3.0.22.pom
Downloading from jboss-public-repository-group: http://repository.jboss.org/nexus/content/groups/public/org/codehaus/plexus/plexus-utils/3.0.22/plexus-utils-3.0.22.pom
Downloading from rcptt-releases: https://repo.eclipse.org/content/repositories/rcptt-releases/org/codehaus/plexus/plexus-utils/3.0.22/plexus-utils-3.0.22.pom
Downloading from eclipse.maven.central.mirror: https://repo.eclipse.org/content/repositories/maven_central/org/codehaus/plexus/plexus-utils/3.0.22/plexus-utils-3.0.22.pom
Progress (1): 3.8 kB
                    
Downloaded from eclipse.maven.central.mirror: https://repo.eclipse.org/content/repositories/maven_central/org/codehaus/plexus/plexus-utils/3.0.22/plexus-utils-3.0.22.pom (3.8 kB at 239 kB/s)
Downloading from eclipse-maven-releases: https://repo.eclipse.org/content/repositories/releases/org/beanshell/bsh/2.0b4/bsh-2.0b4.pom
Downloading from jboss-public-repository-group: http://repository.jboss.org/nexus/content/groups/public/org/beanshell/bsh/2.0b4/bsh-2.0b4.pom
Downloading from rcptt-releases: https://repo.eclipse.org/content/repositories/rcptt-releases/org/beanshell/bsh/2.0b4/bsh-2.0b4.pom
Downloading from eclipse.maven.central.mirror: https://repo.eclipse.org/content/repositories/maven_central/org/beanshell/bsh/2.0b4/bsh-2.0b4.pom
Progress (1): 1.2 kB
                    
Downloaded from eclipse.maven.central.mirror: https://repo.eclipse.org/content/repositories/maven_central/org/beanshell/bsh/2.0b4/bsh-2.0b4.pom (1.2 kB at 36 kB/s)
Downloading from eclipse-maven-releases: https://repo.eclipse.org/content/repositories/releases/org/beanshell/beanshell/2.0b4/beanshell-2.0b4.pom
Downloading from jboss-public-repository-group: http://repository.jboss.org/nexus/content/groups/public/org/beanshell/beanshell/2.0b4/beanshell-2.0b4.pom
Downloading from rcptt-releases: https://repo.eclipse.org/content/repositories/rcptt-releases/org/beanshell/beanshell/2.0b4/beanshell-2.0b4.pom
Downloading from eclipse.maven.central.mirror: https://repo.eclipse.org/content/repositories/maven_central/org/beanshell/beanshell/2.0b4/beanshell-2.0b4.pom
Progress (1): 1.4 kB
                    
Downloaded from eclipse.maven.central.mirror: https://repo.eclipse.org/content/repositories/maven_central/org/beanshell/beanshell/2.0b4/beanshell-2.0b4.pom (1.4 kB at 46 kB/s)
Downloading from eclipse-maven-releases: https://repo.eclipse.org/content/repositories/releases/org/codehaus/plexus/plexus-interpolation/1.11/plexus-interpolation-1.11.jar
Downloading from eclipse-maven-releases: https://repo.eclipse.org/content/repositories/releases/org/beanshell/bsh/2.0b4/bsh-2.0b4.jar
Downloading from eclipse-maven-releases: https://repo.eclipse.org/content/repositories/releases/org/codehaus/plexus/plexus-utils/3.0.22/plexus-utils-3.0.22.jar
Downloading from jboss-public-repository-group: http://repository.jboss.org/nexus/content/groups/public/org/codehaus/plexus/plexus-interpolation/1.11/plexus-interpolation-1.11.jar
Downloading from jboss-public-repository-group: http://repository.jboss.org/nexus/content/groups/public/org/codehaus/plexus/plexus-utils/3.0.22/plexus-utils-3.0.22.jar
Downloading from jboss-public-repository-group: http://repository.jboss.org/nexus/content/groups/public/org/beanshell/bsh/2.0b4/bsh-2.0b4.jar
Downloading from rcptt-releases: https://repo.eclipse.org/content/repositories/rcptt-releases/org/codehaus/plexus/plexus-interpolation/1.11/plexus-interpolation-1.11.jar
Downloading from rcptt-releases: https://repo.eclipse.org/content/repositories/rcptt-releases/org/beanshell/bsh/2.0b4/bsh-2.0b4.jar
Downloading from rcptt-releases: https://repo.eclipse.org/content/repositories/rcptt-releases/org/codehaus/plexus/plexus-utils/3.0.22/plexus-utils-3.0.22.jar
Downloading from eclipse.maven.central.mirror: https://repo.eclipse.org/content/repositories/maven_central/org/codehaus/plexus/plexus-interpolation/1.11/plexus-interpolation-1.11.jar
Downloading from eclipse.maven.central.mirror: https://repo.eclipse.org/content/repositories/maven_central/org/beanshell/bsh/2.0b4/bsh-2.0b4.jar
Downloading from eclipse.maven.central.mirror: https://repo.eclipse.org/content/repositories/maven_central/org/codehaus/plexus/plexus-utils/3.0.22/plexus-utils-3.0.22.jar
Progress (1): 4.1/282 kB
Progress (1): 7.7/282 kB
Progress (1): 12/282 kB 
Progress (1): 16/282 kB
Progress (1): 20/282 kB
Progress (1): 24/282 kB
Progress (1): 28/282 kB
Progress (1): 32/282 kB
Progress (1): 36/282 kB
Progress (1): 40/282 kB
Progress (2): 40/282 kB | 4.1/245 kB
Progress (2): 44/282 kB | 4.1/245 kB
Progress (2): 44/282 kB | 7.7/245 kB
Progress (2): 48/282 kB | 7.7/245 kB
Progress (2): 48/282 kB | 12/245 kB 
Progress (2): 52/282 kB | 12/245 kB
Progress (2): 52/282 kB | 16/245 kB
Progress (2): 56/282 kB | 16/245 kB
Progress (2): 56/282 kB | 20/245 kB
Progress (2): 60/282 kB | 20/245 kB
Progress (2): 60/282 kB | 24/245 kB
Progress (2): 64/282 kB | 24/245 kB
Progress (2): 68/282 kB | 24/245 kB
Progress (2): 68/282 kB | 28/245 kB
Progress (2): 72/282 kB | 28/245 kB
Progress (2): 72/282 kB | 32/245 kB
Progress (2): 76/282 kB | 32/245 kB
Progress (2): 80/282 kB | 32/245 kB
Progress (2): 80/282 kB | 36/245 kB
Progress (2): 80/282 kB | 40/245 kB
Progress (2): 84/282 kB | 40/245 kB
Progress (2): 88/282 kB | 40/245 kB
Progress (2): 88/282 kB | 44/245 kB
Progress (2): 88/282 kB | 48/245 kB
Progress (2): 92/282 kB | 48/245 kB
Progress (2): 96/282 kB | 48/245 kB
Progress (2): 96/282 kB | 52/245 kB
Progress (2): 100/282 kB | 52/245 kB
Progress (2): 100/282 kB | 56/245 kB
Progress (2): 104/282 kB | 56/245 kB
Progress (2): 104/282 kB | 60/245 kB
Progress (2): 108/282 kB | 60/245 kB
Progress (2): 108/282 kB | 64/245 kB
Progress (2): 112/282 kB | 64/245 kB
Progress (2): 116/282 kB | 64/245 kB
Progress (2): 116/282 kB | 68/245 kB
Progress (2): 120/282 kB | 68/245 kB
Progress (2): 120/282 kB | 72/245 kB
Progress (2): 124/282 kB | 72/245 kB
Progress (2): 128/282 kB | 72/245 kB
Progress (2): 128/282 kB | 76/245 kB
Progress (2): 128/282 kB | 80/245 kB
Progress (2): 132/282 kB | 80/245 kB
Progress (2): 136/282 kB | 80/245 kB
Progress (2): 136/282 kB | 84/245 kB
Progress (2): 140/282 kB | 84/245 kB
Progress (2): 140/282 kB | 88/245 kB
Progress (2): 144/282 kB | 88/245 kB
Progress (2): 144/282 kB | 92/245 kB
Progress (2): 148/282 kB | 92/245 kB
Progress (2): 148/282 kB | 96/245 kB
Progress (2): 152/282 kB | 96/245 kB
Progress (2): 152/282 kB | 100/245 kB
Progress (2): 156/282 kB | 100/245 kB
Progress (2): 156/282 kB | 104/245 kB
Progress (2): 160/282 kB | 104/245 kB
Progress (2): 160/282 kB | 108/245 kB
Progress (2): 164/282 kB | 108/245 kB
Progress (2): 164/282 kB | 112/245 kB
Progress (2): 168/282 kB | 112/245 kB
Progress (2): 168/282 kB | 116/245 kB
Progress (2): 172/282 kB | 116/245 kB
Progress (2): 172/282 kB | 120/245 kB
Progress (2): 176/282 kB | 120/245 kB
Progress (2): 176/282 kB | 124/245 kB
Progress (2): 176/282 kB | 128/245 kB
Progress (2): 180/282 kB | 128/245 kB
Progress (2): 184/282 kB | 128/245 kB
Progress (2): 184/282 kB | 132/245 kB
Progress (2): 184/282 kB | 136/245 kB
Progress (2): 184/282 kB | 140/245 kB
Progress (2): 188/282 kB | 140/245 kB
Progress (2): 188/282 kB | 144/245 kB
Progress (2): 192/282 kB | 144/245 kB
Progress (2): 192/282 kB | 148/245 kB
Progress (2): 196/282 kB | 148/245 kB
Progress (2): 196/282 kB | 152/245 kB
Progress (2): 200/282 kB | 152/245 kB
Progress (2): 200/282 kB | 156/245 kB
Progress (2): 204/282 kB | 156/245 kB
Progress (2): 204/282 kB | 160/245 kB
Progress (2): 208/282 kB | 160/245 kB
Progress (2): 212/282 kB | 160/245 kB
Progress (3): 212/282 kB | 160/245 kB | 4.1/51 kB
Progress (3): 216/282 kB | 160/245 kB | 4.1/51 kB
Progress (3): 216/282 kB | 160/245 kB | 7.7/51 kB
Progress (3): 216/282 kB | 164/245 kB | 7.7/51 kB
Progress (3): 216/282 kB | 168/245 kB | 7.7/51 kB
Progress (3): 220/282 kB | 168/245 kB | 7.7/51 kB
Progress (3): 220/282 kB | 168/245 kB | 12/51 kB 
Progress (3): 224/282 kB | 168/245 kB | 12/51 kB
Progress (3): 224/282 kB | 172/245 kB | 12/51 kB
Progress (3): 224/282 kB | 172/245 kB | 16/51 kB
Progress (3): 224/282 kB | 176/245 kB | 16/51 kB
Progress (3): 228/282 kB | 176/245 kB | 16/51 kB
Progress (3): 232/282 kB | 176/245 kB | 16/51 kB
Progress (3): 232/282 kB | 176/245 kB | 20/51 kB
Progress (3): 232/282 kB | 176/245 kB | 24/51 kB
Progress (3): 236/282 kB | 176/245 kB | 24/51 kB
Progress (3): 236/282 kB | 180/245 kB | 24/51 kB
Progress (3): 240/282 kB | 180/245 kB | 24/51 kB
Progress (3): 240/282 kB | 184/245 kB | 24/51 kB
Progress (3): 240/282 kB | 184/245 kB | 28/51 kB
Progress (3): 244/282 kB | 184/245 kB | 28/51 kB
Progress (3): 244/282 kB | 184/245 kB | 32/51 kB
Progress (3): 248/282 kB | 184/245 kB | 32/51 kB
Progress (3): 248/282 kB | 188/245 kB | 32/51 kB
Progress (3): 248/282 kB | 192/245 kB | 32/51 kB
Progress (3): 248/282 kB | 192/245 kB | 36/51 kB
Progress (3): 252/282 kB | 192/245 kB | 36/51 kB
Progress (3): 252/282 kB | 192/245 kB | 40/51 kB
Progress (3): 252/282 kB | 196/245 kB | 40/51 kB
Progress (3): 256/282 kB | 196/245 kB | 40/51 kB
Progress (3): 256/282 kB | 200/245 kB | 40/51 kB
Progress (3): 256/282 kB | 200/245 kB | 44/51 kB
Progress (3): 260/282 kB | 200/245 kB | 44/51 kB
Progress (3): 260/282 kB | 200/245 kB | 48/51 kB
Progress (3): 264/282 kB | 200/245 kB | 48/51 kB
Progress (3): 264/282 kB | 200/245 kB | 51 kB   
Progress (3): 268/282 kB | 200/245 kB | 51 kB
Progress (3): 268/282 kB | 204/245 kB | 51 kB
Progress (3): 272/282 kB | 204/245 kB | 51 kB
Progress (3): 272/282 kB | 208/245 kB | 51 kB
Progress (3): 276/282 kB | 208/245 kB | 51 kB
Progress (3): 280/282 kB | 208/245 kB | 51 kB
Progress (3): 280/282 kB | 212/245 kB | 51 kB
Progress (3): 282 kB | 212/245 kB | 51 kB    
Progress (3): 282 kB | 216/245 kB | 51 kB
Progress (3): 282 kB | 220/245 kB | 51 kB
Progress (3): 282 kB | 224/245 kB | 51 kB
Progress (3): 282 kB | 228/245 kB | 51 kB
Progress (3): 282 kB | 232/245 kB | 51 kB
Progress (3): 282 kB | 236/245 kB | 51 kB
Progress (3): 282 kB | 240/245 kB | 51 kB
Progress (3): 282 kB | 244/245 kB | 51 kB
Progress (3): 282 kB | 245 kB | 51 kB    
                                     
Downloaded from eclipse.maven.central.mirror: https://repo.eclipse.org/content/repositories/maven_central/org/codehaus/plexus/plexus-interpolation/1.11/plexus-interpolation-1.11.jar (51 kB at 894 kB/s)
Downloaded from eclipse.maven.central.mirror: https://repo.eclipse.org/content/repositories/maven_central/org/beanshell/bsh/2.0b4/bsh-2.0b4.jar (282 kB at 4.9 MB/s)
Downloaded from eclipse.maven.central.mirror: https://repo.eclipse.org/content/repositories/maven_central/org/codehaus/plexus/plexus-utils/3.0.22/plexus-utils-3.0.22.jar (245 kB at 2.0 MB/s)
[INFO] 
[INFO] ----< org.eclipse.papyrus.sysml:org.eclipse.papyrus.sysml14.tests >-----
[INFO] Building org.eclipse.papyrus.sysml14.tests 1.3.1-SNAPSHOT         [6/36]
[INFO] ------------------------[ eclipse-test-plugin ]-------------------------
[INFO] 
[INFO] --- maven-clean-plugin:3.0.0:clean (default-clean) @ org.eclipse.papyrus.sysml14.tests ---
[INFO] Deleting /jobs/genie.papyrus/papyrus-sysml-gerrit/workspace/core/org.eclipse.papyrus.sysml14.tests/target
[INFO] 
[INFO] --- tycho-packaging-plugin:1.0.0:build-qualifier (default-build-qualifier) @ org.eclipse.papyrus.sysml14.tests ---
[INFO] The project's OSGi version is 1.3.1.201809171217
[INFO] 
[INFO] --- tycho-packaging-plugin:1.0.0:validate-id (default-validate-id) @ org.eclipse.papyrus.sysml14.tests ---
[INFO] 
[INFO] --- tycho-packaging-plugin:1.0.0:validate-version (default-validate-version) @ org.eclipse.papyrus.sysml14.tests ---
[INFO] 
[INFO] --- maven-resources-plugin:2.7:resources (default-resources) @ org.eclipse.papyrus.sysml14.tests ---
[INFO] Using 'UTF-8' encoding to copy filtered resources.
[INFO] skip non existing resourceDirectory /jobs/genie.papyrus/papyrus-sysml-gerrit/workspace/core/org.eclipse.papyrus.sysml14.tests/src/main/resources
[INFO] 
[INFO] --- tycho-compiler-plugin:1.0.0:compile (default-compile) @ org.eclipse.papyrus.sysml14.tests ---
[INFO] Compiling 19 source files to /jobs/genie.papyrus/papyrus-sysml-gerrit/workspace/core/org.eclipse.papyrus.sysml14.tests/target/classes
[INFO] 
[INFO] --- maven-resources-plugin:2.7:testResources (default-testResources) @ org.eclipse.papyrus.sysml14.tests ---
[INFO] Using 'UTF-8' encoding to copy filtered resources.
[INFO] skip non existing resourceDirectory /jobs/genie.papyrus/papyrus-sysml-gerrit/workspace/core/org.eclipse.papyrus.sysml14.tests/src/test/resources
[INFO] 
[INFO] --- tycho-source-plugin:1.0.0:plugin-source (plugin-source) @ org.eclipse.papyrus.sysml14.tests ---
[INFO] Building jar: /jobs/genie.papyrus/papyrus-sysml-gerrit/workspace/core/org.eclipse.papyrus.sysml14.tests/target/org.eclipse.papyrus.sysml14.tests-1.3.1-SNAPSHOT-sources.jar
[INFO] 
[INFO] --- target-platform-configuration:1.0.0:target-platform (default-target-platform) @ org.eclipse.papyrus.sysml14.tests ---
[INFO] 
[INFO] --- tycho-packaging-plugin:1.0.0:package-plugin (default-package-plugin) @ org.eclipse.papyrus.sysml14.tests ---
[INFO] Building jar: /jobs/genie.papyrus/papyrus-sysml-gerrit/workspace/core/org.eclipse.papyrus.sysml14.tests/target/org.eclipse.papyrus.sysml14.tests-1.3.1-SNAPSHOT.jar
[INFO] 
[INFO] --- tycho-p2-plugin:1.0.0:p2-metadata-default (default-p2-metadata-default) @ org.eclipse.papyrus.sysml14.tests ---
[INFO] 
[INFO] --- tycho-source-feature-plugin:1.0.0:source-feature (source-feature) @ org.eclipse.papyrus.sysml14.tests ---
[INFO] 
[INFO] --- tycho-p2-plugin:1.0.0:p2-metadata (attach-p2-metadata) @ org.eclipse.papyrus.sysml14.tests ---
[INFO] 
[INFO] --- tycho-surefire-plugin:1.0.0:test (default-test) @ org.eclipse.papyrus.sysml14.tests ---
[INFO] Expected eclipse log file: /jobs/genie.papyrus/papyrus-sysml-gerrit/workspace/core/org.eclipse.papyrus.sysml14.tests/target/work/data/.metadata/.log
[INFO] Command line:
	[/opt/public/common/java/oracle/jdk1.8.0_162_x64/jre/bin/java, -Dosgi.noShutdown=false, -Dosgi.os=linux, -Dosgi.ws=gtk, -Dosgi.arch=x86_64, -Dosgi.clean=true, -jar, /jobs/genie.papyrus/papyrus-sysml-gerrit/workspace/.repository/p2/osgi/bundle/org.eclipse.equinox.launcher/1.5.0.v20180512-1130/org.eclipse.equinox.launcher-1.5.0.v20180512-1130.jar, -data, /jobs/genie.papyrus/papyrus-sysml-gerrit/workspace/core/org.eclipse.papyrus.sysml14.tests/target/work/data, -install, /jobs/genie.papyrus/papyrus-sysml-gerrit/workspace/core/org.eclipse.papyrus.sysml14.tests/target/work, -configuration, /jobs/genie.papyrus/papyrus-sysml-gerrit/workspace/core/org.eclipse.papyrus.sysml14.tests/target/work/configuration, -application, org.eclipse.tycho.surefire.osgibooter.uitest, -testproperties, /jobs/genie.papyrus/papyrus-sysml-gerrit/workspace/core/org.eclipse.papyrus.sysml14.tests/target/surefire.properties]
Picked up JAVA_TOOL_OPTIONS: -Xmx2G -Djava.io.tmpdir=/tmp/genie.papyrus

-------------------------------------------------------
 T E S T S
-------------------------------------------------------
Running org.eclipse.papyrus.sysml14.tests.blocks.BlockTest
Tests run: 3, Failures: 0, Errors: 0, Skipped: 0, Time elapsed: 1.134 sec - in org.eclipse.papyrus.sysml14.tests.blocks.BlockTest
testGetParts(org.eclipse.papyrus.sysml14.tests.blocks.BlockTest)  Time elapsed: 0.818 sec
testGetReferences(org.eclipse.papyrus.sysml14.tests.blocks.BlockTest)  Time elapsed: 0.224 sec
testGetFlowProperties(org.eclipse.papyrus.sysml14.tests.blocks.BlockTest)  Time elapsed: 0.074 sec
Running org.eclipse.papyrus.sysml14.tests.blocks.BoundReferenceTest
Tests run: 1, Failures: 0, Errors: 0, Skipped: 0, Time elapsed: 0.07 sec - in org.eclipse.papyrus.sysml14.tests.blocks.BoundReferenceTest
testGetBindingPath(org.eclipse.papyrus.sysml14.tests.blocks.BoundReferenceTest)  Time elapsed: 0.069 sec
Running org.eclipse.papyrus.sysml14.tests.util.DeprecatedElementUtilTest
Tests run: 1, Failures: 0, Errors: 0, Skipped: 0, Time elapsed: 0.076 sec - in org.eclipse.papyrus.sysml14.tests.util.DeprecatedElementUtilTest
testIsDeprecatedElement(org.eclipse.papyrus.sysml14.tests.util.DeprecatedElementUtilTest)  Time elapsed: 0.075 sec
Running org.eclipse.papyrus.sysml14.tests.util.SysmlResourceTest
Tests run: 2, Failures: 0, Errors: 0, Skipped: 0, Time elapsed: 0.2 sec - in org.eclipse.papyrus.sysml14.tests.util.SysmlResourceTest
testGetFirstSysMLMatchingContainerProfiledBySysMLProfile4UMLModel(org.eclipse.papyrus.sysml14.tests.util.SysmlResourceTest)  Time elapsed: 0.055 sec
testGetFirstSysMLMatchingContainerProfiledBySysMLProfile4SysMLModel(org.eclipse.papyrus.sysml14.tests.util.SysmlResourceTest)  Time elapsed: 0.144 sec
Running org.eclipse.papyrus.sysml14.tests.portsandflows.FlowPropertyTest
Tests run: 1, Failures: 0, Errors: 0, Skipped: 0, Time elapsed: 0.151 sec - in org.eclipse.papyrus.sysml14.tests.portsandflows.FlowPropertyTest
testGetIcon(org.eclipse.papyrus.sysml14.tests.portsandflows.FlowPropertyTest)  Time elapsed: 0.149 sec
Running org.eclipse.papyrus.sysml14.tests.modelelements.ViewPointTest
Tests run: 2, Failures: 0, Errors: 0, Skipped: 0, Time elapsed: 0.302 sec - in org.eclipse.papyrus.sysml14.tests.modelelements.ViewPointTest
testGetConcern(org.eclipse.papyrus.sysml14.tests.modelelements.ViewPointTest)  Time elapsed: 0.162 sec
testGetMethod(org.eclipse.papyrus.sysml14.tests.modelelements.ViewPointTest)  Time elapsed: 0.137 sec
Running org.eclipse.papyrus.sysml14.tests.modelelements.ElementGroupTest
Tests run: 3, Failures: 0, Errors: 0, Skipped: 0, Time elapsed: 0.217 sec - in org.eclipse.papyrus.sysml14.tests.modelelements.ElementGroupTest
testGetSize(org.eclipse.papyrus.sysml14.tests.modelelements.ElementGroupTest)  Time elapsed: 0.072 sec
testGetMember(org.eclipse.papyrus.sysml14.tests.modelelements.ElementGroupTest)  Time elapsed: 0.075 sec
testGetCriterion(org.eclipse.papyrus.sysml14.tests.modelelements.ElementGroupTest)  Time elapsed: 0.068 sec
Running org.eclipse.papyrus.sysml14.tests.modelelements.StakeholderTest
Tests run: 1, Failures: 0, Errors: 0, Skipped: 0, Time elapsed: 0.06 sec - in org.eclipse.papyrus.sysml14.tests.modelelements.StakeholderTest
testGetConcern(org.eclipse.papyrus.sysml14.tests.modelelements.StakeholderTest)  Time elapsed: 0.059 sec
Running org.eclipse.papyrus.sysml14.tests.modelelements.ViewTest
Tests run: 2, Failures: 0, Errors: 0, Skipped: 0, Time elapsed: 0.079 sec - in org.eclipse.papyrus.sysml14.tests.modelelements.ViewTest
testGetViewPoint(org.eclipse.papyrus.sysml14.tests.modelelements.ViewTest)  Time elapsed: 0.043 sec
testGetStakeholder(org.eclipse.papyrus.sysml14.tests.modelelements.ViewTest)  Time elapsed: 0.036 sec
Running org.eclipse.papyrus.sysml14.tests.library.SysMLStandardLibraryTest
Tests run: 1, Failures: 0, Errors: 0, Skipped: 0, Time elapsed: 0.098 sec - in org.eclipse.papyrus.sysml14.tests.library.SysMLStandardLibraryTest
validatePropertiesModel(org.eclipse.papyrus.sysml14.tests.library.SysMLStandardLibraryTest)  Time elapsed: 0.098 sec
Running org.eclipse.papyrus.sysml14.tests.library.QUDVTest
Tests run: 1, Failures: 0, Errors: 0, Skipped: 0, Time elapsed: 0.339 sec - in org.eclipse.papyrus.sysml14.tests.library.QUDVTest
validatePropertiesModel(org.eclipse.papyrus.sysml14.tests.library.QUDVTest)  Time elapsed: 0.338 sec
Running org.eclipse.papyrus.sysml14.tests.constraintblocks.ConstraintBlockTest
Tests run: 1, Failures: 0, Errors: 0, Skipped: 0, Time elapsed: 0.143 sec - in org.eclipse.papyrus.sysml14.tests.constraintblocks.ConstraintBlockTest
testGetParameters(org.eclipse.papyrus.sysml14.tests.constraintblocks.ConstraintBlockTest)  Time elapsed: 0.141 sec
Running org.eclipse.papyrus.sysml14.tests.resources.ModelValidationTest
Tests run: 1, Failures: 0, Errors: 0, Skipped: 0, Time elapsed: 0.139 sec - in org.eclipse.papyrus.sysml14.tests.resources.ModelValidationTest
validateModel[0](org.eclipse.papyrus.sysml14.tests.resources.ModelValidationTest)  Time elapsed: 0.121 sec
Running org.eclipse.papyrus.sysml14.tests.resources.ProfileValidationTest
Tests run: 1, Failures: 0, Errors: 0, Skipped: 0, Time elapsed: 0.717 sec - in org.eclipse.papyrus.sysml14.tests.resources.ProfileValidationTest
validateModel(org.eclipse.papyrus.sysml14.tests.resources.ProfileValidationTest)  Time elapsed: 0.716 sec
Running org.eclipse.papyrus.sysml14.tests.requirements.RequirementTest
Tests run: 8, Failures: 0, Errors: 0, Skipped: 0, Time elapsed: 0.458 sec - in org.eclipse.papyrus.sysml14.tests.requirements.RequirementTest
testGetTracedTo(org.eclipse.papyrus.sysml14.tests.requirements.RequirementTest)  Time elapsed: 0.089 sec
testReadOnlyDerived(org.eclipse.papyrus.sysml14.tests.requirements.RequirementTest)  Time elapsed: 0.075 sec
testGetDerivedFrom(org.eclipse.papyrus.sysml14.tests.requirements.RequirementTest)  Time elapsed: 0.05 sec
testGetRefinedBy(org.eclipse.papyrus.sysml14.tests.requirements.RequirementTest)  Time elapsed: 0.056 sec
testGetVerifiedBy(org.eclipse.papyrus.sysml14.tests.requirements.RequirementTest)  Time elapsed: 0.045 sec
testGetSatisfiedBy(org.eclipse.papyrus.sysml14.tests.requirements.RequirementTest)  Time elapsed: 0.045 sec
testGetMaster(org.eclipse.papyrus.sysml14.tests.requirements.RequirementTest)  Time elapsed: 0.049 sec
testGetDerived(org.eclipse.papyrus.sysml14.tests.requirements.RequirementTest)  Time elapsed: 0.045 sec
Running org.eclipse.papyrus.sysml14.tests.deprecatedelements.FlowPortTest
Tests run: 3, Failures: 0, Errors: 0, Skipped: 0, Time elapsed: 0.189 sec - in org.eclipse.papyrus.sysml14.tests.deprecatedelements.FlowPortTest
testGetIcon(org.eclipse.papyrus.sysml14.tests.deprecatedelements.FlowPortTest)  Time elapsed: 0.046 sec
testIsAtomic(org.eclipse.papyrus.sysml14.tests.deprecatedelements.FlowPortTest)  Time elapsed: 0.063 sec
testIsDeprecated(org.eclipse.papyrus.sysml14.tests.deprecatedelements.FlowPortTest)  Time elapsed: 0.079 sec
Running org.eclipse.papyrus.sysml14.tests.deprecatedelements.FlowSpecificationTest
Tests run: 3, Failures: 0, Errors: 0, Skipped: 0, Time elapsed: 0.176 sec - in org.eclipse.papyrus.sysml14.tests.deprecatedelements.FlowSpecificationTest
testGetFlowProperties(org.eclipse.papyrus.sysml14.tests.deprecatedelements.FlowSpecificationTest)  Time elapsed: 0.062 sec
testGetOperations(org.eclipse.papyrus.sysml14.tests.deprecatedelements.FlowSpecificationTest)  Time elapsed: 0.062 sec
testGetReceptions(org.eclipse.papyrus.sysml14.tests.deprecatedelements.FlowSpecificationTest)  Time elapsed: 0.05 sec
Running org.eclipse.papyrus.sysml14.tests.SysmlProfileTest
Tests run: 9, Failures: 0, Errors: 0, Skipped: 0, Time elapsed: 0.259 sec - in org.eclipse.papyrus.sysml14.tests.SysmlProfileTest
testProfilRegistration[0](org.eclipse.papyrus.sysml14.tests.SysmlProfileTest)  Time elapsed: 0.041 sec
testProfilRegistration[1](org.eclipse.papyrus.sysml14.tests.SysmlProfileTest)  Time elapsed: 0.076 sec
testProfilRegistration[2](org.eclipse.papyrus.sysml14.tests.SysmlProfileTest)  Time elapsed: 0.021 sec
testProfilRegistration[3](org.eclipse.papyrus.sysml14.tests.SysmlProfileTest)  Time elapsed: 0.022 sec
testProfilRegistration[4](org.eclipse.papyrus.sysml14.tests.SysmlProfileTest)  Time elapsed: 0.019 sec
testProfilRegistration[5](org.eclipse.papyrus.sysml14.tests.SysmlProfileTest)  Time elapsed: 0.019 sec
testProfilRegistration[6](org.eclipse.papyrus.sysml14.tests.SysmlProfileTest)  Time elapsed: 0.019 sec
testProfilRegistration[7](org.eclipse.papyrus.sysml14.tests.SysmlProfileTest)  Time elapsed: 0.018 sec
testProfilRegistration[8](org.eclipse.papyrus.sysml14.tests.SysmlProfileTest)  Time elapsed: 0.018 sec

Results :

Tests run: 44, Failures: 0, Errors: 0, Skipped: 0

[INFO] All tests passed!
[INFO] 
[INFO] -----< org.eclipse.papyrus.sysml:org.eclipse.papyrus.sysml14.edit >-----
[INFO] Building org.eclipse.papyrus.sysml14.edit 1.3.1-SNAPSHOT          [7/36]
[INFO] ---------------------------[ eclipse-plugin ]---------------------------
[INFO] 
[INFO] --- maven-clean-plugin:3.0.0:clean (default-clean) @ org.eclipse.papyrus.sysml14.edit ---
[INFO] Deleting /jobs/genie.papyrus/papyrus-sysml-gerrit/workspace/core/org.eclipse.papyrus.sysml14.edit/target
[INFO] 
[INFO] --- tycho-packaging-plugin:1.0.0:build-qualifier (default-build-qualifier) @ org.eclipse.papyrus.sysml14.edit ---
[INFO] The project's OSGi version is 1.3.1.201809171217
[INFO] 
[INFO] --- tycho-packaging-plugin:1.0.0:validate-id (default-validate-id) @ org.eclipse.papyrus.sysml14.edit ---
[INFO] 
[INFO] --- tycho-packaging-plugin:1.0.0:validate-version (default-validate-version) @ org.eclipse.papyrus.sysml14.edit ---
[INFO] 
[INFO] --- maven-resources-plugin:2.7:resources (default-resources) @ org.eclipse.papyrus.sysml14.edit ---
[INFO] Using 'UTF-8' encoding to copy filtered resources.
[INFO] skip non existing resourceDirectory /jobs/genie.papyrus/papyrus-sysml-gerrit/workspace/core/org.eclipse.papyrus.sysml14.edit/src/main/resources
[INFO] 
[INFO] --- tycho-compiler-plugin:1.0.0:compile (default-compile) @ org.eclipse.papyrus.sysml14.edit ---
[INFO] Compiling 66 source files to /jobs/genie.papyrus/papyrus-sysml-gerrit/workspace/core/org.eclipse.papyrus.sysml14.edit/target/classes
[INFO] 
[INFO] --- maven-resources-plugin:2.7:testResources (default-testResources) @ org.eclipse.papyrus.sysml14.edit ---
[INFO] Using 'UTF-8' encoding to copy filtered resources.
[INFO] skip non existing resourceDirectory /jobs/genie.papyrus/papyrus-sysml-gerrit/workspace/core/org.eclipse.papyrus.sysml14.edit/src/test/resources
[INFO] 
[INFO] --- tycho-source-plugin:1.0.0:plugin-source (plugin-source) @ org.eclipse.papyrus.sysml14.edit ---
[INFO] Building jar: /jobs/genie.papyrus/papyrus-sysml-gerrit/workspace/core/org.eclipse.papyrus.sysml14.edit/target/org.eclipse.papyrus.sysml14.edit-1.3.1-SNAPSHOT-sources.jar
[INFO] 
[INFO] --- target-platform-configuration:1.0.0:target-platform (default-target-platform) @ org.eclipse.papyrus.sysml14.edit ---
[INFO] 
[INFO] --- tycho-packaging-plugin:1.0.0:package-plugin (default-package-plugin) @ org.eclipse.papyrus.sysml14.edit ---
[INFO] Building jar: /jobs/genie.papyrus/papyrus-sysml-gerrit/workspace/core/org.eclipse.papyrus.sysml14.edit/target/org.eclipse.papyrus.sysml14.edit-1.3.1-SNAPSHOT.jar
[INFO] 
[INFO] --- tycho-p2-plugin:1.0.0:p2-metadata-default (default-p2-metadata-default) @ org.eclipse.papyrus.sysml14.edit ---
[INFO] 
[INFO] --- tycho-source-feature-plugin:1.0.0:source-feature (source-feature) @ org.eclipse.papyrus.sysml14.edit ---
[INFO] 
[INFO] --- tycho-p2-plugin:1.0.0:p2-metadata (attach-p2-metadata) @ org.eclipse.papyrus.sysml14.edit ---
[INFO] 
[INFO] --< org.eclipse.papyrus.sysml:org.eclipse.papyrus.sysml14.edit.tests >--
[INFO] Building org.eclipse.papyrus.sysml14.edit.tests 1.3.1-SNAPSHOT    [8/36]
[INFO] ------------------------[ eclipse-test-plugin ]-------------------------
[INFO] 
[INFO] --- maven-clean-plugin:3.0.0:clean (default-clean) @ org.eclipse.papyrus.sysml14.edit.tests ---
[INFO] Deleting /jobs/genie.papyrus/papyrus-sysml-gerrit/workspace/core/org.eclipse.papyrus.sysml14.edit.tests/target
[INFO] 
[INFO] --- tycho-packaging-plugin:1.0.0:build-qualifier (default-build-qualifier) @ org.eclipse.papyrus.sysml14.edit.tests ---
[INFO] The project's OSGi version is 1.3.1.201809171217
[INFO] 
[INFO] --- tycho-packaging-plugin:1.0.0:validate-id (default-validate-id) @ org.eclipse.papyrus.sysml14.edit.tests ---
[INFO] 
[INFO] --- tycho-packaging-plugin:1.0.0:validate-version (default-validate-version) @ org.eclipse.papyrus.sysml14.edit.tests ---
[INFO] 
[INFO] --- maven-resources-plugin:2.7:resources (default-resources) @ org.eclipse.papyrus.sysml14.edit.tests ---
[INFO] Using 'UTF-8' encoding to copy filtered resources.
[INFO] skip non existing resourceDirectory /jobs/genie.papyrus/papyrus-sysml-gerrit/workspace/core/org.eclipse.papyrus.sysml14.edit.tests/src/main/resources
[INFO] 
[INFO] --- tycho-compiler-plugin:1.0.0:compile (default-compile) @ org.eclipse.papyrus.sysml14.edit.tests ---
[INFO] Compiling 1 source file to /jobs/genie.papyrus/papyrus-sysml-gerrit/workspace/core/org.eclipse.papyrus.sysml14.edit.tests/target/classes
[INFO] 
[INFO] --- maven-resources-plugin:2.7:testResources (default-testResources) @ org.eclipse.papyrus.sysml14.edit.tests ---
[INFO] Using 'UTF-8' encoding to copy filtered resources.
[INFO] skip non existing resourceDirectory /jobs/genie.papyrus/papyrus-sysml-gerrit/workspace/core/org.eclipse.papyrus.sysml14.edit.tests/src/test/resources
[INFO] 
[INFO] --- tycho-source-plugin:1.0.0:plugin-source (plugin-source) @ org.eclipse.papyrus.sysml14.edit.tests ---
[INFO] Building jar: /jobs/genie.papyrus/papyrus-sysml-gerrit/workspace/core/org.eclipse.papyrus.sysml14.edit.tests/target/org.eclipse.papyrus.sysml14.edit.tests-1.3.1-SNAPSHOT-sources.jar
[INFO] 
[INFO] --- target-platform-configuration:1.0.0:target-platform (default-target-platform) @ org.eclipse.papyrus.sysml14.edit.tests ---
[INFO] 
[INFO] --- tycho-packaging-plugin:1.0.0:package-plugin (default-package-plugin) @ org.eclipse.papyrus.sysml14.edit.tests ---
[INFO] Building jar: /jobs/genie.papyrus/papyrus-sysml-gerrit/workspace/core/org.eclipse.papyrus.sysml14.edit.tests/target/org.eclipse.papyrus.sysml14.edit.tests-1.3.1-SNAPSHOT.jar
[INFO] 
[INFO] --- tycho-p2-plugin:1.0.0:p2-metadata-default (default-p2-metadata-default) @ org.eclipse.papyrus.sysml14.edit.tests ---
[INFO] 
[INFO] --- tycho-source-feature-plugin:1.0.0:source-feature (source-feature) @ org.eclipse.papyrus.sysml14.edit.tests ---
[INFO] 
[INFO] --- tycho-p2-plugin:1.0.0:p2-metadata (attach-p2-metadata) @ org.eclipse.papyrus.sysml14.edit.tests ---
[INFO] 
[INFO] --- tycho-surefire-plugin:1.0.0:test (default-test) @ org.eclipse.papyrus.sysml14.edit.tests ---
[INFO] Expected eclipse log file: /jobs/genie.papyrus/papyrus-sysml-gerrit/workspace/core/org.eclipse.papyrus.sysml14.edit.tests/target/work/data/.metadata/.log
[INFO] Command line:
	[/opt/public/common/java/oracle/jdk1.8.0_162_x64/jre/bin/java, -Dosgi.noShutdown=false, -Dosgi.os=linux, -Dosgi.ws=gtk, -Dosgi.arch=x86_64, -Dosgi.clean=true, -jar, /jobs/genie.papyrus/papyrus-sysml-gerrit/workspace/.repository/p2/osgi/bundle/org.eclipse.equinox.launcher/1.5.0.v20180512-1130/org.eclipse.equinox.launcher-1.5.0.v20180512-1130.jar, -data, /jobs/genie.papyrus/papyrus-sysml-gerrit/workspace/core/org.eclipse.papyrus.sysml14.edit.tests/target/work/data, -install, /jobs/genie.papyrus/papyrus-sysml-gerrit/workspace/core/org.eclipse.papyrus.sysml14.edit.tests/target/work, -configuration, /jobs/genie.papyrus/papyrus-sysml-gerrit/workspace/core/org.eclipse.papyrus.sysml14.edit.tests/target/work/configuration, -application, org.eclipse.tycho.surefire.osgibooter.uitest, -testproperties, /jobs/genie.papyrus/papyrus-sysml-gerrit/workspace/core/org.eclipse.papyrus.sysml14.edit.tests/target/surefire.properties]
Picked up JAVA_TOOL_OPTIONS: -Xmx2G -Djava.io.tmpdir=/tmp/genie.papyrus

-------------------------------------------------------
 T E S T S
-------------------------------------------------------
Running org.eclipse.papyrus.sysml14.edit.tests.requirements.provider.RequirementItemProviderTest
Tests run: 1, Failures: 0, Errors: 0, Skipped: 1, Time elapsed: 0.02 sec - in org.eclipse.papyrus.sysml14.edit.tests.requirements.provider.RequirementItemProviderTest
testProfilRegistration(org.eclipse.papyrus.sysml14.edit.tests.requirements.provider.RequirementItemProviderTest) skipped

Results :

Tests run: 1, Failures: 0, Errors: 0, Skipped: 1

[INFO] All tests passed!
[INFO] 
[INFO] --< org.eclipse.papyrus.sysml:org.eclipse.papyrus.sysml14.service.types >--
[INFO] Building org.eclipse.papyrus.sysml14.service.types 1.3.1-SNAPSHOT [9/36]
[INFO] ---------------------------[ eclipse-plugin ]---------------------------
[INFO] 
[INFO] --- maven-clean-plugin:3.0.0:clean (default-clean) @ org.eclipse.papyrus.sysml14.service.types ---
[INFO] Deleting /jobs/genie.papyrus/papyrus-sysml-gerrit/workspace/core/org.eclipse.papyrus.sysml14.service.types/target
[INFO] 
[INFO] --- tycho-packaging-plugin:1.0.0:build-qualifier (default-build-qualifier) @ org.eclipse.papyrus.sysml14.service.types ---
[INFO] The project's OSGi version is 1.3.1.201809171217
[INFO] 
[INFO] --- tycho-packaging-plugin:1.0.0:validate-id (default-validate-id) @ org.eclipse.papyrus.sysml14.service.types ---
[INFO] 
[INFO] --- tycho-packaging-plugin:1.0.0:validate-version (default-validate-version) @ org.eclipse.papyrus.sysml14.service.types ---
[INFO] ------------------------------------------------------------------------
[INFO] Reactor Summary:
[INFO] 
[INFO] SysML 1.3.1-SNAPSHOT ............................... SUCCESS [  4.318 s]
[INFO] SysML Target Platform .............................. SUCCESS [  0.008 s]
[INFO] org.eclipse.papyrus.sysml14.targetplatform.photon .. SUCCESS [  0.129 s]
[INFO] SysML Core ......................................... SUCCESS [  0.004 s]
[INFO] org.eclipse.papyrus.sysml14 ........................ SUCCESS [01:14 min]
[INFO] org.eclipse.papyrus.sysml14.tests .................. SUCCESS [  9.772 s]
[INFO] org.eclipse.papyrus.sysml14.edit ................... SUCCESS [  0.703 s]
[INFO] org.eclipse.papyrus.sysml14.edit.tests ............. SUCCESS [ 11.489 s]
[INFO] org.eclipse.papyrus.sysml14.service.types .......... FAILURE [  0.138 s]
[INFO] org.eclipse.papyrus.sysml14.service.types.tests .... SKIPPED
[INFO] org.eclipse.papyrus.sysml14.validation ............. SKIPPED
[INFO] SysML Diagram ...................................... SKIPPED
[INFO] org.eclipse.papyrus.sysml14.diagram.common ......... SKIPPED
[INFO] org.eclipse.papyrus.sysml14.diagram.common.tests ... SKIPPED
[INFO] org.eclipse.papyrus.sysml14.diagram.blockdefinition  SKIPPED
[INFO] org.eclipse.papyrus.sysml14.diagram.blockdefinition.tests SKIPPED
[INFO] org.eclipse.papyrus.sysml14.diagram.internalblock .. SKIPPED
[INFO] org.eclipse.papyrus.sysml14.diagram.internalblock.tests SKIPPED
[INFO] org.eclipse.papyrus.sysml14.diagram.parametric ..... SKIPPED
[INFO] org.eclipse.papyrus.sysml14.diagram.parametric.tests SKIPPED
[INFO] org.eclipse.papyrus.sysml14.diagram.requirement .... SKIPPED
[INFO] org.eclipse.papyrus.sysml14.diagram.requirement.tests SKIPPED
[INFO] SysML Table ........................................ SKIPPED
[INFO] org.eclipse.papyrus.sysml14.nattable.common ........ SKIPPED
[INFO] org.eclipse.papyrus.sysml14.nattable.allocation .... SKIPPED
[INFO] org.eclipse.papyrus.sysml14.nattable.allocation.tests SKIPPED
[INFO] org.eclipse.papyrus.sysml14.nattable.requirement ... SKIPPED
[INFO] org.eclipse.papyrus.sysml14.nattable.requirement.tests SKIPPED
[INFO] org.eclipse.papyrus.sysml14.nattable.ui ............ SKIPPED
[INFO] SysML GUI .......................................... SKIPPED
[INFO] org.eclipse.papyrus.sysml14.architecture ........... SKIPPED
[INFO] org.eclipse.papyrus.sysml14.architecture.tests ..... SKIPPED
[INFO] org.eclipse.papyrus.sysml14.ui ..................... SKIPPED
[INFO] org.eclipse.papyrus.sysml14.ui.tests ............... SKIPPED
[INFO] SysML Releng ....................................... SKIPPED
[INFO] org.eclipse.papyrus.sysml14.feature 1.3.1-SNAPSHOT . SKIPPED
[INFO] ------------------------------------------------------------------------
[INFO] BUILD FAILURE
[INFO] ------------------------------------------------------------------------
[INFO] Total time: 07:42 min
[INFO] Finished at: 2018-09-17T08:25:29-04:00
[INFO] ------------------------------------------------------------------------
[ERROR] Failed to execute goal org.eclipse.tycho:tycho-packaging-plugin:1.0.0:validate-version (default-validate-version) on project org.eclipse.papyrus.sysml14.service.types: Unqualified OSGi version 1.3.2.qualifier must match unqualified Maven version 1.3.1-SNAPSHOT for SNAPSHOT builds -> [Help 1]
[ERROR] 
[ERROR] To see the full stack trace of the errors, re-run Maven with the -e switch.
[ERROR] Re-run Maven using the -X switch to enable full debug logging.
[ERROR] 
[ERROR] For more information about the errors and possible solutions, please read the following articles:
[ERROR] [Help 1] http://cwiki.apache.org/confluence/display/MAVEN/MojoExecutionException
[ERROR] 
[ERROR] After correcting the problems, you can resume the build with the command
[ERROR]   mvn <goals> -rf :org.eclipse.papyrus.sysml14.service.types
Build step 'Invoke top-level Maven targets' marked build as failure
Terminating xvnc.
Recording test results
Started calculate disk usage of build
Finished Calculation of disk usage of build in 0 seconds
Started calculate disk usage of workspace
Finished Calculation of disk usage of workspace in 0 seconds
Finished: FAILURE