UnstableConsole Output

Skipping 4,097 KB.. Full Log
on:1.0.0:target-platform (default-target-platform) @ org.eclipse.papyrus.uml.validation.tests.genvalidation ---
01:23:05 [INFO] 
01:23:05 [INFO] --- tycho-packaging-plugin:1.0.0:package-plugin (default-package-plugin) @ org.eclipse.papyrus.uml.validation.tests.genvalidation ---
01:23:05 [INFO] Building jar: /jobs/genie.papyrus/Papyrus-Oxygen-Tests/workspace/source/tests/junit/plugins/uml/validation/org.eclipse.papyrus.uml.validation.tests.genvalidation/target/org.eclipse.papyrus.uml.validation.tests.genvalidation-1.2.0-SNAPSHOT.jar
01:23:05 [INFO] 
01:23:05 [INFO] --- tycho-p2-plugin:1.0.0:p2-metadata-default (default-p2-metadata-default) @ org.eclipse.papyrus.uml.validation.tests.genvalidation ---
01:23:05 [INFO] 
01:23:05 [INFO] --- tycho-surefire-plugin:1.0.0:test (default-test) @ org.eclipse.papyrus.uml.validation.tests.genvalidation ---
01:23:05 [INFO] Skipping tests
01:23:05 [INFO] 
01:23:05 [INFO] --- jacoco-maven-plugin:0.7.9:report (default-report) @ org.eclipse.papyrus.uml.validation.tests.genvalidation ---
01:23:05 [INFO] Skipping JaCoCo execution due to missing execution data file.
01:23:05 [INFO] 
01:23:05 [INFO] --< org.eclipse.papyrus.tests:org.eclipse.papyrus.uml.validation.tests >--
01:23:05 [INFO] Building org.eclipse.papyrus.uml.validation.tests 1.2.0-SNAPSHOT [146/155]
01:23:05 [INFO] ------------------------[ eclipse-test-plugin ]-------------------------
01:23:05 [INFO] 
01:23:05 [INFO] --- maven-clean-plugin:2.6:clean (default-clean) @ org.eclipse.papyrus.uml.validation.tests ---
01:23:05 [INFO] 
01:23:05 [INFO] --- tycho-packaging-plugin:1.0.0:build-qualifier (default-build-qualifier) @ org.eclipse.papyrus.uml.validation.tests ---
01:23:05 [INFO] The project's OSGi version is 1.2.0.201911210536
01:23:05 [INFO] 
01:23:05 [INFO] --- tycho-packaging-plugin:1.0.0:validate-id (default-validate-id) @ org.eclipse.papyrus.uml.validation.tests ---
01:23:05 [INFO] 
01:23:05 [INFO] --- tycho-packaging-plugin:1.0.0:validate-version (default-validate-version) @ org.eclipse.papyrus.uml.validation.tests ---
01:23:05 [INFO] 
01:23:05 [INFO] --- jacoco-maven-plugin:0.7.9:prepare-agent (default-prepare-agent) @ org.eclipse.papyrus.uml.validation.tests ---
01:23:05 [INFO] tycho.testArgLine set to -javaagent:/home/hudson/genie.papyrus/.jenkins/jobs/Papyrus-Oxygen-Tests/workspace/.repository/org/jacoco/org.jacoco.agent/0.7.9/org.jacoco.agent-0.7.9-runtime.jar=destfile=/jobs/genie.papyrus/Papyrus-Oxygen-Tests/workspace/source/tests/junit/plugins/uml/validation/org.eclipse.papyrus.uml.validation.tests/target/jacoco.exec,includes=org.eclipse.papyrus.*,excludes=org.eclipse.uml2
01:23:05 [INFO] 
01:23:05 [INFO] --- maven-resources-plugin:2.6:resources (default-resources) @ org.eclipse.papyrus.uml.validation.tests ---
01:23:05 [INFO] Using 'UTF-8' encoding to copy filtered resources.
01:23:05 [INFO] skip non existing resourceDirectory /jobs/genie.papyrus/Papyrus-Oxygen-Tests/workspace/source/tests/junit/plugins/uml/validation/org.eclipse.papyrus.uml.validation.tests/src/main/resources
01:23:05 [INFO] 
01:23:05 [INFO] --- tycho-compiler-plugin:1.0.0:compile (default-compile) @ org.eclipse.papyrus.uml.validation.tests ---
01:23:05 [INFO] Compiling 10 source files to /jobs/genie.papyrus/Papyrus-Oxygen-Tests/workspace/source/tests/junit/plugins/uml/validation/org.eclipse.papyrus.uml.validation.tests/target/classes
01:23:05 [INFO] 
01:23:05 [INFO] --- maven-resources-plugin:2.6:testResources (default-testResources) @ org.eclipse.papyrus.uml.validation.tests ---
01:23:05 [INFO] Using 'UTF-8' encoding to copy filtered resources.
01:23:05 [INFO] skip non existing resourceDirectory /jobs/genie.papyrus/Papyrus-Oxygen-Tests/workspace/source/tests/junit/plugins/uml/validation/org.eclipse.papyrus.uml.validation.tests/src/test/resources
01:23:05 [INFO] 
01:23:05 [INFO] --- target-platform-configuration:1.0.0:target-platform (default-target-platform) @ org.eclipse.papyrus.uml.validation.tests ---
01:23:05 [INFO] 
01:23:05 [INFO] --- tycho-packaging-plugin:1.0.0:package-plugin (default-package-plugin) @ org.eclipse.papyrus.uml.validation.tests ---
01:23:05 [INFO] Building jar: /jobs/genie.papyrus/Papyrus-Oxygen-Tests/workspace/source/tests/junit/plugins/uml/validation/org.eclipse.papyrus.uml.validation.tests/target/org.eclipse.papyrus.uml.validation.tests-1.2.0-SNAPSHOT.jar
01:23:05 [INFO] 
01:23:05 [INFO] --- tycho-p2-plugin:1.0.0:p2-metadata-default (default-p2-metadata-default) @ org.eclipse.papyrus.uml.validation.tests ---
01:23:05 [INFO] 
01:23:05 [INFO] --- tycho-surefire-plugin:1.0.0:test (default-test) @ org.eclipse.papyrus.uml.validation.tests ---
01:23:05 [INFO] Skipping tests
01:23:05 [INFO] 
01:23:05 [INFO] --- jacoco-maven-plugin:0.7.9:report (default-report) @ org.eclipse.papyrus.uml.validation.tests ---
01:23:05 [INFO] Skipping JaCoCo execution due to missing execution data file.
01:23:05 [INFO] 
01:23:05 [INFO] ---< org.eclipse.papyrus.tests:org.eclipse.papyrus.uml.suite.tests >----
01:23:05 [INFO] Building org.eclipse.papyrus.uml.suite.tests 0.0.1-SNAPSHOT    [147/155]
01:23:05 [INFO] ------------------------[ eclipse-test-plugin ]-------------------------
01:23:06 [INFO] 
01:23:06 [INFO] --- maven-clean-plugin:2.6:clean (default-clean) @ org.eclipse.papyrus.uml.suite.tests ---
01:23:06 [INFO] 
01:23:06 [INFO] --- tycho-packaging-plugin:1.0.0:build-qualifier (default-build-qualifier) @ org.eclipse.papyrus.uml.suite.tests ---
01:23:06 [INFO] The project's OSGi version is 0.0.1.201911210536
01:23:06 [INFO] 
01:23:06 [INFO] --- tycho-packaging-plugin:1.0.0:validate-id (default-validate-id) @ org.eclipse.papyrus.uml.suite.tests ---
01:23:06 [INFO] 
01:23:06 [INFO] --- tycho-packaging-plugin:1.0.0:validate-version (default-validate-version) @ org.eclipse.papyrus.uml.suite.tests ---
01:23:06 [INFO] 
01:23:06 [INFO] --- jacoco-maven-plugin:0.7.9:prepare-agent (default-prepare-agent) @ org.eclipse.papyrus.uml.suite.tests ---
01:23:06 [INFO] tycho.testArgLine set to -javaagent:/home/hudson/genie.papyrus/.jenkins/jobs/Papyrus-Oxygen-Tests/workspace/.repository/org/jacoco/org.jacoco.agent/0.7.9/org.jacoco.agent-0.7.9-runtime.jar=destfile=/jobs/genie.papyrus/Papyrus-Oxygen-Tests/workspace/source/tests/junit/plugins/uml/org.eclipse.papyrus.uml.suite.tests/target/jacoco.exec,includes=org.eclipse.papyrus.*,excludes=org.eclipse.uml2
01:23:06 [INFO] 
01:23:06 [INFO] --- maven-resources-plugin:2.6:resources (default-resources) @ org.eclipse.papyrus.uml.suite.tests ---
01:23:06 [INFO] Using 'UTF-8' encoding to copy filtered resources.
01:23:06 [INFO] skip non existing resourceDirectory /jobs/genie.papyrus/Papyrus-Oxygen-Tests/workspace/source/tests/junit/plugins/uml/org.eclipse.papyrus.uml.suite.tests/src/main/resources
01:23:06 [INFO] 
01:23:06 [INFO] --- tycho-compiler-plugin:1.0.0:compile (default-compile) @ org.eclipse.papyrus.uml.suite.tests ---
01:23:06 [INFO] Compiling 2 source files to /jobs/genie.papyrus/Papyrus-Oxygen-Tests/workspace/source/tests/junit/plugins/uml/org.eclipse.papyrus.uml.suite.tests/target/classes
01:23:06 [INFO] 
01:23:06 [INFO] --- maven-resources-plugin:2.6:testResources (default-testResources) @ org.eclipse.papyrus.uml.suite.tests ---
01:23:06 [INFO] Using 'UTF-8' encoding to copy filtered resources.
01:23:06 [INFO] skip non existing resourceDirectory /jobs/genie.papyrus/Papyrus-Oxygen-Tests/workspace/source/tests/junit/plugins/uml/org.eclipse.papyrus.uml.suite.tests/src/test/resources
01:23:06 [INFO] 
01:23:06 [INFO] --- target-platform-configuration:1.0.0:target-platform (default-target-platform) @ org.eclipse.papyrus.uml.suite.tests ---
01:23:06 [INFO] 
01:23:06 [INFO] --- tycho-packaging-plugin:1.0.0:package-plugin (default-package-plugin) @ org.eclipse.papyrus.uml.suite.tests ---
01:23:06 [INFO] Building jar: /jobs/genie.papyrus/Papyrus-Oxygen-Tests/workspace/source/tests/junit/plugins/uml/org.eclipse.papyrus.uml.suite.tests/target/org.eclipse.papyrus.uml.suite.tests-0.0.1-SNAPSHOT.jar
01:23:06 [INFO] 
01:23:06 [INFO] --- tycho-p2-plugin:1.0.0:p2-metadata-default (default-p2-metadata-default) @ org.eclipse.papyrus.uml.suite.tests ---
01:23:06 [INFO] 
01:23:06 [INFO] --- tycho-surefire-plugin:1.0.0:test (default-test) @ org.eclipse.papyrus.uml.suite.tests ---
01:23:07 [INFO] Expected eclipse log file: /jobs/genie.papyrus/Papyrus-Oxygen-Tests/workspace/source/tests/junit/plugins/uml/org.eclipse.papyrus.uml.suite.tests/target/work/data/.metadata/.log
01:23:07 [INFO] Command line:
01:23:07 	[/opt/public/common/java/oracle/jdk1.8.0_192_x64/jre/bin/java, -Dosgi.noShutdown=false, -Dosgi.os=linux, -Dosgi.ws=gtk, -Dosgi.arch=x86_64, -javaagent:/home/hudson/genie.papyrus/.jenkins/jobs/Papyrus-Oxygen-Tests/workspace/.repository/org/jacoco/org.jacoco.agent/0.7.9/org.jacoco.agent-0.7.9-runtime.jar=destfile=/jobs/genie.papyrus/Papyrus-Oxygen-Tests/workspace/source/tests/junit/plugins/uml/org.eclipse.papyrus.uml.suite.tests/target/jacoco.exec,includes=org.eclipse.papyrus.*,excludes=org.eclipse.uml2, -Xms512m, -Xmx2048m, -XX:SoftRefLRUPolicyMSPerMB=100, -Dosgi.clean=true, -jar, /jobs/genie.papyrus/Papyrus-Oxygen-Tests/workspace/.repository/p2/osgi/bundle/org.eclipse.equinox.launcher/1.4.0.v20161219-1356/org.eclipse.equinox.launcher-1.4.0.v20161219-1356.jar, -data, /jobs/genie.papyrus/Papyrus-Oxygen-Tests/workspace/source/tests/junit/plugins/uml/org.eclipse.papyrus.uml.suite.tests/target/work/data, -install, /jobs/genie.papyrus/Papyrus-Oxygen-Tests/workspace/source/tests/junit/plugins/uml/org.eclipse.papyrus.uml.suite.tests/target/work, -configuration, /jobs/genie.papyrus/Papyrus-Oxygen-Tests/workspace/source/tests/junit/plugins/uml/org.eclipse.papyrus.uml.suite.tests/target/work/configuration, -application, org.eclipse.tycho.surefire.osgibooter.uitest, -testproperties, /jobs/genie.papyrus/Papyrus-Oxygen-Tests/workspace/source/tests/junit/plugins/uml/org.eclipse.papyrus.uml.suite.tests/target/surefire.properties, -product, org.eclipse.sdk.ide, -testConfig=CI_TESTS_CONFIG]
01:23:07 Picked up JAVA_TOOL_OPTIONS: -Xmx2G -Djava.io.tmpdir=/tmp/genie.papyrus -DforkCount=1
01:23:17 
01:23:17 -------------------------------------------------------
01:23:17  T E S T S
01:23:17 -------------------------------------------------------
01:23:17 Running org.eclipse.papyrus.uml.suite.tests.AllTests
01:23:29 Warning: NLS unused message: "Select in: messages
01:23:47 Plugin org.eclipse.papyrus.uml.architecture, extension org.eclipse.papyrus.infra.nattable.common.tableReconciler
01:23:47 Error processing extension: org.eclipse.core.internal.registry.ConfigurationElementHandle@408a
01:26:14 log4j:WARN No appenders could be found for logger (org.eclipse.ocl.pivot.internal.resource.StandaloneProjectMap).
01:26:14 log4j:WARN Please initialize the log4j system properly.
01:27:06 Tests run: 576, Failures: 1, Errors: 0, Skipped: 38, Time elapsed: 228.533 sec <<< FAILURE! - in org.eclipse.papyrus.uml.suite.tests.AllTests
01:27:06 testUML(org.eclipse.papyrus.uml.service.types.tests.creation.CreatePureUMLElementTest)  Time elapsed: 0.047 sec
01:27:06 test(org.eclipse.papyrus.uml.service.types.tests.creation.CreatePureUMLElementTest)  Time elapsed: 0.147 sec
01:27:06 testDeleteOneAddVariableValueAction(org.eclipse.papyrus.uml.service.types.tests.deletion.DeletePureUMLElementTest)  Time elapsed: 0.057 sec
01:27:06 testDeleteOneCentralBufferNode(org.eclipse.papyrus.uml.service.types.tests.deletion.DeletePureUMLElementTest)  Time elapsed: 0.01 sec
01:27:06 stereotypeApplicationsDeleted:command(org.eclipse.papyrus.uml.service.types.tests.deletion.DeleteDependentWithStereotypeApplications458685)  Time elapsed: 1.595 sec
01:27:06 stereotypeApplicationsDeleted:elements(org.eclipse.papyrus.uml.service.types.tests.deletion.DeleteDependentWithStereotypeApplications458685)  Time elapsed: 0 sec
01:27:06 stereotypeApplicationsDeleted:stereotypes(org.eclipse.papyrus.uml.service.types.tests.deletion.DeleteDependentWithStereotypeApplications458685)  Time elapsed: 0 sec
01:27:06 stereotypeApplicationsDeleted:undo(org.eclipse.papyrus.uml.service.types.tests.deletion.DeleteDependentWithStereotypeApplications458685)  Time elapsed: 0 sec
01:27:06 stereotypeApplicationsDeleted:redo(org.eclipse.papyrus.uml.service.types.tests.deletion.DeleteDependentWithStereotypeApplications458685)  Time elapsed: 0 sec
01:27:06 deleteInitialState(org.eclipse.papyrus.uml.service.types.tests.deletion.DeleteTransitionsWithVertexTest)  Time elapsed: 0.38 sec
01:27:06 deleteS1(org.eclipse.papyrus.uml.service.types.tests.deletion.DeleteTransitionsWithVertexTest)  Time elapsed: 0.193 sec
01:27:06 deleteS2(org.eclipse.papyrus.uml.service.types.tests.deletion.DeleteTransitionsWithVertexTest)  Time elapsed: 0.189 sec
01:27:06 deleteFinalState(org.eclipse.papyrus.uml.service.types.tests.deletion.DeleteTransitionsWithVertexTest)  Time elapsed: 0.202 sec
01:27:06 deleteFromContainmentSubset(org.eclipse.papyrus.uml.service.types.tests.deletion.DeleteContainmentSubsetTest)  Time elapsed: 0.114 sec
01:27:06 deleteFromTwoContainmentSupersetsAtOnce(org.eclipse.papyrus.uml.service.types.tests.deletion.DeleteContainmentSubsetTest)  Time elapsed: 0.096 sec
01:27:06 createAssociationWritable(org.eclipse.papyrus.uml.service.types.tests.creation.ConnectorReadOnlyTestBug465899)  Time elapsed: 0.06 sec
01:27:06 createAssociationReadOnly_usecase(org.eclipse.papyrus.uml.service.types.tests.creation.ConnectorReadOnlyTestBug465899)  Time elapsed: 0.21 sec
01:27:06 createAssociationReadOnly(org.eclipse.papyrus.uml.service.types.tests.creation.ConnectorReadOnlyTestBug465899)  Time elapsed: 0.059 sec
01:27:06 createConnectorTargetReadOnly(org.eclipse.papyrus.uml.service.types.tests.creation.ConnectorReadOnlyTestBug465899)  Time elapsed: 0.029 sec
01:27:06 createConnectorSourceReadOnly(org.eclipse.papyrus.uml.service.types.tests.creation.ConnectorReadOnlyTestBug465899)  Time elapsed: 0.041 sec
01:27:06 testDeletion(org.eclipse.papyrus.uml.service.types.tests.deletion.DeleteAssociationPropertyTypeTest)  Time elapsed: 0.03 sec
01:27:06 testDeletionInCompositeDiagram(org.eclipse.papyrus.uml.service.types.tests.deletion.DeleteCommentLinkTest)  Time elapsed: 5.644 sec
01:27:06 testDeletionWithSetRequest(org.eclipse.papyrus.uml.service.types.tests.deletion.DeleteCommentLinkTest) skipped
01:27:06 testDeletionInClassDiagram(org.eclipse.papyrus.uml.service.types.tests.deletion.DeleteCommentLinkTest)  Time elapsed: 1.322 sec
01:27:06 testDeletionInComponentDiagram(org.eclipse.papyrus.uml.service.types.tests.deletion.DeleteCommentLinkTest)  Time elapsed: 1.096 sec
01:27:06 testCreation(org.eclipse.papyrus.uml.service.types.tests.creation.CreateAssociationTest)  Time elapsed: 0.013 sec
01:27:06 testCreation(org.eclipse.papyrus.uml.service.types.tests.creation.CreateAssociationDirectedTest)  Time elapsed: 0.009 sec
01:27:06 testCreation(org.eclipse.papyrus.uml.service.types.tests.creation.CreateAssociationCompositeTest)  Time elapsed: 0.006 sec
01:27:06 testCreation(org.eclipse.papyrus.uml.service.types.tests.creation.CreateAssociationCompositeDirectedTest)  Time elapsed: 0.008 sec
01:27:06 testCreation(org.eclipse.papyrus.uml.service.types.tests.creation.CreateAssociationSharedTest)  Time elapsed: 0.007 sec
01:27:06 testCreation(org.eclipse.papyrus.uml.service.types.tests.creation.CreateAssociationSharedDirectedTest)  Time elapsed: 0.007 sec
01:27:06 deleteInteractionFragmentInOperand(org.eclipse.papyrus.uml.service.types.tests.deletion.InteractionDeletionTest)  Time elapsed: 0.508 sec
01:27:06 deleteAllOperandsOfCombinedFragment(org.eclipse.papyrus.uml.service.types.tests.deletion.InteractionDeletionTest)  Time elapsed: 0.417 sec
01:27:06 deleteCombinedFragment(org.eclipse.papyrus.uml.service.types.tests.deletion.InteractionDeletionTest)  Time elapsed: 0.397 sec
01:27:06 deleteCombinedFragmentNested(org.eclipse.papyrus.uml.service.types.tests.deletion.InteractionDeletionTest)  Time elapsed: 0.379 sec
01:27:06 deleteOperandsOfCombinedFragment(org.eclipse.papyrus.uml.service.types.tests.deletion.InteractionDeletionTest)  Time elapsed: 0.484 sec
01:27:06 deleteCombinedFragmentDeeplyNested(org.eclipse.papyrus.uml.service.types.tests.deletion.InteractionDeletionTest)  Time elapsed: 0.57 sec
01:27:06 deleteInteractionWithNesting(org.eclipse.papyrus.uml.service.types.tests.deletion.InteractionDeletionTest)  Time elapsed: 0.435 sec
01:27:06 deleteInteraction(org.eclipse.papyrus.uml.service.types.tests.deletion.InteractionDeletionTest)  Time elapsed: 1.892 sec
01:27:06 testCreateClassInModel(org.eclipse.papyrus.uml.service.types.ui.tests.creation.CreateElementTest)  Time elapsed: 0.019 sec
01:27:06 testCreateCentralBufferNodeInActivity(org.eclipse.papyrus.uml.service.types.ui.tests.creation.CreateElementTest)  Time elapsed: 0.016 sec
01:27:06 testCreateCentralBufferNodeInActivityWithNode(org.eclipse.papyrus.uml.service.types.ui.tests.creation.CreateElementTest)  Time elapsed: 0.009 sec
01:27:06 testCannotCreateOperationRedefinableTemplateSignature_bug468071(org.eclipse.papyrus.uml.service.types.ui.tests.creation.CreateElementTest)  Time elapsed: 0.001 sec
01:27:06 testCreateOperationTemplateSignature_bug468071(org.eclipse.papyrus.uml.service.types.ui.tests.creation.CreateElementTest)  Time elapsed: 0.009 sec
01:27:06 testCreateModelInClass(org.eclipse.papyrus.uml.service.types.ui.tests.creation.CreateElementTest)  Time elapsed: 0 sec
01:27:06 testCreateDeploymentBetweenNodeAndArtifactInNode(org.eclipse.papyrus.uml.service.types.ui.tests.creation.CreateRelationshipTest)  Time elapsed: 0.005 sec
01:27:06 testCreatePackageMergeBetweenPackageAndPackageInPackage2(org.eclipse.papyrus.uml.service.types.ui.tests.creation.CreateRelationshipTest)  Time elapsed: 0.009 sec
01:27:06 testCreateTraceBetweenClassAndNullInPackage(org.eclipse.papyrus.uml.service.types.ui.tests.creation.CreateRelationshipTest)  Time elapsed: 0.003 sec
01:27:06 testCreateDependencyBetweenClassesInPackage(org.eclipse.papyrus.uml.service.types.ui.tests.creation.CreateRelationshipTest)  Time elapsed: 0.006 sec
01:27:06 testCreateProtocolConformanceBetweenPackageAndPackageInPackage(org.eclipse.papyrus.uml.service.types.ui.tests.creation.CreateRelationshipTest)  Time elapsed: 0.006 sec
01:27:06 testCreateInformationfloweBetweenClasses2InPackage(org.eclipse.papyrus.uml.service.types.ui.tests.creation.CreateRelationshipTest)  Time elapsed: 0.008 sec
01:27:06 testCreateUsageBetweenClassAndNullInPackage(org.eclipse.papyrus.uml.service.types.ui.tests.creation.CreateRelationshipTest)  Time elapsed: 0.002 sec
01:27:06 testCreateAbstractionBetweenPackageAndClassesInModel(org.eclipse.papyrus.uml.service.types.ui.tests.creation.CreateRelationshipTest)  Time elapsed: 0.011 sec
01:27:06 testCreateComponentRealizationBetweenClassAndComponentInComponent(org.eclipse.papyrus.uml.service.types.ui.tests.creation.CreateRelationshipTest)  Time elapsed: 0.011 sec
01:27:06 testCreateAbstractionBetweenClassesInPackage(org.eclipse.papyrus.uml.service.types.ui.tests.creation.CreateRelationshipTest)  Time elapsed: 0.003 sec
01:27:06 testCreateUsageBetweenClassesInPackage(org.eclipse.papyrus.uml.service.types.ui.tests.creation.CreateRelationshipTest)  Time elapsed: 0.002 sec
01:27:06 testCreatePackageImportBetweenPackageAndPackageInPackage(org.eclipse.papyrus.uml.service.types.ui.tests.creation.CreateRelationshipTest)  Time elapsed: 0.006 sec
01:27:06 testCreateComponentRealizationBetweenComponentAndClassInComponent(org.eclipse.papyrus.uml.service.types.ui.tests.creation.CreateRelationshipTest)  Time elapsed: 0.008 sec
01:27:06 testCreateElementImportBetweenPackageAndPackageInPackage(org.eclipse.papyrus.uml.service.types.ui.tests.creation.CreateRelationshipTest)  Time elapsed: 0.007 sec
01:27:06 testCreateDeploymentBetweenNodeAndArtifactInArtifact(org.eclipse.papyrus.uml.service.types.ui.tests.creation.CreateRelationshipTest)  Time elapsed: 0 sec
01:27:06 testCreateGeneralizationBetweenClassesInPackage(org.eclipse.papyrus.uml.service.types.ui.tests.creation.CreateRelationshipTest)  Time elapsed: 0.004 sec
01:27:06 testCreateGeneralizationBetweenClassAndNullInClass(org.eclipse.papyrus.uml.service.types.ui.tests.creation.CreateRelationshipTest)  Time elapsed: 0.002 sec
01:27:06 testCreateDeploymentBetweenArtifactAndNodeInArtifact(org.eclipse.papyrus.uml.service.types.ui.tests.creation.CreateRelationshipTest)  Time elapsed: 0.008 sec
01:27:06 testCreateExtendBetweenClasses2InPackage(org.eclipse.papyrus.uml.service.types.ui.tests.creation.CreateRelationshipTest)  Time elapsed: 0.001 sec
01:27:06 testCreateProtocolConformanceBetweenPackageAndPackageInPackage2(org.eclipse.papyrus.uml.service.types.ui.tests.creation.CreateRelationshipTest)  Time elapsed: 0 sec
01:27:06 testCreateTransitionBetweenInitialAndState(org.eclipse.papyrus.uml.service.types.ui.tests.creation.CreateRelationshipTest) skipped
01:27:06 testCreateInformationfloweBetweenUseCases2InUseCase(org.eclipse.papyrus.uml.service.types.ui.tests.creation.CreateRelationshipTest)  Time elapsed: 0.004 sec
01:27:06 testCreateRefineBetweenClassesInPackage(org.eclipse.papyrus.uml.service.types.ui.tests.creation.CreateRelationshipTest)  Time elapsed: 0.031 sec
01:27:06 testCreateComponentRealizationBetweenClassAndComponentInClass(org.eclipse.papyrus.uml.service.types.ui.tests.creation.CreateRelationshipTest)  Time elapsed: 0.008 sec
01:27:06 testCreateRealizationBetweenClassAndNullInPackage(org.eclipse.papyrus.uml.service.types.ui.tests.creation.CreateRelationshipTest)  Time elapsed: 0.002 sec
01:27:06 testCreateExtensionBetweenClassAndNullInNull(org.eclipse.papyrus.uml.service.types.ui.tests.creation.CreateRelationshipTest)  Time elapsed: 0 sec
01:27:06 testCreateExtendBetweenUseCases2InUseCase(org.eclipse.papyrus.uml.service.types.ui.tests.creation.CreateRelationshipTest)  Time elapsed: 0.012 sec
01:27:06 testCreateElementImportBetweenPackageAndPackageInPackage2(org.eclipse.papyrus.uml.service.types.ui.tests.creation.CreateRelationshipTest)  Time elapsed: 0.003 sec
01:27:06 testCreateAssociationBetweenClassesInPackage(org.eclipse.papyrus.uml.service.types.ui.tests.creation.CreateRelationshipTest)  Time elapsed: 0.003 sec
01:27:06 testCreateTraceBetweenClassesInClass(org.eclipse.papyrus.uml.service.types.ui.tests.creation.CreateRelationshipTest)  Time elapsed: 0.011 sec
01:27:06 testCreateManifestationBetweenArtifactAndPackage2InArtifact(org.eclipse.papyrus.uml.service.types.ui.tests.creation.CreateRelationshipTest)  Time elapsed: 0.008 sec
01:27:06 testCreateSubstitutionBetweenClassesInPackage(org.eclipse.papyrus.uml.service.types.ui.tests.creation.CreateRelationshipTest)  Time elapsed: 0.007 sec
01:27:06 testCreateAbstractionBetweenClassAndNullInPackage(org.eclipse.papyrus.uml.service.types.ui.tests.creation.CreateRelationshipTest)  Time elapsed: 0.001 sec
01:27:06 testCreateAbstractionBetweenClassAndClassInClass(org.eclipse.papyrus.uml.service.types.ui.tests.creation.CreateRelationshipTest)  Time elapsed: 0.004 sec
01:27:06 testCreatePackageMergeBetweenPackageAndPackageInPackage(org.eclipse.papyrus.uml.service.types.ui.tests.creation.CreateRelationshipTest)  Time elapsed: 0.004 sec
01:27:06 testCreateRealizationBetweenClassesInPackage(org.eclipse.papyrus.uml.service.types.ui.tests.creation.CreateRelationshipTest)  Time elapsed: 0.003 sec
01:27:06 testCreateTransitionBetweenStateAndInitial(org.eclipse.papyrus.uml.service.types.ui.tests.creation.CreateRelationshipTest) skipped
01:27:06 testCreateAssociationBetweenClassAndNullInPackage(org.eclipse.papyrus.uml.service.types.ui.tests.creation.CreateRelationshipTest)  Time elapsed: 0.002 sec
01:27:06 testCreateRefineBetweenClassAndNullInPackage(org.eclipse.papyrus.uml.service.types.ui.tests.creation.CreateRelationshipTest)  Time elapsed: 0.002 sec
01:27:06 testCreateDeploymentBetweenArtifactAndNodeInNode(org.eclipse.papyrus.uml.service.types.ui.tests.creation.CreateRelationshipTest)  Time elapsed: 0.005 sec
01:27:06 testCreateIncludeBetweenUseCases2InUseCase(org.eclipse.papyrus.uml.service.types.ui.tests.creation.CreateRelationshipTest)  Time elapsed: 0.006 sec
01:27:06 testCreateGeneralizationBetweenClassesInClass(org.eclipse.papyrus.uml.service.types.ui.tests.creation.CreateRelationshipTest)  Time elapsed: 0.004 sec
01:27:06 testCreateExtensionBetweenClassAndNullInClass(org.eclipse.papyrus.uml.service.types.ui.tests.creation.CreateRelationshipTest)  Time elapsed: 0 sec
01:27:06 testCreateDependencyBetweenClassAndNullInPackage(org.eclipse.papyrus.uml.service.types.ui.tests.creation.CreateRelationshipTest)  Time elapsed: 0.001 sec
01:27:06 testCreatePackageImportBetweenPackageAndPackageInPackage2(org.eclipse.papyrus.uml.service.types.ui.tests.creation.CreateRelationshipTest)  Time elapsed: 0.003 sec
01:27:06 testCreateComponentRealizationBetweenComponentAndClass(org.eclipse.papyrus.uml.service.types.ui.tests.creation.CreateRelationshipTest)  Time elapsed: 0.001 sec
01:27:06 testCreateSubstitutionBetweenClassAndNullInPackage(org.eclipse.papyrus.uml.service.types.ui.tests.creation.CreateRelationshipTest)  Time elapsed: 0.001 sec
01:27:06 testCreateInterfaceRealizationBetweenClassAndInterfaceInClass(org.eclipse.papyrus.uml.service.types.ui.tests.creation.CreateRelationshipTest)  Time elapsed: 0.006 sec
01:27:06 testCreateTraceBetweenClassesInPackage(org.eclipse.papyrus.uml.service.types.ui.tests.creation.CreateRelationshipTest)  Time elapsed: 0.008 sec
01:27:06 testCreateTransitionBetweenStateAndFinal(org.eclipse.papyrus.uml.service.types.ui.tests.creation.CreateRelationshipTest) skipped
01:27:06 testCreateAbstractionBetweenClassAndPackageInModel(org.eclipse.papyrus.uml.service.types.ui.tests.creation.CreateRelationshipTest)  Time elapsed: 0.003 sec
01:27:06 testCreateRefineBetweenClassesInClass(org.eclipse.papyrus.uml.service.types.ui.tests.creation.CreateRelationshipTest)  Time elapsed: 0.008 sec
01:27:06 testCreateTransitionBetweenFinalAndState(org.eclipse.papyrus.uml.service.types.ui.tests.creation.CreateRelationshipTest) skipped
01:27:06 testCreateManifestationBetweenClassAndPackage2InArtifact(org.eclipse.papyrus.uml.service.types.ui.tests.creation.CreateRelationshipTest)  Time elapsed: 0.003 sec
01:27:06 testCreateInterfaceRealizationBetweenUseCases2InUseCase(org.eclipse.papyrus.uml.service.types.ui.tests.creation.CreateRelationshipTest)  Time elapsed: 0.001 sec
01:27:06 testCreateIncludeBetweenClasses2InPackage(org.eclipse.papyrus.uml.service.types.ui.tests.creation.CreateRelationshipTest)  Time elapsed: 0 sec
01:27:06 testCreateExtensionBetweenStereotypeAndMetaClassInPackage(org.eclipse.papyrus.uml.service.types.ui.tests.creation.CreateProfileRelationshipTest)  Time elapsed: 0.013 sec
01:27:06 testMoveTemplateSignatureToOperation_bug468071(org.eclipse.papyrus.uml.service.types.ui.tests.creation.MoveElementTest)  Time elapsed: 0.027 sec
01:27:06 testMoveRedefinableTemplateSignatureToClass_bug468071(org.eclipse.papyrus.uml.service.types.ui.tests.creation.MoveElementTest)  Time elapsed: 0.002 sec
01:27:06 testCannotMoveRedefinableTemplateSignatureToOperation_bug468071(org.eclipse.papyrus.uml.service.types.ui.tests.creation.MoveElementTest)  Time elapsed: 0 sec
01:27:06 testSetTemplateSignatureOfOperation_bug468071(org.eclipse.papyrus.uml.service.types.ui.tests.creation.SetFeatureTest)  Time elapsed: 0.004 sec
01:27:06 testSetRedefinableTemplateSignatureOfClass_bug468071(org.eclipse.papyrus.uml.service.types.ui.tests.creation.SetFeatureTest)  Time elapsed: 0.001 sec
01:27:06 testCannotSetRedefinableTemplateSignatureOfOperation_bug468071(org.eclipse.papyrus.uml.service.types.ui.tests.creation.SetFeatureTest)  Time elapsed: 0 sec
01:27:06 deleteAssociation(org.eclipse.papyrus.uml.service.types.ui.tests.deletion.DeleteAssociationTest)  Time elapsed: 0.209 sec
01:27:06 deleteAssociationTarget(org.eclipse.papyrus.uml.service.types.ui.tests.deletion.DeleteAssociationTest)  Time elapsed: 0.186 sec
01:27:06 deleteReadOnlyElement(org.eclipse.papyrus.uml.modelexplorer.tests.DeleteModelExplorerTest)  Time elapsed: 1.646 sec
01:27:06 deleteClassInTheModel(org.eclipse.papyrus.uml.modelexplorer.tests.DeleteModelExplorerTest)  Time elapsed: 1.064 sec
01:27:06 deleteRootOfTheModel(org.eclipse.papyrus.uml.modelexplorer.tests.DeleteModelExplorerTest)  Time elapsed: 0.941 sec
01:27:06 renameUMLUnnamedElementTest(org.eclipse.papyrus.uml.modelexplorer.tests.RenameHandlerTest) skipped
01:27:06 renameUMLNamedElementTest(org.eclipse.papyrus.uml.modelexplorer.tests.RenameHandlerTest) skipped
01:27:06 revealSemanticElement_selectRootTest(org.eclipse.papyrus.uml.modelexplorer.tests.ModelExplorerViewTests)  Time elapsed: 1.162 sec
01:27:06 revealSemanticElement_selectChildrenTest(org.eclipse.papyrus.uml.modelexplorer.tests.ModelExplorerViewTests)  Time elapsed: 1.127 sec
01:27:06 revealSemanticElement_selectImportedPackage(org.eclipse.papyrus.uml.modelexplorer.tests.ModelExplorerViewTests)  Time elapsed: 1.118 sec
01:27:06 revealSemanticElement_selectImportedPackageList(org.eclipse.papyrus.uml.modelexplorer.tests.ModelExplorerViewTests)  Time elapsed: 1.153 sec
01:27:06 revealSemanticElement_selectChildrenTestList(org.eclipse.papyrus.uml.modelexplorer.tests.ModelExplorerViewTests)  Time elapsed: 1.14 sec
01:27:06 cutReadOnlyElement(org.eclipse.papyrus.uml.modelexplorer.tests.paste.CutPasteModelExplorerTest)  Time elapsed: 0.857 sec
01:27:06 cutClassTest(org.eclipse.papyrus.uml.modelexplorer.tests.paste.CutPasteModelExplorerTest)  Time elapsed: 0.984 sec
01:27:06 cutRootOfTheModel(org.eclipse.papyrus.uml.modelexplorer.tests.paste.CutPasteModelExplorerTest)  Time elapsed: 0.814 sec
01:27:06 copyPasteofClass1Test(org.eclipse.papyrus.uml.modelexplorer.tests.paste.CopyPasteModelExplorerTest)  Time elapsed: 0.757 sec
01:27:06 pasteOnReadOnlyElement(org.eclipse.papyrus.uml.modelexplorer.tests.paste.CopyPasteModelExplorerTest)  Time elapsed: 0.79 sec
01:27:06 copyPasteofClass1And2Test(org.eclipse.papyrus.uml.modelexplorer.tests.paste.CopyPasteModelExplorerTest)  Time elapsed: 0.724 sec
01:27:06 copyPasteDiagramTest(org.eclipse.papyrus.uml.modelexplorer.tests.paste.DiagramCopyPasteModelExplorerTest)  Time elapsed: 0.769 sec
01:27:06 copyPasteTableTest(org.eclipse.papyrus.uml.modelexplorer.tests.paste.TableCopyPasteModelExplorerTest)  Time elapsed: 0.681 sec  <<< FAILURE!
01:27:06 java.lang.AssertionError: TableOfViews0 TreeElement is null
01:27:06 	at org.junit.Assert.fail(Assert.java:88)
01:27:06 	at org.junit.Assert.assertTrue(Assert.java:41)
01:27:06 	at org.junit.Assert.assertNotNull(Assert.java:712)
01:27:06 	at org.eclipse.papyrus.uml.modelexplorer.tests.paste.TableCopyPasteModelExplorerTest.copyPasteTableTest(TableCopyPasteModelExplorerTest.java:119)
01:27:06 
01:27:06 copyPasteofClass1Test(org.eclipse.papyrus.uml.modelexplorer.tests.paste.StereotypeCopyPasteModelExplorerTest)  Time elapsed: 1.181 sec
01:27:06 advancedModeDoesNotCollapseItself(org.eclipse.papyrus.uml.modelexplorer.tests.AdvancedModeTest)  Time elapsed: 1.772 sec
01:27:06 dropInterface(org.eclipse.papyrus.uml.diagram.dnd.tests.tests.InstanceSpecificationTest)  Time elapsed: 0.106 sec
01:27:06 dropClass(org.eclipse.papyrus.uml.diagram.dnd.tests.tests.InstanceSpecificationTest)  Time elapsed: 0.022 sec
01:27:06 testPropertyContentProvider(org.eclipse.papyrus.uml.diagram.dnd.tests.tests.InstanceSpecificationTest)  Time elapsed: 0.003 sec
01:27:06 dropClassAndInterface(org.eclipse.papyrus.uml.diagram.dnd.tests.tests.InstanceSpecificationTest)  Time elapsed: 0.034 sec
01:27:06 dropClassAndSuperclass(org.eclipse.papyrus.uml.diagram.dnd.tests.tests.InstanceSpecificationTest)  Time elapsed: 0.041 sec
01:27:06 singleValuePropertyGraphicalTest(org.eclipse.papyrus.uml.tools.tests.tests.ContentProviderTest)  Time elapsed: 0.086 sec
01:27:06 singleValuePropertyTest(org.eclipse.papyrus.uml.tools.tests.tests.ContentProviderTest)  Time elapsed: 0.023 sec
01:27:06 multipleValuePropertyTest(org.eclipse.papyrus.uml.tools.tests.tests.ContentProviderTest) skipped
01:27:06 enumPropertyTest(org.eclipse.papyrus.uml.tools.tests.tests.ContentProviderTest)  Time elapsed: 0.007 sec
01:27:06 testProfileContentWithBaseClassPropertyWithoutInheritedProperties(org.eclipse.papyrus.uml.tools.tests.tests.UMLStereotypePropertyContentProviderTest)  Time elapsed: 0.181 sec
01:27:06 testProfileContentWithoutBaseClassPropertyWithoutInheritedProperties(org.eclipse.papyrus.uml.tools.tests.tests.UMLStereotypePropertyContentProviderTest)  Time elapsed: 0.158 sec
01:27:06 testProfileContentWithBaseClassPropertyWithInheritedProperties(org.eclipse.papyrus.uml.tools.tests.tests.UMLStereotypePropertyContentProviderTest)  Time elapsed: 0.141 sec
01:27:06 testProfileContentWithoutBaseClassPropertyWithInheritedProperties(org.eclipse.papyrus.uml.tools.tests.tests.UMLStereotypePropertyContentProviderTest)  Time elapsed: 0.134 sec
01:27:06 testSwitchToProxy(org.eclipse.papyrus.uml.tools.tests.tests.DependencyManagementTest) skipped
01:27:06 testSwitchProfilesWithStereotypes(org.eclipse.papyrus.uml.tools.tests.tests.DependencyManagementTest)  Time elapsed: 1.348 sec
01:27:06 testSwitchFromRegistererdToLocal(org.eclipse.papyrus.uml.tools.tests.tests.DependencyManagementTest)  Time elapsed: 1.565 sec
01:27:06 testSwitchProfilesWithStereotypeProperties(org.eclipse.papyrus.uml.tools.tests.tests.DependencyManagementTest)  Time elapsed: 1.286 sec
01:27:06 testSwitchProfilesWithMissingDefinitions(org.eclipse.papyrus.uml.tools.tests.tests.DependencyManagementTest)  Time elapsed: 1.228 sec
01:27:06 testSwitchFromLocalToRegistered(org.eclipse.papyrus.uml.tools.tests.tests.DependencyManagementTest)  Time elapsed: 1.267 sec
01:27:06 testSwitchToDifferentVersion(org.eclipse.papyrus.uml.tools.tests.tests.DependencyManagementTest) skipped
01:27:06 testSimpleSwitch(org.eclipse.papyrus.uml.tools.tests.tests.DependencyManagementTest)  Time elapsed: 1.428 sec
01:27:06 testSwitchFromProxy(org.eclipse.papyrus.uml.tools.tests.tests.DependencyManagementTest) skipped
01:27:06 testSwitchProfilesStereotypeIdentities(org.eclipse.papyrus.uml.tools.tests.tests.DependencyManagementTest)  Time elapsed: 1.183 sec
01:27:06 testSwitchProfilesWithRequiredStereotypes(org.eclipse.papyrus.uml.tools.tests.tests.DependencyManagementTest)  Time elapsed: 1.18 sec
01:27:06 testOverloadDoesNotClash(org.eclipse.papyrus.uml.tools.tests.tests.NamedElementValidatorTest)  Time elapsed: 0.031 sec
01:27:06 testNameClash(org.eclipse.papyrus.uml.tools.tests.tests.NamedElementValidatorTest)  Time elapsed: 0.027 sec
01:27:06 testElementOfDifferentKindDoesNotClash(org.eclipse.papyrus.uml.tools.tests.tests.NamedElementValidatorTest)  Time elapsed: 0.026 sec
01:27:06 testModifiedSysMLStereotype(org.eclipse.papyrus.uml.tools.tests.tests.StereotypeElementListenerTest) skipped
01:27:06 testUndoUnapplyProfile(org.eclipse.papyrus.uml.tools.tests.tests.StereotypeElementListenerTest)  Time elapsed: 0.278 sec
01:27:06 testAddStereotype(org.eclipse.papyrus.uml.tools.tests.tests.StereotypeElementListenerTest)  Time elapsed: 0.378 sec
01:27:06 testStereotypeUnsetAttributeChange(org.eclipse.papyrus.uml.tools.tests.tests.StereotypeElementListenerTest)  Time elapsed: 0.469 sec
01:27:06 testUndoAddStereotype(org.eclipse.papyrus.uml.tools.tests.tests.StereotypeElementListenerTest)  Time elapsed: 0.525 sec
01:27:06 testAddStereotypes(org.eclipse.papyrus.uml.tools.tests.tests.StereotypeElementListenerTest)  Time elapsed: 0.564 sec
01:27:06 testUndoRemoveStereotype(org.eclipse.papyrus.uml.tools.tests.tests.StereotypeElementListenerTest)  Time elapsed: 0.292 sec
01:27:06 testAddSysMLStereotype(org.eclipse.papyrus.uml.tools.tests.tests.StereotypeElementListenerTest)  Time elapsed: 0.449 sec
01:27:06 testModifiedStereotype(org.eclipse.papyrus.uml.tools.tests.tests.StereotypeElementListenerTest)  Time elapsed: 0.312 sec
01:27:06 testAddStereotypeOnSeveralElements(org.eclipse.papyrus.uml.tools.tests.tests.StereotypeElementListenerTest)  Time elapsed: 0.374 sec
01:27:06 testUndoAddStereotypes(org.eclipse.papyrus.uml.tools.tests.tests.StereotypeElementListenerTest)  Time elapsed: 0.583 sec
01:27:06 testFakeBasedProperty(org.eclipse.papyrus.uml.tools.tests.tests.StereotypeElementListenerTest)  Time elapsed: 0.337 sec
01:27:06 testRemoveStereotype(org.eclipse.papyrus.uml.tools.tests.tests.StereotypeElementListenerTest)  Time elapsed: 0.401 sec
01:27:06 testRemoveSysMLStereotype(org.eclipse.papyrus.uml.tools.tests.tests.StereotypeElementListenerTest)  Time elapsed: 0.355 sec
01:27:06 testUndoAddSysMLStereotype(org.eclipse.papyrus.uml.tools.tests.tests.StereotypeElementListenerTest)  Time elapsed: 0.317 sec
01:27:06 testUndoModifiedStereotype(org.eclipse.papyrus.uml.tools.tests.tests.StereotypeElementListenerTest)  Time elapsed: 0.371 sec
01:27:06 testUndoAddStereotypeOnSeveralElements(org.eclipse.papyrus.uml.tools.tests.tests.StereotypeElementListenerTest)  Time elapsed: 0.392 sec
01:27:06 testUndoRedoAddStereotypeTiming(org.eclipse.papyrus.uml.tools.tests.tests.StereotypeElementListenerTest)  Time elapsed: 0.364 sec
01:27:06 testUnapplyProfile(org.eclipse.papyrus.uml.tools.tests.tests.StereotypeElementListenerTest)  Time elapsed: 0.417 sec
01:27:06 testUndoRemoveSysMLStereotype(org.eclipse.papyrus.uml.tools.tests.tests.StereotypeElementListenerTest)  Time elapsed: 0.421 sec
01:27:06 testUndoModifiedSysMLStereotype(org.eclipse.papyrus.uml.tools.tests.tests.StereotypeElementListenerTest) skipped
01:27:06 testStereotypeListAttributeChange(org.eclipse.papyrus.uml.tools.tests.tests.StereotypeElementListenerTest)  Time elapsed: 0.411 sec
01:27:06 twoProfilesUnapplied(org.eclipse.papyrus.uml.tools.tests.tests.ProfileApplicationListenerTest)  Time elapsed: 0.085 sec
01:27:06 moveProfileApplication(org.eclipse.papyrus.uml.tools.tests.tests.ProfileApplicationListenerTest)  Time elapsed: 0.106 sec
01:27:06 applyProfileThenMoveApplication(org.eclipse.papyrus.uml.tools.tests.tests.ProfileApplicationListenerTest)  Time elapsed: 0.1 sec
01:27:06 twoProfilesApplied(org.eclipse.papyrus.uml.tools.tests.tests.ProfileApplicationListenerTest)  Time elapsed: 0.103 sec
01:27:06 profileReplacedInAnApplication(org.eclipse.papyrus.uml.tools.tests.tests.ProfileApplicationListenerTest)  Time elapsed: 0.096 sec
01:27:06 simpleNewProfileApplication(org.eclipse.papyrus.uml.tools.tests.tests.ProfileApplicationListenerTest)  Time elapsed: 0.096 sec
01:27:06 simpleProfileUnapplication(org.eclipse.papyrus.uml.tools.tests.tests.ProfileApplicationListenerTest)  Time elapsed: 0.091 sec
01:27:06 profileAppliedThenReplacedInSameApplication(org.eclipse.papyrus.uml.tools.tests.tests.ProfileApplicationListenerTest)  Time elapsed: 0.102 sec
01:27:06 testEditToDisplaySingleString_1(org.eclipse.papyrus.uml.tools.tests.tests.UMLReferenceConverterTest)  Time elapsed: 0.053 sec
01:27:06 testList(org.eclipse.papyrus.uml.tools.tests.tests.UMLReferenceConverterTest)  Time elapsed: 0.051 sec
01:27:06 testNull(org.eclipse.papyrus.uml.tools.tests.tests.UMLReferenceConverterTest)  Time elapsed: 0.042 sec
01:27:06 testDisplayToEditString_1(org.eclipse.papyrus.uml.tools.tests.tests.UMLReferenceConverterTest)  Time elapsed: 0.056 sec
01:27:06 testEmptyString(org.eclipse.papyrus.uml.tools.tests.tests.UMLReferenceConverterTest)  Time elapsed: 0.031 sec
01:27:06 testClass2(org.eclipse.papyrus.uml.tools.tests.tests.UMLReferenceConverterTest)  Time elapsed: 0.025 sec
01:27:06 testClass3(org.eclipse.papyrus.uml.tools.tests.tests.UMLReferenceConverterTest)  Time elapsed: 0.019 sec
01:27:06 testMatchingElementstSingleValue1(org.eclipse.papyrus.uml.tools.tests.tests.UMLReferenceConverterTest)  Time elapsed: 0.023 sec
01:27:06 testMatchingElementstSingleValue2(org.eclipse.papyrus.uml.tools.tests.tests.UMLReferenceConverterTest)  Time elapsed: 0.019 sec
01:27:06 testCompletionToFindClass_1(org.eclipse.papyrus.uml.tools.tests.tests.UMLReferenceConverterCompletionTest)  Time elapsed: 0.04 sec
01:27:06 testCompletionToFindClass_3(org.eclipse.papyrus.uml.tools.tests.tests.UMLReferenceConverterCompletionTest)  Time elapsed: 0.025 sec
01:27:06 testCompletionToFindClass_4(org.eclipse.papyrus.uml.tools.tests.tests.UMLReferenceConverterCompletionTest)  Time elapsed: 0.026 sec
01:27:06 testCompletionToFindClass_5(org.eclipse.papyrus.uml.tools.tests.tests.UMLReferenceConverterCompletionTest)  Time elapsed: 0.027 sec
01:27:06 testCompletionToFindClass_6(org.eclipse.papyrus.uml.tools.tests.tests.UMLReferenceConverterCompletionTest)  Time elapsed: 0.027 sec
01:27:06 testCompletionToFindClass_7(org.eclipse.papyrus.uml.tools.tests.tests.UMLReferenceConverterCompletionTest)  Time elapsed: 0.032 sec
01:27:06 testCompletionToFindClass_8(org.eclipse.papyrus.uml.tools.tests.tests.UMLReferenceConverterCompletionTest)  Time elapsed: 0.033 sec
01:27:06 testSplitString_1(org.eclipse.papyrus.uml.tools.tests.tests.UMLReferenceConverterCompletionTest)  Time elapsed: 0.03 sec
01:27:06 testSplitString_2(org.eclipse.papyrus.uml.tools.tests.tests.UMLReferenceConverterCompletionTest)  Time elapsed: 0.029 sec
01:27:06 testCompletionToFindConstraint_1(org.eclipse.papyrus.uml.tools.tests.tests.UMLReferenceConverterCompletionTest)  Time elapsed: 0.027 sec
01:27:06 testCompletionToFindConstraint_2(org.eclipse.papyrus.uml.tools.tests.tests.UMLReferenceConverterCompletionTest)  Time elapsed: 0.024 sec
01:27:06 testCompletionMultiValueConverterEmptyString(org.eclipse.papyrus.uml.tools.tests.tests.UMLReferenceConverterCompletionTest)  Time elapsed: 0.023 sec
01:27:06 testCompletionToFindPackage_1(org.eclipse.papyrus.uml.tools.tests.tests.UMLReferenceConverterCompletionTest)  Time elapsed: 0.026 sec
01:27:06 testCompletionToFindPackage_2(org.eclipse.papyrus.uml.tools.tests.tests.UMLReferenceConverterCompletionTest)  Time elapsed: 0.027 sec
01:27:06 testCompletionSingleValueConverterEmptyString(org.eclipse.papyrus.uml.tools.tests.tests.UMLReferenceConverterCompletionTest)  Time elapsed: 0.066 sec
01:27:06 profileLanguage(org.eclipse.papyrus.uml.tools.tests.tests.UMLLanguageProvidersTest)  Time elapsed: 0.001 sec
01:27:06 umlLanguage(org.eclipse.papyrus.uml.tools.tests.tests.UMLLanguageProvidersTest)  Time elapsed: 0.001 sec
01:27:06 ValidationStereotypesListClass1Test(org.eclipse.papyrus.uml.tools.tests.tests.IconsStereotypesTest)  Time elapsed: 1.087 sec
01:27:06 ValidationStereotypesListClass2Test(org.eclipse.papyrus.uml.tools.tests.tests.IconsStereotypesTest)  Time elapsed: 0.963 sec
01:27:06 ValidationStereotypesListClass3Test(org.eclipse.papyrus.uml.tools.tests.tests.IconsStereotypesTest)  Time elapsed: 0.891 sec
01:27:06 ValidationStereotypesListClass4Test(org.eclipse.papyrus.uml.tools.tests.tests.IconsStereotypesTest)  Time elapsed: 1.154 sec
01:27:06 ValidationImageClass1Test(org.eclipse.papyrus.uml.tools.tests.tests.IconsStereotypesTest)  Time elapsed: 1.053 sec
01:27:06 ValidationImageClass2Test(org.eclipse.papyrus.uml.tools.tests.tests.IconsStereotypesTest)  Time elapsed: 1.123 sec
01:27:06 ValidationImageClass3Test(org.eclipse.papyrus.uml.tools.tests.tests.IconsStereotypesTest)  Time elapsed: 1.178 sec
01:27:06 ValidationImageClass4Test(org.eclipse.papyrus.uml.tools.tests.tests.IconsStereotypesTest)  Time elapsed: 1.297 sec
01:27:06 returnedTextTest(org.eclipse.papyrus.uml.tools.tests.tests.CustomizableDelegatingItemLabelProviderTest)  Time elapsed: 1.076 sec
01:27:06 returnedStyledTextTest(org.eclipse.papyrus.uml.tools.tests.tests.CustomizableDelegatingItemLabelProviderTest)  Time elapsed: 1.028 sec
01:27:06 notifyChange(org.eclipse.papyrus.uml.tools.tests.tests.DelegatingItemLabelProviderTest)  Time elapsed: 0.069 sec
01:27:06 copyingInterfaceRealizationDoesNotCorruptTheModel(org.eclipse.papyrus.uml.tools.tests.tests.UMLCopyTest)  Time elapsed: 0.003 sec
01:27:06 recursiveImportPackage(org.eclipse.papyrus.uml.tools.utils.tests.tests.NameResolutionHelperTest)  Time elapsed: 0.041 sec
01:27:06 testIsAutoNamed(org.eclipse.papyrus.uml.tools.utils.tests.tests.NamedElementUtilTest)  Time elapsed: 0.022 sec
01:27:06 testGetDefaultNameWithIncrement(org.eclipse.papyrus.uml.tools.utils.tests.tests.NamedElementUtilTest)  Time elapsed: 0.001 sec
01:27:06 testAutoNameIncrement(org.eclipse.papyrus.uml.tools.utils.tests.tests.NamedElementUtilTest)  Time elapsed: 0 sec
01:27:06 testExistingElementHavingNameNotRenamed(org.eclipse.papyrus.uml.tools.utils.tests.tests.NamedElementUtilTest)  Time elapsed: 0.001 sec
01:27:06 testGetAppliedSuperstereotype(org.eclipse.papyrus.uml.tools.utils.tests.tests.UMLUtilTest)  Time elapsed: 0.058 sec
01:27:06 testGetApplicableStereotype_notStrict_notApplicable(org.eclipse.papyrus.uml.tools.utils.tests.tests.UMLUtilTest)  Time elapsed: 0.243 sec
01:27:06 testGetApplicableStereotype_notStrict_applicable(org.eclipse.papyrus.uml.tools.utils.tests.tests.UMLUtilTest)  Time elapsed: 0.221 sec
01:27:06 testGetApplicableStereotype_strict_applicable(org.eclipse.papyrus.uml.tools.utils.tests.tests.UMLUtilTest)  Time elapsed: 0.199 sec
01:27:06 testGetAppliedSubstereotype_notApplied(org.eclipse.papyrus.uml.tools.utils.tests.tests.UMLUtilTest)  Time elapsed: 0.154 sec
01:27:06 testGetApplicableStereotype_strict_notApplicable(org.eclipse.papyrus.uml.tools.utils.tests.tests.UMLUtilTest)  Time elapsed: 0.228 sec
01:27:06 testGetAppliedSubstereotype_applied(org.eclipse.papyrus.uml.tools.utils.tests.tests.UMLUtilTest)  Time elapsed: 0.079 sec
01:27:06 testUnApplyStereotypeApplication(org.eclipse.papyrus.uml.diagram.stereotypeproperty.TestBadUnapplyProfile2ClosedDiagComment)  Time elapsed: 2.092 sec
01:27:06 testStereotypeApplicationOnClass(org.eclipse.papyrus.uml.diagram.stereotypeproperty.TestDropStereotypedClass)  Time elapsed: 0.777 sec
01:27:06 testProfileApplicationOnModel(org.eclipse.papyrus.uml.diagram.stereotypeproperty.TestProfileApplication)  Time elapsed: 0.438 sec
01:27:06 testBrace(org.eclipse.papyrus.uml.diagram.stereotypeproperty.tests.asbrace.TestDisplayAsBrace)  Time elapsed: 0.814 sec
01:27:06 testReopenStereotypeAsComment(org.eclipse.papyrus.uml.diagram.stereotypeproperty.tests.asbrace.TestReopenAsBrace)  Time elapsed: 2.061 sec
01:27:06 testStereotypeApplicationOnClass(org.eclipse.papyrus.uml.diagram.stereotypeproperty.tests.ascomment.TestDisplayAsComment)  Time elapsed: 0.562 sec
01:27:06 testReopenStereotypeAsComment(org.eclipse.papyrus.uml.diagram.stereotypeproperty.tests.ascomment.TestReopenAsComment)  Time elapsed: 2.078 sec
01:27:06 testStereotypeApplicationOnClass(org.eclipse.papyrus.uml.diagram.stereotypeproperty.tests.ascompartment.TestDisplayAsCompartment)  Time elapsed: 1.16 sec
01:27:06 testReopenStereotypeAsComment(org.eclipse.papyrus.uml.diagram.stereotypeproperty.tests.ascompartment.TestReopenAsCompartment)  Time elapsed: 2.488 sec
01:27:06 test2StereotypeApplicationsOnClass(org.eclipse.papyrus.uml.diagram.stereotypeproperty.tests.displayname.Test2StereotypeApplications)  Time elapsed: 0.597 sec
01:27:06 testStereotypeApplicationOnPackage(org.eclipse.papyrus.uml.diagram.stereotypeproperty.tests.displayname.TestStereotypeApplication)  Time elapsed: 0.869 sec
01:27:06 testStereotypeApplicationOnClass(org.eclipse.papyrus.uml.diagram.stereotypeproperty.tests.displayname.TestStereotypeApplication)  Time elapsed: 0.079 sec
01:27:06 testQNStereotypeApplicationOnClass(org.eclipse.papyrus.uml.diagram.stereotypeproperty.tests.displayname.TestStereotypeApplicationQualifiedName)  Time elapsed: 0.631 sec
01:27:06 testLayoutStereotypeApplicationOnClass(org.eclipse.papyrus.uml.diagram.stereotypeproperty.tests.layout.TestLayoutWithStereotype) skipped
01:27:06 testLayoutOnClass(org.eclipse.papyrus.uml.diagram.stereotypeproperty.tests.layout.TestLayoutWithStereotype) skipped
01:27:06 testLayoutStereotypeApplicationOnClass(org.eclipse.papyrus.uml.diagram.stereotypeproperty.tests.layout.TestLayoutWithStereotypeOnEclipseHIPPInstance) skipped
01:27:06 testLayoutOnClass(org.eclipse.papyrus.uml.diagram.stereotypeproperty.tests.layout.TestLayoutWithStereotypeOnEclipseHIPPInstance) skipped
01:27:06 testDiagramFileExtentionLabel(org.eclipse.papyrus.uml.diagram.wizards.TestCreateModelWizard)  Time elapsed: 0.329 sec
01:27:06 testDiagramFileExtenstionForUML(org.eclipse.papyrus.uml.diagram.wizards.TestCreateModelWizard)  Time elapsed: 0.082 sec
01:27:06 testOrderOfPages(org.eclipse.papyrus.uml.diagram.wizards.TestCreateModelWizard)  Time elapsed: 0.096 sec
01:27:06 testDiagramFileExtentionLabel(org.eclipse.papyrus.uml.diagram.wizards.TestInitModelWizard)  Time elapsed: 0.086 sec
01:27:06 testDiagramFileExtenstionForUML(org.eclipse.papyrus.uml.diagram.wizards.TestInitModelWizard)  Time elapsed: 0.086 sec
01:27:06 testOrderOfPages(org.eclipse.papyrus.uml.diagram.wizards.TestInitModelWizard)  Time elapsed: 0.084 sec
01:27:06 testOrderOfPages(org.eclipse.papyrus.uml.diagram.wizards.TestNewProjectWizard)  Time elapsed: 0.084 sec
01:27:06 testForSimpleModel(org.eclipse.papyrus.uml.diagram.wizards.TestCreateModelFromExistingModelWizard)  Time elapsed: 0.075 sec
01:27:06 testOrderOfPages(org.eclipse.papyrus.uml.diagram.wizards.TestCreateModelFromExistingModelWizard)  Time elapsed: 0.074 sec
01:27:06 testForModelWithDot(org.eclipse.papyrus.uml.diagram.wizards.TestCreateModelFromExistingModelWizard)  Time elapsed: 0.136 sec
01:27:06 missingSchema(org.eclipse.papyrus.uml.modelrepair.internal.stereotypes.StereotypeApplicationRepairSnippetTest)  Time elapsed: 0.3 sec
01:27:06 noCorruptionControlCase(org.eclipse.papyrus.uml.modelrepair.internal.stereotypes.StereotypeApplicationRepairSnippetTest)  Time elapsed: 0.194 sec
01:27:06 wrongProfileVersion(org.eclipse.papyrus.uml.modelrepair.internal.stereotypes.StereotypeApplicationRepairSnippetTest)  Time elapsed: 0.315 sec
01:27:06 missingProfileApplication(org.eclipse.papyrus.uml.modelrepair.internal.stereotypes.StereotypeApplicationRepairSnippetTest)  Time elapsed: 0.276 sec
01:27:06 deleteStereotypes(org.eclipse.papyrus.uml.modelrepair.internal.stereotypes.StereotypeApplicationRepairSnippetTest)  Time elapsed: 0.327 sec
01:27:06 nestedProfileApplicationsMissingNamespace_bug434302(org.eclipse.papyrus.uml.modelrepair.internal.stereotypes.StereotypeRepairRegressionTest)  Time elapsed: 0.667 sec
01:27:06 orphansOfWrongProfileVersion_bug436666(org.eclipse.papyrus.uml.modelrepair.internal.stereotypes.StereotypeRepairRegressionTest)  Time elapsed: 0.352 sec
01:27:06 badSchemaLocationInNonPackageFragment_bug459488(org.eclipse.papyrus.uml.modelrepair.internal.stereotypes.StereotypeRepairRegressionTest)  Time elapsed: 0.87 sec
01:27:06 nestedProfilesAndNestedApplicationsWellFormed_bug434302(org.eclipse.papyrus.uml.modelrepair.internal.stereotypes.StereotypeRepairRegressionTest)  Time elapsed: 0.266 sec
01:27:06 registeredDynamicProfie_bug455329(org.eclipse.papyrus.uml.modelrepair.internal.stereotypes.StereotypeRepairRegressionTest)  Time elapsed: 0.045 sec
01:27:06 nestedPackageSchemaMissing_bug436666(org.eclipse.papyrus.uml.modelrepair.internal.stereotypes.StereotypeRepairRegressionTest)  Time elapsed: 0.259 sec
01:27:06 incorrectZombieGroupingWithoutProfileNamespaceURIPattern_bug496307(org.eclipse.papyrus.uml.modelrepair.internal.stereotypes.StereotypeRepairRegressionTest)  Time elapsed: 0.064 sec
01:27:06 nonStereotypeApplicationsAreOK_bug436666(org.eclipse.papyrus.uml.modelrepair.internal.stereotypes.StereotypeRepairRegressionTest)  Time elapsed: 0.019 sec
01:27:06 nestedProfileApplications2Pkgs1Profile_bug434302(org.eclipse.papyrus.uml.modelrepair.internal.stereotypes.StereotypeRepairRegressionTest)  Time elapsed: 0.245 sec
01:27:06 crossReferencedPackageUnitWithoutOwnProfileApplication_bug458736(org.eclipse.papyrus.uml.modelrepair.internal.stereotypes.StereotypeRepairRegressionTest)  Time elapsed: 0.498 sec
01:27:06 correctZombieGroupingWithProfileNamespaceURIPattern_bug496307(org.eclipse.papyrus.uml.modelrepair.internal.stereotypes.StereotypeRepairRegressionTest)  Time elapsed: 0.051 sec
01:27:06 orphansOfValidSchema_bug436666(org.eclipse.papyrus.uml.modelrepair.internal.stereotypes.StereotypeRepairRegressionTest)  Time elapsed: 0.071 sec
01:27:06 packageUnitWithoutOwnProfileApplication_bug455248(org.eclipse.papyrus.uml.modelrepair.internal.stereotypes.StereotypeRepairRegressionTest)  Time elapsed: 0.054 sec
01:27:06 nestedPackageInProfileIsOK_bug436666(org.eclipse.papyrus.uml.modelrepair.internal.stereotypes.StereotypeRepairRegressionTest)  Time elapsed: 0.315 sec
01:27:06 compareMultiVersionSameURISameVersion(org.eclipse.papyrus.uml.modelrepair.internal.uripattern.ProfileNamespaceURIPatternTest)  Time elapsed: 0 sec
01:27:06 compareMultiVersionDifferentURIDifferentVersion(org.eclipse.papyrus.uml.modelrepair.internal.uripattern.ProfileNamespaceURIPatternTest)  Time elapsed: 0 sec
01:27:06 compareSingleVersionDifferentURISameVersion(org.eclipse.papyrus.uml.modelrepair.internal.uripattern.ProfileNamespaceURIPatternTest)  Time elapsed: 0 sec
01:27:06 compareMultiVersionDifferentURISameVersion(org.eclipse.papyrus.uml.modelrepair.internal.uripattern.ProfileNamespaceURIPatternTest)  Time elapsed: 0.001 sec
01:27:06 compareCorrectInvalidComparisonConstantBehavior(org.eclipse.papyrus.uml.modelrepair.internal.uripattern.ProfileNamespaceURIPatternTest)  Time elapsed: 0 sec
01:27:06 compareNoVersionSameURI(org.eclipse.papyrus.uml.modelrepair.internal.uripattern.ProfileNamespaceURIPatternTest)  Time elapsed: 0 sec
01:27:06 compareSingleVersionDifferentURIDifferentVersion(org.eclipse.papyrus.uml.modelrepair.internal.uripattern.ProfileNamespaceURIPatternTest)  Time elapsed: 0 sec
01:27:06 matchCorrectNoMatchConstantBehavior(org.eclipse.papyrus.uml.modelrepair.internal.uripattern.ProfileNamespaceURIPatternTest)  Time elapsed: 0 sec
01:27:06 matchSingleVersionCorrectURIGivenVersion(org.eclipse.papyrus.uml.modelrepair.internal.uripattern.ProfileNamespaceURIPatternTest)  Time elapsed: 0 sec
01:27:06 matchNoVersionCorrectURIDefaultVersion(org.eclipse.papyrus.uml.modelrepair.internal.uripattern.ProfileNamespaceURIPatternTest)  Time elapsed: 0.001 sec
01:27:06 matchMultipleVersionCorrectURIGivenVersion(org.eclipse.papyrus.uml.modelrepair.internal.uripattern.ProfileNamespaceURIPatternTest)  Time elapsed: 0 sec
01:27:06 matchMultipleVersionCorrectURIDefaultVersion(org.eclipse.papyrus.uml.modelrepair.internal.uripattern.ProfileNamespaceURIPatternTest)  Time elapsed: 0 sec
01:27:06 compareCorrectInvalidComparisonBehaviorWrongLHS(org.eclipse.papyrus.uml.modelrepair.internal.uripattern.ProfileNamespaceURIPatternTest)  Time elapsed: 0 sec
01:27:06 compareCorrectInvalidComparisonBehaviorWrongRHS(org.eclipse.papyrus.uml.modelrepair.internal.uripattern.ProfileNamespaceURIPatternTest)  Time elapsed: 0 sec
01:27:06 registryExtensionPointCorrectMatch(org.eclipse.papyrus.uml.modelrepair.internal.uripattern.ProfileNamespaceURIPatternTest)  Time elapsed: 0.003 sec
01:27:06 compareSingleVersionSameURIDifferentVersion(org.eclipse.papyrus.uml.modelrepair.internal.uripattern.ProfileNamespaceURIPatternTest)  Time elapsed: 0.001 sec
01:27:06 compareSingleVersionSameURISameVersion(org.eclipse.papyrus.uml.modelrepair.internal.uripattern.ProfileNamespaceURIPatternTest)  Time elapsed: 0 sec
01:27:06 compareMultiVersionSameURIDifferentVersion(org.eclipse.papyrus.uml.modelrepair.internal.uripattern.ProfileNamespaceURIPatternTest)  Time elapsed: 0 sec
01:27:06 registryCorrectUnregisterAndRegister(org.eclipse.papyrus.uml.modelrepair.internal.uripattern.ProfileNamespaceURIPatternTest)  Time elapsed: 0 sec
01:27:06 registryExtensionPointRegistered(org.eclipse.papyrus.uml.modelrepair.internal.uripattern.ProfileNamespaceURIPatternTest)  Time elapsed: 0 sec
01:27:06 compareCorrectInvalidComparisonBehaviorWrongPattern(org.eclipse.papyrus.uml.modelrepair.internal.uripattern.ProfileNamespaceURIPatternTest)  Time elapsed: 0 sec
01:27:06 matchNoVersionCorrectURIGivenVersion(org.eclipse.papyrus.uml.modelrepair.internal.uripattern.ProfileNamespaceURIPatternTest)  Time elapsed: 0 sec
01:27:06 compareNoVersionDifferentURI(org.eclipse.papyrus.uml.modelrepair.internal.uripattern.ProfileNamespaceURIPatternTest)  Time elapsed: 0 sec
01:27:06 matchSingleVersionCorrectURIDefaultVersion(org.eclipse.papyrus.uml.modelrepair.internal.uripattern.ProfileNamespaceURIPatternTest)  Time elapsed: 0 sec
01:27:06 matchCorrectNoMatchBehavior(org.eclipse.papyrus.uml.modelrepair.internal.uripattern.ProfileNamespaceURIPatternTest)  Time elapsed: 0 sec
01:27:06 outOfDateModelSkipMigration_papyrus(org.eclipse.papyrus.uml.profile.service.ReapplyProfilesServiceTest)  Time elapsed: 1.448 sec
01:27:06 upToDateModelDoesNotPromptForMigration_papyrus(org.eclipse.papyrus.uml.profile.service.ReapplyProfilesServiceTest)  Time elapsed: 1.191 sec
01:27:06 outOfDateModelDoMigration_dynamic(org.eclipse.papyrus.uml.profile.service.ReapplyProfilesServiceTest)  Time elapsed: 1.195 sec
01:27:06 outOfDateModelSkipMigration_uml2(org.eclipse.papyrus.uml.profile.service.ReapplyProfilesServiceTest)  Time elapsed: 1.481 sec
01:27:06 outOfDateModelDoMigration_papyrus(org.eclipse.papyrus.uml.profile.service.ReapplyProfilesServiceTest)  Time elapsed: 1.47 sec
01:27:06 outOfDateModelSkipMigration_dynamic(org.eclipse.papyrus.uml.profile.service.ReapplyProfilesServiceTest)  Time elapsed: 1.399 sec
01:27:06 outOfDateModelDoMigration_uml2(org.eclipse.papyrus.uml.profile.service.ReapplyProfilesServiceTest)  Time elapsed: 1.313 sec
01:27:06 upToDateModelDoesNotPromptForMigration_uml2(org.eclipse.papyrus.uml.profile.service.ReapplyProfilesServiceTest)  Time elapsed: 1.153 sec
01:27:06 upToDateModelDoesNotPromptForMigration_dynamic(org.eclipse.papyrus.uml.profile.service.ReapplyProfilesServiceTest)  Time elapsed: 1.083 sec
01:27:06 loadDecoratorAsMainModel(org.eclipse.papyrus.uml.decoratormodel.tests.ExternalizeProfileApplicationTest)  Time elapsed: 0.431 sec
01:27:06 externalizeApplication(org.eclipse.papyrus.uml.decoratormodel.tests.ExternalizeProfileApplicationTest)  Time elapsed: 0.467 sec
01:27:06 unloadApplication(org.eclipse.papyrus.uml.decoratormodel.tests.ExternalizeProfileApplicationTest)  Time elapsed: 0.437 sec
01:27:06 externalizeApplication_undo(org.eclipse.papyrus.uml.decoratormodel.tests.ExternalizeProfileApplicationTest)  Time elapsed: 0.392 sec
01:27:06 unloadedApplicationNotAvailable(org.eclipse.papyrus.uml.decoratormodel.tests.ExternalizeProfileApplicationTest)  Time elapsed: 0.409 sec
01:27:06 loadApplication(org.eclipse.papyrus.uml.decoratormodel.tests.ExternalizeProfileApplicationTest)  Time elapsed: 0.419 sec
01:27:06 externalizeApplication_undo_redo(org.eclipse.papyrus.uml.decoratormodel.tests.ExternalizeProfileApplicationTest)  Time elapsed: 0.422 sec
01:27:06 nestedPackageApplicationOfSameProfile_bug459613(org.eclipse.papyrus.uml.decoratormodel.tests.ExternalizeProfileApplicationTest)  Time elapsed: 0.462 sec
01:27:06 externalizeApplication_forNestedPackage(org.eclipse.papyrus.uml.decoratormodel.tests.ExternalizeProfileApplicationTest)  Time elapsed: 0.509 sec
01:27:06 internalizeApplication_undo(org.eclipse.papyrus.uml.decoratormodel.tests.InternalizeProfileApplicationTest)  Time elapsed: 0.388 sec
01:27:06 internalizeApplication_undo_redo(org.eclipse.papyrus.uml.decoratormodel.tests.InternalizeProfileApplicationTest)  Time elapsed: 0.413 sec
01:27:06 internalizeApplication(org.eclipse.papyrus.uml.decoratormodel.tests.InternalizeProfileApplicationTest)  Time elapsed: 0.499 sec
01:27:06 migrateProfile(org.eclipse.papyrus.uml.decoratormodel.tests.ProfileMigrationTest)  Time elapsed: 0.362 sec
01:27:06 missingSchema(org.eclipse.papyrus.uml.decoratormodel.tests.StereotypeApplicationRepairTest)  Time elapsed: 0.421 sec
01:27:06 wrongProfileVersion(org.eclipse.papyrus.uml.decoratormodel.tests.StereotypeApplicationRepairTest)  Time elapsed: 0.51 sec
01:27:06 missingProfileApplication(org.eclipse.papyrus.uml.decoratormodel.tests.StereotypeApplicationRepairTest)  Time elapsed: 0.415 sec
01:27:06 decoratorModelsForPackageAsync(org.eclipse.papyrus.uml.decoratormodel.internal.resource.tests.DecoratorModelIndexTest)  Time elapsed: 0.493 sec
01:27:06 decoratorModelsForPackage_none(org.eclipse.papyrus.uml.decoratormodel.internal.resource.tests.DecoratorModelIndexTest)  Time elapsed: 0.547 sec
01:27:06 removeResource(org.eclipse.papyrus.uml.decoratormodel.internal.resource.tests.DecoratorModelIndexTest)  Time elapsed: 0.673 sec
01:27:06 decoratorModelsAsync_uri(org.eclipse.papyrus.uml.decoratormodel.internal.resource.tests.DecoratorModelIndexTest)  Time elapsed: 0.993 sec
01:27:06 decoratorModelName(org.eclipse.papyrus.uml.decoratormodel.internal.resource.tests.DecoratorModelIndexTest)  Time elapsed: 0.547 sec
01:27:06 baseline(org.eclipse.papyrus.uml.decoratormodel.internal.resource.tests.DecoratorModelIndexTest)  Time elapsed: 0.582 sec
01:27:06 decoratorModelsForPackage(org.eclipse.papyrus.uml.decoratormodel.internal.resource.tests.DecoratorModelIndexTest)  Time elapsed: 0.603 sec
01:27:06 decoratorModelNameAsync(org.eclipse.papyrus.uml.decoratormodel.internal.resource.tests.DecoratorModelIndexTest)  Time elapsed: 0.562 sec
01:27:06 appliedProfilesByResourceIndex(org.eclipse.papyrus.uml.decoratormodel.internal.resource.tests.DecoratorModelIndexTest)  Time elapsed: 0.544 sec
01:27:06 decoratorModels(org.eclipse.papyrus.uml.decoratormodel.internal.resource.tests.DecoratorModelIndexTest)  Time elapsed: 0.482 sec
01:27:06 decoratorModelsAsync(org.eclipse.papyrus.uml.decoratormodel.internal.resource.tests.DecoratorModelIndexTest)  Time elapsed: 0.473 sec
01:27:06 allAppliedProfiles(org.eclipse.papyrus.uml.decoratormodel.internal.resource.tests.DecoratorModelIndexTest)  Time elapsed: 0.641 sec
01:27:06 decoratorModelNames(org.eclipse.papyrus.uml.decoratormodel.internal.resource.tests.DecoratorModelIndexTest)  Time elapsed: 0.453 sec
01:27:06 decoratorModels_uri(org.eclipse.papyrus.uml.decoratormodel.internal.resource.tests.DecoratorModelIndexTest)  Time elapsed: 0.623 sec
01:27:06 decoratorModelNamesAsync(org.eclipse.papyrus.uml.decoratormodel.internal.resource.tests.DecoratorModelIndexTest)  Time elapsed: 0.576 sec
01:27:06 listener(org.eclipse.papyrus.uml.decoratormodel.internal.resource.tests.DecoratorModelIndexTest)  Time elapsed: 0.819 sec
01:27:06 allAppliedProfilesAsync(org.eclipse.papyrus.uml.decoratormodel.internal.resource.tests.DecoratorModelIndexTest)  Time elapsed: 0.535 sec
01:27:06 addNewResource(org.eclipse.papyrus.uml.decoratormodel.internal.resource.tests.DecoratorModelIndexTest)  Time elapsed: 0.784 sec
01:27:06 decoratorModelsForPackageAsync_none(org.eclipse.papyrus.uml.decoratormodel.internal.resource.tests.DecoratorModelIndexTest)  Time elapsed: 0.457 sec
01:27:06 copy_subsetOfProfiles(org.eclipse.papyrus.uml.decoratormodel.internal.resource.tests.DecoratorModelCopierTest)  Time elapsed: 0.765 sec
01:27:06 copy_allProfiles(org.eclipse.papyrus.uml.decoratormodel.internal.resource.tests.DecoratorModelCopierTest)  Time elapsed: 0.57 sec
01:27:06 testHasUnloadedDecoratorModelsAsync_recursive(org.eclipse.papyrus.uml.decoratormodel.helper.tests.DecoratorModelUtilsTest)  Time elapsed: 0.779 sec
01:27:06 testIsDecoratorModelFor(org.eclipse.papyrus.uml.decoratormodel.helper.tests.DecoratorModelUtilsTest)  Time elapsed: 0.407 sec
01:27:06 testIsDecoratorModelURI(org.eclipse.papyrus.uml.decoratormodel.helper.tests.DecoratorModelUtilsTest)  Time elapsed: 0.45 sec
01:27:06 testInternalizeProfileApplications(org.eclipse.papyrus.uml.decoratormodel.helper.tests.DecoratorModelUtilsTest)  Time elapsed: 0.415 sec
01:27:06 testHasUnloadedDecoratorModelsAsync(org.eclipse.papyrus.uml.decoratormodel.helper.tests.DecoratorModelUtilsTest)  Time elapsed: 0.429 sec
01:27:06 testExternalizeProfileApplication(org.eclipse.papyrus.uml.decoratormodel.helper.tests.DecoratorModelUtilsTest)  Time elapsed: 0.489 sec
01:27:06 testGetDecoratorPackages(org.eclipse.papyrus.uml.decoratormodel.helper.tests.DecoratorModelUtilsTest)  Time elapsed: 0.447 sec
01:27:06 testGetDecoratorModelAppliedProfiles(org.eclipse.papyrus.uml.decoratormodel.helper.tests.DecoratorModelUtilsTest)  Time elapsed: 0.349 sec
01:27:06 testGetUnloadedDecoratorModelsAsyncResource(org.eclipse.papyrus.uml.decoratormodel.helper.tests.DecoratorModelUtilsTest)  Time elapsed: 0.672 sec
01:27:06 testGetExternalizationProfile(org.eclipse.papyrus.uml.decoratormodel.helper.tests.DecoratorModelUtilsTest)  Time elapsed: 0.432 sec
01:27:06 testIsDecoratorModelResource(org.eclipse.papyrus.uml.decoratormodel.helper.tests.DecoratorModelUtilsTest)  Time elapsed: 0.513 sec
01:27:06 testGetDecoratorModelProfileApplications(org.eclipse.papyrus.uml.decoratormodel.helper.tests.DecoratorModelUtilsTest)  Time elapsed: 1.333 sec
01:27:06 testGetUnloadedDecoratorModelsAsyncPackage(org.eclipse.papyrus.uml.decoratormodel.helper.tests.DecoratorModelUtilsTest)  Time elapsed: 0.671 sec
01:27:06 testGetLoadedDecoratorModels(org.eclipse.papyrus.uml.decoratormodel.helper.tests.DecoratorModelUtilsTest)  Time elapsed: 0.407 sec
01:27:06 testGetLoadedSubUnitPackages(org.eclipse.papyrus.uml.decoratormodel.helper.tests.DecoratorModelUtilsTest)  Time elapsed: 0.399 sec
01:27:06 testGetUnloadedDecoratorModels(org.eclipse.papyrus.uml.decoratormodel.helper.tests.DecoratorModelUtilsTest)  Time elapsed: 0.49 sec
01:27:06 testHasExternalizationProfile(org.eclipse.papyrus.uml.decoratormodel.helper.tests.DecoratorModelUtilsTest)  Time elapsed: 0.407 sec
01:27:06 testGetUnloadedDecoratorModelsAsyncIterableOfResource(org.eclipse.papyrus.uml.decoratormodel.helper.tests.DecoratorModelUtilsTest)  Time elapsed: 1.209 sec
01:27:06 testGetUserModelResources(org.eclipse.papyrus.uml.decoratormodel.helper.tests.DecoratorModelUtilsTest)  Time elapsed: 0.393 sec
01:27:06 testGetDecoratorProfileApplications(org.eclipse.papyrus.uml.decoratormodel.helper.tests.DecoratorModelUtilsTest)  Time elapsed: 0.409 sec
01:27:06 stereotypeApplication_inNestedPackage(org.eclipse.papyrus.uml.decoratormodel.helper.tests.PapyrusStereotypeApplicationHelperTest)  Time elapsed: 0.163 sec
01:27:06 stereotypeApplication_inNonPackageSubmodelUnit_bug459613(org.eclipse.papyrus.uml.decoratormodel.helper.tests.PapyrusStereotypeApplicationHelperTest)  Time elapsed: 0.16 sec
01:27:06 applyStereotype_resourceSet(org.eclipse.papyrus.uml.decoratormodel.helper.tests.PapyrusStereotypeApplicationHelperTest)  Time elapsed: 0.155 sec
01:27:06 applyStereotype_freeFloating(org.eclipse.papyrus.uml.decoratormodel.helper.tests.PapyrusStereotypeApplicationHelperTest)  Time elapsed: 0.182 sec
01:27:06 isDecoratorModel_decoratorModelUML(org.eclipse.papyrus.uml.decoratormodel.internal.expressions.tests.FilePropertyTesterTest)  Time elapsed: 0.322 sec
01:27:06 isDecoratorModel_decoratorModelNotation(org.eclipse.papyrus.uml.decoratormodel.internal.expressions.tests.FilePropertyTesterTest)  Time elapsed: 0.296 sec
01:27:06 isDecoratorModel_userModelUML(org.eclipse.papyrus.uml.decoratormodel.internal.expressions.tests.FilePropertyTesterTest)  Time elapsed: 0.303 sec
01:27:06 decoratorIndexing(org.eclipse.papyrus.uml.decoratormodel.internal.resource.index.tests.ProfileIndexTest)  Time elapsed: 0.307 sec
01:27:06 userModelIndexing(org.eclipse.papyrus.uml.decoratormodel.internal.resource.index.tests.ProfileIndexTest)  Time elapsed: 0 sec
01:27:06 decoratorAsUserModelIndexing(org.eclipse.papyrus.uml.decoratormodel.internal.resource.index.tests.ProfileIndexTest)  Time elapsed: 0 sec
01:27:06 migrateProfileExtendingDynamic_bug481302(org.eclipse.papyrus.uml.decoratormodel.tests.RegressionTest)  Time elapsed: 0.417 sec
01:27:06 basicUMLMigrateProfileExtendingStatic_bug481302(org.eclipse.papyrus.uml.decoratormodel.tests.RegressionTest) skipped
01:27:06 migrateProfileExtendingStatic_bug481302(org.eclipse.papyrus.uml.decoratormodel.tests.RegressionTest)  Time elapsed: 0.308 sec
01:27:06 control_undo_redo_allDecoratorsLoaded(org.eclipse.papyrus.uml.decoratormodel.controlmode.tests.ControlModeWithDecoratorModelsTest)  Time elapsed: 0.768 sec
01:27:06 uncontrol_undo_redo_allDecoratorsUnloaded(org.eclipse.papyrus.uml.decoratormodel.controlmode.tests.ControlModeWithDecoratorModelsTest)  Time elapsed: 2.678 sec
01:27:06 control_someDecoratorsLoaded(org.eclipse.papyrus.uml.decoratormodel.controlmode.tests.ControlModeWithDecoratorModelsTest)  Time elapsed: 0.955 sec
01:27:06 uncontrol_someDecoratorsLoaded(org.eclipse.papyrus.uml.decoratormodel.controlmode.tests.ControlModeWithDecoratorModelsTest)  Time elapsed: 3.111 sec
01:27:06 uncontrol_allDecoratorsUnloaded(org.eclipse.papyrus.uml.decoratormodel.controlmode.tests.ControlModeWithDecoratorModelsTest)  Time elapsed: 1.699 sec
01:27:06 control_undo_redo_someDecoratorsLoaded(org.eclipse.papyrus.uml.decoratormodel.controlmode.tests.ControlModeWithDecoratorModelsTest)  Time elapsed: 1.795 sec
01:27:06 control_allDecoratorsLoaded(org.eclipse.papyrus.uml.decoratormodel.controlmode.tests.ControlModeWithDecoratorModelsTest)  Time elapsed: 0.678 sec
01:27:06 control_undo_redo_allDecoratorsUnloaded(org.eclipse.papyrus.uml.decoratormodel.controlmode.tests.ControlModeWithDecoratorModelsTest)  Time elapsed: 2.594 sec
01:27:06 control_allDecoratorsUnloaded(org.eclipse.papyrus.uml.decoratormodel.controlmode.tests.ControlModeWithDecoratorModelsTest)  Time elapsed: 1.392 sec
01:27:06 uncontrol_undo_redo_someDecoratorsLoaded(org.eclipse.papyrus.uml.decoratormodel.controlmode.tests.ControlModeWithDecoratorModelsTest)  Time elapsed: 2.46 sec
01:27:06 uncontrol_undo_redo_allDecoratorsLoaded(org.eclipse.papyrus.uml.decoratormodel.controlmode.tests.ControlModeWithDecoratorModelsTest)  Time elapsed: 0.689 sec
01:27:06 uncontrol_allDecoratorsLoaded(org.eclipse.papyrus.uml.decoratormodel.controlmode.tests.ControlModeWithDecoratorModelsTest)  Time elapsed: 0.695 sec
01:27:06 nonBaseElementStereotypeCrossReferences(org.eclipse.papyrus.uml.decoratormodel.controlmode.tests.AdditionalModelStructuresTest)  Time elapsed: 1.313 sec
01:27:06 classUnitExternalizeParentUnitProfileApplication_bug459613(org.eclipse.papyrus.uml.decoratormodel.controlmode.tests.AdditionalModelStructuresTest)  Time elapsed: 0.521 sec
01:27:06 nestedPackagesInheritingExternalProfileApplications(org.eclipse.papyrus.uml.decoratormodel.controlmode.tests.AdditionalModelStructuresTest)  Time elapsed: 2.572 sec
01:27:06 validateOCLOnInstanceSpec(org.eclipse.papyrus.uml.validation.tests.rules.TestOCLConstraintOnInstanceSpec)  Time elapsed: 4.007 sec
01:27:06 validateCamelCaseRule(org.eclipse.papyrus.uml.validation.tests.rules.TestOCLValidationRuleFromFile)  Time elapsed: 1.185 sec
01:27:06 validateIsActiveOCLRule_inactiveClass(org.eclipse.papyrus.uml.validation.tests.rules.TestValidationRulesInPluginXML)  Time elapsed: 2.806 sec
01:27:06 validateIsPassiveJavaRule_inactiveClass(org.eclipse.papyrus.uml.validation.tests.rules.TestValidationRulesInPluginXML)  Time elapsed: 2.525 sec
01:27:06 validateIsPassiveJavaRule_activeClass(org.eclipse.papyrus.uml.validation.tests.rules.TestValidationRulesInPluginXML)  Time elapsed: 1.847 sec
01:27:06 validateMalformedActiveRule_notActiveCapsule(org.eclipse.papyrus.uml.validation.tests.rules.TestValidationRulesInProfile)  Time elapsed: 1.816 sec
01:27:06 validateIsActiveRule_notActiveCapsule(org.eclipse.papyrus.uml.validation.tests.rules.TestValidationRulesInProfile)  Time elapsed: 1.734 sec
01:27:06 validateIsActiveRule_ActiveCapsule(org.eclipse.papyrus.uml.validation.tests.rules.TestValidationRulesInProfile)  Time elapsed: 1.815 sec
01:27:06 validateNameClashDetection(org.eclipse.papyrus.uml.validation.tests.rules.TestUMLValidationRules)  Time elapsed: 1.166 sec
01:27:06 validateNonStandardMultiplicity(org.eclipse.papyrus.uml.validation.tests.rules.TestUMLValidationRules)  Time elapsed: 0.851 sec
01:27:06 validateUnsetStereotypeAttribute(org.eclipse.papyrus.uml.validation.tests.rules.TestStereotypeValidation)  Time elapsed: 1.442 sec
01:27:06 testResolveProfile__Object(org.eclipse.papyrus.uml.filters.tests.ProfileAppliedTest)  Time elapsed: 0.057 sec
01:27:06 testMatches__Object(org.eclipse.papyrus.uml.filters.tests.ProfileAppliedTest)  Time elapsed: 0.018 sec
01:27:06 profileAppliedFilterResourceURI_bug480221(org.eclipse.papyrus.uml.filters.tests.ProfileAppliedRegressionTest)  Time elapsed: 0.031 sec
01:27:06 profileAppliedFilterDoesNotLoadProfiles_miss_bug480221(org.eclipse.papyrus.uml.filters.tests.ProfileAppliedRegressionTest)  Time elapsed: 0.023 sec
01:27:06 profileAppliedFilterDoesNotLoadProfiles_hit_bug480221(org.eclipse.papyrus.uml.filters.tests.ProfileAppliedRegressionTest)  Time elapsed: 0.024 sec
01:27:06 popupsGenerated(org.eclipse.papyrus.uml.profile.assistants.generator.tests.BasicAssistantsGenerationTest)  Time elapsed: 0.012 sec
01:27:06 connectionTargetFilters(org.eclipse.papyrus.uml.profile.assistants.generator.tests.BasicAssistantsGenerationTest)  Time elapsed: 0.005 sec
01:27:06 popupFilters(org.eclipse.papyrus.uml.profile.assistants.generator.tests.BasicAssistantsGenerationTest)  Time elapsed: 0.001 sec
01:27:06 connectionSourceFilters(org.eclipse.papyrus.uml.profile.assistants.generator.tests.BasicAssistantsGenerationTest)  Time elapsed: 0.001 sec
01:27:06 connectionsGenerated(org.eclipse.papyrus.uml.profile.assistants.generator.tests.BasicAssistantsGenerationTest)  Time elapsed: 0 sec
01:27:06 popupsGenerated(org.eclipse.papyrus.uml.profile.assistants.generator.tests.DiagramSpecificAssistantsGenerationTest)  Time elapsed: 0.03 sec
01:27:06 connectionTargetFilters(org.eclipse.papyrus.uml.profile.assistants.generator.tests.DiagramSpecificAssistantsGenerationTest)  Time elapsed: 0.002 sec
01:27:06 distinctConnectionHintsGenerated(org.eclipse.papyrus.uml.profile.assistants.generator.tests.DiagramSpecificAssistantsGenerationTest)  Time elapsed: 0.001 sec
01:27:06 popupFilters(org.eclipse.papyrus.uml.profile.assistants.generator.tests.DiagramSpecificAssistantsGenerationTest)  Time elapsed: 0.001 sec
01:27:06 connectionSourceFilters(org.eclipse.papyrus.uml.profile.assistants.generator.tests.DiagramSpecificAssistantsGenerationTest)  Time elapsed: 0.001 sec
01:27:06 distinctPopupHintsGenerated(org.eclipse.papyrus.uml.profile.assistants.generator.tests.DiagramSpecificAssistantsGenerationTest)  Time elapsed: 0 sec
01:27:06 connectionsGenerated(org.eclipse.papyrus.uml.profile.assistants.generator.tests.DiagramSpecificAssistantsGenerationTest)  Time elapsed: 0 sec
01:27:06 popupsGenerated(org.eclipse.papyrus.uml.profile.assistants.generator.tests.ProfilesWithPackageNestingTest)  Time elapsed: 0.002 sec
01:27:06 connectionTargetFilters(org.eclipse.papyrus.uml.profile.assistants.generator.tests.ProfilesWithPackageNestingTest)  Time elapsed: 0.002 sec
01:27:06 popupFilters(org.eclipse.papyrus.uml.profile.assistants.generator.tests.ProfilesWithPackageNestingTest)  Time elapsed: 0.001 sec
01:27:06 connectionSourceFilters(org.eclipse.papyrus.uml.profile.assistants.generator.tests.ProfilesWithPackageNestingTest)  Time elapsed: 0 sec
01:27:06 connectionsGenerated(org.eclipse.papyrus.uml.profile.assistants.generator.tests.ProfilesWithPackageNestingTest)  Time elapsed: 0 sec
01:27:06 connectionsGenerated[<<Indirect>> Generalization](org.eclipse.papyrus.uml.profile.assistants.generator.tests.ConnectionTypesTest)  Time elapsed: 0.003 sec
01:27:06 connectionsGenerated[<<Indirect>> GeneralizationSet](org.eclipse.papyrus.uml.profile.assistants.generator.tests.ConnectionTypesTest)  Time elapsed: 0 sec
01:27:06 connectionsGenerated[<<Virtual>> ControlFlow](org.eclipse.papyrus.uml.profile.assistants.generator.tests.ConnectionTypesTest)  Time elapsed: 0 sec
01:27:06 connectionsGenerated[<<Virtual>> ObjectFlow](org.eclipse.papyrus.uml.profile.assistants.generator.tests.ConnectionTypesTest)  Time elapsed: 0 sec
01:27:06 connectionsGenerated[<<Virtual>> Transition](org.eclipse.papyrus.uml.profile.assistants.generator.tests.ConnectionTypesTest)  Time elapsed: 0.001 sec
01:27:06 connectionsGenerated[<<Virtual>> Message](org.eclipse.papyrus.uml.profile.assistants.generator.tests.ConnectionTypesTest)  Time elapsed: 0 sec
01:27:06 connectionsGenerated[<<Indirect>> Connector](org.eclipse.papyrus.uml.profile.assistants.generator.tests.ConnectionTypesTest)  Time elapsed: 0 sec
01:27:06 iconGenerated(org.eclipse.papyrus.uml.profile.types.generator.tests.BasicElementTypesGenerationTest)  Time elapsed: 0.005 sec
01:27:06 elementTypeSpecializedTypes_bug461717(org.eclipse.papyrus.uml.profile.types.generator.tests.BasicElementTypesGenerationTest)  Time elapsed: 0.007 sec
01:27:06 multipleElementTypesForOneStereotypeGenerated(org.eclipse.papyrus.uml.profile.types.generator.tests.BasicElementTypesGenerationTest)  Time elapsed: 0.001 sec
01:27:06 stereotypeAdviceGenerated(org.eclipse.papyrus.uml.profile.types.generator.tests.BasicElementTypesGenerationTest)  Time elapsed: 0.001 sec
01:27:06 elementTypesGenerated(org.eclipse.papyrus.uml.profile.types.generator.tests.BasicElementTypesGenerationTest)  Time elapsed: 0 sec
01:27:06 stereotypeMatcherGenerated(org.eclipse.papyrus.uml.profile.types.generator.tests.BasicElementTypesGenerationTest)  Time elapsed: 0 sec
01:27:06 stereotypeAdviceNotGenerated(org.eclipse.papyrus.uml.profile.types.generator.tests.DiagramSpecificElementTypesGenerationTest)  Time elapsed: 0.003 sec
01:27:06 distinctHintsGenerated(org.eclipse.papyrus.uml.profile.types.generator.tests.DiagramSpecificElementTypesGenerationTest)  Time elapsed: 0.002 sec
01:27:06 stereotypeMatcherNotGenerated(org.eclipse.papyrus.uml.profile.types.generator.tests.DiagramSpecificElementTypesGenerationTest)  Time elapsed: 0 sec
01:27:06 iconGenerated(org.eclipse.papyrus.uml.profile.types.generator.tests.DiagramSpecificElementTypesGenerationTest)  Time elapsed: 0 sec
01:27:06 elementTypeSpecializedTypes_bug461717(org.eclipse.papyrus.uml.profile.types.generator.tests.DiagramSpecificElementTypesGenerationTest)  Time elapsed: 0.016 sec
01:27:06 elementTypesGenerated(org.eclipse.papyrus.uml.profile.types.generator.tests.DiagramSpecificElementTypesGenerationTest)  Time elapsed: 0 sec
01:27:06 iconGenerated(org.eclipse.papyrus.uml.profile.types.generator.tests.ProfilesWithPackageNestingTest)  Time elapsed: 0.002 sec
01:27:06 stereotypeAdviceGenerated(org.eclipse.papyrus.uml.profile.types.generator.tests.ProfilesWithPackageNestingTest)  Time elapsed: 0.001 sec
01:27:06 elementTypesGenerated(org.eclipse.papyrus.uml.profile.types.generator.tests.ProfilesWithPackageNestingTest)  Time elapsed: 0 sec
01:27:06 stereotypeMatcherGenerated(org.eclipse.papyrus.uml.profile.types.generator.tests.ProfilesWithPackageNestingTest)  Time elapsed: 0 sec
01:27:06 elementTypeSpecializedTypes(org.eclipse.papyrus.uml.profile.types.generator.tests.DiagramSpecificElementTypesGenerationBug461717Test)  Time elapsed: 0.017 sec
01:27:06 stereotypeAdviceGenerated(org.eclipse.papyrus.uml.profile.types.generator.tests.DiagramSpecificElementTypesGenerationBug461717Test)  Time elapsed: 0.001 sec
01:27:06 stereotypeMatcherGenerated(org.eclipse.papyrus.uml.profile.types.generator.tests.DiagramSpecificElementTypesGenerationBug461717Test)  Time elapsed: 0.001 sec
01:27:06 testGetStereotypeNames(org.eclipse.papyrus.uml.profile.drafter.tests.ProfileCatalogTest)  Time elapsed: 0.03 sec
01:27:06 testGetStereotypes(org.eclipse.papyrus.uml.profile.drafter.tests.ProfileCatalogTest)  Time elapsed: 0.028 sec
01:27:06 testGetAllStereotypeNames(org.eclipse.papyrus.uml.profile.drafter.tests.ProfileCatalogTest) skipped
01:27:06 testGetProfileNames(org.eclipse.papyrus.uml.profile.drafter.tests.ProfileCatalogTest)  Time elapsed: 0.049 sec
01:27:06 testProfileCatalog(org.eclipse.papyrus.uml.profile.drafter.tests.ProfileCatalogTest)  Time elapsed: 0.047 sec
01:27:06 testLookupStereotype(org.eclipse.papyrus.uml.profile.drafter.tests.ProfileCatalogTest)  Time elapsed: 0.08 sec
01:27:06 testLookupStereotypeInAppliedProfile(org.eclipse.papyrus.uml.profile.drafter.tests.ProfileCatalogTest)  Time elapsed: 0.061 sec
01:27:06 testProfileCopy(org.eclipse.papyrus.uml.profile.drafter.tests.ProfileCatalogTest)  Time elapsed: 0.024 sec
01:27:06 testGetProfiles(org.eclipse.papyrus.uml.profile.drafter.tests.ProfileCatalogTest)  Time elapsed: 0.026 sec
01:27:06 testGetNamedElement(org.eclipse.papyrus.uml.profile.drafter.tests.ProfileCatalogTest)  Time elapsed: 0.017 sec
01:27:06 testIsModelsExist(org.eclipse.papyrus.uml.profile.drafter.tests.ProfileCatalogTest)  Time elapsed: 0.022 sec
01:27:06 testGetStereotypeQualifiedNames(org.eclipse.papyrus.uml.profile.drafter.tests.ProfileCatalogTest)  Time elapsed: 0.023 sec
01:27:06 testGetProfileQualifiedNames(org.eclipse.papyrus.uml.profile.drafter.tests.ProfileCatalogTest)  Time elapsed: 0.022 sec
01:27:06 testCopyResources(org.eclipse.papyrus.uml.profile.drafter.tests.EclipseProjectTest)  Time elapsed: 0.004 sec
01:27:06 testCopyResource(org.eclipse.papyrus.uml.profile.drafter.tests.EclipseProjectTest)  Time elapsed: 0.003 sec
01:27:06 testGetProject(org.eclipse.papyrus.uml.profile.drafter.tests.EclipseProjectTest)  Time elapsed: 0 sec
01:27:06 testEclipseProject(org.eclipse.papyrus.uml.profile.drafter.tests.EclipseProjectTest)  Time elapsed: 0 sec
01:27:06 testGetUmlModelWithIFile(org.eclipse.papyrus.uml.profile.drafter.tests.ModelSetManagerTest)  Time elapsed: 0.022 sec
01:27:06 testModelSetManagerString(org.eclipse.papyrus.uml.profile.drafter.tests.ModelSetManagerTest)  Time elapsed: 0.003 sec
01:27:06 testModelSetManagerURI(org.eclipse.papyrus.uml.profile.drafter.tests.ModelSetManagerTest)  Time elapsed: 0.003 sec
01:27:06 testGetNamedElementByNameString(org.eclipse.papyrus.uml.profile.drafter.tests.ModelSetManagerTest)  Time elapsed: 0.003 sec
01:27:06 testGetUmlModel(org.eclipse.papyrus.uml.profile.drafter.tests.ModelSetManagerTest)  Time elapsed: 0.116 sec
01:27:06 testModelSetManagerStringModels(org.eclipse.papyrus.uml.profile.drafter.tests.ModelSetManagerTest)  Time elapsed: 0.002 sec
01:27:06 testGetNamedElementByNameWithSterotype(org.eclipse.papyrus.uml.profile.drafter.tests.ModelSetManagerTest)  Time elapsed: 0.026 sec
01:27:06 testCreation(org.eclipse.papyrus.uml.profile.drafter.tests.utils.UMLModelCreatorTest)  Time elapsed: 0.003 sec
01:27:06 testCreateClass(org.eclipse.papyrus.uml.profile.drafter.tests.utils.UMLModelCreatorTest)  Time elapsed: 0 sec
01:27:06 testCreateModel(org.eclipse.papyrus.uml.profile.drafter.tests.utils.UMLModelCreatorTest)  Time elapsed: 0 sec
01:27:06 testCreatePackage(org.eclipse.papyrus.uml.profile.drafter.tests.utils.UMLModelCreatorTest)  Time elapsed: 0 sec
01:27:06 testCd(org.eclipse.papyrus.uml.profile.drafter.tests.utils.UMLModelCreatorTest)  Time elapsed: 0 sec
01:27:06 testUMLModelCreatorResourceFailing(org.eclipse.papyrus.uml.profile.drafter.tests.utils.UMLModelCreatorTest)  Time elapsed: 0 sec
01:27:06 testUMLModelCreatorStringString(org.eclipse.papyrus.uml.profile.drafter.tests.utils.UMLModelCreatorTest)  Time elapsed: 0 sec
01:27:06 testUMLModelCreatorResource(org.eclipse.papyrus.uml.profile.drafter.tests.utils.UMLModelCreatorTest)  Time elapsed: 0 sec
01:27:06 testCreateDatatype(org.eclipse.papyrus.uml.profile.drafter.tests.utils.UMLModelCreatorTest)  Time elapsed: 0 sec
01:27:06 testCompoundTypeProvider(org.eclipse.papyrus.uml.profile.drafter.ui.model.CompoundTypeProviderTest)  Time elapsed: 0.001 sec
01:27:06 testGetTypes(org.eclipse.papyrus.uml.profile.drafter.ui.model.CompoundTypeProviderTest)  Time elapsed: 0 sec
01:27:06 testAddITypeProvider(org.eclipse.papyrus.uml.profile.drafter.ui.model.CompoundTypeProviderTest)  Time elapsed: 0 sec
01:27:06 testIterator(org.eclipse.papyrus.uml.profile.drafter.ui.model.CompoundTypeProviderTest)  Time elapsed: 0 sec
01:27:06 testVisitMetaclassesModel(org.eclipse.papyrus.uml.profile.drafter.ui.model.SimpleModelVisitorTest) skipped
01:27:06 testVisitPropertyModel(org.eclipse.papyrus.uml.profile.drafter.ui.model.SimpleModelVisitorTest) skipped
01:27:06 testSimpleModelVisitor(org.eclipse.papyrus.uml.profile.drafter.ui.model.SimpleModelVisitorTest)  Time elapsed: 0.001 sec
01:27:06 testDoVisitStereoptypeModel(org.eclipse.papyrus.uml.profile.drafter.ui.model.SimpleModelVisitorTest) skipped
01:27:06 testDoVisitPropertyModel(org.eclipse.papyrus.uml.profile.drafter.ui.model.SimpleModelVisitorTest) skipped
01:27:06 testVisitStereoptypeModel(org.eclipse.papyrus.uml.profile.drafter.ui.model.SimpleModelVisitorTest) skipped
01:27:06 testDoVisitMetaclassesModel(org.eclipse.papyrus.uml.profile.drafter.ui.model.SimpleModelVisitorTest) skipped
01:27:06 testSetStereotypeName(org.eclipse.papyrus.uml.profile.drafter.ui.model.StereotypeURLTest)  Time elapsed: 0.016 sec
01:27:06 testGetProfileName(org.eclipse.papyrus.uml.profile.drafter.ui.model.StereotypeURLTest)  Time elapsed: 0 sec
01:27:06 testAddPropertyChangeListenerPropertyChangeListener(org.eclipse.papyrus.uml.profile.drafter.ui.model.StereotypeURLTest)  Time elapsed: 0.001 sec
01:27:06 testSetQualifiedNameComplex(org.eclipse.papyrus.uml.profile.drafter.ui.model.StereotypeURLTest)  Time elapsed: 0 sec
01:27:06 testClear(org.eclipse.papyrus.uml.profile.drafter.ui.model.StereotypeURLTest)  Time elapsed: 0 sec
01:27:06 testStereotypeURLString(org.eclipse.papyrus.uml.profile.drafter.ui.model.StereotypeURLTest)  Time elapsed: 0 sec
01:27:06 testToString(org.eclipse.papyrus.uml.profile.drafter.ui.model.StereotypeURLTest)  Time elapsed: 0 sec
01:27:06 testGetStereotypeName(org.eclipse.papyrus.uml.profile.drafter.ui.model.StereotypeURLTest)  Time elapsed: 0 sec
01:27:06 testAddPropertyChangeListenerStringPropertyChangeListener(org.eclipse.papyrus.uml.profile.drafter.ui.model.StereotypeURLTest)  Time elapsed: 0 sec
01:27:06 testStereotypeURL(org.eclipse.papyrus.uml.profile.drafter.ui.model.StereotypeURLTest)  Time elapsed: 0 sec
01:27:06 testRemovePropertyChangeListenerPropertyChangeListener(org.eclipse.papyrus.uml.profile.drafter.ui.model.StereotypeURLTest)  Time elapsed: 0 sec
01:27:06 testSetQualifiedNameSimple(org.eclipse.papyrus.uml.profile.drafter.ui.model.StereotypeURLTest)  Time elapsed: 0 sec
01:27:06 testSetProfileName(org.eclipse.papyrus.uml.profile.drafter.ui.model.StereotypeURLTest)  Time elapsed: 0 sec
01:27:06 testRemovePropertyChangeListenerStringPropertyChangeListener(org.eclipse.papyrus.uml.profile.drafter.ui.model.StereotypeURLTest)  Time elapsed: 0.001 sec
01:27:06 testComputeQualifiedName(org.eclipse.papyrus.uml.profile.drafter.ui.model.StereotypeURLTest)  Time elapsed: 0 sec
01:27:06 testGetQualifiedName(org.eclipse.papyrus.uml.profile.drafter.ui.model.StereotypeURLTest)  Time elapsed: 0 sec
01:27:06 testStereotypeURLStringString(org.eclipse.papyrus.uml.profile.drafter.ui.model.StereotypeURLTest)  Time elapsed: 0 sec
01:27:06 testGetTypes(org.eclipse.papyrus.uml.profile.drafter.ui.model.TypeProviderTest)  Time elapsed: 0.002 sec
01:27:06 testTypeProvider(org.eclipse.papyrus.uml.profile.drafter.ui.model.TypeProviderTest)  Time elapsed: 0.001 sec
01:27:06 testIterator(org.eclipse.papyrus.uml.profile.drafter.ui.model.TypeProviderTest)  Time elapsed: 0 sec
01:27:06 testGetTypes(org.eclipse.papyrus.uml.profile.drafter.ui.model.TypeProviderTest2)  Time elapsed: 0 sec
01:27:06 testAddType(org.eclipse.papyrus.uml.profile.drafter.ui.model.TypeProviderTest2)  Time elapsed: 0 sec
01:27:06 testAddTypeFromConstructor(org.eclipse.papyrus.uml.profile.drafter.ui.model.TypeProviderTest2)  Time elapsed: 0 sec
01:27:06 testTypeProvider(org.eclipse.papyrus.uml.profile.drafter.ui.model.TypeProviderTest2)  Time elapsed: 0 sec
01:27:06 testTypeProviderTypeArray(org.eclipse.papyrus.uml.profile.drafter.ui.model.TypeProviderTest2)  Time elapsed: 0 sec
01:27:06 testIterator(org.eclipse.papyrus.uml.profile.drafter.ui.model.TypeProviderTest2)  Time elapsed: 0 sec
01:27:06 testUMLPrimitiveTypesModel(org.eclipse.papyrus.uml.profile.drafter.utils.UMLPrimitiveTypesModelTest)  Time elapsed: 0.013 sec
01:27:06 testGetLibraryPackage(org.eclipse.papyrus.uml.profile.drafter.utils.UMLPrimitiveTypesModelTest)  Time elapsed: 0.01 sec
01:27:06 testUseInternationalizationModification(org.eclipse.papyrus.uml.internationalization.tests.tests.UMLInternationalizationChangePreferencesTest)  Time elapsed: 0.789 sec
01:27:06 testLanguageModification(org.eclipse.papyrus.uml.internationalization.tests.tests.UMLInternationalizationChangeLanguageTest)  Time elapsed: 2.937 sec
01:27:06 rebuildAdapters(org.eclipse.papyrus.uml.internationalization.tests.tests.InternationalizationUMLItemProviderAdapterFactoryTest)  Time elapsed: 1.656 sec
01:27:06 normalAdapters(org.eclipse.papyrus.uml.internationalization.tests.tests.InternationalizationUMLItemProviderAdapterFactoryTest)  Time elapsed: 0.718 sec
01:27:06 testMapping(org.eclipse.papyrus.uml.alf.tests.mapper.MappingTest) skipped
01:27:06 org.eclipse.papyrus.uml.alf.tests.mapper.MappingTest skipped
01:27:06 testMerging(org.eclipse.papyrus.uml.alf.tests.mapper.MergeTest) skipped
01:27:06 org.eclipse.papyrus.uml.alf.tests.mapper.MergeTest skipped
01:27:06 testStaticSemantics(org.eclipse.papyrus.uml.alf.tests.SemanticTest) skipped
01:27:06 org.eclipse.papyrus.uml.alf.tests.SemanticTest skipped
01:27:06 testOneFile(org.eclipse.papyrus.uml.alf.tests.SingleTest) skipped
01:27:06 org.eclipse.papyrus.uml.alf.tests.SingleTest skipped
01:27:06 testSyntax(org.eclipse.papyrus.uml.alf.tests.SyntacticTest) skipped
01:27:06 org.eclipse.papyrus.uml.alf.tests.SyntacticTest skipped
01:27:06 testGeneration(org.eclipse.papyrus.uml.alf.tests.generator.GenerationTest) skipped
01:27:06 org.eclipse.papyrus.uml.alf.tests.generator.GenerationTest skipped
01:27:06 org.eclipse.papyrus.uml.alf.tests.AllTests skipped
01:27:06 IsStereotypedWithExpression_Test10(org.eclipse.papyrus.uml.expressions.tests.IsStereotypedWithExpressionTests)  Time elapsed: 1.236 sec
01:27:06 IsStereotypedWithExpression_Test11(org.eclipse.papyrus.uml.expressions.tests.IsStereotypedWithExpressionTests)  Time elapsed: 1.076 sec
01:27:06 IsStereotypedWithExpression_Test12(org.eclipse.papyrus.uml.expressions.tests.IsStereotypedWithExpressionTests)  Time elapsed: 1.084 sec
01:27:06 IsStereotypedWithExpression_Test13(org.eclipse.papyrus.uml.expressions.tests.IsStereotypedWithExpressionTests)  Time elapsed: 1.072 sec
01:27:06 IsStereotypedWithExpression_Test1(org.eclipse.papyrus.uml.expressions.tests.IsStereotypedWithExpressionTests)  Time elapsed: 1.034 sec
01:27:06 IsStereotypedWithExpression_Test2(org.eclipse.papyrus.uml.expressions.tests.IsStereotypedWithExpressionTests)  Time elapsed: 1.181 sec
01:27:06 IsStereotypedWithExpression_Test3(org.eclipse.papyrus.uml.expressions.tests.IsStereotypedWithExpressionTests)  Time elapsed: 1.081 sec
01:27:06 IsStereotypedWithExpression_Test4(org.eclipse.papyrus.uml.expressions.tests.IsStereotypedWithExpressionTests)  Time elapsed: 1.132 sec
01:27:06 IsStereotypedWithExpression_Test5(org.eclipse.papyrus.uml.expressions.tests.IsStereotypedWithExpressionTests)  Time elapsed: 1.003 sec
01:27:06 IsStereotypedWithExpression_Test6(org.eclipse.papyrus.uml.expressions.tests.IsStereotypedWithExpressionTests)  Time elapsed: 1.101 sec
01:27:06 IsStereotypedWithExpression_Test7(org.eclipse.papyrus.uml.expressions.tests.IsStereotypedWithExpressionTests)  Time elapsed: 1.216 sec
01:27:06 IsStereotypedWithExpression_Test8(org.eclipse.papyrus.uml.expressions.tests.IsStereotypedWithExpressionTests)  Time elapsed: 1.017 sec
01:27:06 IsStereotypedWithExpression_Test9(org.eclipse.papyrus.uml.expressions.tests.IsStereotypedWithExpressionTests)  Time elapsed: 1.001 sec
01:27:06 HasStereotypeExpressionTests_Test1(org.eclipse.papyrus.uml.expressions.tests.HasAppliedStereotypeExpressionTests)  Time elapsed: 1.083 sec
01:27:06 HasStereotypeExpressionTests_Test2(org.eclipse.papyrus.uml.expressions.tests.HasAppliedStereotypeExpressionTests)  Time elapsed: 1.086 sec
01:27:06 HasStereotypeExpressionTests_Test3(org.eclipse.papyrus.uml.expressions.tests.HasAppliedStereotypeExpressionTests)  Time elapsed: 1.077 sec
01:27:06 HasStereotypeExpressionTests_Test4(org.eclipse.papyrus.uml.expressions.tests.HasAppliedStereotypeExpressionTests)  Time elapsed: 1.49 sec
01:27:06 metaclassAndNoContext(org.eclipse.papyrus.uml.expressions.tests.IsKindOfExpressionTest)  Time elapsed: 0.004 sec
01:27:06 noMetaclassAndNoContextTest(org.eclipse.papyrus.uml.expressions.tests.IsKindOfExpressionTest)  Time elapsed: 0 sec
01:27:06 metaclassAndValidContext_1(org.eclipse.papyrus.uml.expressions.tests.IsKindOfExpressionTest)  Time elapsed: 0 sec
01:27:06 metaclassAndValidContext_2(org.eclipse.papyrus.uml.expressions.tests.IsKindOfExpressionTest)  Time elapsed: 0 sec
01:27:06 metaclassAndInvalidContext(org.eclipse.papyrus.uml.expressions.tests.IsKindOfExpressionTest)  Time elapsed: 0 sec
01:27:06 metaclassAndNoContext(org.eclipse.papyrus.uml.expressions.tests.IsTypeOfExpressionTests)  Time elapsed: 0.003 sec
01:27:06 noMetaclassAndNoContextTest(org.eclipse.papyrus.uml.expressions.tests.IsTypeOfExpressionTests)  Time elapsed: 0 sec
01:27:06 metaclassAndValidContext_2(org.eclipse.papyrus.uml.expressions.tests.IsTypeOfExpressionTests)  Time elapsed: 0 sec
01:27:06 metaclassAndInValidContext_1(org.eclipse.papyrus.uml.expressions.tests.IsTypeOfExpressionTests)  Time elapsed: 0 sec
01:27:06 
01:27:06 Results :
01:27:06 
01:27:06 Failed tests: 
01:27:06   TableCopyPasteModelExplorerTest.copyPasteTableTest:119 TableOfViews0 TreeElement is null
01:27:06 
01:27:06 Tests run: 576, Failures: 1, Errors: 0, Skipped: 38
01:27:06 
01:27:08 [ERROR] There are test failures.
01:27:08 
01:27:08 Please refer to /jobs/genie.papyrus/Papyrus-Oxygen-Tests/workspace/source/tests/junit/plugins/uml/org.eclipse.papyrus.uml.suite.tests/target/surefire-reports for the individual test results.
01:27:08 [INFO] 
01:27:08 [INFO] --- jacoco-maven-plugin:0.7.9:report (default-report) @ org.eclipse.papyrus.uml.suite.tests ---
01:27:08 [INFO] Loading execution data file /jobs/genie.papyrus/Papyrus-Oxygen-Tests/workspace/source/tests/junit/plugins/uml/org.eclipse.papyrus.uml.suite.tests/target/jacoco.exec
01:27:08 [INFO] Analyzed bundle 'org.eclipse.papyrus.uml.suite.tests' with 0 classes
01:27:08 [INFO] 
01:27:08 [INFO] --< org.eclipse.papyrus.tests:org.eclipse.papyrus.uml.alf.tests.releng >--
01:27:08 [INFO] Building org.eclipse.papyrus.uml.alf.tests.releng 0.0.1-SNAPSHOT [148/155]
01:27:08 [INFO] --------------------------------[ pom ]---------------------------------
01:27:08 [INFO] 
01:27:08 [INFO] --- maven-clean-plugin:2.6:clean (default-clean) @ org.eclipse.papyrus.uml.alf.tests.releng ---
01:27:08 [INFO] 
01:27:08 [INFO] --- jacoco-maven-plugin:0.7.9:prepare-agent (default-prepare-agent) @ org.eclipse.papyrus.uml.alf.tests.releng ---
01:27:08 [INFO] argLine set to -javaagent:/home/hudson/genie.papyrus/.jenkins/jobs/Papyrus-Oxygen-Tests/workspace/.repository/org/jacoco/org.jacoco.agent/0.7.9/org.jacoco.agent-0.7.9-runtime.jar=destfile=/jobs/genie.papyrus/Papyrus-Oxygen-Tests/workspace/source/tests/junit/plugins/uml/alf/target/jacoco.exec,includes=org.eclipse.papyrus.*,excludes=org.eclipse.uml2
01:27:08 [INFO] 
01:27:08 [INFO] --- jacoco-maven-plugin:0.7.9:report (default-report) @ org.eclipse.papyrus.uml.alf.tests.releng ---
01:27:08 [INFO] Skipping JaCoCo execution due to missing execution data file.
01:27:08 [INFO] 
01:27:08 [INFO] --< org.eclipse.papyrus.tests:org.eclipse.papyrus.uml.alf.backend.tests >--
01:27:08 [INFO] Building org.eclipse.papyrus.uml.alf.backend.tests 1.1.0-SNAPSHOT [149/155]
01:27:08 [INFO] ------------------------[ eclipse-test-plugin ]-------------------------
01:27:08 [INFO] 
01:27:08 [INFO] --- maven-clean-plugin:2.6:clean (default-clean) @ org.eclipse.papyrus.uml.alf.backend.tests ---
01:27:08 [INFO] 
01:27:08 [INFO] --- tycho-packaging-plugin:1.0.0:build-qualifier (default-build-qualifier) @ org.eclipse.papyrus.uml.alf.backend.tests ---
01:27:08 [INFO] The project's OSGi version is 1.1.0.201911210536
01:27:08 [INFO] 
01:27:08 [INFO] --- tycho-packaging-plugin:1.0.0:validate-id (default-validate-id) @ org.eclipse.papyrus.uml.alf.backend.tests ---
01:27:08 [INFO] 
01:27:08 [INFO] --- tycho-packaging-plugin:1.0.0:validate-version (default-validate-version) @ org.eclipse.papyrus.uml.alf.backend.tests ---
01:27:08 [INFO] 
01:27:08 [INFO] --- jacoco-maven-plugin:0.7.9:prepare-agent (default-prepare-agent) @ org.eclipse.papyrus.uml.alf.backend.tests ---
01:27:08 [INFO] tycho.testArgLine set to -javaagent:/home/hudson/genie.papyrus/.jenkins/jobs/Papyrus-Oxygen-Tests/workspace/.repository/org/jacoco/org.jacoco.agent/0.7.9/org.jacoco.agent-0.7.9-runtime.jar=destfile=/jobs/genie.papyrus/Papyrus-Oxygen-Tests/workspace/source/tests/junit/plugins/uml/alf/org.eclipse.papyrus.uml.alf.backend.tests/target/jacoco.exec,includes=org.eclipse.papyrus.*,excludes=org.eclipse.uml2
01:27:08 [INFO] 
01:27:08 [INFO] --- xtend-maven-plugin:2.11.0:compile (default) @ org.eclipse.papyrus.uml.alf.backend.tests ---
01:27:09 [INFO] 
01:27:09 [INFO] --- maven-resources-plugin:2.6:resources (default-resources) @ org.eclipse.papyrus.uml.alf.backend.tests ---
01:27:09 [INFO] Using 'UTF-8' encoding to copy filtered resources.
01:27:09 [INFO] skip non existing resourceDirectory /jobs/genie.papyrus/Papyrus-Oxygen-Tests/workspace/source/tests/junit/plugins/uml/alf/org.eclipse.papyrus.uml.alf.backend.tests/src/main/resources
01:27:09 [INFO] 
01:27:09 [INFO] --- tycho-compiler-plugin:1.0.0:compile (default-compile) @ org.eclipse.papyrus.uml.alf.backend.tests ---
01:27:09 [INFO] Compiling 4 source files to /jobs/genie.papyrus/Papyrus-Oxygen-Tests/workspace/source/tests/junit/plugins/uml/alf/org.eclipse.papyrus.uml.alf.backend.tests/target/classes
01:27:09 [INFO] 
01:27:09 [INFO] --- maven-resources-plugin:2.6:testResources (default-testResources) @ org.eclipse.papyrus.uml.alf.backend.tests ---
01:27:09 [INFO] Using 'UTF-8' encoding to copy filtered resources.
01:27:09 [INFO] skip non existing resourceDirectory /jobs/genie.papyrus/Papyrus-Oxygen-Tests/workspace/source/tests/junit/plugins/uml/alf/org.eclipse.papyrus.uml.alf.backend.tests/src/test/resources
01:27:09 [INFO] 
01:27:09 [INFO] --- target-platform-configuration:1.0.0:target-platform (default-target-platform) @ org.eclipse.papyrus.uml.alf.backend.tests ---
01:27:09 [INFO] 
01:27:09 [INFO] --- tycho-packaging-plugin:1.0.0:package-plugin (default-package-plugin) @ org.eclipse.papyrus.uml.alf.backend.tests ---
01:27:09 [INFO] Building jar: /jobs/genie.papyrus/Papyrus-Oxygen-Tests/workspace/source/tests/junit/plugins/uml/alf/org.eclipse.papyrus.uml.alf.backend.tests/target/org.eclipse.papyrus.uml.alf.backend.tests-1.1.0-SNAPSHOT.jar
01:27:09 [INFO] 
01:27:09 [INFO] --- tycho-p2-plugin:1.0.0:p2-metadata-default (default-p2-metadata-default) @ org.eclipse.papyrus.uml.alf.backend.tests ---
01:27:09 [INFO] 
01:27:09 [INFO] --- tycho-surefire-plugin:1.0.0:test (default-test) @ org.eclipse.papyrus.uml.alf.backend.tests ---
01:27:09 [INFO] Skipping tests
01:27:09 [INFO] 
01:27:09 [INFO] --- jacoco-maven-plugin:0.7.9:report (default-report) @ org.eclipse.papyrus.uml.alf.backend.tests ---
01:27:09 [INFO] Skipping JaCoCo execution due to missing execution data file.
01:27:09 [INFO] 
01:27:09 [INFO] --< org.eclipse.papyrus.tests:org.eclipse.papyrus.uml.internationalization.controlmode.tests >--
01:27:09 [INFO] Building org.eclipse.papyrus.uml.internationalization.controlmode.tests 1.0.0-SNAPSHOT [150/155]
01:27:09 [INFO] ------------------------[ eclipse-test-plugin ]-------------------------
01:27:09 [INFO] 
01:27:09 [INFO] --- maven-clean-plugin:2.6:clean (default-clean) @ org.eclipse.papyrus.uml.internationalization.controlmode.tests ---
01:27:09 [INFO] 
01:27:09 [INFO] --- tycho-packaging-plugin:1.0.0:build-qualifier (default-build-qualifier) @ org.eclipse.papyrus.uml.internationalization.controlmode.tests ---
01:27:09 [INFO] The project's OSGi version is 1.0.0.201911210536
01:27:09 [INFO] 
01:27:09 [INFO] --- tycho-packaging-plugin:1.0.0:validate-id (default-validate-id) @ org.eclipse.papyrus.uml.internationalization.controlmode.tests ---
01:27:09 [INFO] 
01:27:09 [INFO] --- tycho-packaging-plugin:1.0.0:validate-version (default-validate-version) @ org.eclipse.papyrus.uml.internationalization.controlmode.tests ---
01:27:09 [INFO] 
01:27:09 [INFO] --- jacoco-maven-plugin:0.7.9:prepare-agent (default-prepare-agent) @ org.eclipse.papyrus.uml.internationalization.controlmode.tests ---
01:27:09 [INFO] tycho.testArgLine set to -javaagent:/home/hudson/genie.papyrus/.jenkins/jobs/Papyrus-Oxygen-Tests/workspace/.repository/org/jacoco/org.jacoco.agent/0.7.9/org.jacoco.agent-0.7.9-runtime.jar=destfile=/jobs/genie.papyrus/Papyrus-Oxygen-Tests/workspace/source/tests/junit/plugins/uml/internationalization/org.eclipse.papyrus.uml.internationalization.controlmode.tests/target/jacoco.exec,includes=org.eclipse.papyrus.*,excludes=org.eclipse.uml2
01:27:09 [INFO] 
01:27:09 [INFO] --- maven-resources-plugin:2.6:resources (default-resources) @ org.eclipse.papyrus.uml.internationalization.controlmode.tests ---
01:27:09 [INFO] Using 'UTF-8' encoding to copy filtered resources.
01:27:09 [INFO] skip non existing resourceDirectory /jobs/genie.papyrus/Papyrus-Oxygen-Tests/workspace/source/tests/junit/plugins/uml/internationalization/org.eclipse.papyrus.uml.internationalization.controlmode.tests/src/main/resources
01:27:09 [INFO] 
01:27:09 [INFO] --- tycho-compiler-plugin:1.0.0:compile (default-compile) @ org.eclipse.papyrus.uml.internationalization.controlmode.tests ---
01:27:09 [INFO] Compiling 5 source files to /jobs/genie.papyrus/Papyrus-Oxygen-Tests/workspace/source/tests/junit/plugins/uml/internationalization/org.eclipse.papyrus.uml.internationalization.controlmode.tests/target/classes
01:27:09 [INFO] 
01:27:09 [INFO] --- maven-resources-plugin:2.6:testResources (default-testResources) @ org.eclipse.papyrus.uml.internationalization.controlmode.tests ---
01:27:09 [INFO] Using 'UTF-8' encoding to copy filtered resources.
01:27:09 [INFO] skip non existing resourceDirectory /jobs/genie.papyrus/Papyrus-Oxygen-Tests/workspace/source/tests/junit/plugins/uml/internationalization/org.eclipse.papyrus.uml.internationalization.controlmode.tests/src/test/resources
01:27:09 [INFO] 
01:27:09 [INFO] --- target-platform-configuration:1.0.0:target-platform (default-target-platform) @ org.eclipse.papyrus.uml.internationalization.controlmode.tests ---
01:27:09 [INFO] 
01:27:09 [INFO] --- tycho-packaging-plugin:1.0.0:package-plugin (default-package-plugin) @ org.eclipse.papyrus.uml.internationalization.controlmode.tests ---
01:27:09 [INFO] Building jar: /jobs/genie.papyrus/Papyrus-Oxygen-Tests/workspace/source/tests/junit/plugins/uml/internationalization/org.eclipse.papyrus.uml.internationalization.controlmode.tests/target/org.eclipse.papyrus.uml.internationalization.controlmode.tests-1.0.0-SNAPSHOT.jar
01:27:09 [INFO] 
01:27:09 [INFO] --- tycho-p2-plugin:1.0.0:p2-metadata-default (default-p2-metadata-default) @ org.eclipse.papyrus.uml.internationalization.controlmode.tests ---
01:27:09 [INFO] 
01:27:09 [INFO] --- tycho-surefire-plugin:1.0.0:test (default-test) @ org.eclipse.papyrus.uml.internationalization.controlmode.tests ---
01:27:09 [INFO] Skipping tests
01:27:09 [INFO] 
01:27:09 [INFO] --- jacoco-maven-plugin:0.7.9:report (default-report) @ org.eclipse.papyrus.uml.internationalization.controlmode.tests ---
01:27:09 [INFO] Skipping JaCoCo execution due to missing execution data file.
01:27:09 [INFO] 
01:27:09 [INFO] --< org.eclipse.papyrus.tests:org.eclipse.papyrus.views.properties.toolsmiths.tests >--
01:27:09 [INFO] Building org.eclipse.papyrus.views.properties.toolsmiths.tests 1.2.0-SNAPSHOT [151/155]
01:27:09 [INFO] ------------------------[ eclipse-test-plugin ]-------------------------
01:27:09 [INFO] 
01:27:09 [INFO] --- maven-clean-plugin:2.6:clean (default-clean) @ org.eclipse.papyrus.views.properties.toolsmiths.tests ---
01:27:09 [INFO] 
01:27:09 [INFO] --- tycho-packaging-plugin:1.0.0:build-qualifier (default-build-qualifier) @ org.eclipse.papyrus.views.properties.toolsmiths.tests ---
01:27:09 [INFO] The project's OSGi version is 1.2.0.201911210536
01:27:09 [INFO] 
01:27:09 [INFO] --- tycho-packaging-plugin:1.0.0:validate-id (default-validate-id) @ org.eclipse.papyrus.views.properties.toolsmiths.tests ---
01:27:09 [INFO] 
01:27:09 [INFO] --- tycho-packaging-plugin:1.0.0:validate-version (default-validate-version) @ org.eclipse.papyrus.views.properties.toolsmiths.tests ---
01:27:09 [INFO] 
01:27:09 [INFO] --- jacoco-maven-plugin:0.7.9:prepare-agent (default-prepare-agent) @ org.eclipse.papyrus.views.properties.toolsmiths.tests ---
01:27:09 [INFO] tycho.testArgLine set to -javaagent:/home/hudson/genie.papyrus/.jenkins/jobs/Papyrus-Oxygen-Tests/workspace/.repository/org/jacoco/org.jacoco.agent/0.7.9/org.jacoco.agent-0.7.9-runtime.jar=destfile=/jobs/genie.papyrus/Papyrus-Oxygen-Tests/workspace/source/tests/junit/plugins/views/org.eclipse.papyrus.views.properties.toolsmiths.tests/target/jacoco.exec,includes=org.eclipse.papyrus.*,excludes=org.eclipse.uml2
01:27:09 [INFO] 
01:27:09 [INFO] --- maven-resources-plugin:2.6:resources (default-resources) @ org.eclipse.papyrus.views.properties.toolsmiths.tests ---
01:27:09 [INFO] Using 'UTF-8' encoding to copy filtered resources.
01:27:09 [INFO] skip non existing resourceDirectory /jobs/genie.papyrus/Papyrus-Oxygen-Tests/workspace/source/tests/junit/plugins/views/org.eclipse.papyrus.views.properties.toolsmiths.tests/src/main/resources
01:27:09 [INFO] 
01:27:09 [INFO] --- tycho-compiler-plugin:1.0.0:compile (default-compile) @ org.eclipse.papyrus.views.properties.toolsmiths.tests ---
01:27:09 [INFO] Compiling 3 source files to /jobs/genie.papyrus/Papyrus-Oxygen-Tests/workspace/source/tests/junit/plugins/views/org.eclipse.papyrus.views.properties.toolsmiths.tests/target/classes
01:27:10 [WARNING] /jobs/genie.papyrus/Papyrus-Oxygen-Tests/workspace/source/tests/junit/plugins/views/org.eclipse.papyrus.views.properties.toolsmiths.tests/src/org/eclipse/papyrus/views/properties/toolsmiths/tests/qvt/TransformationsTests.java:[164] 
01:27:10 	ModelExtent temp = new BasicModelExtent();
01:27:10 	            ^^^^
01:27:10 The value of the local variable temp is not used
01:27:10 [WARNING] /jobs/genie.papyrus/Papyrus-Oxygen-Tests/workspace/source/tests/junit/plugins/views/org.eclipse.papyrus.views.properties.toolsmiths.tests/src/org/eclipse/papyrus/views/properties/toolsmiths/tests/qvt/TransformationsTests.java:[275] 
01:27:10 	DataContextElement st3Element = findContextElement(context, "Stereotype3");
01:27:10 	                   ^^^^^^^^^^
01:27:10 The value of the local variable st3Element is not used
01:27:10 2 problems (2 warnings)
01:27:10 [INFO] 
01:27:10 [INFO] --- maven-resources-plugin:2.6:testResources (default-testResources) @ org.eclipse.papyrus.views.properties.toolsmiths.tests ---
01:27:10 [INFO] Using 'UTF-8' encoding to copy filtered resources.
01:27:10 [INFO] skip non existing resourceDirectory /jobs/genie.papyrus/Papyrus-Oxygen-Tests/workspace/source/tests/junit/plugins/views/org.eclipse.papyrus.views.properties.toolsmiths.tests/src/test/resources
01:27:10 [INFO] 
01:27:10 [INFO] --- target-platform-configuration:1.0.0:target-platform (default-target-platform) @ org.eclipse.papyrus.views.properties.toolsmiths.tests ---
01:27:10 [INFO] 
01:27:10 [INFO] --- tycho-packaging-plugin:1.0.0:package-plugin (default-package-plugin) @ org.eclipse.papyrus.views.properties.toolsmiths.tests ---
01:27:10 [INFO] Building jar: /jobs/genie.papyrus/Papyrus-Oxygen-Tests/workspace/source/tests/junit/plugins/views/org.eclipse.papyrus.views.properties.toolsmiths.tests/target/org.eclipse.papyrus.views.properties.toolsmiths.tests-1.2.0-SNAPSHOT.jar
01:27:10 [INFO] 
01:27:10 [INFO] --- tycho-p2-plugin:1.0.0:p2-metadata-default (default-p2-metadata-default) @ org.eclipse.papyrus.views.properties.toolsmiths.tests ---
01:27:10 [INFO] 
01:27:10 [INFO] --- tycho-surefire-plugin:1.0.0:test (default-test) @ org.eclipse.papyrus.views.properties.toolsmiths.tests ---
01:27:10 [INFO] Skipping tests
01:27:10 [INFO] 
01:27:10 [INFO] --- jacoco-maven-plugin:0.7.9:report (default-report) @ org.eclipse.papyrus.views.properties.toolsmiths.tests ---
01:27:10 [INFO] Skipping JaCoCo execution due to missing execution data file.
01:27:10 [INFO] 
01:27:10 [INFO] --< org.eclipse.papyrus.tests:org.eclipse.papyrus.views.suite.tests >---
01:27:10 [INFO] Building org.eclipse.papyrus.views.suite.tests 0.0.1-SNAPSHOT  [152/155]
01:27:10 [INFO] ------------------------[ eclipse-test-plugin ]-------------------------
01:27:10 [INFO] 
01:27:10 [INFO] --- maven-clean-plugin:2.6:clean (default-clean) @ org.eclipse.papyrus.views.suite.tests ---
01:27:10 [INFO] 
01:27:10 [INFO] --- tycho-packaging-plugin:1.0.0:build-qualifier (default-build-qualifier) @ org.eclipse.papyrus.views.suite.tests ---
01:27:10 [INFO] The project's OSGi version is 0.0.1.201911210536
01:27:10 [INFO] 
01:27:10 [INFO] --- tycho-packaging-plugin:1.0.0:validate-id (default-validate-id) @ org.eclipse.papyrus.views.suite.tests ---
01:27:10 [INFO] 
01:27:10 [INFO] --- tycho-packaging-plugin:1.0.0:validate-version (default-validate-version) @ org.eclipse.papyrus.views.suite.tests ---
01:27:10 [INFO] 
01:27:10 [INFO] --- jacoco-maven-plugin:0.7.9:prepare-agent (default-prepare-agent) @ org.eclipse.papyrus.views.suite.tests ---
01:27:10 [INFO] tycho.testArgLine set to -javaagent:/home/hudson/genie.papyrus/.jenkins/jobs/Papyrus-Oxygen-Tests/workspace/.repository/org/jacoco/org.jacoco.agent/0.7.9/org.jacoco.agent-0.7.9-runtime.jar=destfile=/jobs/genie.papyrus/Papyrus-Oxygen-Tests/workspace/source/tests/junit/plugins/views/org.eclipse.papyrus.views.suite.tests/target/jacoco.exec,includes=org.eclipse.papyrus.*,excludes=org.eclipse.uml2
01:27:10 [INFO] 
01:27:10 [INFO] --- maven-resources-plugin:2.6:resources (default-resources) @ org.eclipse.papyrus.views.suite.tests ---
01:27:10 [INFO] Using 'UTF-8' encoding to copy filtered resources.
01:27:10 [INFO] skip non existing resourceDirectory /jobs/genie.papyrus/Papyrus-Oxygen-Tests/workspace/source/tests/junit/plugins/views/org.eclipse.papyrus.views.suite.tests/src/main/resources
01:27:10 [INFO] 
01:27:10 [INFO] --- tycho-compiler-plugin:1.0.0:compile (default-compile) @ org.eclipse.papyrus.views.suite.tests ---
01:27:10 [INFO] Compiling 2 source files to /jobs/genie.papyrus/Papyrus-Oxygen-Tests/workspace/source/tests/junit/plugins/views/org.eclipse.papyrus.views.suite.tests/target/classes
01:27:10 [INFO] 
01:27:10 [INFO] --- maven-resources-plugin:2.6:testResources (default-testResources) @ org.eclipse.papyrus.views.suite.tests ---
01:27:10 [INFO] Using 'UTF-8' encoding to copy filtered resources.
01:27:10 [INFO] skip non existing resourceDirectory /jobs/genie.papyrus/Papyrus-Oxygen-Tests/workspace/source/tests/junit/plugins/views/org.eclipse.papyrus.views.suite.tests/src/test/resources
01:27:10 [INFO] 
01:27:10 [INFO] --- target-platform-configuration:1.0.0:target-platform (default-target-platform) @ org.eclipse.papyrus.views.suite.tests ---
01:27:10 [INFO] 
01:27:10 [INFO] --- tycho-packaging-plugin:1.0.0:package-plugin (default-package-plugin) @ org.eclipse.papyrus.views.suite.tests ---
01:27:10 [INFO] Building jar: /jobs/genie.papyrus/Papyrus-Oxygen-Tests/workspace/source/tests/junit/plugins/views/org.eclipse.papyrus.views.suite.tests/target/org.eclipse.papyrus.views.suite.tests-0.0.1-SNAPSHOT.jar
01:27:10 [INFO] 
01:27:10 [INFO] --- tycho-p2-plugin:1.0.0:p2-metadata-default (default-p2-metadata-default) @ org.eclipse.papyrus.views.suite.tests ---
01:27:10 [INFO] 
01:27:10 [INFO] --- tycho-surefire-plugin:1.0.0:test (default-test) @ org.eclipse.papyrus.views.suite.tests ---
01:27:11 [INFO] Expected eclipse log file: /jobs/genie.papyrus/Papyrus-Oxygen-Tests/workspace/source/tests/junit/plugins/views/org.eclipse.papyrus.views.suite.tests/target/work/data/.metadata/.log
01:27:11 [INFO] Command line:
01:27:11 	[/opt/public/common/java/oracle/jdk1.8.0_192_x64/jre/bin/java, -Dosgi.noShutdown=false, -Dosgi.os=linux, -Dosgi.ws=gtk, -Dosgi.arch=x86_64, -javaagent:/home/hudson/genie.papyrus/.jenkins/jobs/Papyrus-Oxygen-Tests/workspace/.repository/org/jacoco/org.jacoco.agent/0.7.9/org.jacoco.agent-0.7.9-runtime.jar=destfile=/jobs/genie.papyrus/Papyrus-Oxygen-Tests/workspace/source/tests/junit/plugins/views/org.eclipse.papyrus.views.suite.tests/target/jacoco.exec,includes=org.eclipse.papyrus.*,excludes=org.eclipse.uml2, -Xms512m, -Xmx2048m, -XX:SoftRefLRUPolicyMSPerMB=100, -Dosgi.clean=true, -jar, /jobs/genie.papyrus/Papyrus-Oxygen-Tests/workspace/.repository/p2/osgi/bundle/org.eclipse.equinox.launcher/1.4.0.v20161219-1356/org.eclipse.equinox.launcher-1.4.0.v20161219-1356.jar, -data, /jobs/genie.papyrus/Papyrus-Oxygen-Tests/workspace/source/tests/junit/plugins/views/org.eclipse.papyrus.views.suite.tests/target/work/data, -install, /jobs/genie.papyrus/Papyrus-Oxygen-Tests/workspace/source/tests/junit/plugins/views/org.eclipse.papyrus.views.suite.tests/target/work, -configuration, /jobs/genie.papyrus/Papyrus-Oxygen-Tests/workspace/source/tests/junit/plugins/views/org.eclipse.papyrus.views.suite.tests/target/work/configuration, -application, org.eclipse.tycho.surefire.osgibooter.uitest, -testproperties, /jobs/genie.papyrus/Papyrus-Oxygen-Tests/workspace/source/tests/junit/plugins/views/org.eclipse.papyrus.views.suite.tests/target/surefire.properties, -product, org.eclipse.sdk.ide, -testConfig=CI_TESTS_CONFIG]
01:27:11 Picked up JAVA_TOOL_OPTIONS: -Xmx2G -Djava.io.tmpdir=/tmp/genie.papyrus -DforkCount=1
01:27:20 
01:27:20 -------------------------------------------------------
01:27:20  T E S T S
01:27:20 -------------------------------------------------------
01:27:20 Running org.eclipse.papyrus.views.suite.tests.AllTests
01:27:36 Tests run: 10, Failures: 0, Errors: 0, Skipped: 0, Time elapsed: 15.859 sec - in org.eclipse.papyrus.views.suite.tests.AllTests
01:27:36 revealSemanticElement_rootTest(org.eclipse.papyrus.views.modelexplorer.tests.ModelExplorerViewTests)  Time elapsed: 8.587 sec
01:27:36 deleteDiagramTest(org.eclipse.papyrus.views.modelexplorer.tests.DeleteHandlerTest)  Time elapsed: 1.84 sec
01:27:36 deleteTableTest(org.eclipse.papyrus.views.modelexplorer.tests.DeleteHandlerTest)  Time elapsed: 1.136 sec
01:27:36 deleteLinkItemTest(org.eclipse.papyrus.views.modelexplorer.tests.DeleteHandlerTest)  Time elapsed: 1.09 sec
01:27:36 deleteRootOfTheModel(org.eclipse.papyrus.views.modelexplorer.tests.DeleteHandlerTest)  Time elapsed: 1.01 sec
01:27:36 testOpendiagramTest(org.eclipse.papyrus.views.modelexplorer.tests.OpendiagramTest)  Time elapsed: 0.442 sec
01:27:36 handleXWTFileFromResourceSet(org.eclipse.papyrus.views.properties.toolsmiths.tests.qvt.TransformationsTests)  Time elapsed: 0.781 sec
01:27:36 handleXWTFileFromResource(org.eclipse.papyrus.views.properties.toolsmiths.tests.qvt.TransformationsTests)  Time elapsed: 0.152 sec
01:27:36 generateEcoreContext(org.eclipse.papyrus.views.properties.toolsmiths.tests.qvt.TransformationsTests)  Time elapsed: 0.101 sec
01:27:36 generateProfileContext(org.eclipse.papyrus.views.properties.toolsmiths.tests.qvt.TransformationsTests)  Time elapsed: 0.373 sec
01:27:36 
01:27:36 Results :
01:27:36 
01:27:36 Tests run: 10, Failures: 0, Errors: 0, Skipped: 0
01:27:36 
01:27:38 [INFO] All tests passed!
01:27:38 [INFO] 
01:27:38 [INFO] --- jacoco-maven-plugin:0.7.9:report (default-report) @ org.eclipse.papyrus.views.suite.tests ---
01:27:38 [INFO] Loading execution data file /jobs/genie.papyrus/Papyrus-Oxygen-Tests/workspace/source/tests/junit/plugins/views/org.eclipse.papyrus.views.suite.tests/target/jacoco.exec
01:27:38 [INFO] Analyzed bundle 'org.eclipse.papyrus.views.suite.tests' with 0 classes
01:27:38 [INFO] 
01:27:38 [INFO] --< org.eclipse.papyrus.tests:org.eclipse.papyrus.toolsmiths.suite.tests >--
01:27:38 [INFO] Building org.eclipse.papyrus.toolsmiths.suite.tests 0.0.1-SNAPSHOT [153/155]
01:27:38 [INFO] ------------------------[ eclipse-test-plugin ]-------------------------
01:27:38 [INFO] 
01:27:38 [INFO] --- maven-clean-plugin:2.6:clean (default-clean) @ org.eclipse.papyrus.toolsmiths.suite.tests ---
01:27:38 [INFO] 
01:27:38 [INFO] --- tycho-packaging-plugin:1.0.0:build-qualifier (default-build-qualifier) @ org.eclipse.papyrus.toolsmiths.suite.tests ---
01:27:38 [INFO] The project's OSGi version is 0.0.1.201911210536
01:27:38 [INFO] 
01:27:38 [INFO] --- tycho-packaging-plugin:1.0.0:validate-id (default-validate-id) @ org.eclipse.papyrus.toolsmiths.suite.tests ---
01:27:38 [INFO] 
01:27:38 [INFO] --- tycho-packaging-plugin:1.0.0:validate-version (default-validate-version) @ org.eclipse.papyrus.toolsmiths.suite.tests ---
01:27:38 [INFO] 
01:27:38 [INFO] --- jacoco-maven-plugin:0.7.9:prepare-agent (default-prepare-agent) @ org.eclipse.papyrus.toolsmiths.suite.tests ---
01:27:38 [INFO] tycho.testArgLine set to -javaagent:/home/hudson/genie.papyrus/.jenkins/jobs/Papyrus-Oxygen-Tests/workspace/.repository/org/jacoco/org.jacoco.agent/0.7.9/org.jacoco.agent-0.7.9-runtime.jar=destfile=/jobs/genie.papyrus/Papyrus-Oxygen-Tests/workspace/source/tests/junit/plugins/toolsmiths/org.eclipse.papyrus.toolsmiths.suite.tests/target/jacoco.exec,includes=org.eclipse.papyrus.*,excludes=org.eclipse.uml2
01:27:38 [INFO] 
01:27:38 [INFO] --- maven-resources-plugin:2.6:resources (default-resources) @ org.eclipse.papyrus.toolsmiths.suite.tests ---
01:27:38 [INFO] Using 'UTF-8' encoding to copy filtered resources.
01:27:38 [INFO] skip non existing resourceDirectory /jobs/genie.papyrus/Papyrus-Oxygen-Tests/workspace/source/tests/junit/plugins/toolsmiths/org.eclipse.papyrus.toolsmiths.suite.tests/src/main/resources
01:27:38 [INFO] 
01:27:38 [INFO] --- tycho-compiler-plugin:1.0.0:compile (default-compile) @ org.eclipse.papyrus.toolsmiths.suite.tests ---
01:27:38 [INFO] Compiling 2 source files to /jobs/genie.papyrus/Papyrus-Oxygen-Tests/workspace/source/tests/junit/plugins/toolsmiths/org.eclipse.papyrus.toolsmiths.suite.tests/target/classes
01:27:39 [INFO] 
01:27:39 [INFO] --- maven-resources-plugin:2.6:testResources (default-testResources) @ org.eclipse.papyrus.toolsmiths.suite.tests ---
01:27:39 [INFO] Using 'UTF-8' encoding to copy filtered resources.
01:27:39 [INFO] skip non existing resourceDirectory /jobs/genie.papyrus/Papyrus-Oxygen-Tests/workspace/source/tests/junit/plugins/toolsmiths/org.eclipse.papyrus.toolsmiths.suite.tests/src/test/resources
01:27:39 [INFO] 
01:27:39 [INFO] --- target-platform-configuration:1.0.0:target-platform (default-target-platform) @ org.eclipse.papyrus.toolsmiths.suite.tests ---
01:27:39 [INFO] 
01:27:39 [INFO] --- tycho-packaging-plugin:1.0.0:package-plugin (default-package-plugin) @ org.eclipse.papyrus.toolsmiths.suite.tests ---
01:27:39 [INFO] Building jar: /jobs/genie.papyrus/Papyrus-Oxygen-Tests/workspace/source/tests/junit/plugins/toolsmiths/org.eclipse.papyrus.toolsmiths.suite.tests/target/org.eclipse.papyrus.toolsmiths.suite.tests-0.0.1-SNAPSHOT.jar
01:27:39 [INFO] 
01:27:39 [INFO] --- tycho-p2-plugin:1.0.0:p2-metadata-default (default-p2-metadata-default) @ org.eclipse.papyrus.toolsmiths.suite.tests ---
01:27:39 [INFO] 
01:27:39 [INFO] --- tycho-surefire-plugin:1.0.0:test (default-test) @ org.eclipse.papyrus.toolsmiths.suite.tests ---
01:27:40 [INFO] Expected eclipse log file: /jobs/genie.papyrus/Papyrus-Oxygen-Tests/workspace/source/tests/junit/plugins/toolsmiths/org.eclipse.papyrus.toolsmiths.suite.tests/target/work/data/.metadata/.log
01:27:40 [INFO] Command line:
01:27:40 	[/opt/public/common/java/oracle/jdk1.8.0_192_x64/jre/bin/java, -Dosgi.noShutdown=false, -Dosgi.os=linux, -Dosgi.ws=gtk, -Dosgi.arch=x86_64, -javaagent:/home/hudson/genie.papyrus/.jenkins/jobs/Papyrus-Oxygen-Tests/workspace/.repository/org/jacoco/org.jacoco.agent/0.7.9/org.jacoco.agent-0.7.9-runtime.jar=destfile=/jobs/genie.papyrus/Papyrus-Oxygen-Tests/workspace/source/tests/junit/plugins/toolsmiths/org.eclipse.papyrus.toolsmiths.suite.tests/target/jacoco.exec,includes=org.eclipse.papyrus.*,excludes=org.eclipse.uml2, -Xms512m, -Xmx2048m, -XX:SoftRefLRUPolicyMSPerMB=100, -Dosgi.clean=true, -jar, /jobs/genie.papyrus/Papyrus-Oxygen-Tests/workspace/.repository/p2/osgi/bundle/org.eclipse.equinox.launcher/1.4.0.v20161219-1356/org.eclipse.equinox.launcher-1.4.0.v20161219-1356.jar, -data, /jobs/genie.papyrus/Papyrus-Oxygen-Tests/workspace/source/tests/junit/plugins/toolsmiths/org.eclipse.papyrus.toolsmiths.suite.tests/target/work/data, -install, /jobs/genie.papyrus/Papyrus-Oxygen-Tests/workspace/source/tests/junit/plugins/toolsmiths/org.eclipse.papyrus.toolsmiths.suite.tests/target/work, -configuration, /jobs/genie.papyrus/Papyrus-Oxygen-Tests/workspace/source/tests/junit/plugins/toolsmiths/org.eclipse.papyrus.toolsmiths.suite.tests/target/work/configuration, -application, org.eclipse.tycho.surefire.osgibooter.uitest, -testproperties, /jobs/genie.papyrus/Papyrus-Oxygen-Tests/workspace/source/tests/junit/plugins/toolsmiths/org.eclipse.papyrus.toolsmiths.suite.tests/target/surefire.properties, -product, org.eclipse.sdk.ide, -testConfig=CI_TESTS_CONFIG]
01:27:40 Picked up JAVA_TOOL_OPTIONS: -Xmx2G -Djava.io.tmpdir=/tmp/genie.papyrus -DforkCount=1
01:27:50 
01:27:50 -------------------------------------------------------
01:27:50  T E S T S
01:27:50 -------------------------------------------------------
01:27:50 Running org.eclipse.papyrus.toolsmiths.suite.tests.AllTests
01:27:51 log4j:WARN No appenders could be found for logger (org.eclipse.emf.compare.EMFCompare).
01:27:51 log4j:WARN Please initialize the log4j system properly.
01:27:53 Tests run: 21, Failures: 0, Errors: 0, Skipped: 0, Time elapsed: 2.531 sec - in org.eclipse.papyrus.toolsmiths.suite.tests.AllTests
01:27:53 ProfileAutomaticMigrationTest(org.eclipse.papyrus.toolsmiths.profilemigration.tests.automatic.AutomaticMigrationTest)  Time elapsed: 0.004 sec
01:27:53 PackageAutomaticMigrationTest(org.eclipse.papyrus.toolsmiths.profilemigration.tests.automatic.AutomaticMigrationTest)  Time elapsed: 0.014 sec
01:27:53 StereotypeAutomaticMigrationTest_Stereotype_delete_Property(org.eclipse.papyrus.toolsmiths.profilemigration.tests.automatic.AutomaticMigrationTest)  Time elapsed: 0 sec
01:27:53 PropertyAutomaticMigrationTest(org.eclipse.papyrus.toolsmiths.profilemigration.tests.automatic.AutomaticMigrationTest)  Time elapsed: 0.001 sec
01:27:53 StereotypeAutomaticMigrationTest(org.eclipse.papyrus.toolsmiths.profilemigration.tests.automatic.AutomaticMigrationTest)  Time elapsed: 0 sec
01:27:53 GeneralizationAutomaticMigrationTest(org.eclipse.papyrus.toolsmiths.profilemigration.tests.automatic.AutomaticMigrationTest)  Time elapsed: 0.002 sec
01:27:53 atomicListTest(org.eclipse.papyrus.toolsmiths.profilemigration.tests.migrators.ChangeIsAbstractFromStereotypeTest)  Time elapsed: 0.002 sec
01:27:53 atomicListMoveProfileIntoNonApplyProfileTest(org.eclipse.papyrus.toolsmiths.profilemigration.tests.migrators.MoveMigratorTest)  Time elapsed: 0.038 sec
01:27:53 atomicListMoveStereotypeIntoNonApplyProfileTest(org.eclipse.papyrus.toolsmiths.profilemigration.tests.migrators.MoveMigratorTest)  Time elapsed: 0.042 sec
01:27:53 atomicListMovePackageIntoAlreadyApplyProfileTest(org.eclipse.papyrus.toolsmiths.profilemigration.tests.migrators.MoveMigratorTest)  Time elapsed: 0.04 sec
01:27:53 atomicListMoveStereotypeIntoAlreadyApplyProfileTest(org.eclipse.papyrus.toolsmiths.profilemigration.tests.migrators.MoveMigratorTest)  Time elapsed: 0.039 sec
01:27:53 atomicListMovePackageIntoNonApplyProfileTest(org.eclipse.papyrus.toolsmiths.profilemigration.tests.migrators.MoveMigratorTest)  Time elapsed: 0.036 sec
01:27:53 atomicListMoveProfileIntoAlreadyApplyProfileTest(org.eclipse.papyrus.toolsmiths.profilemigration.tests.migrators.MoveMigratorTest)  Time elapsed: 0.038 sec
01:27:53 UpperMultiplicityTest(org.eclipse.papyrus.toolsmiths.profilemigration.tests.migrators.ChangeMultiplicityFromPropertyMigratorTest)  Time elapsed: 0.001 sec
01:27:53 atomicListTest(org.eclipse.papyrus.toolsmiths.profilemigration.tests.migrators.ChangeMultiplicityFromPropertyMigratorTest)  Time elapsed: 0 sec
01:27:53 LowerMultiplicityTest(org.eclipse.papyrus.toolsmiths.profilemigration.tests.migrators.ChangeMultiplicityFromPropertyMigratorTest)  Time elapsed: 0 sec
01:27:53 DeleteEnumerationLiteralTest(org.eclipse.papyrus.toolsmiths.profilemigration.tests.migrators.DeleteEnumLiteralFromEnumerationTest)  Time elapsed: 0.002 sec
01:27:53 MoveEnumerationLiteralTest(org.eclipse.papyrus.toolsmiths.profilemigration.tests.migrators.DeleteEnumLiteralFromEnumerationTest)  Time elapsed: 0 sec
01:27:53 atomicListTest(org.eclipse.papyrus.toolsmiths.profilemigration.tests.migrators.DeleteEnumLiteralFromEnumerationTest)  Time elapsed: 0 sec
01:27:53 atomicListTest(org.eclipse.papyrus.toolsmiths.profilemigration.tests.migrators.ChangeIsStaticFromPropertyTest)  Time elapsed: 0.002 sec
01:27:53 atomicListTest(org.eclipse.papyrus.toolsmiths.profilemigration.tests.migrators.AddPropertyToStereotypeTest)  Time elapsed: 0.001 sec
01:27:53 
01:27:53 Results :
01:27:53 
01:27:53 Tests run: 21, Failures: 0, Errors: 0, Skipped: 0
01:27:53 
01:27:55 [INFO] All tests passed!
01:27:55 [INFO] 
01:27:55 [INFO] --- jacoco-maven-plugin:0.7.9:report (default-report) @ org.eclipse.papyrus.toolsmiths.suite.tests ---
01:27:55 [INFO] Loading execution data file /jobs/genie.papyrus/Papyrus-Oxygen-Tests/workspace/source/tests/junit/plugins/toolsmiths/org.eclipse.papyrus.toolsmiths.suite.tests/target/jacoco.exec
01:27:55 [INFO] Analyzed bundle 'org.eclipse.papyrus.toolsmiths.suite.tests' with 0 classes
01:27:55 [INFO] 
01:27:55 [INFO] --< org.eclipse.papyrus:org.eclipse.papyrus.main.tests.target.parent >--
01:27:55 [INFO] Building org.eclipse.papyrus.main.tests.target.parent 0.0.1-SNAPSHOT [154/155]
01:27:55 [INFO] --------------------------------[ pom ]---------------------------------
01:27:55 [INFO] 
01:27:55 [INFO] --- maven-clean-plugin:2.6:clean (default-clean) @ org.eclipse.papyrus.main.tests.target.parent ---
01:27:55 [INFO] 
01:27:55 [INFO] --- jacoco-maven-plugin:0.7.9:prepare-agent (default-prepare-agent) @ org.eclipse.papyrus.main.tests.target.parent ---
01:27:55 [INFO] argLine set to -javaagent:/home/hudson/genie.papyrus/.jenkins/jobs/Papyrus-Oxygen-Tests/workspace/.repository/org/jacoco/org.jacoco.agent/0.7.9/org.jacoco.agent-0.7.9-runtime.jar=destfile=/jobs/genie.papyrus/Papyrus-Oxygen-Tests/workspace/source/releng/main-tests/targetPlatform/target/jacoco.exec,includes=org.eclipse.papyrus.*,excludes=org.eclipse.uml2
01:27:55 [INFO] 
01:27:55 [INFO] --- jacoco-maven-plugin:0.7.9:report (default-report) @ org.eclipse.papyrus.main.tests.target.parent ---
01:27:55 [INFO] Skipping JaCoCo execution due to missing execution data file.
01:27:55 [INFO] 
01:27:55 [INFO] --< org.eclipse.papyrus:org.eclipse.papyrus.main.tests.portable.target >--
01:27:55 [INFO] Building org.eclipse.papyrus.main.tests.portable.target 0.0.1-SNAPSHOT [155/155]
01:27:55 [INFO] ---------------------[ eclipse-target-definition ]----------------------
01:27:55 [INFO] 
01:27:55 [INFO] --- maven-clean-plugin:2.6:clean (default-clean) @ org.eclipse.papyrus.main.tests.portable.target ---
01:27:55 [INFO] 
01:27:55 [INFO] --- jacoco-maven-plugin:0.7.9:prepare-agent (default-prepare-agent) @ org.eclipse.papyrus.main.tests.portable.target ---
01:27:55 [INFO] argLine set to -javaagent:/home/hudson/genie.papyrus/.jenkins/jobs/Papyrus-Oxygen-Tests/workspace/.repository/org/jacoco/org.jacoco.agent/0.7.9/org.jacoco.agent-0.7.9-runtime.jar=destfile=/jobs/genie.papyrus/Papyrus-Oxygen-Tests/workspace/source/releng/main-tests/targetPlatform/portable/target/jacoco.exec,includes=org.eclipse.papyrus.*,excludes=org.eclipse.uml2
01:27:55 [INFO] 
01:27:55 [INFO] --- tycho-packaging-plugin:1.0.0:package-target-definition (default-package-target-definition) @ org.eclipse.papyrus.main.tests.portable.target ---
01:27:55 [INFO] 
01:27:55 [INFO] --- jacoco-maven-plugin:0.7.9:report (default-report) @ org.eclipse.papyrus.main.tests.portable.target ---
01:27:55 [INFO] Skipping JaCoCo execution due to missing execution data file.
01:27:55 [INFO] ------------------------------------------------------------------------
01:27:55 [INFO] Reactor Summary:
01:27:55 [INFO] 
01:27:55 [INFO] org.eclipse.papyrus.tests.releng 1.2.0-SNAPSHOT .... SUCCESS [01:18 min]
01:27:55 [INFO] org.eclipse.papyrus.plugins.tests.releng 0.0.1-SNAPSHOT SUCCESS [  0.007 s]
01:27:55 [INFO] org.eclipse.papyrus.editor.tests.releng 0.0.1-SNAPSHOT SUCCESS [  0.004 s]
01:27:55 [INFO] org.eclipse.papyrus.editor.integration.tests 1.3.100-SNAPSHOT SUCCESS [ 31.190 s]
01:27:55 [INFO] org.eclipse.papyrus.infra.tests.releng 0.0.1-SNAPSHOT SUCCESS [  0.006 s]
01:27:55 [INFO] org.eclipse.papyrus.infra.core.tests.releng 0.0.1-SNAPSHOT SUCCESS [  0.006 s]
01:27:55 [INFO] org.eclipse.papyrus.infra.core.clipboard.tests 1.3.0-SNAPSHOT SUCCESS [  0.546 s]
01:27:55 [INFO] org.eclipse.papyrus.infra.core.sasheditor.tests 1.2.0-SNAPSHOT SUCCESS [  1.314 s]
01:27:55 [INFO] org.eclipse.papyrus.infra.core.sasheditor.di.tests 1.2.0-SNAPSHOT SUCCESS [  0.373 s]
01:27:55 [INFO] org.eclipse.papyrus.infra.core.tests 3.0.1-SNAPSHOT  SUCCESS [  0.913 s]
01:27:55 [INFO] org.eclipse.papyrus.infra.editor.tests.releng 0.0.1-SNAPSHOT SUCCESS [  0.005 s]
01:27:55 [INFO] org.eclipse.papyrus.infra.editor.welcome.tests 1.2.0-SNAPSHOT SUCCESS [  0.557 s]
01:27:55 [INFO] org.eclipse.papyrus.infra.emf.tests.releng 0.0.1-SNAPSHOT SUCCESS [  0.006 s]
01:27:55 [INFO] org.eclipse.papyrus.infra.emf.gmf.tests 1.2.100-SNAPSHOT SUCCESS [  0.359 s]
01:27:55 [INFO] org.eclipse.papyrus.infra.emf.readonly.tests 1.2.0-SNAPSHOT SUCCESS [  0.326 s]
01:27:55 [INFO] org.eclipse.papyrus.infra.emf.tests 1.4.0-SNAPSHOT . SUCCESS [  0.556 s]
01:27:55 [INFO] org.eclipse.papyrus.infra.filters.tests 1.2.0-SNAPSHOT SUCCESS [  0.160 s]
01:27:55 [INFO] org.eclipse.papyrus.infra.gmfdiag.tests.releng 0.0.1-SNAPSHOT SUCCESS [  0.005 s]
01:27:55 [INFO] org.eclipse.papyrus.infra.gmfdiag.assistant.tests.releng 0.0.1-SNAPSHOT SUCCESS [  0.003 s]
01:27:55 [INFO] org.eclipse.papyrus.infra.gmfdiag.assistant.tests 1.2.0-SNAPSHOT SUCCESS [  0.449 s]
01:27:55 [INFO] org.eclipse.papyrus.infra.gmfdiag.canonical.tests 1.2.0-SNAPSHOT SUCCESS [  0.544 s]
01:27:55 [INFO] org.eclipse.papyrus.infra.gmfdiag.commands.tests 1.2.0-SNAPSHOT SUCCESS [  0.463 s]
01:27:55 [INFO] org.eclipse.papyrus.infra.gmfdiag.common.tests 3.0.0-SNAPSHOT SUCCESS [  0.534 s]
01:27:55 [INFO] org.eclipse.papyrus.infra.gmfdiag.css.tests 1.2.0-SNAPSHOT SUCCESS [  0.476 s]
01:27:55 [INFO] org.eclipse.papyrus.infra.gmfdiag.menu.tests 1.2.0-SNAPSHOT SUCCESS [  0.345 s]
01:27:55 [INFO] org.eclipse.papyrus.infra.gmfdiag.paletteconfiguration.tests 1.2.0-SNAPSHOT SUCCESS [  0.365 s]
01:27:55 [INFO] org.eclipse.papyrus.infra.gmfdiag.welcome.tests 1.2.0-SNAPSHOT SUCCESS [  0.387 s]
01:27:55 [INFO] org.eclipse.papyrus.infra.nattable.main.test 1.2.0-SNAPSHOT SUCCESS [  0.004 s]
01:27:55 [INFO] org.eclipse.papyrus.infra.nattable.common.tests 1.2.100-SNAPSHOT SUCCESS [  0.372 s]
01:27:55 [INFO] org.eclipse.papyrus.infra.nattable.model.editor.tests 1.2.100-SNAPSHOT SUCCESS [  0.408 s]
01:27:55 [INFO] org.eclipse.papyrus.infra.nattable.model.tests 1.2.100-SNAPSHOT SUCCESS [  0.346 s]
01:27:55 [INFO] org.eclipse.papyrus.infra.nattable.tests 1.2.100-SNAPSHOT SUCCESS [  0.377 s]
01:27:55 [INFO] org.eclipse.papyrus.infra.nattable.views.tests 1.2.100-SNAPSHOT SUCCESS [  0.461 s]
01:27:55 [INFO] org.eclipse.papyrus.infra.properties.tests.releng 0.0.1-SNAPSHOT SUCCESS [  0.005 s]
01:27:55 [INFO] org.eclipse.papyrus.infra.properties.ui.tests 2.0.0-SNAPSHOT SUCCESS [  0.416 s]
01:27:55 [INFO] org.eclipse.papyrus.infra.services.tests.releng 0.0.1-SNAPSHOT SUCCESS [  0.003 s]
01:27:55 [INFO] org.eclipse.papyrus.infra.services.controlmode.tests 1.4.0-SNAPSHOT SUCCESS [  0.502 s]
01:27:55 [INFO] org.eclipse.papyrus.infra.services.edit.tests 1.2.0-SNAPSHOT SUCCESS [  0.424 s]
01:27:55 [INFO] org.eclipse.papyrus.infra.services.edit.ui.tests 1.2.0-SNAPSHOT SUCCESS [  0.349 s]
01:27:55 [INFO] org.eclipse.papyrus.infra.services.resourceloading.tests 1.2.0-SNAPSHOT SUCCESS [  0.431 s]
01:27:55 [INFO] org.eclipse.papyrus.infra.services.semantic.tests 1.2.100-SNAPSHOT SUCCESS [  0.590 s]
01:27:55 [INFO] org.eclipse.papyrus.infra.tools.tests 1.2.0-SNAPSHOT SUCCESS [  0.769 s]
01:27:55 [INFO] org.eclipse.papyrus.infra.types.tests.releng 0.0.1-SNAPSHOT SUCCESS [  0.005 s]
01:27:55 [INFO] org.eclipse.papyrus.infra.types.tests 3.0.0-SNAPSHOT SUCCESS [  0.497 s]
01:27:55 [INFO] org.eclipse.papyrus.infra.types.ui.tests 3.0.0-SNAPSHOT SUCCESS [  0.495 s]
01:27:55 [INFO] org.eclipse.papyrus.infra.ui.emf.tests 1.2.0-SNAPSHOT SUCCESS [  0.589 s]
01:27:55 [INFO] org.eclipse.papyrus.infra.ui.tests 1.2.0-SNAPSHOT .. SUCCESS [  0.391 s]
01:27:55 [INFO] org.eclipse.papyrus.infra.viewpoints.tests.releng 1.2.0-SNAPSHOT SUCCESS [  0.003 s]
01:27:55 [INFO] org.eclipse.papyrus.infra.viewpoints.policy.tests 1.2.0-SNAPSHOT SUCCESS [  0.386 s]
01:27:55 [INFO] org.eclipse.papyrus.uml.tests.releng 0.0.1-SNAPSHOT  SUCCESS [  0.004 s]
01:27:55 [INFO] org.eclipse.papyrus.uml.diagram.tests.releng 1.2.0-SNAPSHOT SUCCESS [  0.002 s]
01:27:55 [INFO] org.eclipse.papyrus.uml.diagram.tests 1.3.0-SNAPSHOT SUCCESS [  0.810 s]
01:27:55 [INFO] org.eclipse.papyrus.uml.diagram.clazz.tests 1.3.0-SNAPSHOT SUCCESS [  0.726 s]
01:27:55 [INFO] org.eclipse.papyrus.uml.diagram.activity.tests 1.2.0-SNAPSHOT SUCCESS [  0.803 s]
01:27:55 [INFO] org.eclipse.papyrus.uml.diagram.usecase.tests 1.2.0-SNAPSHOT SUCCESS [  0.521 s]
01:27:55 [INFO] org.eclipse.papyrus.uml.diagram.deployment.tests 1.2.0-SNAPSHOT SUCCESS [  0.586 s]
01:27:55 [INFO] org.eclipse.papyrus.uml.diagram.component.tests 1.2.0-SNAPSHOT SUCCESS [  0.534 s]
01:27:55 [INFO] org.eclipse.papyrus.uml.diagram.timing.tests 1.2.0-SNAPSHOT SUCCESS [  0.743 s]
01:27:55 [INFO] org.eclipse.papyrus.uml.diagram.stereotypeproperty.tests 1.2.0-SNAPSHOT SUCCESS [  0.417 s]
01:27:55 [INFO] org.eclipse.papyrus.uml.diagram.sequence.tests 1.3.100-SNAPSHOT SUCCESS [  0.883 s]
01:27:55 [INFO] org.eclipse.papyrus.uml.diagram.composite.tests 1.2.0-SNAPSHOT SUCCESS [  0.587 s]
01:27:55 [INFO] org.eclipse.papyrus.uml.diagram.wizards.tests 1.2.0-SNAPSHOT SUCCESS [  1.981 s]
01:27:55 [INFO] org.eclipse.papyrus.uml.diagram.profile.tests 1.2.0-SNAPSHOT SUCCESS [  0.553 s]
01:27:55 [INFO] org.eclipse.papyrus.uml.dynamic.profile.tests 1.2.0-SNAPSHOT SUCCESS [  0.045 s]
01:27:55 [INFO] org.eclipse.papyrus.uml.diagram.common.tests 1.3.0-SNAPSHOT SUCCESS [  0.729 s]
01:27:55 [INFO] org.eclipse.papyrus.tests.uml.diagram.feature 1.2.0-SNAPSHOT SUCCESS [  0.293 s]
01:27:55 [INFO] org.eclipse.papyrus.tests.infra.services.feature 1.2.0-SNAPSHOT SUCCESS [  0.081 s]
01:27:55 [INFO] org.eclipse.papyrus.views.tests.releng 0.0.1-SNAPSHOT SUCCESS [  0.003 s]
01:27:55 [INFO] org.eclipse.papyrus.views.modelexplorer.tests 1.2.100-SNAPSHOT SUCCESS [  0.349 s]
01:27:55 [INFO] org.eclipse.papyrus.uml.modelexplorer.tests.releng 0.0.1-SNAPSHOT SUCCESS [  0.004 s]
01:27:55 [INFO] org.eclipse.papyrus.uml.modelexplorer.tests 1.3.100-SNAPSHOT SUCCESS [  0.402 s]
01:27:55 [INFO] org.eclipse.papyrus.uml.modelrepair.tests 1.2.100-SNAPSHOT SUCCESS [  0.646 s]
01:27:55 [INFO] org.eclipse.papyrus.uml.service.types.tests 1.2.0-SNAPSHOT SUCCESS [  0.605 s]
01:27:55 [INFO] org.eclipse.papyrus.uml.service.types.ui.tests 1.2.0-SNAPSHOT SUCCESS [  0.635 s]
01:27:55 [INFO] org.eclipse.papyrus.uml.profile.tests.releng 0.0.1-SNAPSHOT SUCCESS [  0.004 s]
01:27:55 [INFO] org.eclipse.papyrus.uml.profile.drafter.tests 1.2.0-SNAPSHOT SUCCESS [  0.661 s]
01:27:55 [INFO] org.eclipse.papyrus.uml.filters.tests 1.2.0-SNAPSHOT SUCCESS [  0.432 s]
01:27:55 [INFO] org.eclipse.papyrus.uml.profile.tests 1.2.0-SNAPSHOT SUCCESS [  0.387 s]
01:27:55 [INFO] org.eclipse.papyrus.tests.uml.feature 1.2.0-SNAPSHOT SUCCESS [  0.128 s]
01:27:55 [INFO] org.eclipse.papyrus.tests.views.feature 1.2.0-SNAPSHOT SUCCESS [  0.047 s]
01:27:55 [INFO] org.eclipse.papyrus.tests.infra.nattable.feature 1.3.0-SNAPSHOT SUCCESS [  0.095 s]
01:27:55 [INFO] org.eclipse.papyrus.uml.nattable.main.test 1.2.0-SNAPSHOT SUCCESS [  0.003 s]
01:27:55 [INFO] org.eclipse.papyrus.uml.nattable.tests 1.2.100-SNAPSHOT SUCCESS [  0.451 s]
01:27:55 [INFO] org.eclipse.papyrus.uml.nattable.generic.tests 1.2.100-SNAPSHOT SUCCESS [  0.784 s]
01:27:55 [INFO] org.eclipse.papyrus.uml.nattable.clazz.config.tests 1.2.100-SNAPSHOT SUCCESS [  0.955 s]
01:27:55 [INFO] org.eclipse.papyrus.uml.nattable.stereotyped.elements.tests 1.0.100-SNAPSHOT SUCCESS [  0.732 s]
01:27:55 [INFO] org.eclipse.papyrus.uml.nattable.matrix.tests 1.0.0-SNAPSHOT SUCCESS [  0.487 s]
01:27:55 [INFO] org.eclipse.papyrus.tests.uml.nattable.feature 1.3.0-SNAPSHOT SUCCESS [  0.121 s]
01:27:55 [INFO] org.eclipse.papyrus.tests.infra.feature 1.2.0-SNAPSHOT SUCCESS [  0.212 s]
01:27:55 [INFO] org.eclipse.papyrus.tests.infra.core.feature 1.2.0-SNAPSHOT SUCCESS [  0.065 s]
01:27:55 [INFO] org.eclipse.papyrus.uml.tools.tests.releng 0.0.1-SNAPSHOT SUCCESS [  0.005 s]
01:27:55 [INFO] org.eclipse.papyrus.uml.tools.tests 3.0.0-SNAPSHOT . SUCCESS [  0.530 s]
01:27:55 [INFO] org.eclipse.papyrus.uml.tools.utils.tests 1.3.0-SNAPSHOT SUCCESS [  0.463 s]
01:27:55 [INFO] org.eclipse.papyrus.tests.uml.tools.feature 1.2.0-SNAPSHOT SUCCESS [  0.060 s]
01:27:55 [INFO] org.eclipse.papyrus.uml.decoratormodel.tests.releng 0.0.1-SNAPSHOT SUCCESS [  0.003 s]
01:27:55 [INFO] org.eclipse.papyrus.uml.decoratormodel.tests 1.2.0-SNAPSHOT SUCCESS [  0.576 s]
01:27:55 [INFO] org.eclipse.papyrus.uml.decoratormodel.controlmode.tests 1.2.0-SNAPSHOT SUCCESS [  0.497 s]
01:27:55 [INFO] org.eclipse.papyrus.tests.uml.decoratormodel.feature 1.2.0-SNAPSHOT SUCCESS [  0.076 s]
01:27:55 [INFO] org.eclipse.papyrus.uml.textedit.tests.releng 0.0.1-SNAPSHOT SUCCESS [  0.003 s]
01:27:55 [INFO] org.eclipse.papyrus.uml.textedit.tests 1.2.0-SNAPSHOT SUCCESS [  0.601 s]
01:27:55 [INFO] org.eclipse.papyrus.uml.textedit.parameter.tests 1.2.0-SNAPSHOT SUCCESS [  0.448 s]
01:27:55 [INFO] org.eclipse.papyrus.uml.textedit.port.tests 1.2.0-SNAPSHOT SUCCESS [  0.592 s]
01:27:55 [INFO] org.eclipse.papyrus.uml.textedit.property.tests 1.2.0-SNAPSHOT SUCCESS [  0.670 s]
01:27:55 [INFO] org.eclipse.papyrus.uml.textedit.tests.feature 1.2.0-SNAPSHOT SUCCESS [  0.114 s]
01:27:55 [INFO] org.eclipse.papyrus.uml.assistants.tests.releng 0.0.1-SNAPSHOT SUCCESS [  0.004 s]
01:27:55 [INFO] org.eclipse.papyrus.uml.profile.types.generator.tests 1.2.0-SNAPSHOT SUCCESS [  0.640 s]
01:27:55 [INFO] org.eclipse.papyrus.uml.profile.assistants.generator.tests 1.2.0-SNAPSHOT SUCCESS [  0.520 s]
01:27:55 [INFO] org.eclipse.papyrus.tests.uml.assistants.feature 1.2.0-SNAPSHOT SUCCESS [  0.076 s]
01:27:55 [INFO] org.eclipse.papyrus.toolsmiths.tests.releng 0.0.1-SNAPSHOT SUCCESS [  0.003 s]
01:27:55 [INFO] org.eclipse.papyrus.toolsmiths.profilemigration.tests 0.7.0-SNAPSHOT SUCCESS [  0.536 s]
01:27:55 [INFO] org.eclipse.papyrus.tests.toolsmiths.feature 1.0.0-SNAPSHOT SUCCESS [  0.047 s]
01:27:55 [INFO] org.eclipse.papyrus.tests.feature 1.3.0-SNAPSHOT ... SUCCESS [  1.073 s]
01:27:55 [INFO] org.eclipse.papyrus.infra.emf.expressions.main.tests 0.0.1-SNAPSHOT SUCCESS [  0.003 s]
01:27:55 [INFO] org.eclipse.papyrus.infra.emf.expressions.tests 1.0.0-SNAPSHOT SUCCESS [  0.166 s]
01:27:55 [INFO] org.eclipse.papyrus.tests.infra.emf.expressions.feature 1.0.0-SNAPSHOT SUCCESS [  0.034 s]
01:27:55 [INFO] org.eclipse.papyrus.uml.expressions.tests.releng 0.0.1-SNAPSHOT SUCCESS [  0.002 s]
01:27:55 [INFO] org.eclipse.papyrus.uml.expressions.tests 1.0.0-SNAPSHOT SUCCESS [  0.521 s]
01:27:55 [INFO] org.eclipse.papyrus.tests.uml.expressions.feature 1.0.0-SNAPSHOT SUCCESS [  0.085 s]
01:27:55 [INFO] org.eclipse.papyrus.uml.alf.tests 1.2.0-SNAPSHOT ... SUCCESS [03:41 min]
01:27:55 [INFO] org.eclipse.papyrus.uml.alf.tests.feature 1.2.0-SNAPSHOT SUCCESS [  0.127 s]
01:27:55 [INFO] org.eclipse.papyrus.developer.suite.tests 0.0.1-SNAPSHOT SUCCESS [ 19.452 s]
01:27:55 [INFO] org.eclipse.papyrus.developer.tests.releng 0.0.1-SNAPSHOT SUCCESS [  0.004 s]
01:27:55 [INFO] org.eclipse.papyrus.eclipse.project.editors.tests 2.0.0-SNAPSHOT SUCCESS [  0.466 s]
01:27:55 [INFO] org.eclipse.papyrus.editors.suite.tests 0.0.1-SNAPSHOT SUCCESS [03:23 min]
01:27:55 [INFO] org.eclipse.papyrus.infra.core.suite.tests 0.0.1-SNAPSHOT SUCCESS [ 43.777 s]
01:27:55 [INFO] org.eclipse.papyrus.infra.nattable.suite.tests 0.0.1-SNAPSHOT SUCCESS [ 45.936 s]
01:27:55 [INFO] org.eclipse.papyrus.infra.internationalization.main.test 1.0.0-SNAPSHOT SUCCESS [  0.004 s]
01:27:55 [INFO] org.eclipse.papyrus.infra.internationalization.tests 1.1.0-SNAPSHOT SUCCESS [  0.383 s]
01:27:55 [INFO] org.eclipse.papyrus.infra.services.labelprovider.tests 1.2.1-SNAPSHOT SUCCESS [  0.313 s]
01:27:55 [INFO] org.eclipse.papyrus.infra.suite.tests 0.0.1-SNAPSHOT SUCCESS [04:51 min]
01:27:55 [INFO] org.eclipse.papyrus.infra.newchild.tests 1.2.0-SNAPSHOT SUCCESS [  1.981 s]
01:27:55 [INFO] org.eclipse.papyrus.uml.diagram.communication.tests 1.2.0-SNAPSHOT SUCCESS [  0.517 s]
01:27:55 [INFO] org.eclipse.papyrus.uml.diagram.interactionoverview.tests 1.2.0-SNAPSHOT SUCCESS [  0.391 s]
01:27:55 [INFO] org.eclipse.papyrus.uml.diagram.statemachine.tests 1.2.0-SNAPSHOT SUCCESS [  0.461 s]
01:27:55 [INFO] org.eclipse.papyrus.uml.diagram.suite.tests 0.0.1-SNAPSHOT SUCCESS [07:26 min]
01:27:55 [INFO] org.eclipse.papyrus.uml.diagram.dnd.tests 1.2.0-SNAPSHOT SUCCESS [  0.309 s]
01:27:55 [INFO] org.eclipse.papyrus.uml.nattable.stereotype.display.tests 1.2.100-SNAPSHOT SUCCESS [  0.421 s]
01:27:55 [INFO] org.eclipse.papyrus.uml.nattable.suite.tests 0.0.1-SNAPSHOT SUCCESS [13:03 min]
01:27:55 [INFO] org.eclipse.papyrus.uml.textedit.valuespecification.tests 1.2.0-SNAPSHOT SUCCESS [  0.406 s]
01:27:55 [INFO] org.eclipse.papyrus.uml.textedit.suite.tests 0.0.1-SNAPSHOT SUCCESS [ 18.877 s]
01:27:55 [INFO] org.eclipse.papyrus.uml.internationalization.main.test 1.0.0-SNAPSHOT SUCCESS [  0.003 s]
01:27:55 [INFO] org.eclipse.papyrus.uml.internationalization.tests 1.1.0-SNAPSHOT SUCCESS [  0.338 s]
01:27:55 [INFO] org.eclipse.papyrus.uml.validation.tests.releng 0.0.1-SNAPSHOT SUCCESS [  0.003 s]
01:27:55 [INFO] org.eclipse.papyrus.uml.validation.tests.staticprofile 1.2.0-SNAPSHOT SUCCESS [  0.171 s]
01:27:55 [INFO] org.eclipse.papyrus.uml.validation.tests.genvalidation 1.2.0-SNAPSHOT SUCCESS [  0.251 s]
01:27:55 [INFO] org.eclipse.papyrus.uml.validation.tests 1.2.0-SNAPSHOT SUCCESS [  0.324 s]
01:27:55 [INFO] org.eclipse.papyrus.uml.suite.tests 0.0.1-SNAPSHOT . SUCCESS [04:03 min]
01:27:55 [INFO] org.eclipse.papyrus.uml.alf.tests.releng 0.0.1-SNAPSHOT SUCCESS [  0.004 s]
01:27:55 [INFO] org.eclipse.papyrus.uml.alf.backend.tests 1.1.0-SNAPSHOT SUCCESS [  0.695 s]
01:27:55 [INFO] org.eclipse.papyrus.uml.internationalization.controlmode.tests 1.0.0-SNAPSHOT SUCCESS [  0.340 s]
01:27:55 [INFO] org.eclipse.papyrus.views.properties.toolsmiths.tests 1.2.0-SNAPSHOT SUCCESS [  0.212 s]
01:27:55 [INFO] org.eclipse.papyrus.views.suite.tests 0.0.1-SNAPSHOT SUCCESS [ 28.531 s]
01:27:55 [INFO] org.eclipse.papyrus.toolsmiths.suite.tests 0.0.1-SNAPSHOT SUCCESS [ 16.600 s]
01:27:55 [INFO] org.eclipse.papyrus.main.tests.target.parent 0.0.1-SNAPSHOT SUCCESS [  0.004 s]
01:27:55 [INFO] org.eclipse.papyrus.main.tests.portable.target 0.0.1-SNAPSHOT SUCCESS [  0.003 s]
01:27:55 [INFO] ------------------------------------------------------------------------
01:27:55 [INFO] BUILD SUCCESS
01:27:55 [INFO] ------------------------------------------------------------------------
01:27:55 [INFO] Total time:  51:35 min
01:27:55 [INFO] Finished at: 2019-11-21T01:27:55-05:00
01:27:55 [INFO] ------------------------------------------------------------------------
01:27:56 Taking screenshot.
01:27:56 [workspace] $ echo $XAUTHORITY
01:27:56 /home/hudson/genie.papyrus/.jenkins/jobs/Papyrus-Oxygen-Tests/workspace/.Xauthority-3660548104552021632
01:27:56 [workspace] $ ls -l $XAUTHORITY
01:27:56 -rw-rw-r-- 1 genie.papyrus modeling.mdt.papyrus 0 Nov 21 00:36 /home/hudson/genie.papyrus/.jenkins/jobs/Papyrus-Oxygen-Tests/workspace/.Xauthority-3660548104552021632
01:27:56 [workspace] $ import -window root -display :728 screenshot.jpg
01:27:56 Terminating xvnc.
01:28:05 Sending e-mails to: patrick.tessier@cea.fr vincent.lorenzo@cea.fr quentin.lemenez@cea.fr
01:28:05 Recording test results
01:28:06 Build step 'Publish JUnit test result report' changed build result to UNSTABLE
01:28:06 Started calculate disk usage of build
01:28:06 Finished Calculation of disk usage of build in 0 seconds
01:28:06 Started calculate disk usage of workspace
01:28:07 Finished Calculation of disk usage of workspace in  1 second
01:28:08 [WS-CLEANUP] Deleting project workspace...
01:28:08 [WS-CLEANUP] Deferred wipeout is used...
01:28:08 [WS-CLEANUP] done
01:28:08 Finished: UNSTABLE