UnstableConsole Output

Skipping 4,227 KB.. Full Log
es=org.eclipse.uml2
01:52:51 [INFO] 
01:52:51 [INFO] --- maven-resources-plugin:2.6:resources (default-resources) @ org.eclipse.papyrus.uml.validation.tests ---
01:52:51 [INFO] Using 'UTF-8' encoding to copy filtered resources.
01:52:51 [INFO] skip non existing resourceDirectory /jobs/genie.papyrus/Papyrus-Oxygen-Tests-Failures/workspace/source/tests/junit/plugins/uml/validation/org.eclipse.papyrus.uml.validation.tests/src/main/resources
01:52:51 [INFO] 
01:52:51 [INFO] --- tycho-compiler-plugin:1.0.0:compile (default-compile) @ org.eclipse.papyrus.uml.validation.tests ---
01:52:51 [INFO] Compiling 10 source files to /jobs/genie.papyrus/Papyrus-Oxygen-Tests-Failures/workspace/source/tests/junit/plugins/uml/validation/org.eclipse.papyrus.uml.validation.tests/target/classes
01:52:51 [INFO] 
01:52:51 [INFO] --- maven-resources-plugin:2.6:testResources (default-testResources) @ org.eclipse.papyrus.uml.validation.tests ---
01:52:51 [INFO] Using 'UTF-8' encoding to copy filtered resources.
01:52:51 [INFO] skip non existing resourceDirectory /jobs/genie.papyrus/Papyrus-Oxygen-Tests-Failures/workspace/source/tests/junit/plugins/uml/validation/org.eclipse.papyrus.uml.validation.tests/src/test/resources
01:52:51 [INFO] 
01:52:51 [INFO] --- target-platform-configuration:1.0.0:target-platform (default-target-platform) @ org.eclipse.papyrus.uml.validation.tests ---
01:52:51 [INFO] 
01:52:51 [INFO] --- tycho-packaging-plugin:1.0.0:package-plugin (default-package-plugin) @ org.eclipse.papyrus.uml.validation.tests ---
01:52:51 [INFO] Building jar: /jobs/genie.papyrus/Papyrus-Oxygen-Tests-Failures/workspace/source/tests/junit/plugins/uml/validation/org.eclipse.papyrus.uml.validation.tests/target/org.eclipse.papyrus.uml.validation.tests-1.2.0-SNAPSHOT.jar
01:52:51 [INFO] 
01:52:51 [INFO] --- tycho-p2-plugin:1.0.0:p2-metadata-default (default-p2-metadata-default) @ org.eclipse.papyrus.uml.validation.tests ---
01:52:51 [INFO] 
01:52:51 [INFO] --- tycho-surefire-plugin:1.0.0:test (default-test) @ org.eclipse.papyrus.uml.validation.tests ---
01:52:51 [INFO] Skipping tests
01:52:51 [INFO] 
01:52:51 [INFO] --- jacoco-maven-plugin:0.7.9:report (default-report) @ org.eclipse.papyrus.uml.validation.tests ---
01:52:51 [INFO] Skipping JaCoCo execution due to missing execution data file.
01:52:51 [INFO] 
01:52:51 [INFO] ---< org.eclipse.papyrus.tests:org.eclipse.papyrus.uml.suite.tests >----
01:52:51 [INFO] Building org.eclipse.papyrus.uml.suite.tests 0.0.1-SNAPSHOT    [147/155]
01:52:51 [INFO] ------------------------[ eclipse-test-plugin ]-------------------------
01:52:51 [INFO] 
01:52:51 [INFO] --- maven-clean-plugin:2.6:clean (default-clean) @ org.eclipse.papyrus.uml.suite.tests ---
01:52:51 [INFO] 
01:52:51 [INFO] --- tycho-packaging-plugin:1.0.0:build-qualifier (default-build-qualifier) @ org.eclipse.papyrus.uml.suite.tests ---
01:52:51 [INFO] The project's OSGi version is 0.0.1.201911100627
01:52:51 [INFO] 
01:52:51 [INFO] --- tycho-packaging-plugin:1.0.0:validate-id (default-validate-id) @ org.eclipse.papyrus.uml.suite.tests ---
01:52:51 [INFO] 
01:52:51 [INFO] --- tycho-packaging-plugin:1.0.0:validate-version (default-validate-version) @ org.eclipse.papyrus.uml.suite.tests ---
01:52:51 [INFO] 
01:52:51 [INFO] --- jacoco-maven-plugin:0.7.9:prepare-agent (default-prepare-agent) @ org.eclipse.papyrus.uml.suite.tests ---
01:52:51 [INFO] tycho.testArgLine set to -javaagent:/home/hudson/genie.papyrus/.jenkins/jobs/Papyrus-Oxygen-Tests-Failures/workspace/.repository/org/jacoco/org.jacoco.agent/0.7.9/org.jacoco.agent-0.7.9-runtime.jar=destfile=/jobs/genie.papyrus/Papyrus-Oxygen-Tests-Failures/workspace/source/tests/junit/plugins/uml/org.eclipse.papyrus.uml.suite.tests/target/jacoco.exec,includes=org.eclipse.papyrus.*,excludes=org.eclipse.uml2
01:52:51 [INFO] 
01:52:51 [INFO] --- maven-resources-plugin:2.6:resources (default-resources) @ org.eclipse.papyrus.uml.suite.tests ---
01:52:51 [INFO] Using 'UTF-8' encoding to copy filtered resources.
01:52:51 [INFO] skip non existing resourceDirectory /jobs/genie.papyrus/Papyrus-Oxygen-Tests-Failures/workspace/source/tests/junit/plugins/uml/org.eclipse.papyrus.uml.suite.tests/src/main/resources
01:52:51 [INFO] 
01:52:51 [INFO] --- tycho-compiler-plugin:1.0.0:compile (default-compile) @ org.eclipse.papyrus.uml.suite.tests ---
01:52:51 [INFO] Compiling 2 source files to /jobs/genie.papyrus/Papyrus-Oxygen-Tests-Failures/workspace/source/tests/junit/plugins/uml/org.eclipse.papyrus.uml.suite.tests/target/classes
01:52:52 [INFO] 
01:52:52 [INFO] --- maven-resources-plugin:2.6:testResources (default-testResources) @ org.eclipse.papyrus.uml.suite.tests ---
01:52:52 [INFO] Using 'UTF-8' encoding to copy filtered resources.
01:52:52 [INFO] skip non existing resourceDirectory /jobs/genie.papyrus/Papyrus-Oxygen-Tests-Failures/workspace/source/tests/junit/plugins/uml/org.eclipse.papyrus.uml.suite.tests/src/test/resources
01:52:52 [INFO] 
01:52:52 [INFO] --- target-platform-configuration:1.0.0:target-platform (default-target-platform) @ org.eclipse.papyrus.uml.suite.tests ---
01:52:52 [INFO] 
01:52:52 [INFO] --- tycho-packaging-plugin:1.0.0:package-plugin (default-package-plugin) @ org.eclipse.papyrus.uml.suite.tests ---
01:52:52 [INFO] Building jar: /jobs/genie.papyrus/Papyrus-Oxygen-Tests-Failures/workspace/source/tests/junit/plugins/uml/org.eclipse.papyrus.uml.suite.tests/target/org.eclipse.papyrus.uml.suite.tests-0.0.1-SNAPSHOT.jar
01:52:52 [INFO] 
01:52:52 [INFO] --- tycho-p2-plugin:1.0.0:p2-metadata-default (default-p2-metadata-default) @ org.eclipse.papyrus.uml.suite.tests ---
01:52:52 [INFO] 
01:52:52 [INFO] --- tycho-surefire-plugin:1.0.0:test (default-test) @ org.eclipse.papyrus.uml.suite.tests ---
01:52:53 [INFO] Expected eclipse log file: /jobs/genie.papyrus/Papyrus-Oxygen-Tests-Failures/workspace/source/tests/junit/plugins/uml/org.eclipse.papyrus.uml.suite.tests/target/work/data/.metadata/.log
01:52:53 [INFO] Command line:
01:52:53 	[/opt/public/common/java/oracle/jdk1.8.0_192_x64/jre/bin/java, -Dosgi.noShutdown=false, -Dosgi.os=linux, -Dosgi.ws=gtk, -Dosgi.arch=x86_64, -javaagent:/home/hudson/genie.papyrus/.jenkins/jobs/Papyrus-Oxygen-Tests-Failures/workspace/.repository/org/jacoco/org.jacoco.agent/0.7.9/org.jacoco.agent-0.7.9-runtime.jar=destfile=/jobs/genie.papyrus/Papyrus-Oxygen-Tests-Failures/workspace/source/tests/junit/plugins/uml/org.eclipse.papyrus.uml.suite.tests/target/jacoco.exec,includes=org.eclipse.papyrus.*,excludes=org.eclipse.uml2, -Xms512m, -Xmx2048m, -XX:SoftRefLRUPolicyMSPerMB=100, -Dosgi.clean=true, -jar, /jobs/genie.papyrus/Papyrus-Oxygen-Tests-Failures/workspace/.repository/p2/osgi/bundle/org.eclipse.equinox.launcher/1.4.0.v20161219-1356/org.eclipse.equinox.launcher-1.4.0.v20161219-1356.jar, -data, /jobs/genie.papyrus/Papyrus-Oxygen-Tests-Failures/workspace/source/tests/junit/plugins/uml/org.eclipse.papyrus.uml.suite.tests/target/work/data, -install, /jobs/genie.papyrus/Papyrus-Oxygen-Tests-Failures/workspace/source/tests/junit/plugins/uml/org.eclipse.papyrus.uml.suite.tests/target/work, -configuration, /jobs/genie.papyrus/Papyrus-Oxygen-Tests-Failures/workspace/source/tests/junit/plugins/uml/org.eclipse.papyrus.uml.suite.tests/target/work/configuration, -application, org.eclipse.tycho.surefire.osgibooter.uitest, -testproperties, /jobs/genie.papyrus/Papyrus-Oxygen-Tests-Failures/workspace/source/tests/junit/plugins/uml/org.eclipse.papyrus.uml.suite.tests/target/surefire.properties, -product, org.eclipse.sdk.ide, -testConfig=FAILING_TESTS_CONFIG]
01:52:53 Picked up JAVA_TOOL_OPTIONS: -Xmx2G -Djava.io.tmpdir=/tmp/genie.papyrus -DforkCount=1
01:53:02 
01:53:02 -------------------------------------------------------
01:53:02  T E S T S
01:53:02 -------------------------------------------------------
01:53:02 Running org.eclipse.papyrus.uml.suite.tests.AllTests
01:53:52 Tests run: 655, Failures: 8, Errors: 0, Skipped: 594, Time elapsed: 49.654 sec <<< FAILURE! - in org.eclipse.papyrus.uml.suite.tests.AllTests
01:53:52 testUML(org.eclipse.papyrus.uml.service.types.tests.creation.CreatePureUMLElementTest) skipped
01:53:52 test(org.eclipse.papyrus.uml.service.types.tests.creation.CreatePureUMLElementTest) skipped
01:53:52 testDeleteOneAddVariableValueAction(org.eclipse.papyrus.uml.service.types.tests.deletion.DeletePureUMLElementTest) skipped
01:53:52 testDeleteOneCentralBufferNode(org.eclipse.papyrus.uml.service.types.tests.deletion.DeletePureUMLElementTest) skipped
01:53:52 stereotypeApplicationsDeleted:command(org.eclipse.papyrus.uml.service.types.tests.deletion.DeleteDependentWithStereotypeApplications458685) skipped
01:53:52 stereotypeApplicationsDeleted:elements(org.eclipse.papyrus.uml.service.types.tests.deletion.DeleteDependentWithStereotypeApplications458685) skipped
01:53:52 stereotypeApplicationsDeleted:stereotypes(org.eclipse.papyrus.uml.service.types.tests.deletion.DeleteDependentWithStereotypeApplications458685) skipped
01:53:52 stereotypeApplicationsDeleted:undo(org.eclipse.papyrus.uml.service.types.tests.deletion.DeleteDependentWithStereotypeApplications458685) skipped
01:53:52 stereotypeApplicationsDeleted:redo(org.eclipse.papyrus.uml.service.types.tests.deletion.DeleteDependentWithStereotypeApplications458685) skipped
01:53:52 deleteInitialState(org.eclipse.papyrus.uml.service.types.tests.deletion.DeleteTransitionsWithVertexTest)  Time elapsed: 1.043 sec
01:53:52 deleteS1(org.eclipse.papyrus.uml.service.types.tests.deletion.DeleteTransitionsWithVertexTest)  Time elapsed: 0.421 sec
01:53:52 deleteS2(org.eclipse.papyrus.uml.service.types.tests.deletion.DeleteTransitionsWithVertexTest)  Time elapsed: 0.157 sec
01:53:52 deleteFinalState(org.eclipse.papyrus.uml.service.types.tests.deletion.DeleteTransitionsWithVertexTest)  Time elapsed: 0.428 sec
01:53:52 deleteFromContainmentSubset(org.eclipse.papyrus.uml.service.types.tests.deletion.DeleteContainmentSubsetTest) skipped
01:53:52 deleteFromTwoContainmentSupersetsAtOnce(org.eclipse.papyrus.uml.service.types.tests.deletion.DeleteContainmentSubsetTest) skipped
01:53:52 createAssociationWritable(org.eclipse.papyrus.uml.service.types.tests.creation.ConnectorReadOnlyTestBug465899) skipped
01:53:52 createAssociationReadOnly_usecase(org.eclipse.papyrus.uml.service.types.tests.creation.ConnectorReadOnlyTestBug465899) skipped
01:53:52 createAssociationReadOnly(org.eclipse.papyrus.uml.service.types.tests.creation.ConnectorReadOnlyTestBug465899) skipped
01:53:52 createConnectorTargetReadOnly(org.eclipse.papyrus.uml.service.types.tests.creation.ConnectorReadOnlyTestBug465899) skipped
01:53:52 createConnectorSourceReadOnly(org.eclipse.papyrus.uml.service.types.tests.creation.ConnectorReadOnlyTestBug465899) skipped
01:53:52 testDeletion(org.eclipse.papyrus.uml.service.types.tests.deletion.DeleteAssociationPropertyTypeTest) skipped
01:53:52 testDeletionInCompositeDiagram(org.eclipse.papyrus.uml.service.types.tests.deletion.DeleteCommentLinkTest) skipped
01:53:52 testDeletionWithSetRequest(org.eclipse.papyrus.uml.service.types.tests.deletion.DeleteCommentLinkTest)  Time elapsed: 6.227 sec  <<< FAILURE!
01:53:52 java.lang.AssertionError: expected:<8> but was:<10>
01:53:52 	at org.junit.Assert.fail(Assert.java:88)
01:53:52 	at org.junit.Assert.failNotEquals(Assert.java:834)
01:53:52 	at org.junit.Assert.assertEquals(Assert.java:645)
01:53:52 	at org.junit.Assert.assertEquals(Assert.java:631)
01:53:52 	at org.eclipse.papyrus.uml.service.types.tests.deletion.DeleteCommentLinkTest.checkDiagramAfterLinkDeletion(DeleteCommentLinkTest.java:354)
01:53:52 	at org.eclipse.papyrus.uml.service.types.tests.deletion.DeleteCommentLinkTest.checkModelAndDiagramsAfterLinkDeletion(DeleteCommentLinkTest.java:333)
01:53:52 	at org.eclipse.papyrus.uml.service.types.tests.deletion.DeleteCommentLinkTest.testDeletionWithSetRequest(DeleteCommentLinkTest.java:219)
01:53:52 
01:53:52 testDeletionInClassDiagram(org.eclipse.papyrus.uml.service.types.tests.deletion.DeleteCommentLinkTest) skipped
01:53:52 testDeletionInComponentDiagram(org.eclipse.papyrus.uml.service.types.tests.deletion.DeleteCommentLinkTest) skipped
01:53:52 testCreation(org.eclipse.papyrus.uml.service.types.tests.creation.CreateAssociationTest) skipped
01:53:52 testCreation(org.eclipse.papyrus.uml.service.types.tests.creation.CreateAssociationDirectedTest) skipped
01:53:52 testCreation(org.eclipse.papyrus.uml.service.types.tests.creation.CreateAssociationCompositeTest) skipped
01:53:52 testCreation(org.eclipse.papyrus.uml.service.types.tests.creation.CreateAssociationCompositeDirectedTest) skipped
01:53:52 testCreation(org.eclipse.papyrus.uml.service.types.tests.creation.CreateAssociationSharedTest) skipped
01:53:52 testCreation(org.eclipse.papyrus.uml.service.types.tests.creation.CreateAssociationSharedDirectedTest) skipped
01:53:52 deleteInteractionFragmentInOperand(org.eclipse.papyrus.uml.service.types.tests.deletion.InteractionDeletionTest)  Time elapsed: 0.549 sec
01:53:52 deleteAllOperandsOfCombinedFragment(org.eclipse.papyrus.uml.service.types.tests.deletion.InteractionDeletionTest)  Time elapsed: 0.506 sec
01:53:52 deleteCombinedFragment(org.eclipse.papyrus.uml.service.types.tests.deletion.InteractionDeletionTest)  Time elapsed: 0.891 sec
01:53:52 deleteCombinedFragmentNested(org.eclipse.papyrus.uml.service.types.tests.deletion.InteractionDeletionTest)  Time elapsed: 0.562 sec
01:53:52 deleteOperandsOfCombinedFragment(org.eclipse.papyrus.uml.service.types.tests.deletion.InteractionDeletionTest)  Time elapsed: 0.562 sec
01:53:52 deleteCombinedFragmentDeeplyNested(org.eclipse.papyrus.uml.service.types.tests.deletion.InteractionDeletionTest)  Time elapsed: 0.464 sec
01:53:52 deleteInteractionWithNesting(org.eclipse.papyrus.uml.service.types.tests.deletion.InteractionDeletionTest)  Time elapsed: 0.51 sec
01:53:52 deleteInteraction(org.eclipse.papyrus.uml.service.types.tests.deletion.InteractionDeletionTest)  Time elapsed: 0.605 sec
01:53:52 testCreateClassInModel(org.eclipse.papyrus.uml.service.types.ui.tests.creation.CreateElementTest) skipped
01:53:52 testCreateCentralBufferNodeInActivity(org.eclipse.papyrus.uml.service.types.ui.tests.creation.CreateElementTest) skipped
01:53:52 testCreateCentralBufferNodeInActivityWithNode(org.eclipse.papyrus.uml.service.types.ui.tests.creation.CreateElementTest) skipped
01:53:52 testCannotCreateOperationRedefinableTemplateSignature_bug468071(org.eclipse.papyrus.uml.service.types.ui.tests.creation.CreateElementTest) skipped
01:53:52 testCreateOperationTemplateSignature_bug468071(org.eclipse.papyrus.uml.service.types.ui.tests.creation.CreateElementTest) skipped
01:53:52 testCreateModelInClass(org.eclipse.papyrus.uml.service.types.ui.tests.creation.CreateElementTest) skipped
01:53:52 org.eclipse.papyrus.uml.service.types.ui.tests.creation.CreateElementTest skipped
01:53:52 testCreateDeploymentBetweenNodeAndArtifactInNode(org.eclipse.papyrus.uml.service.types.ui.tests.creation.CreateRelationshipTest) skipped
01:53:52 testCreatePackageMergeBetweenPackageAndPackageInPackage2(org.eclipse.papyrus.uml.service.types.ui.tests.creation.CreateRelationshipTest) skipped
01:53:52 testCreateTraceBetweenClassAndNullInPackage(org.eclipse.papyrus.uml.service.types.ui.tests.creation.CreateRelationshipTest) skipped
01:53:52 testCreateDependencyBetweenClassesInPackage(org.eclipse.papyrus.uml.service.types.ui.tests.creation.CreateRelationshipTest) skipped
01:53:52 testCreateProtocolConformanceBetweenPackageAndPackageInPackage(org.eclipse.papyrus.uml.service.types.ui.tests.creation.CreateRelationshipTest) skipped
01:53:52 testCreateInformationfloweBetweenClasses2InPackage(org.eclipse.papyrus.uml.service.types.ui.tests.creation.CreateRelationshipTest) skipped
01:53:52 testCreateUsageBetweenClassAndNullInPackage(org.eclipse.papyrus.uml.service.types.ui.tests.creation.CreateRelationshipTest) skipped
01:53:52 testCreateAbstractionBetweenPackageAndClassesInModel(org.eclipse.papyrus.uml.service.types.ui.tests.creation.CreateRelationshipTest) skipped
01:53:52 testCreateComponentRealizationBetweenClassAndComponentInComponent(org.eclipse.papyrus.uml.service.types.ui.tests.creation.CreateRelationshipTest) skipped
01:53:52 testCreateAbstractionBetweenClassesInPackage(org.eclipse.papyrus.uml.service.types.ui.tests.creation.CreateRelationshipTest) skipped
01:53:52 testCreateUsageBetweenClassesInPackage(org.eclipse.papyrus.uml.service.types.ui.tests.creation.CreateRelationshipTest) skipped
01:53:52 testCreatePackageImportBetweenPackageAndPackageInPackage(org.eclipse.papyrus.uml.service.types.ui.tests.creation.CreateRelationshipTest) skipped
01:53:52 testCreateComponentRealizationBetweenComponentAndClassInComponent(org.eclipse.papyrus.uml.service.types.ui.tests.creation.CreateRelationshipTest) skipped
01:53:52 testCreateElementImportBetweenPackageAndPackageInPackage(org.eclipse.papyrus.uml.service.types.ui.tests.creation.CreateRelationshipTest) skipped
01:53:52 testCreateDeploymentBetweenNodeAndArtifactInArtifact(org.eclipse.papyrus.uml.service.types.ui.tests.creation.CreateRelationshipTest) skipped
01:53:52 testCreateGeneralizationBetweenClassesInPackage(org.eclipse.papyrus.uml.service.types.ui.tests.creation.CreateRelationshipTest) skipped
01:53:52 testCreateGeneralizationBetweenClassAndNullInClass(org.eclipse.papyrus.uml.service.types.ui.tests.creation.CreateRelationshipTest) skipped
01:53:52 testCreateDeploymentBetweenArtifactAndNodeInArtifact(org.eclipse.papyrus.uml.service.types.ui.tests.creation.CreateRelationshipTest) skipped
01:53:52 testCreateExtendBetweenClasses2InPackage(org.eclipse.papyrus.uml.service.types.ui.tests.creation.CreateRelationshipTest) skipped
01:53:52 testCreateProtocolConformanceBetweenPackageAndPackageInPackage2(org.eclipse.papyrus.uml.service.types.ui.tests.creation.CreateRelationshipTest) skipped
01:53:52 testCreateTransitionBetweenInitialAndState(org.eclipse.papyrus.uml.service.types.ui.tests.creation.CreateRelationshipTest) skipped
01:53:52 testCreateInformationfloweBetweenUseCases2InUseCase(org.eclipse.papyrus.uml.service.types.ui.tests.creation.CreateRelationshipTest) skipped
01:53:52 testCreateRefineBetweenClassesInPackage(org.eclipse.papyrus.uml.service.types.ui.tests.creation.CreateRelationshipTest) skipped
01:53:52 testCreateComponentRealizationBetweenClassAndComponentInClass(org.eclipse.papyrus.uml.service.types.ui.tests.creation.CreateRelationshipTest) skipped
01:53:52 testCreateRealizationBetweenClassAndNullInPackage(org.eclipse.papyrus.uml.service.types.ui.tests.creation.CreateRelationshipTest) skipped
01:53:52 testCreateExtensionBetweenClassAndNullInNull(org.eclipse.papyrus.uml.service.types.ui.tests.creation.CreateRelationshipTest) skipped
01:53:52 testCreateExtendBetweenUseCases2InUseCase(org.eclipse.papyrus.uml.service.types.ui.tests.creation.CreateRelationshipTest) skipped
01:53:52 testCreateElementImportBetweenPackageAndPackageInPackage2(org.eclipse.papyrus.uml.service.types.ui.tests.creation.CreateRelationshipTest) skipped
01:53:52 testCreateAssociationBetweenClassesInPackage(org.eclipse.papyrus.uml.service.types.ui.tests.creation.CreateRelationshipTest) skipped
01:53:52 testCreateTraceBetweenClassesInClass(org.eclipse.papyrus.uml.service.types.ui.tests.creation.CreateRelationshipTest) skipped
01:53:52 testCreateManifestationBetweenArtifactAndPackage2InArtifact(org.eclipse.papyrus.uml.service.types.ui.tests.creation.CreateRelationshipTest) skipped
01:53:52 testCreateSubstitutionBetweenClassesInPackage(org.eclipse.papyrus.uml.service.types.ui.tests.creation.CreateRelationshipTest) skipped
01:53:52 testCreateAbstractionBetweenClassAndNullInPackage(org.eclipse.papyrus.uml.service.types.ui.tests.creation.CreateRelationshipTest) skipped
01:53:52 testCreateAbstractionBetweenClassAndClassInClass(org.eclipse.papyrus.uml.service.types.ui.tests.creation.CreateRelationshipTest) skipped
01:53:52 testCreatePackageMergeBetweenPackageAndPackageInPackage(org.eclipse.papyrus.uml.service.types.ui.tests.creation.CreateRelationshipTest) skipped
01:53:52 testCreateRealizationBetweenClassesInPackage(org.eclipse.papyrus.uml.service.types.ui.tests.creation.CreateRelationshipTest) skipped
01:53:52 testCreateTransitionBetweenStateAndInitial(org.eclipse.papyrus.uml.service.types.ui.tests.creation.CreateRelationshipTest) skipped
01:53:52 testCreateAssociationBetweenClassAndNullInPackage(org.eclipse.papyrus.uml.service.types.ui.tests.creation.CreateRelationshipTest) skipped
01:53:52 testCreateRefineBetweenClassAndNullInPackage(org.eclipse.papyrus.uml.service.types.ui.tests.creation.CreateRelationshipTest) skipped
01:53:52 testCreateDeploymentBetweenArtifactAndNodeInNode(org.eclipse.papyrus.uml.service.types.ui.tests.creation.CreateRelationshipTest) skipped
01:53:52 testCreateIncludeBetweenUseCases2InUseCase(org.eclipse.papyrus.uml.service.types.ui.tests.creation.CreateRelationshipTest) skipped
01:53:52 testCreateGeneralizationBetweenClassesInClass(org.eclipse.papyrus.uml.service.types.ui.tests.creation.CreateRelationshipTest) skipped
01:53:52 testCreateExtensionBetweenClassAndNullInClass(org.eclipse.papyrus.uml.service.types.ui.tests.creation.CreateRelationshipTest) skipped
01:53:52 testCreateDependencyBetweenClassAndNullInPackage(org.eclipse.papyrus.uml.service.types.ui.tests.creation.CreateRelationshipTest) skipped
01:53:52 testCreatePackageImportBetweenPackageAndPackageInPackage2(org.eclipse.papyrus.uml.service.types.ui.tests.creation.CreateRelationshipTest) skipped
01:53:52 testCreateComponentRealizationBetweenComponentAndClass(org.eclipse.papyrus.uml.service.types.ui.tests.creation.CreateRelationshipTest) skipped
01:53:52 testCreateSubstitutionBetweenClassAndNullInPackage(org.eclipse.papyrus.uml.service.types.ui.tests.creation.CreateRelationshipTest) skipped
01:53:52 testCreateInterfaceRealizationBetweenClassAndInterfaceInClass(org.eclipse.papyrus.uml.service.types.ui.tests.creation.CreateRelationshipTest) skipped
01:53:52 testCreateTraceBetweenClassesInPackage(org.eclipse.papyrus.uml.service.types.ui.tests.creation.CreateRelationshipTest) skipped
01:53:52 testCreateTransitionBetweenStateAndFinal(org.eclipse.papyrus.uml.service.types.ui.tests.creation.CreateRelationshipTest) skipped
01:53:52 testCreateAbstractionBetweenClassAndPackageInModel(org.eclipse.papyrus.uml.service.types.ui.tests.creation.CreateRelationshipTest) skipped
01:53:52 testCreateRefineBetweenClassesInClass(org.eclipse.papyrus.uml.service.types.ui.tests.creation.CreateRelationshipTest) skipped
01:53:52 testCreateTransitionBetweenFinalAndState(org.eclipse.papyrus.uml.service.types.ui.tests.creation.CreateRelationshipTest) skipped
01:53:52 testCreateManifestationBetweenClassAndPackage2InArtifact(org.eclipse.papyrus.uml.service.types.ui.tests.creation.CreateRelationshipTest) skipped
01:53:52 testCreateInterfaceRealizationBetweenUseCases2InUseCase(org.eclipse.papyrus.uml.service.types.ui.tests.creation.CreateRelationshipTest) skipped
01:53:52 testCreateIncludeBetweenClasses2InPackage(org.eclipse.papyrus.uml.service.types.ui.tests.creation.CreateRelationshipTest) skipped
01:53:52 org.eclipse.papyrus.uml.service.types.ui.tests.creation.CreateRelationshipTest skipped
01:53:52 testCreateExtensionBetweenStereotypeAndMetaClassInPackage(org.eclipse.papyrus.uml.service.types.ui.tests.creation.CreateProfileRelationshipTest) skipped
01:53:52 org.eclipse.papyrus.uml.service.types.ui.tests.creation.CreateProfileRelationshipTest skipped
01:53:52 testMoveTemplateSignatureToOperation_bug468071(org.eclipse.papyrus.uml.service.types.ui.tests.creation.MoveElementTest) skipped
01:53:52 testMoveRedefinableTemplateSignatureToClass_bug468071(org.eclipse.papyrus.uml.service.types.ui.tests.creation.MoveElementTest) skipped
01:53:52 testCannotMoveRedefinableTemplateSignatureToOperation_bug468071(org.eclipse.papyrus.uml.service.types.ui.tests.creation.MoveElementTest) skipped
01:53:52 org.eclipse.papyrus.uml.service.types.ui.tests.creation.MoveElementTest skipped
01:53:52 testSetTemplateSignatureOfOperation_bug468071(org.eclipse.papyrus.uml.service.types.ui.tests.creation.SetFeatureTest) skipped
01:53:52 testSetRedefinableTemplateSignatureOfClass_bug468071(org.eclipse.papyrus.uml.service.types.ui.tests.creation.SetFeatureTest) skipped
01:53:52 testCannotSetRedefinableTemplateSignatureOfOperation_bug468071(org.eclipse.papyrus.uml.service.types.ui.tests.creation.SetFeatureTest) skipped
01:53:52 org.eclipse.papyrus.uml.service.types.ui.tests.creation.SetFeatureTest skipped
01:53:52 deleteAssociation(org.eclipse.papyrus.uml.service.types.ui.tests.deletion.DeleteAssociationTest) skipped
01:53:52 deleteAssociationTarget(org.eclipse.papyrus.uml.service.types.ui.tests.deletion.DeleteAssociationTest) skipped
01:53:52 org.eclipse.papyrus.uml.service.types.ui.tests.deletion.DeleteAssociationTest skipped
01:53:52 org.eclipse.papyrus.uml.service.types.ui.tests.suites.AllTests skipped
01:53:52 deleteReadOnlyElement(org.eclipse.papyrus.uml.modelexplorer.tests.DeleteModelExplorerTest) skipped
01:53:52 deleteClassInTheModel(org.eclipse.papyrus.uml.modelexplorer.tests.DeleteModelExplorerTest) skipped
01:53:52 deleteRootOfTheModel(org.eclipse.papyrus.uml.modelexplorer.tests.DeleteModelExplorerTest) skipped
01:53:52 org.eclipse.papyrus.uml.modelexplorer.tests.DeleteModelExplorerTest skipped
01:53:52 renameUMLUnnamedElementTest(org.eclipse.papyrus.uml.modelexplorer.tests.RenameHandlerTest) skipped
01:53:52 renameUMLNamedElementTest(org.eclipse.papyrus.uml.modelexplorer.tests.RenameHandlerTest) skipped
01:53:52 org.eclipse.papyrus.uml.modelexplorer.tests.RenameHandlerTest skipped
01:53:52 revealSemanticElement_selectRootTest(org.eclipse.papyrus.uml.modelexplorer.tests.ModelExplorerViewTests) skipped
01:53:52 revealSemanticElement_selectChildrenTest(org.eclipse.papyrus.uml.modelexplorer.tests.ModelExplorerViewTests) skipped
01:53:52 revealSemanticElement_selectImportedPackage(org.eclipse.papyrus.uml.modelexplorer.tests.ModelExplorerViewTests) skipped
01:53:52 revealSemanticElement_selectImportedPackageList(org.eclipse.papyrus.uml.modelexplorer.tests.ModelExplorerViewTests) skipped
01:53:52 revealSemanticElement_selectChildrenTestList(org.eclipse.papyrus.uml.modelexplorer.tests.ModelExplorerViewTests) skipped
01:53:52 org.eclipse.papyrus.uml.modelexplorer.tests.ModelExplorerViewTests skipped
01:53:52 cutReadOnlyElement(org.eclipse.papyrus.uml.modelexplorer.tests.paste.CutPasteModelExplorerTest) skipped
01:53:52 cutClassTest(org.eclipse.papyrus.uml.modelexplorer.tests.paste.CutPasteModelExplorerTest) skipped
01:53:52 cutRootOfTheModel(org.eclipse.papyrus.uml.modelexplorer.tests.paste.CutPasteModelExplorerTest) skipped
01:53:52 org.eclipse.papyrus.uml.modelexplorer.tests.paste.CutPasteModelExplorerTest skipped
01:53:52 copyPasteofClass1Test(org.eclipse.papyrus.uml.modelexplorer.tests.paste.CopyPasteModelExplorerTest) skipped
01:53:52 pasteOnReadOnlyElement(org.eclipse.papyrus.uml.modelexplorer.tests.paste.CopyPasteModelExplorerTest) skipped
01:53:52 copyPasteofClass1And2Test(org.eclipse.papyrus.uml.modelexplorer.tests.paste.CopyPasteModelExplorerTest) skipped
01:53:52 org.eclipse.papyrus.uml.modelexplorer.tests.paste.CopyPasteModelExplorerTest skipped
01:53:52 copyPasteDiagramTest(org.eclipse.papyrus.uml.modelexplorer.tests.paste.DiagramCopyPasteModelExplorerTest) skipped
01:53:52 org.eclipse.papyrus.uml.modelexplorer.tests.paste.DiagramCopyPasteModelExplorerTest skipped
01:53:52 copyPasteTableTest(org.eclipse.papyrus.uml.modelexplorer.tests.paste.TableCopyPasteModelExplorerTest) skipped
01:53:52 org.eclipse.papyrus.uml.modelexplorer.tests.paste.TableCopyPasteModelExplorerTest skipped
01:53:52 copyPasteofClass1Test(org.eclipse.papyrus.uml.modelexplorer.tests.paste.StereotypeCopyPasteModelExplorerTest) skipped
01:53:52 org.eclipse.papyrus.uml.modelexplorer.tests.paste.StereotypeCopyPasteModelExplorerTest skipped
01:53:52 advancedModeDoesNotCollapseItself(org.eclipse.papyrus.uml.modelexplorer.tests.AdvancedModeTest) skipped
01:53:52 org.eclipse.papyrus.uml.modelexplorer.tests.AdvancedModeTest skipped
01:53:52 org.eclipse.papyrus.uml.modelexplorer.tests.AllTests skipped
01:53:52 dropInterface(org.eclipse.papyrus.uml.diagram.dnd.tests.tests.InstanceSpecificationTest) skipped
01:53:52 dropClass(org.eclipse.papyrus.uml.diagram.dnd.tests.tests.InstanceSpecificationTest) skipped
01:53:52 testPropertyContentProvider(org.eclipse.papyrus.uml.diagram.dnd.tests.tests.InstanceSpecificationTest) skipped
01:53:52 dropClassAndInterface(org.eclipse.papyrus.uml.diagram.dnd.tests.tests.InstanceSpecificationTest) skipped
01:53:52 dropClassAndSuperclass(org.eclipse.papyrus.uml.diagram.dnd.tests.tests.InstanceSpecificationTest) skipped
01:53:52 org.eclipse.papyrus.uml.diagram.dnd.tests.tests.InstanceSpecificationTest skipped
01:53:52 org.eclipse.papyrus.uml.diagram.dnd.tests.tests.AllTests skipped
01:53:52 singleValuePropertyGraphicalTest(org.eclipse.papyrus.uml.tools.tests.tests.ContentProviderTest) skipped
01:53:52 singleValuePropertyTest(org.eclipse.papyrus.uml.tools.tests.tests.ContentProviderTest) skipped
01:53:52 multipleValuePropertyTest(org.eclipse.papyrus.uml.tools.tests.tests.ContentProviderTest) skipped
01:53:52 enumPropertyTest(org.eclipse.papyrus.uml.tools.tests.tests.ContentProviderTest) skipped
01:53:52 testProfileContentWithBaseClassPropertyWithoutInheritedProperties(org.eclipse.papyrus.uml.tools.tests.tests.UMLStereotypePropertyContentProviderTest) skipped
01:53:52 testProfileContentWithoutBaseClassPropertyWithoutInheritedProperties(org.eclipse.papyrus.uml.tools.tests.tests.UMLStereotypePropertyContentProviderTest) skipped
01:53:52 testProfileContentWithBaseClassPropertyWithInheritedProperties(org.eclipse.papyrus.uml.tools.tests.tests.UMLStereotypePropertyContentProviderTest) skipped
01:53:52 testProfileContentWithoutBaseClassPropertyWithInheritedProperties(org.eclipse.papyrus.uml.tools.tests.tests.UMLStereotypePropertyContentProviderTest) skipped
01:53:52 testSwitchToProxy(org.eclipse.papyrus.uml.tools.tests.tests.DependencyManagementTest) skipped
01:53:52 testSwitchProfilesWithStereotypes(org.eclipse.papyrus.uml.tools.tests.tests.DependencyManagementTest) skipped
01:53:52 testSwitchFromRegistererdToLocal(org.eclipse.papyrus.uml.tools.tests.tests.DependencyManagementTest) skipped
01:53:52 testSwitchProfilesWithStereotypeProperties(org.eclipse.papyrus.uml.tools.tests.tests.DependencyManagementTest) skipped
01:53:52 testSwitchProfilesWithMissingDefinitions(org.eclipse.papyrus.uml.tools.tests.tests.DependencyManagementTest) skipped
01:53:52 testSwitchFromLocalToRegistered(org.eclipse.papyrus.uml.tools.tests.tests.DependencyManagementTest) skipped
01:53:52 testSwitchToDifferentVersion(org.eclipse.papyrus.uml.tools.tests.tests.DependencyManagementTest) skipped
01:53:52 testSimpleSwitch(org.eclipse.papyrus.uml.tools.tests.tests.DependencyManagementTest) skipped
01:53:52 testSwitchFromProxy(org.eclipse.papyrus.uml.tools.tests.tests.DependencyManagementTest) skipped
01:53:52 testSwitchProfilesStereotypeIdentities(org.eclipse.papyrus.uml.tools.tests.tests.DependencyManagementTest) skipped
01:53:52 testSwitchProfilesWithRequiredStereotypes(org.eclipse.papyrus.uml.tools.tests.tests.DependencyManagementTest) skipped
01:53:52 testOverloadDoesNotClash(org.eclipse.papyrus.uml.tools.tests.tests.NamedElementValidatorTest) skipped
01:53:52 testNameClash(org.eclipse.papyrus.uml.tools.tests.tests.NamedElementValidatorTest) skipped
01:53:52 testElementOfDifferentKindDoesNotClash(org.eclipse.papyrus.uml.tools.tests.tests.NamedElementValidatorTest) skipped
01:53:52 testModifiedSysMLStereotype(org.eclipse.papyrus.uml.tools.tests.tests.StereotypeElementListenerTest)  Time elapsed: 0.555 sec  <<< FAILURE!
01:53:52 java.lang.AssertionError: SysML dependency needs to be removed
01:53:52 	at org.junit.Assert.fail(Assert.java:88)
01:53:52 	at org.eclipse.papyrus.uml.tools.tests.tests.StereotypeElementListenerTest.testModifiedSysMLStereotype(StereotypeElementListenerTest.java:603)
01:53:52 
01:53:52 testUndoUnapplyProfile(org.eclipse.papyrus.uml.tools.tests.tests.StereotypeElementListenerTest) skipped
01:53:52 testAddStereotype(org.eclipse.papyrus.uml.tools.tests.tests.StereotypeElementListenerTest) skipped
01:53:52 testStereotypeUnsetAttributeChange(org.eclipse.papyrus.uml.tools.tests.tests.StereotypeElementListenerTest) skipped
01:53:52 testUndoAddStereotype(org.eclipse.papyrus.uml.tools.tests.tests.StereotypeElementListenerTest) skipped
01:53:52 testAddStereotypes(org.eclipse.papyrus.uml.tools.tests.tests.StereotypeElementListenerTest) skipped
01:53:52 testUndoRemoveStereotype(org.eclipse.papyrus.uml.tools.tests.tests.StereotypeElementListenerTest) skipped
01:53:52 testAddSysMLStereotype(org.eclipse.papyrus.uml.tools.tests.tests.StereotypeElementListenerTest) skipped
01:53:52 testModifiedStereotype(org.eclipse.papyrus.uml.tools.tests.tests.StereotypeElementListenerTest) skipped
01:53:52 testAddStereotypeOnSeveralElements(org.eclipse.papyrus.uml.tools.tests.tests.StereotypeElementListenerTest) skipped
01:53:52 testUndoAddStereotypes(org.eclipse.papyrus.uml.tools.tests.tests.StereotypeElementListenerTest) skipped
01:53:52 testFakeBasedProperty(org.eclipse.papyrus.uml.tools.tests.tests.StereotypeElementListenerTest) skipped
01:53:52 testRemoveStereotype(org.eclipse.papyrus.uml.tools.tests.tests.StereotypeElementListenerTest) skipped
01:53:52 testRemoveSysMLStereotype(org.eclipse.papyrus.uml.tools.tests.tests.StereotypeElementListenerTest) skipped
01:53:52 testUndoAddSysMLStereotype(org.eclipse.papyrus.uml.tools.tests.tests.StereotypeElementListenerTest) skipped
01:53:52 testUndoModifiedStereotype(org.eclipse.papyrus.uml.tools.tests.tests.StereotypeElementListenerTest) skipped
01:53:52 testUndoAddStereotypeOnSeveralElements(org.eclipse.papyrus.uml.tools.tests.tests.StereotypeElementListenerTest) skipped
01:53:52 testUndoRedoAddStereotypeTiming(org.eclipse.papyrus.uml.tools.tests.tests.StereotypeElementListenerTest) skipped
01:53:52 testUnapplyProfile(org.eclipse.papyrus.uml.tools.tests.tests.StereotypeElementListenerTest) skipped
01:53:52 testUndoRemoveSysMLStereotype(org.eclipse.papyrus.uml.tools.tests.tests.StereotypeElementListenerTest) skipped
01:53:52 testUndoModifiedSysMLStereotype(org.eclipse.papyrus.uml.tools.tests.tests.StereotypeElementListenerTest)  Time elapsed: 0.634 sec  <<< FAILURE!
01:53:52 java.lang.AssertionError: SysML dependency needs to be removed
01:53:52 	at org.junit.Assert.fail(Assert.java:88)
01:53:52 	at org.eclipse.papyrus.uml.tools.tests.tests.StereotypeElementListenerTest.testUndoModifiedSysMLStereotype(StereotypeElementListenerTest.java:632)
01:53:52 
01:53:52 testStereotypeListAttributeChange(org.eclipse.papyrus.uml.tools.tests.tests.StereotypeElementListenerTest) skipped
01:53:52 twoProfilesUnapplied(org.eclipse.papyrus.uml.tools.tests.tests.ProfileApplicationListenerTest) skipped
01:53:52 moveProfileApplication(org.eclipse.papyrus.uml.tools.tests.tests.ProfileApplicationListenerTest) skipped
01:53:52 applyProfileThenMoveApplication(org.eclipse.papyrus.uml.tools.tests.tests.ProfileApplicationListenerTest) skipped
01:53:52 twoProfilesApplied(org.eclipse.papyrus.uml.tools.tests.tests.ProfileApplicationListenerTest) skipped
01:53:52 profileReplacedInAnApplication(org.eclipse.papyrus.uml.tools.tests.tests.ProfileApplicationListenerTest) skipped
01:53:52 simpleNewProfileApplication(org.eclipse.papyrus.uml.tools.tests.tests.ProfileApplicationListenerTest) skipped
01:53:52 simpleProfileUnapplication(org.eclipse.papyrus.uml.tools.tests.tests.ProfileApplicationListenerTest) skipped
01:53:52 profileAppliedThenReplacedInSameApplication(org.eclipse.papyrus.uml.tools.tests.tests.ProfileApplicationListenerTest) skipped
01:53:52 testEditToDisplaySingleString_1(org.eclipse.papyrus.uml.tools.tests.tests.UMLReferenceConverterTest)  Time elapsed: 0.044 sec
01:53:52 testList(org.eclipse.papyrus.uml.tools.tests.tests.UMLReferenceConverterTest)  Time elapsed: 0.059 sec
01:53:52 testNull(org.eclipse.papyrus.uml.tools.tests.tests.UMLReferenceConverterTest)  Time elapsed: 0.054 sec
01:53:52 testDisplayToEditString_1(org.eclipse.papyrus.uml.tools.tests.tests.UMLReferenceConverterTest)  Time elapsed: 0.046 sec
01:53:52 testEmptyString(org.eclipse.papyrus.uml.tools.tests.tests.UMLReferenceConverterTest)  Time elapsed: 0.059 sec
01:53:52 testClass2(org.eclipse.papyrus.uml.tools.tests.tests.UMLReferenceConverterTest)  Time elapsed: 0.053 sec
01:53:52 testClass3(org.eclipse.papyrus.uml.tools.tests.tests.UMLReferenceConverterTest)  Time elapsed: 0.056 sec
01:53:52 testMatchingElementstSingleValue1(org.eclipse.papyrus.uml.tools.tests.tests.UMLReferenceConverterTest)  Time elapsed: 0.034 sec
01:53:52 testMatchingElementstSingleValue2(org.eclipse.papyrus.uml.tools.tests.tests.UMLReferenceConverterTest)  Time elapsed: 0.11 sec
01:53:52 testCompletionToFindClass_1(org.eclipse.papyrus.uml.tools.tests.tests.UMLReferenceConverterCompletionTest)  Time elapsed: 0.26 sec
01:53:52 testCompletionToFindClass_3(org.eclipse.papyrus.uml.tools.tests.tests.UMLReferenceConverterCompletionTest)  Time elapsed: 0.049 sec
01:53:52 testCompletionToFindClass_4(org.eclipse.papyrus.uml.tools.tests.tests.UMLReferenceConverterCompletionTest)  Time elapsed: 0.029 sec
01:53:52 testCompletionToFindClass_5(org.eclipse.papyrus.uml.tools.tests.tests.UMLReferenceConverterCompletionTest)  Time elapsed: 0.03 sec
01:53:52 testCompletionToFindClass_6(org.eclipse.papyrus.uml.tools.tests.tests.UMLReferenceConverterCompletionTest)  Time elapsed: 0.027 sec
01:53:52 testCompletionToFindClass_7(org.eclipse.papyrus.uml.tools.tests.tests.UMLReferenceConverterCompletionTest)  Time elapsed: 0.031 sec
01:53:52 testCompletionToFindClass_8(org.eclipse.papyrus.uml.tools.tests.tests.UMLReferenceConverterCompletionTest)  Time elapsed: 0.029 sec
01:53:52 testSplitString_1(org.eclipse.papyrus.uml.tools.tests.tests.UMLReferenceConverterCompletionTest)  Time elapsed: 0.03 sec
01:53:52 testSplitString_2(org.eclipse.papyrus.uml.tools.tests.tests.UMLReferenceConverterCompletionTest)  Time elapsed: 0.027 sec
01:53:52 testCompletionToFindConstraint_1(org.eclipse.papyrus.uml.tools.tests.tests.UMLReferenceConverterCompletionTest)  Time elapsed: 0.035 sec
01:53:52 testCompletionToFindConstraint_2(org.eclipse.papyrus.uml.tools.tests.tests.UMLReferenceConverterCompletionTest)  Time elapsed: 0.027 sec
01:53:52 testCompletionMultiValueConverterEmptyString(org.eclipse.papyrus.uml.tools.tests.tests.UMLReferenceConverterCompletionTest)  Time elapsed: 0.023 sec
01:53:52 testCompletionToFindPackage_1(org.eclipse.papyrus.uml.tools.tests.tests.UMLReferenceConverterCompletionTest)  Time elapsed: 0.024 sec
01:53:52 testCompletionToFindPackage_2(org.eclipse.papyrus.uml.tools.tests.tests.UMLReferenceConverterCompletionTest)  Time elapsed: 0.025 sec
01:53:52 testCompletionSingleValueConverterEmptyString(org.eclipse.papyrus.uml.tools.tests.tests.UMLReferenceConverterCompletionTest)  Time elapsed: 0.027 sec
01:53:52 profileLanguage(org.eclipse.papyrus.uml.tools.tests.tests.UMLLanguageProvidersTest)  Time elapsed: 0.002 sec
01:53:52 umlLanguage(org.eclipse.papyrus.uml.tools.tests.tests.UMLLanguageProvidersTest)  Time elapsed: 0.001 sec
01:53:52 ValidationStereotypesListClass1Test(org.eclipse.papyrus.uml.tools.tests.tests.IconsStereotypesTest)  Time elapsed: 1.319 sec
01:53:52 ValidationStereotypesListClass2Test(org.eclipse.papyrus.uml.tools.tests.tests.IconsStereotypesTest)  Time elapsed: 1.765 sec
01:53:52 ValidationStereotypesListClass3Test(org.eclipse.papyrus.uml.tools.tests.tests.IconsStereotypesTest)  Time elapsed: 1.268 sec
01:53:52 ValidationStereotypesListClass4Test(org.eclipse.papyrus.uml.tools.tests.tests.IconsStereotypesTest)  Time elapsed: 2.611 sec
01:53:52 ValidationImageClass1Test(org.eclipse.papyrus.uml.tools.tests.tests.IconsStereotypesTest)  Time elapsed: 1.443 sec
01:53:52 ValidationImageClass2Test(org.eclipse.papyrus.uml.tools.tests.tests.IconsStereotypesTest)  Time elapsed: 1.071 sec
01:53:52 ValidationImageClass3Test(org.eclipse.papyrus.uml.tools.tests.tests.IconsStereotypesTest)  Time elapsed: 1.173 sec
01:53:52 ValidationImageClass4Test(org.eclipse.papyrus.uml.tools.tests.tests.IconsStereotypesTest)  Time elapsed: 1.039 sec
01:53:52 returnedTextTest(org.eclipse.papyrus.uml.tools.tests.tests.CustomizableDelegatingItemLabelProviderTest)  Time elapsed: 1.13 sec
01:53:52 returnedStyledTextTest(org.eclipse.papyrus.uml.tools.tests.tests.CustomizableDelegatingItemLabelProviderTest)  Time elapsed: 1.108 sec
01:53:52 notifyChange(org.eclipse.papyrus.uml.tools.tests.tests.DelegatingItemLabelProviderTest)  Time elapsed: 0.17 sec
01:53:52 copyingInterfaceRealizationDoesNotCorruptTheModel(org.eclipse.papyrus.uml.tools.tests.tests.UMLCopyTest)  Time elapsed: 0.03 sec
01:53:52 recursiveImportPackage(org.eclipse.papyrus.uml.tools.utils.tests.tests.NameResolutionHelperTest) skipped
01:53:52 org.eclipse.papyrus.uml.tools.utils.tests.tests.NameResolutionHelperTest skipped
01:53:52 testIsAutoNamed(org.eclipse.papyrus.uml.tools.utils.tests.tests.NamedElementUtilTest) skipped
01:53:52 testGetDefaultNameWithIncrement(org.eclipse.papyrus.uml.tools.utils.tests.tests.NamedElementUtilTest) skipped
01:53:52 testAutoNameIncrement(org.eclipse.papyrus.uml.tools.utils.tests.tests.NamedElementUtilTest) skipped
01:53:52 testExistingElementHavingNameNotRenamed(org.eclipse.papyrus.uml.tools.utils.tests.tests.NamedElementUtilTest) skipped
01:53:52 org.eclipse.papyrus.uml.tools.utils.tests.tests.NamedElementUtilTest skipped
01:53:52 testGetAppliedSuperstereotype(org.eclipse.papyrus.uml.tools.utils.tests.tests.UMLUtilTest) skipped
01:53:52 testGetApplicableStereotype_notStrict_notApplicable(org.eclipse.papyrus.uml.tools.utils.tests.tests.UMLUtilTest) skipped
01:53:52 testGetApplicableStereotype_notStrict_applicable(org.eclipse.papyrus.uml.tools.utils.tests.tests.UMLUtilTest) skipped
01:53:52 testGetApplicableStereotype_strict_applicable(org.eclipse.papyrus.uml.tools.utils.tests.tests.UMLUtilTest) skipped
01:53:52 testGetAppliedSubstereotype_notApplied(org.eclipse.papyrus.uml.tools.utils.tests.tests.UMLUtilTest) skipped
01:53:52 testGetApplicableStereotype_strict_notApplicable(org.eclipse.papyrus.uml.tools.utils.tests.tests.UMLUtilTest) skipped
01:53:52 testGetAppliedSubstereotype_applied(org.eclipse.papyrus.uml.tools.utils.tests.tests.UMLUtilTest) skipped
01:53:52 org.eclipse.papyrus.uml.tools.utils.tests.tests.UMLUtilTest skipped
01:53:52 org.eclipse.papyrus.uml.tools.utils.tests.tests.AllTests skipped
01:53:52 testUnApplyStereotypeApplication(org.eclipse.papyrus.uml.diagram.stereotypeproperty.TestBadUnapplyProfile2ClosedDiagComment) skipped
01:53:52 testStereotypeApplicationOnClass(org.eclipse.papyrus.uml.diagram.stereotypeproperty.TestDropStereotypedClass) skipped
01:53:52 testProfileApplicationOnModel(org.eclipse.papyrus.uml.diagram.stereotypeproperty.TestProfileApplication) skipped
01:53:52 testBrace(org.eclipse.papyrus.uml.diagram.stereotypeproperty.tests.asbrace.TestDisplayAsBrace) skipped
01:53:52 testReopenStereotypeAsComment(org.eclipse.papyrus.uml.diagram.stereotypeproperty.tests.asbrace.TestReopenAsBrace) skipped
01:53:52 testStereotypeApplicationOnClass(org.eclipse.papyrus.uml.diagram.stereotypeproperty.tests.ascomment.TestDisplayAsComment) skipped
01:53:52 testReopenStereotypeAsComment(org.eclipse.papyrus.uml.diagram.stereotypeproperty.tests.ascomment.TestReopenAsComment) skipped
01:53:52 testStereotypeApplicationOnClass(org.eclipse.papyrus.uml.diagram.stereotypeproperty.tests.ascompartment.TestDisplayAsCompartment) skipped
01:53:52 testReopenStereotypeAsComment(org.eclipse.papyrus.uml.diagram.stereotypeproperty.tests.ascompartment.TestReopenAsCompartment) skipped
01:53:52 test2StereotypeApplicationsOnClass(org.eclipse.papyrus.uml.diagram.stereotypeproperty.tests.displayname.Test2StereotypeApplications) skipped
01:53:52 testStereotypeApplicationOnPackage(org.eclipse.papyrus.uml.diagram.stereotypeproperty.tests.displayname.TestStereotypeApplication) skipped
01:53:52 testStereotypeApplicationOnClass(org.eclipse.papyrus.uml.diagram.stereotypeproperty.tests.displayname.TestStereotypeApplication) skipped
01:53:52 testQNStereotypeApplicationOnClass(org.eclipse.papyrus.uml.diagram.stereotypeproperty.tests.displayname.TestStereotypeApplicationQualifiedName) skipped
01:53:52 testLayoutStereotypeApplicationOnClass(org.eclipse.papyrus.uml.diagram.stereotypeproperty.tests.layout.TestLayoutWithStereotype)  Time elapsed: 1.563 sec  <<< FAILURE!
01:53:52 java.lang.AssertionError: The label of stereotype for the Class is not good has not the good X coordinate expected:<0> but was:<1>
01:53:52 	at org.junit.Assert.fail(Assert.java:88)
01:53:52 	at org.junit.Assert.failNotEquals(Assert.java:834)
01:53:52 	at org.junit.Assert.assertEquals(Assert.java:645)
01:53:52 	at org.eclipse.papyrus.uml.diagram.stereotypeproperty.tests.layout.TestLayoutWithStereotype.assertDimension(TestLayoutWithStereotype.java:345)
01:53:52 	at org.eclipse.papyrus.uml.diagram.stereotypeproperty.tests.layout.TestLayoutWithStereotype.testToCreateANodeWithStereotype(TestLayoutWithStereotype.java:262)
01:53:52 	at org.eclipse.papyrus.uml.diagram.stereotypeproperty.tests.layout.TestLayoutWithStereotype.testLayoutStereotypeApplicationOnClass(TestLayoutWithStereotype.java:98)
01:53:52 
01:53:52 testLayoutOnClass(org.eclipse.papyrus.uml.diagram.stereotypeproperty.tests.layout.TestLayoutWithStereotype)  Time elapsed: 0.07 sec  <<< FAILURE!
01:53:52 java.lang.AssertionError: The figure of the Class  has not the good X coordinate expected:<0> but was:<1>
01:53:52 	at org.junit.Assert.fail(Assert.java:88)
01:53:52 	at org.junit.Assert.failNotEquals(Assert.java:834)
01:53:52 	at org.junit.Assert.assertEquals(Assert.java:645)
01:53:52 	at org.eclipse.papyrus.uml.diagram.stereotypeproperty.tests.layout.TestLayoutWithStereotype.assertDimension(TestLayoutWithStereotype.java:345)
01:53:52 	at org.eclipse.papyrus.uml.diagram.stereotypeproperty.tests.layout.TestLayoutWithStereotype.testToCreateANodeWithoutStereotype(TestLayoutWithStereotype.java:150)
01:53:52 	at org.eclipse.papyrus.uml.diagram.stereotypeproperty.tests.layout.TestLayoutWithStereotype.testLayoutOnClass(TestLayoutWithStereotype.java:92)
01:53:52 
01:53:52 testLayoutStereotypeApplicationOnClass(org.eclipse.papyrus.uml.diagram.stereotypeproperty.tests.layout.TestLayoutWithStereotypeOnEclipseHIPPInstance)  Time elapsed: 1.186 sec  <<< FAILURE!
01:53:52 java.lang.AssertionError: The label of stereotype for the Class is not good has not the good X coordinate expected:<0> but was:<1>
01:53:52 	at org.junit.Assert.fail(Assert.java:88)
01:53:52 	at org.junit.Assert.failNotEquals(Assert.java:834)
01:53:52 	at org.junit.Assert.assertEquals(Assert.java:645)
01:53:52 	at org.eclipse.papyrus.uml.diagram.stereotypeproperty.tests.layout.TestLayoutWithStereotypeOnEclipseHIPPInstance.assertDimension(TestLayoutWithStereotypeOnEclipseHIPPInstance.java:350)
01:53:52 	at org.eclipse.papyrus.uml.diagram.stereotypeproperty.tests.layout.TestLayoutWithStereotypeOnEclipseHIPPInstance.testToCreateANodeWithStereotype(TestLayoutWithStereotypeOnEclipseHIPPInstance.java:267)
01:53:52 	at org.eclipse.papyrus.uml.diagram.stereotypeproperty.tests.layout.TestLayoutWithStereotypeOnEclipseHIPPInstance.testLayoutStereotypeApplicationOnClass(TestLayoutWithStereotypeOnEclipseHIPPInstance.java:102)
01:53:52 
01:53:52 testLayoutOnClass(org.eclipse.papyrus.uml.diagram.stereotypeproperty.tests.layout.TestLayoutWithStereotypeOnEclipseHIPPInstance)  Time elapsed: 0.072 sec  <<< FAILURE!
01:53:52 java.lang.AssertionError: The figure of the Class  has not the good X coordinate expected:<0> but was:<1>
01:53:52 	at org.junit.Assert.fail(Assert.java:88)
01:53:52 	at org.junit.Assert.failNotEquals(Assert.java:834)
01:53:52 	at org.junit.Assert.assertEquals(Assert.java:645)
01:53:52 	at org.eclipse.papyrus.uml.diagram.stereotypeproperty.tests.layout.TestLayoutWithStereotypeOnEclipseHIPPInstance.assertDimension(TestLayoutWithStereotypeOnEclipseHIPPInstance.java:350)
01:53:52 	at org.eclipse.papyrus.uml.diagram.stereotypeproperty.tests.layout.TestLayoutWithStereotypeOnEclipseHIPPInstance.testToCreateANodeWithoutStereotype(TestLayoutWithStereotypeOnEclipseHIPPInstance.java:154)
01:53:52 	at org.eclipse.papyrus.uml.diagram.stereotypeproperty.tests.layout.TestLayoutWithStereotypeOnEclipseHIPPInstance.testLayoutOnClass(TestLayoutWithStereotypeOnEclipseHIPPInstance.java:96)
01:53:52 
01:53:52 testDiagramFileExtentionLabel(org.eclipse.papyrus.uml.diagram.wizards.TestCreateModelWizard) skipped
01:53:52 testDiagramFileExtenstionForUML(org.eclipse.papyrus.uml.diagram.wizards.TestCreateModelWizard) skipped
01:53:52 testOrderOfPages(org.eclipse.papyrus.uml.diagram.wizards.TestCreateModelWizard) skipped
01:53:52 org.eclipse.papyrus.uml.diagram.wizards.TestCreateModelWizard skipped
01:53:52 testDiagramFileExtentionLabel(org.eclipse.papyrus.uml.diagram.wizards.TestInitModelWizard) skipped
01:53:52 testDiagramFileExtenstionForUML(org.eclipse.papyrus.uml.diagram.wizards.TestInitModelWizard) skipped
01:53:52 testOrderOfPages(org.eclipse.papyrus.uml.diagram.wizards.TestInitModelWizard) skipped
01:53:52 org.eclipse.papyrus.uml.diagram.wizards.TestInitModelWizard skipped
01:53:52 testOrderOfPages(org.eclipse.papyrus.uml.diagram.wizards.TestNewProjectWizard) skipped
01:53:52 org.eclipse.papyrus.uml.diagram.wizards.TestNewProjectWizard skipped
01:53:52 testForSimpleModel(org.eclipse.papyrus.uml.diagram.wizards.TestCreateModelFromExistingModelWizard) skipped
01:53:52 testOrderOfPages(org.eclipse.papyrus.uml.diagram.wizards.TestCreateModelFromExistingModelWizard) skipped
01:53:52 testForModelWithDot(org.eclipse.papyrus.uml.diagram.wizards.TestCreateModelFromExistingModelWizard) skipped
01:53:52 org.eclipse.papyrus.uml.diagram.wizards.TestCreateModelFromExistingModelWizard skipped
01:53:52 org.eclipse.papyrus.uml.diagram.wizards.AllTests skipped
01:53:52 missingSchema(org.eclipse.papyrus.uml.modelrepair.internal.stereotypes.StereotypeApplicationRepairSnippetTest) skipped
01:53:52 noCorruptionControlCase(org.eclipse.papyrus.uml.modelrepair.internal.stereotypes.StereotypeApplicationRepairSnippetTest) skipped
01:53:52 wrongProfileVersion(org.eclipse.papyrus.uml.modelrepair.internal.stereotypes.StereotypeApplicationRepairSnippetTest) skipped
01:53:52 missingProfileApplication(org.eclipse.papyrus.uml.modelrepair.internal.stereotypes.StereotypeApplicationRepairSnippetTest) skipped
01:53:52 deleteStereotypes(org.eclipse.papyrus.uml.modelrepair.internal.stereotypes.StereotypeApplicationRepairSnippetTest) skipped
01:53:52 org.eclipse.papyrus.uml.modelrepair.internal.stereotypes.StereotypeApplicationRepairSnippetTest skipped
01:53:52 nestedProfileApplicationsMissingNamespace_bug434302(org.eclipse.papyrus.uml.modelrepair.internal.stereotypes.StereotypeRepairRegressionTest) skipped
01:53:52 orphansOfWrongProfileVersion_bug436666(org.eclipse.papyrus.uml.modelrepair.internal.stereotypes.StereotypeRepairRegressionTest) skipped
01:53:52 badSchemaLocationInNonPackageFragment_bug459488(org.eclipse.papyrus.uml.modelrepair.internal.stereotypes.StereotypeRepairRegressionTest) skipped
01:53:52 nestedProfilesAndNestedApplicationsWellFormed_bug434302(org.eclipse.papyrus.uml.modelrepair.internal.stereotypes.StereotypeRepairRegressionTest) skipped
01:53:52 registeredDynamicProfie_bug455329(org.eclipse.papyrus.uml.modelrepair.internal.stereotypes.StereotypeRepairRegressionTest) skipped
01:53:52 nestedPackageSchemaMissing_bug436666(org.eclipse.papyrus.uml.modelrepair.internal.stereotypes.StereotypeRepairRegressionTest) skipped
01:53:52 incorrectZombieGroupingWithoutProfileNamespaceURIPattern_bug496307(org.eclipse.papyrus.uml.modelrepair.internal.stereotypes.StereotypeRepairRegressionTest) skipped
01:53:52 nonStereotypeApplicationsAreOK_bug436666(org.eclipse.papyrus.uml.modelrepair.internal.stereotypes.StereotypeRepairRegressionTest) skipped
01:53:52 nestedProfileApplications2Pkgs1Profile_bug434302(org.eclipse.papyrus.uml.modelrepair.internal.stereotypes.StereotypeRepairRegressionTest) skipped
01:53:52 crossReferencedPackageUnitWithoutOwnProfileApplication_bug458736(org.eclipse.papyrus.uml.modelrepair.internal.stereotypes.StereotypeRepairRegressionTest) skipped
01:53:52 correctZombieGroupingWithProfileNamespaceURIPattern_bug496307(org.eclipse.papyrus.uml.modelrepair.internal.stereotypes.StereotypeRepairRegressionTest) skipped
01:53:52 orphansOfValidSchema_bug436666(org.eclipse.papyrus.uml.modelrepair.internal.stereotypes.StereotypeRepairRegressionTest) skipped
01:53:52 packageUnitWithoutOwnProfileApplication_bug455248(org.eclipse.papyrus.uml.modelrepair.internal.stereotypes.StereotypeRepairRegressionTest) skipped
01:53:52 nestedPackageInProfileIsOK_bug436666(org.eclipse.papyrus.uml.modelrepair.internal.stereotypes.StereotypeRepairRegressionTest) skipped
01:53:52 org.eclipse.papyrus.uml.modelrepair.internal.stereotypes.StereotypeRepairRegressionTest skipped
01:53:52 compareMultiVersionSameURISameVersion(org.eclipse.papyrus.uml.modelrepair.internal.uripattern.ProfileNamespaceURIPatternTest) skipped
01:53:52 compareMultiVersionDifferentURIDifferentVersion(org.eclipse.papyrus.uml.modelrepair.internal.uripattern.ProfileNamespaceURIPatternTest) skipped
01:53:52 compareSingleVersionDifferentURISameVersion(org.eclipse.papyrus.uml.modelrepair.internal.uripattern.ProfileNamespaceURIPatternTest) skipped
01:53:52 compareMultiVersionDifferentURISameVersion(org.eclipse.papyrus.uml.modelrepair.internal.uripattern.ProfileNamespaceURIPatternTest) skipped
01:53:52 compareCorrectInvalidComparisonConstantBehavior(org.eclipse.papyrus.uml.modelrepair.internal.uripattern.ProfileNamespaceURIPatternTest) skipped
01:53:52 compareNoVersionSameURI(org.eclipse.papyrus.uml.modelrepair.internal.uripattern.ProfileNamespaceURIPatternTest) skipped
01:53:52 compareSingleVersionDifferentURIDifferentVersion(org.eclipse.papyrus.uml.modelrepair.internal.uripattern.ProfileNamespaceURIPatternTest) skipped
01:53:52 matchCorrectNoMatchConstantBehavior(org.eclipse.papyrus.uml.modelrepair.internal.uripattern.ProfileNamespaceURIPatternTest) skipped
01:53:52 matchSingleVersionCorrectURIGivenVersion(org.eclipse.papyrus.uml.modelrepair.internal.uripattern.ProfileNamespaceURIPatternTest) skipped
01:53:52 matchNoVersionCorrectURIDefaultVersion(org.eclipse.papyrus.uml.modelrepair.internal.uripattern.ProfileNamespaceURIPatternTest) skipped
01:53:52 matchMultipleVersionCorrectURIGivenVersion(org.eclipse.papyrus.uml.modelrepair.internal.uripattern.ProfileNamespaceURIPatternTest) skipped
01:53:52 matchMultipleVersionCorrectURIDefaultVersion(org.eclipse.papyrus.uml.modelrepair.internal.uripattern.ProfileNamespaceURIPatternTest) skipped
01:53:52 compareCorrectInvalidComparisonBehaviorWrongLHS(org.eclipse.papyrus.uml.modelrepair.internal.uripattern.ProfileNamespaceURIPatternTest) skipped
01:53:52 compareCorrectInvalidComparisonBehaviorWrongRHS(org.eclipse.papyrus.uml.modelrepair.internal.uripattern.ProfileNamespaceURIPatternTest) skipped
01:53:52 registryExtensionPointCorrectMatch(org.eclipse.papyrus.uml.modelrepair.internal.uripattern.ProfileNamespaceURIPatternTest) skipped
01:53:52 compareSingleVersionSameURIDifferentVersion(org.eclipse.papyrus.uml.modelrepair.internal.uripattern.ProfileNamespaceURIPatternTest) skipped
01:53:52 compareSingleVersionSameURISameVersion(org.eclipse.papyrus.uml.modelrepair.internal.uripattern.ProfileNamespaceURIPatternTest) skipped
01:53:52 compareMultiVersionSameURIDifferentVersion(org.eclipse.papyrus.uml.modelrepair.internal.uripattern.ProfileNamespaceURIPatternTest) skipped
01:53:52 registryCorrectUnregisterAndRegister(org.eclipse.papyrus.uml.modelrepair.internal.uripattern.ProfileNamespaceURIPatternTest) skipped
01:53:52 registryExtensionPointRegistered(org.eclipse.papyrus.uml.modelrepair.internal.uripattern.ProfileNamespaceURIPatternTest) skipped
01:53:52 compareCorrectInvalidComparisonBehaviorWrongPattern(org.eclipse.papyrus.uml.modelrepair.internal.uripattern.ProfileNamespaceURIPatternTest) skipped
01:53:52 matchNoVersionCorrectURIGivenVersion(org.eclipse.papyrus.uml.modelrepair.internal.uripattern.ProfileNamespaceURIPatternTest) skipped
01:53:52 compareNoVersionDifferentURI(org.eclipse.papyrus.uml.modelrepair.internal.uripattern.ProfileNamespaceURIPatternTest) skipped
01:53:52 matchSingleVersionCorrectURIDefaultVersion(org.eclipse.papyrus.uml.modelrepair.internal.uripattern.ProfileNamespaceURIPatternTest) skipped
01:53:52 matchCorrectNoMatchBehavior(org.eclipse.papyrus.uml.modelrepair.internal.uripattern.ProfileNamespaceURIPatternTest) skipped
01:53:52 org.eclipse.papyrus.uml.modelrepair.internal.uripattern.ProfileNamespaceURIPatternTest skipped
01:53:52 org.eclipse.papyrus.uml.modelrepair.tests.AllTests skipped
01:53:52 outOfDateModelSkipMigration_papyrus(org.eclipse.papyrus.uml.profile.service.ReapplyProfilesServiceTest) skipped
01:53:52 upToDateModelDoesNotPromptForMigration_papyrus(org.eclipse.papyrus.uml.profile.service.ReapplyProfilesServiceTest) skipped
01:53:52 outOfDateModelDoMigration_dynamic(org.eclipse.papyrus.uml.profile.service.ReapplyProfilesServiceTest) skipped
01:53:52 outOfDateModelSkipMigration_uml2(org.eclipse.papyrus.uml.profile.service.ReapplyProfilesServiceTest) skipped
01:53:52 outOfDateModelDoMigration_papyrus(org.eclipse.papyrus.uml.profile.service.ReapplyProfilesServiceTest) skipped
01:53:52 outOfDateModelSkipMigration_dynamic(org.eclipse.papyrus.uml.profile.service.ReapplyProfilesServiceTest) skipped
01:53:52 outOfDateModelDoMigration_uml2(org.eclipse.papyrus.uml.profile.service.ReapplyProfilesServiceTest) skipped
01:53:52 upToDateModelDoesNotPromptForMigration_uml2(org.eclipse.papyrus.uml.profile.service.ReapplyProfilesServiceTest) skipped
01:53:52 upToDateModelDoesNotPromptForMigration_dynamic(org.eclipse.papyrus.uml.profile.service.ReapplyProfilesServiceTest) skipped
01:53:52 org.eclipse.papyrus.uml.profile.service.ReapplyProfilesServiceTest skipped
01:53:52 org.eclipse.papyrus.uml.profile.tests.AllTests skipped
01:53:52 loadDecoratorAsMainModel(org.eclipse.papyrus.uml.decoratormodel.tests.ExternalizeProfileApplicationTest) skipped
01:53:52 externalizeApplication(org.eclipse.papyrus.uml.decoratormodel.tests.ExternalizeProfileApplicationTest) skipped
01:53:52 unloadApplication(org.eclipse.papyrus.uml.decoratormodel.tests.ExternalizeProfileApplicationTest) skipped
01:53:52 externalizeApplication_undo(org.eclipse.papyrus.uml.decoratormodel.tests.ExternalizeProfileApplicationTest) skipped
01:53:52 unloadedApplicationNotAvailable(org.eclipse.papyrus.uml.decoratormodel.tests.ExternalizeProfileApplicationTest) skipped
01:53:52 loadApplication(org.eclipse.papyrus.uml.decoratormodel.tests.ExternalizeProfileApplicationTest) skipped
01:53:52 externalizeApplication_undo_redo(org.eclipse.papyrus.uml.decoratormodel.tests.ExternalizeProfileApplicationTest) skipped
01:53:52 nestedPackageApplicationOfSameProfile_bug459613(org.eclipse.papyrus.uml.decoratormodel.tests.ExternalizeProfileApplicationTest) skipped
01:53:52 externalizeApplication_forNestedPackage(org.eclipse.papyrus.uml.decoratormodel.tests.ExternalizeProfileApplicationTest) skipped
01:53:52 internalizeApplication_undo(org.eclipse.papyrus.uml.decoratormodel.tests.InternalizeProfileApplicationTest) skipped
01:53:52 internalizeApplication_undo_redo(org.eclipse.papyrus.uml.decoratormodel.tests.InternalizeProfileApplicationTest) skipped
01:53:52 internalizeApplication(org.eclipse.papyrus.uml.decoratormodel.tests.InternalizeProfileApplicationTest) skipped
01:53:52 migrateProfile(org.eclipse.papyrus.uml.decoratormodel.tests.ProfileMigrationTest) skipped
01:53:52 missingSchema(org.eclipse.papyrus.uml.decoratormodel.tests.StereotypeApplicationRepairTest) skipped
01:53:52 wrongProfileVersion(org.eclipse.papyrus.uml.decoratormodel.tests.StereotypeApplicationRepairTest) skipped
01:53:52 missingProfileApplication(org.eclipse.papyrus.uml.decoratormodel.tests.StereotypeApplicationRepairTest) skipped
01:53:52 decoratorModelsForPackageAsync(org.eclipse.papyrus.uml.decoratormodel.internal.resource.tests.DecoratorModelIndexTest) skipped
01:53:52 decoratorModelsForPackage_none(org.eclipse.papyrus.uml.decoratormodel.internal.resource.tests.DecoratorModelIndexTest) skipped
01:53:52 removeResource(org.eclipse.papyrus.uml.decoratormodel.internal.resource.tests.DecoratorModelIndexTest) skipped
01:53:52 decoratorModelsAsync_uri(org.eclipse.papyrus.uml.decoratormodel.internal.resource.tests.DecoratorModelIndexTest) skipped
01:53:52 decoratorModelName(org.eclipse.papyrus.uml.decoratormodel.internal.resource.tests.DecoratorModelIndexTest) skipped
01:53:52 baseline(org.eclipse.papyrus.uml.decoratormodel.internal.resource.tests.DecoratorModelIndexTest) skipped
01:53:52 decoratorModelsForPackage(org.eclipse.papyrus.uml.decoratormodel.internal.resource.tests.DecoratorModelIndexTest) skipped
01:53:52 decoratorModelNameAsync(org.eclipse.papyrus.uml.decoratormodel.internal.resource.tests.DecoratorModelIndexTest) skipped
01:53:52 appliedProfilesByResourceIndex(org.eclipse.papyrus.uml.decoratormodel.internal.resource.tests.DecoratorModelIndexTest) skipped
01:53:52 decoratorModels(org.eclipse.papyrus.uml.decoratormodel.internal.resource.tests.DecoratorModelIndexTest) skipped
01:53:52 decoratorModelsAsync(org.eclipse.papyrus.uml.decoratormodel.internal.resource.tests.DecoratorModelIndexTest) skipped
01:53:52 allAppliedProfiles(org.eclipse.papyrus.uml.decoratormodel.internal.resource.tests.DecoratorModelIndexTest) skipped
01:53:52 decoratorModelNames(org.eclipse.papyrus.uml.decoratormodel.internal.resource.tests.DecoratorModelIndexTest) skipped
01:53:52 decoratorModels_uri(org.eclipse.papyrus.uml.decoratormodel.internal.resource.tests.DecoratorModelIndexTest) skipped
01:53:52 decoratorModelNamesAsync(org.eclipse.papyrus.uml.decoratormodel.internal.resource.tests.DecoratorModelIndexTest) skipped
01:53:52 listener(org.eclipse.papyrus.uml.decoratormodel.internal.resource.tests.DecoratorModelIndexTest) skipped
01:53:52 allAppliedProfilesAsync(org.eclipse.papyrus.uml.decoratormodel.internal.resource.tests.DecoratorModelIndexTest) skipped
01:53:52 addNewResource(org.eclipse.papyrus.uml.decoratormodel.internal.resource.tests.DecoratorModelIndexTest) skipped
01:53:52 decoratorModelsForPackageAsync_none(org.eclipse.papyrus.uml.decoratormodel.internal.resource.tests.DecoratorModelIndexTest) skipped
01:53:52 copy_subsetOfProfiles(org.eclipse.papyrus.uml.decoratormodel.internal.resource.tests.DecoratorModelCopierTest) skipped
01:53:52 copy_allProfiles(org.eclipse.papyrus.uml.decoratormodel.internal.resource.tests.DecoratorModelCopierTest) skipped
01:53:52 testHasUnloadedDecoratorModelsAsync_recursive(org.eclipse.papyrus.uml.decoratormodel.helper.tests.DecoratorModelUtilsTest) skipped
01:53:52 testIsDecoratorModelFor(org.eclipse.papyrus.uml.decoratormodel.helper.tests.DecoratorModelUtilsTest) skipped
01:53:52 testIsDecoratorModelURI(org.eclipse.papyrus.uml.decoratormodel.helper.tests.DecoratorModelUtilsTest) skipped
01:53:52 testInternalizeProfileApplications(org.eclipse.papyrus.uml.decoratormodel.helper.tests.DecoratorModelUtilsTest) skipped
01:53:52 testHasUnloadedDecoratorModelsAsync(org.eclipse.papyrus.uml.decoratormodel.helper.tests.DecoratorModelUtilsTest) skipped
01:53:52 testExternalizeProfileApplication(org.eclipse.papyrus.uml.decoratormodel.helper.tests.DecoratorModelUtilsTest) skipped
01:53:52 testGetDecoratorPackages(org.eclipse.papyrus.uml.decoratormodel.helper.tests.DecoratorModelUtilsTest) skipped
01:53:52 testGetDecoratorModelAppliedProfiles(org.eclipse.papyrus.uml.decoratormodel.helper.tests.DecoratorModelUtilsTest) skipped
01:53:52 testGetUnloadedDecoratorModelsAsyncResource(org.eclipse.papyrus.uml.decoratormodel.helper.tests.DecoratorModelUtilsTest) skipped
01:53:52 testGetExternalizationProfile(org.eclipse.papyrus.uml.decoratormodel.helper.tests.DecoratorModelUtilsTest) skipped
01:53:52 testIsDecoratorModelResource(org.eclipse.papyrus.uml.decoratormodel.helper.tests.DecoratorModelUtilsTest) skipped
01:53:52 testGetDecoratorModelProfileApplications(org.eclipse.papyrus.uml.decoratormodel.helper.tests.DecoratorModelUtilsTest) skipped
01:53:52 testGetUnloadedDecoratorModelsAsyncPackage(org.eclipse.papyrus.uml.decoratormodel.helper.tests.DecoratorModelUtilsTest) skipped
01:53:52 testGetLoadedDecoratorModels(org.eclipse.papyrus.uml.decoratormodel.helper.tests.DecoratorModelUtilsTest) skipped
01:53:52 testGetLoadedSubUnitPackages(org.eclipse.papyrus.uml.decoratormodel.helper.tests.DecoratorModelUtilsTest) skipped
01:53:52 testGetUnloadedDecoratorModels(org.eclipse.papyrus.uml.decoratormodel.helper.tests.DecoratorModelUtilsTest) skipped
01:53:52 testHasExternalizationProfile(org.eclipse.papyrus.uml.decoratormodel.helper.tests.DecoratorModelUtilsTest) skipped
01:53:52 testGetUnloadedDecoratorModelsAsyncIterableOfResource(org.eclipse.papyrus.uml.decoratormodel.helper.tests.DecoratorModelUtilsTest) skipped
01:53:52 testGetUserModelResources(org.eclipse.papyrus.uml.decoratormodel.helper.tests.DecoratorModelUtilsTest) skipped
01:53:52 testGetDecoratorProfileApplications(org.eclipse.papyrus.uml.decoratormodel.helper.tests.DecoratorModelUtilsTest) skipped
01:53:52 stereotypeApplication_inNestedPackage(org.eclipse.papyrus.uml.decoratormodel.helper.tests.PapyrusStereotypeApplicationHelperTest) skipped
01:53:52 stereotypeApplication_inNonPackageSubmodelUnit_bug459613(org.eclipse.papyrus.uml.decoratormodel.helper.tests.PapyrusStereotypeApplicationHelperTest) skipped
01:53:52 applyStereotype_resourceSet(org.eclipse.papyrus.uml.decoratormodel.helper.tests.PapyrusStereotypeApplicationHelperTest) skipped
01:53:52 applyStereotype_freeFloating(org.eclipse.papyrus.uml.decoratormodel.helper.tests.PapyrusStereotypeApplicationHelperTest) skipped
01:53:52 isDecoratorModel_decoratorModelUML(org.eclipse.papyrus.uml.decoratormodel.internal.expressions.tests.FilePropertyTesterTest) skipped
01:53:52 isDecoratorModel_decoratorModelNotation(org.eclipse.papyrus.uml.decoratormodel.internal.expressions.tests.FilePropertyTesterTest) skipped
01:53:52 isDecoratorModel_userModelUML(org.eclipse.papyrus.uml.decoratormodel.internal.expressions.tests.FilePropertyTesterTest) skipped
01:53:52 decoratorIndexing(org.eclipse.papyrus.uml.decoratormodel.internal.resource.index.tests.ProfileIndexTest)  Time elapsed: 0.402 sec
01:53:52 userModelIndexing(org.eclipse.papyrus.uml.decoratormodel.internal.resource.index.tests.ProfileIndexTest)  Time elapsed: 0 sec
01:53:52 decoratorAsUserModelIndexing(org.eclipse.papyrus.uml.decoratormodel.internal.resource.index.tests.ProfileIndexTest)  Time elapsed: 0 sec
01:53:52 migrateProfileExtendingDynamic_bug481302(org.eclipse.papyrus.uml.decoratormodel.tests.RegressionTest) skipped
01:53:52 basicUMLMigrateProfileExtendingStatic_bug481302(org.eclipse.papyrus.uml.decoratormodel.tests.RegressionTest)  Time elapsed: 0.399 sec  <<< FAILURE!
01:53:52 java.lang.AssertionError: 
01:53:52 Expected: is "R1"
01:53:52      but: was null
01:53:52 	at org.hamcrest.MatcherAssert.assertThat(MatcherAssert.java:20)
01:53:52 	at org.hamcrest.MatcherAssert.assertThat(MatcherAssert.java:8)
01:53:52 	at org.eclipse.papyrus.uml.decoratormodel.tests.RegressionTest.doTestMigrateProfileExtendingOther_bug481302(RegressionTest.java:59)
01:53:52 	at org.eclipse.papyrus.uml.decoratormodel.tests.RegressionTest.basicUMLMigrateProfileExtendingStatic_bug481302(RegressionTest.java:75)
01:53:52 
01:53:52 migrateProfileExtendingStatic_bug481302(org.eclipse.papyrus.uml.decoratormodel.tests.RegressionTest) skipped
01:53:52 control_undo_redo_allDecoratorsLoaded(org.eclipse.papyrus.uml.decoratormodel.controlmode.tests.ControlModeWithDecoratorModelsTest) skipped
01:53:52 uncontrol_undo_redo_allDecoratorsUnloaded(org.eclipse.papyrus.uml.decoratormodel.controlmode.tests.ControlModeWithDecoratorModelsTest) skipped
01:53:52 control_someDecoratorsLoaded(org.eclipse.papyrus.uml.decoratormodel.controlmode.tests.ControlModeWithDecoratorModelsTest) skipped
01:53:52 uncontrol_someDecoratorsLoaded(org.eclipse.papyrus.uml.decoratormodel.controlmode.tests.ControlModeWithDecoratorModelsTest) skipped
01:53:52 uncontrol_allDecoratorsUnloaded(org.eclipse.papyrus.uml.decoratormodel.controlmode.tests.ControlModeWithDecoratorModelsTest) skipped
01:53:52 control_undo_redo_someDecoratorsLoaded(org.eclipse.papyrus.uml.decoratormodel.controlmode.tests.ControlModeWithDecoratorModelsTest) skipped
01:53:52 control_allDecoratorsLoaded(org.eclipse.papyrus.uml.decoratormodel.controlmode.tests.ControlModeWithDecoratorModelsTest) skipped
01:53:52 control_undo_redo_allDecoratorsUnloaded(org.eclipse.papyrus.uml.decoratormodel.controlmode.tests.ControlModeWithDecoratorModelsTest) skipped
01:53:52 control_allDecoratorsUnloaded(org.eclipse.papyrus.uml.decoratormodel.controlmode.tests.ControlModeWithDecoratorModelsTest) skipped
01:53:52 uncontrol_undo_redo_someDecoratorsLoaded(org.eclipse.papyrus.uml.decoratormodel.controlmode.tests.ControlModeWithDecoratorModelsTest) skipped
01:53:52 uncontrol_undo_redo_allDecoratorsLoaded(org.eclipse.papyrus.uml.decoratormodel.controlmode.tests.ControlModeWithDecoratorModelsTest) skipped
01:53:52 uncontrol_allDecoratorsLoaded(org.eclipse.papyrus.uml.decoratormodel.controlmode.tests.ControlModeWithDecoratorModelsTest) skipped
01:53:52 org.eclipse.papyrus.uml.decoratormodel.controlmode.tests.ControlModeWithDecoratorModelsTest skipped
01:53:52 nonBaseElementStereotypeCrossReferences(org.eclipse.papyrus.uml.decoratormodel.controlmode.tests.AdditionalModelStructuresTest) skipped
01:53:52 classUnitExternalizeParentUnitProfileApplication_bug459613(org.eclipse.papyrus.uml.decoratormodel.controlmode.tests.AdditionalModelStructuresTest) skipped
01:53:52 nestedPackagesInheritingExternalProfileApplications(org.eclipse.papyrus.uml.decoratormodel.controlmode.tests.AdditionalModelStructuresTest) skipped
01:53:52 org.eclipse.papyrus.uml.decoratormodel.controlmode.tests.AdditionalModelStructuresTest skipped
01:53:52 org.eclipse.papyrus.uml.decoratormodel.controlmode.tests.AllTests skipped
01:53:52 validateOCLOnInstanceSpec(org.eclipse.papyrus.uml.validation.tests.rules.TestOCLConstraintOnInstanceSpec) skipped
01:53:52 validateCamelCaseRule(org.eclipse.papyrus.uml.validation.tests.rules.TestOCLValidationRuleFromFile) skipped
01:53:52 validateIsActiveOCLRule_inactiveClass(org.eclipse.papyrus.uml.validation.tests.rules.TestValidationRulesInPluginXML) skipped
01:53:52 validateIsPassiveJavaRule_inactiveClass(org.eclipse.papyrus.uml.validation.tests.rules.TestValidationRulesInPluginXML) skipped
01:53:52 validateIsPassiveJavaRule_activeClass(org.eclipse.papyrus.uml.validation.tests.rules.TestValidationRulesInPluginXML) skipped
01:53:52 validateMalformedActiveRule_notActiveCapsule(org.eclipse.papyrus.uml.validation.tests.rules.TestValidationRulesInProfile) skipped
01:53:52 validateIsActiveRule_notActiveCapsule(org.eclipse.papyrus.uml.validation.tests.rules.TestValidationRulesInProfile) skipped
01:53:52 validateIsActiveRule_ActiveCapsule(org.eclipse.papyrus.uml.validation.tests.rules.TestValidationRulesInProfile) skipped
01:53:52 validateNameClashDetection(org.eclipse.papyrus.uml.validation.tests.rules.TestUMLValidationRules) skipped
01:53:52 validateNonStandardMultiplicity(org.eclipse.papyrus.uml.validation.tests.rules.TestUMLValidationRules) skipped
01:53:52 validateUnsetStereotypeAttribute(org.eclipse.papyrus.uml.validation.tests.rules.TestStereotypeValidation) skipped
01:53:52 testResolveProfile__Object(org.eclipse.papyrus.uml.filters.tests.ProfileAppliedTest) skipped
01:53:52 testMatches__Object(org.eclipse.papyrus.uml.filters.tests.ProfileAppliedTest) skipped
01:53:52 org.eclipse.papyrus.uml.filters.tests.ProfileAppliedTest skipped
01:53:52 filters Tests skipped
01:53:52 UMLFilters Tests skipped
01:53:52 profileAppliedFilterResourceURI_bug480221(org.eclipse.papyrus.uml.filters.tests.ProfileAppliedRegressionTest) skipped
01:53:52 profileAppliedFilterDoesNotLoadProfiles_miss_bug480221(org.eclipse.papyrus.uml.filters.tests.ProfileAppliedRegressionTest) skipped
01:53:52 profileAppliedFilterDoesNotLoadProfiles_hit_bug480221(org.eclipse.papyrus.uml.filters.tests.ProfileAppliedRegressionTest) skipped
01:53:52 org.eclipse.papyrus.uml.filters.tests.ProfileAppliedRegressionTest skipped
01:53:52 org.eclipse.papyrus.uml.filters.tests.AllTests skipped
01:53:52 popupsGenerated(org.eclipse.papyrus.uml.profile.assistants.generator.tests.BasicAssistantsGenerationTest) skipped
01:53:52 connectionTargetFilters(org.eclipse.papyrus.uml.profile.assistants.generator.tests.BasicAssistantsGenerationTest) skipped
01:53:52 popupFilters(org.eclipse.papyrus.uml.profile.assistants.generator.tests.BasicAssistantsGenerationTest) skipped
01:53:52 connectionSourceFilters(org.eclipse.papyrus.uml.profile.assistants.generator.tests.BasicAssistantsGenerationTest) skipped
01:53:52 connectionsGenerated(org.eclipse.papyrus.uml.profile.assistants.generator.tests.BasicAssistantsGenerationTest) skipped
01:53:52 org.eclipse.papyrus.uml.profile.assistants.generator.tests.BasicAssistantsGenerationTest skipped
01:53:52 popupsGenerated(org.eclipse.papyrus.uml.profile.assistants.generator.tests.DiagramSpecificAssistantsGenerationTest) skipped
01:53:52 connectionTargetFilters(org.eclipse.papyrus.uml.profile.assistants.generator.tests.DiagramSpecificAssistantsGenerationTest) skipped
01:53:52 distinctConnectionHintsGenerated(org.eclipse.papyrus.uml.profile.assistants.generator.tests.DiagramSpecificAssistantsGenerationTest) skipped
01:53:52 popupFilters(org.eclipse.papyrus.uml.profile.assistants.generator.tests.DiagramSpecificAssistantsGenerationTest) skipped
01:53:52 connectionSourceFilters(org.eclipse.papyrus.uml.profile.assistants.generator.tests.DiagramSpecificAssistantsGenerationTest) skipped
01:53:52 distinctPopupHintsGenerated(org.eclipse.papyrus.uml.profile.assistants.generator.tests.DiagramSpecificAssistantsGenerationTest) skipped
01:53:52 connectionsGenerated(org.eclipse.papyrus.uml.profile.assistants.generator.tests.DiagramSpecificAssistantsGenerationTest) skipped
01:53:52 org.eclipse.papyrus.uml.profile.assistants.generator.tests.DiagramSpecificAssistantsGenerationTest skipped
01:53:52 popupsGenerated(org.eclipse.papyrus.uml.profile.assistants.generator.tests.ProfilesWithPackageNestingTest) skipped
01:53:52 connectionTargetFilters(org.eclipse.papyrus.uml.profile.assistants.generator.tests.ProfilesWithPackageNestingTest) skipped
01:53:52 popupFilters(org.eclipse.papyrus.uml.profile.assistants.generator.tests.ProfilesWithPackageNestingTest) skipped
01:53:52 connectionSourceFilters(org.eclipse.papyrus.uml.profile.assistants.generator.tests.ProfilesWithPackageNestingTest) skipped
01:53:52 connectionsGenerated(org.eclipse.papyrus.uml.profile.assistants.generator.tests.ProfilesWithPackageNestingTest) skipped
01:53:52 org.eclipse.papyrus.uml.profile.assistants.generator.tests.ProfilesWithPackageNestingTest skipped
01:53:52 connectionsGenerated[<<Indirect>> Generalization](org.eclipse.papyrus.uml.profile.assistants.generator.tests.ConnectionTypesTest) skipped
01:53:52 [<<Indirect>> Generalization] skipped
01:53:52 connectionsGenerated[<<Indirect>> GeneralizationSet](org.eclipse.papyrus.uml.profile.assistants.generator.tests.ConnectionTypesTest) skipped
01:53:52 [<<Indirect>> GeneralizationSet] skipped
01:53:52 connectionsGenerated[<<Virtual>> ControlFlow](org.eclipse.papyrus.uml.profile.assistants.generator.tests.ConnectionTypesTest) skipped
01:53:52 [<<Virtual>> ControlFlow] skipped
01:53:52 connectionsGenerated[<<Virtual>> ObjectFlow](org.eclipse.papyrus.uml.profile.assistants.generator.tests.ConnectionTypesTest) skipped
01:53:52 [<<Virtual>> ObjectFlow] skipped
01:53:52 connectionsGenerated[<<Virtual>> Transition](org.eclipse.papyrus.uml.profile.assistants.generator.tests.ConnectionTypesTest) skipped
01:53:52 [<<Virtual>> Transition] skipped
01:53:52 connectionsGenerated[<<Virtual>> Message](org.eclipse.papyrus.uml.profile.assistants.generator.tests.ConnectionTypesTest) skipped
01:53:52 [<<Virtual>> Message] skipped
01:53:52 connectionsGenerated[<<Indirect>> Connector](org.eclipse.papyrus.uml.profile.assistants.generator.tests.ConnectionTypesTest) skipped
01:53:52 [<<Indirect>> Connector] skipped
01:53:52 org.eclipse.papyrus.uml.profile.assistants.generator.tests.ConnectionTypesTest skipped
01:53:52 org.eclipse.papyrus.uml.profile.assistants.generator.tests.AllTests skipped
01:53:52 iconGenerated(org.eclipse.papyrus.uml.profile.types.generator.tests.BasicElementTypesGenerationTest) skipped
01:53:52 elementTypeSpecializedTypes_bug461717(org.eclipse.papyrus.uml.profile.types.generator.tests.BasicElementTypesGenerationTest) skipped
01:53:52 multipleElementTypesForOneStereotypeGenerated(org.eclipse.papyrus.uml.profile.types.generator.tests.BasicElementTypesGenerationTest) skipped
01:53:52 stereotypeAdviceGenerated(org.eclipse.papyrus.uml.profile.types.generator.tests.BasicElementTypesGenerationTest) skipped
01:53:52 elementTypesGenerated(org.eclipse.papyrus.uml.profile.types.generator.tests.BasicElementTypesGenerationTest) skipped
01:53:52 stereotypeMatcherGenerated(org.eclipse.papyrus.uml.profile.types.generator.tests.BasicElementTypesGenerationTest) skipped
01:53:52 org.eclipse.papyrus.uml.profile.types.generator.tests.BasicElementTypesGenerationTest skipped
01:53:52 stereotypeAdviceNotGenerated(org.eclipse.papyrus.uml.profile.types.generator.tests.DiagramSpecificElementTypesGenerationTest) skipped
01:53:52 distinctHintsGenerated(org.eclipse.papyrus.uml.profile.types.generator.tests.DiagramSpecificElementTypesGenerationTest) skipped
01:53:52 stereotypeMatcherNotGenerated(org.eclipse.papyrus.uml.profile.types.generator.tests.DiagramSpecificElementTypesGenerationTest) skipped
01:53:52 iconGenerated(org.eclipse.papyrus.uml.profile.types.generator.tests.DiagramSpecificElementTypesGenerationTest) skipped
01:53:52 elementTypeSpecializedTypes_bug461717(org.eclipse.papyrus.uml.profile.types.generator.tests.DiagramSpecificElementTypesGenerationTest) skipped
01:53:52 elementTypesGenerated(org.eclipse.papyrus.uml.profile.types.generator.tests.DiagramSpecificElementTypesGenerationTest) skipped
01:53:52 org.eclipse.papyrus.uml.profile.types.generator.tests.DiagramSpecificElementTypesGenerationTest skipped
01:53:52 iconGenerated(org.eclipse.papyrus.uml.profile.types.generator.tests.ProfilesWithPackageNestingTest) skipped
01:53:52 stereotypeAdviceGenerated(org.eclipse.papyrus.uml.profile.types.generator.tests.ProfilesWithPackageNestingTest) skipped
01:53:52 elementTypesGenerated(org.eclipse.papyrus.uml.profile.types.generator.tests.ProfilesWithPackageNestingTest) skipped
01:53:52 stereotypeMatcherGenerated(org.eclipse.papyrus.uml.profile.types.generator.tests.ProfilesWithPackageNestingTest) skipped
01:53:52 org.eclipse.papyrus.uml.profile.types.generator.tests.ProfilesWithPackageNestingTest skipped
01:53:52 elementTypeSpecializedTypes(org.eclipse.papyrus.uml.profile.types.generator.tests.DiagramSpecificElementTypesGenerationBug461717Test) skipped
01:53:52 stereotypeAdviceGenerated(org.eclipse.papyrus.uml.profile.types.generator.tests.DiagramSpecificElementTypesGenerationBug461717Test) skipped
01:53:52 stereotypeMatcherGenerated(org.eclipse.papyrus.uml.profile.types.generator.tests.DiagramSpecificElementTypesGenerationBug461717Test) skipped
01:53:52 org.eclipse.papyrus.uml.profile.types.generator.tests.DiagramSpecificElementTypesGenerationBug461717Test skipped
01:53:52 org.eclipse.papyrus.uml.profile.types.generator.tests.AllTests skipped
01:53:52 testGetStereotypeNames(org.eclipse.papyrus.uml.profile.drafter.tests.ProfileCatalogTest) skipped
01:53:52 testGetStereotypes(org.eclipse.papyrus.uml.profile.drafter.tests.ProfileCatalogTest) skipped
01:53:52 testGetAllStereotypeNames(org.eclipse.papyrus.uml.profile.drafter.tests.ProfileCatalogTest) skipped
01:53:52 testGetProfileNames(org.eclipse.papyrus.uml.profile.drafter.tests.ProfileCatalogTest) skipped
01:53:52 testProfileCatalog(org.eclipse.papyrus.uml.profile.drafter.tests.ProfileCatalogTest) skipped
01:53:52 testLookupStereotype(org.eclipse.papyrus.uml.profile.drafter.tests.ProfileCatalogTest) skipped
01:53:52 testLookupStereotypeInAppliedProfile(org.eclipse.papyrus.uml.profile.drafter.tests.ProfileCatalogTest) skipped
01:53:52 testProfileCopy(org.eclipse.papyrus.uml.profile.drafter.tests.ProfileCatalogTest) skipped
01:53:52 testGetProfiles(org.eclipse.papyrus.uml.profile.drafter.tests.ProfileCatalogTest) skipped
01:53:52 testGetNamedElement(org.eclipse.papyrus.uml.profile.drafter.tests.ProfileCatalogTest) skipped
01:53:52 testIsModelsExist(org.eclipse.papyrus.uml.profile.drafter.tests.ProfileCatalogTest) skipped
01:53:52 testGetStereotypeQualifiedNames(org.eclipse.papyrus.uml.profile.drafter.tests.ProfileCatalogTest) skipped
01:53:52 testGetProfileQualifiedNames(org.eclipse.papyrus.uml.profile.drafter.tests.ProfileCatalogTest) skipped
01:53:52 org.eclipse.papyrus.uml.profile.drafter.tests.ProfileCatalogTest skipped
01:53:52 testCopyResources(org.eclipse.papyrus.uml.profile.drafter.tests.EclipseProjectTest) skipped
01:53:52 testCopyResource(org.eclipse.papyrus.uml.profile.drafter.tests.EclipseProjectTest) skipped
01:53:52 testGetProject(org.eclipse.papyrus.uml.profile.drafter.tests.EclipseProjectTest) skipped
01:53:52 testEclipseProject(org.eclipse.papyrus.uml.profile.drafter.tests.EclipseProjectTest) skipped
01:53:52 org.eclipse.papyrus.uml.profile.drafter.tests.EclipseProjectTest skipped
01:53:52 testGetUmlModelWithIFile(org.eclipse.papyrus.uml.profile.drafter.tests.ModelSetManagerTest) skipped
01:53:52 testModelSetManagerString(org.eclipse.papyrus.uml.profile.drafter.tests.ModelSetManagerTest) skipped
01:53:52 testModelSetManagerURI(org.eclipse.papyrus.uml.profile.drafter.tests.ModelSetManagerTest) skipped
01:53:52 testGetNamedElementByNameString(org.eclipse.papyrus.uml.profile.drafter.tests.ModelSetManagerTest) skipped
01:53:52 testGetUmlModel(org.eclipse.papyrus.uml.profile.drafter.tests.ModelSetManagerTest) skipped
01:53:52 testModelSetManagerStringModels(org.eclipse.papyrus.uml.profile.drafter.tests.ModelSetManagerTest) skipped
01:53:52 testGetNamedElementByNameWithSterotype(org.eclipse.papyrus.uml.profile.drafter.tests.ModelSetManagerTest) skipped
01:53:52 org.eclipse.papyrus.uml.profile.drafter.tests.ModelSetManagerTest skipped
01:53:52 testCreation(org.eclipse.papyrus.uml.profile.drafter.tests.utils.UMLModelCreatorTest) skipped
01:53:52 testCreateClass(org.eclipse.papyrus.uml.profile.drafter.tests.utils.UMLModelCreatorTest) skipped
01:53:52 testCreateModel(org.eclipse.papyrus.uml.profile.drafter.tests.utils.UMLModelCreatorTest) skipped
01:53:52 testCreatePackage(org.eclipse.papyrus.uml.profile.drafter.tests.utils.UMLModelCreatorTest) skipped
01:53:52 testCd(org.eclipse.papyrus.uml.profile.drafter.tests.utils.UMLModelCreatorTest) skipped
01:53:52 testUMLModelCreatorResourceFailing(org.eclipse.papyrus.uml.profile.drafter.tests.utils.UMLModelCreatorTest) skipped
01:53:52 testUMLModelCreatorStringString(org.eclipse.papyrus.uml.profile.drafter.tests.utils.UMLModelCreatorTest) skipped
01:53:52 testUMLModelCreatorResource(org.eclipse.papyrus.uml.profile.drafter.tests.utils.UMLModelCreatorTest) skipped
01:53:52 testCreateDatatype(org.eclipse.papyrus.uml.profile.drafter.tests.utils.UMLModelCreatorTest) skipped
01:53:52 org.eclipse.papyrus.uml.profile.drafter.tests.utils.UMLModelCreatorTest skipped
01:53:52 testCompoundTypeProvider(org.eclipse.papyrus.uml.profile.drafter.ui.model.CompoundTypeProviderTest) skipped
01:53:52 testGetTypes(org.eclipse.papyrus.uml.profile.drafter.ui.model.CompoundTypeProviderTest) skipped
01:53:52 testAddITypeProvider(org.eclipse.papyrus.uml.profile.drafter.ui.model.CompoundTypeProviderTest) skipped
01:53:52 testIterator(org.eclipse.papyrus.uml.profile.drafter.ui.model.CompoundTypeProviderTest) skipped
01:53:52 org.eclipse.papyrus.uml.profile.drafter.ui.model.CompoundTypeProviderTest skipped
01:53:52 testVisitMetaclassesModel(org.eclipse.papyrus.uml.profile.drafter.ui.model.SimpleModelVisitorTest) skipped
01:53:52 testVisitPropertyModel(org.eclipse.papyrus.uml.profile.drafter.ui.model.SimpleModelVisitorTest) skipped
01:53:52 testSimpleModelVisitor(org.eclipse.papyrus.uml.profile.drafter.ui.model.SimpleModelVisitorTest) skipped
01:53:52 testDoVisitStereoptypeModel(org.eclipse.papyrus.uml.profile.drafter.ui.model.SimpleModelVisitorTest) skipped
01:53:52 testDoVisitPropertyModel(org.eclipse.papyrus.uml.profile.drafter.ui.model.SimpleModelVisitorTest) skipped
01:53:52 testVisitStereoptypeModel(org.eclipse.papyrus.uml.profile.drafter.ui.model.SimpleModelVisitorTest) skipped
01:53:52 testDoVisitMetaclassesModel(org.eclipse.papyrus.uml.profile.drafter.ui.model.SimpleModelVisitorTest) skipped
01:53:52 org.eclipse.papyrus.uml.profile.drafter.ui.model.SimpleModelVisitorTest skipped
01:53:52 testSetStereotypeName(org.eclipse.papyrus.uml.profile.drafter.ui.model.StereotypeURLTest) skipped
01:53:52 testGetProfileName(org.eclipse.papyrus.uml.profile.drafter.ui.model.StereotypeURLTest) skipped
01:53:52 testAddPropertyChangeListenerPropertyChangeListener(org.eclipse.papyrus.uml.profile.drafter.ui.model.StereotypeURLTest) skipped
01:53:52 testSetQualifiedNameComplex(org.eclipse.papyrus.uml.profile.drafter.ui.model.StereotypeURLTest) skipped
01:53:52 testClear(org.eclipse.papyrus.uml.profile.drafter.ui.model.StereotypeURLTest) skipped
01:53:52 testStereotypeURLString(org.eclipse.papyrus.uml.profile.drafter.ui.model.StereotypeURLTest) skipped
01:53:52 testToString(org.eclipse.papyrus.uml.profile.drafter.ui.model.StereotypeURLTest) skipped
01:53:52 testGetStereotypeName(org.eclipse.papyrus.uml.profile.drafter.ui.model.StereotypeURLTest) skipped
01:53:52 testAddPropertyChangeListenerStringPropertyChangeListener(org.eclipse.papyrus.uml.profile.drafter.ui.model.StereotypeURLTest) skipped
01:53:52 testStereotypeURL(org.eclipse.papyrus.uml.profile.drafter.ui.model.StereotypeURLTest) skipped
01:53:52 testRemovePropertyChangeListenerPropertyChangeListener(org.eclipse.papyrus.uml.profile.drafter.ui.model.StereotypeURLTest) skipped
01:53:52 testSetQualifiedNameSimple(org.eclipse.papyrus.uml.profile.drafter.ui.model.StereotypeURLTest) skipped
01:53:52 testSetProfileName(org.eclipse.papyrus.uml.profile.drafter.ui.model.StereotypeURLTest) skipped
01:53:52 testRemovePropertyChangeListenerStringPropertyChangeListener(org.eclipse.papyrus.uml.profile.drafter.ui.model.StereotypeURLTest) skipped
01:53:52 testComputeQualifiedName(org.eclipse.papyrus.uml.profile.drafter.ui.model.StereotypeURLTest) skipped
01:53:52 testGetQualifiedName(org.eclipse.papyrus.uml.profile.drafter.ui.model.StereotypeURLTest) skipped
01:53:52 testStereotypeURLStringString(org.eclipse.papyrus.uml.profile.drafter.ui.model.StereotypeURLTest) skipped
01:53:52 org.eclipse.papyrus.uml.profile.drafter.ui.model.StereotypeURLTest skipped
01:53:52 testGetTypes(org.eclipse.papyrus.uml.profile.drafter.ui.model.TypeProviderTest) skipped
01:53:52 testTypeProvider(org.eclipse.papyrus.uml.profile.drafter.ui.model.TypeProviderTest) skipped
01:53:52 testIterator(org.eclipse.papyrus.uml.profile.drafter.ui.model.TypeProviderTest) skipped
01:53:52 org.eclipse.papyrus.uml.profile.drafter.ui.model.TypeProviderTest skipped
01:53:52 testGetTypes(org.eclipse.papyrus.uml.profile.drafter.ui.model.TypeProviderTest2) skipped
01:53:52 testAddType(org.eclipse.papyrus.uml.profile.drafter.ui.model.TypeProviderTest2) skipped
01:53:52 testAddTypeFromConstructor(org.eclipse.papyrus.uml.profile.drafter.ui.model.TypeProviderTest2) skipped
01:53:52 testTypeProvider(org.eclipse.papyrus.uml.profile.drafter.ui.model.TypeProviderTest2) skipped
01:53:52 testTypeProviderTypeArray(org.eclipse.papyrus.uml.profile.drafter.ui.model.TypeProviderTest2) skipped
01:53:52 testIterator(org.eclipse.papyrus.uml.profile.drafter.ui.model.TypeProviderTest2) skipped
01:53:52 org.eclipse.papyrus.uml.profile.drafter.ui.model.TypeProviderTest2 skipped
01:53:52 testUMLPrimitiveTypesModel(org.eclipse.papyrus.uml.profile.drafter.utils.UMLPrimitiveTypesModelTest) skipped
01:53:52 testGetLibraryPackage(org.eclipse.papyrus.uml.profile.drafter.utils.UMLPrimitiveTypesModelTest) skipped
01:53:52 org.eclipse.papyrus.uml.profile.drafter.utils.UMLPrimitiveTypesModelTest skipped
01:53:52 org.eclipse.papyrus.uml.profile.drafter.tests.AllTests skipped
01:53:52 testUseInternationalizationModification(org.eclipse.papyrus.uml.internationalization.tests.tests.UMLInternationalizationChangePreferencesTest) skipped
01:53:52 org.eclipse.papyrus.uml.internationalization.tests.tests.UMLInternationalizationChangePreferencesTest skipped
01:53:52 testLanguageModification(org.eclipse.papyrus.uml.internationalization.tests.tests.UMLInternationalizationChangeLanguageTest) skipped
01:53:52 org.eclipse.papyrus.uml.internationalization.tests.tests.UMLInternationalizationChangeLanguageTest skipped
01:53:52 rebuildAdapters(org.eclipse.papyrus.uml.internationalization.tests.tests.InternationalizationUMLItemProviderAdapterFactoryTest) skipped
01:53:52 normalAdapters(org.eclipse.papyrus.uml.internationalization.tests.tests.InternationalizationUMLItemProviderAdapterFactoryTest) skipped
01:53:52 org.eclipse.papyrus.uml.internationalization.tests.tests.InternationalizationUMLItemProviderAdapterFactoryTest skipped
01:53:52 org.eclipse.papyrus.uml.internationalization.tests.tests.AllTests skipped
01:53:52 testMapping(org.eclipse.papyrus.uml.alf.tests.mapper.MappingTest) skipped
01:53:52 org.eclipse.papyrus.uml.alf.tests.mapper.MappingTest skipped
01:53:52 testMerging(org.eclipse.papyrus.uml.alf.tests.mapper.MergeTest) skipped
01:53:52 org.eclipse.papyrus.uml.alf.tests.mapper.MergeTest skipped
01:53:52 testStaticSemantics(org.eclipse.papyrus.uml.alf.tests.SemanticTest) skipped
01:53:52 org.eclipse.papyrus.uml.alf.tests.SemanticTest skipped
01:53:52 testOneFile(org.eclipse.papyrus.uml.alf.tests.SingleTest) skipped
01:53:52 org.eclipse.papyrus.uml.alf.tests.SingleTest skipped
01:53:52 testSyntax(org.eclipse.papyrus.uml.alf.tests.SyntacticTest) skipped
01:53:52 org.eclipse.papyrus.uml.alf.tests.SyntacticTest skipped
01:53:52 testGeneration(org.eclipse.papyrus.uml.alf.tests.generator.GenerationTest) skipped
01:53:52 org.eclipse.papyrus.uml.alf.tests.generator.GenerationTest skipped
01:53:52 org.eclipse.papyrus.uml.alf.tests.AllTests skipped
01:53:52 IsStereotypedWithExpression_Test10(org.eclipse.papyrus.uml.expressions.tests.IsStereotypedWithExpressionTests) skipped
01:53:52 IsStereotypedWithExpression_Test11(org.eclipse.papyrus.uml.expressions.tests.IsStereotypedWithExpressionTests) skipped
01:53:52 IsStereotypedWithExpression_Test12(org.eclipse.papyrus.uml.expressions.tests.IsStereotypedWithExpressionTests) skipped
01:53:52 IsStereotypedWithExpression_Test13(org.eclipse.papyrus.uml.expressions.tests.IsStereotypedWithExpressionTests) skipped
01:53:52 IsStereotypedWithExpression_Test1(org.eclipse.papyrus.uml.expressions.tests.IsStereotypedWithExpressionTests) skipped
01:53:52 IsStereotypedWithExpression_Test2(org.eclipse.papyrus.uml.expressions.tests.IsStereotypedWithExpressionTests) skipped
01:53:52 IsStereotypedWithExpression_Test3(org.eclipse.papyrus.uml.expressions.tests.IsStereotypedWithExpressionTests) skipped
01:53:52 IsStereotypedWithExpression_Test4(org.eclipse.papyrus.uml.expressions.tests.IsStereotypedWithExpressionTests) skipped
01:53:52 IsStereotypedWithExpression_Test5(org.eclipse.papyrus.uml.expressions.tests.IsStereotypedWithExpressionTests) skipped
01:53:52 IsStereotypedWithExpression_Test6(org.eclipse.papyrus.uml.expressions.tests.IsStereotypedWithExpressionTests) skipped
01:53:52 IsStereotypedWithExpression_Test7(org.eclipse.papyrus.uml.expressions.tests.IsStereotypedWithExpressionTests) skipped
01:53:52 IsStereotypedWithExpression_Test8(org.eclipse.papyrus.uml.expressions.tests.IsStereotypedWithExpressionTests) skipped
01:53:52 IsStereotypedWithExpression_Test9(org.eclipse.papyrus.uml.expressions.tests.IsStereotypedWithExpressionTests) skipped
01:53:52 org.eclipse.papyrus.uml.expressions.tests.IsStereotypedWithExpressionTests skipped
01:53:52 HasStereotypeExpressionTests_Test1(org.eclipse.papyrus.uml.expressions.tests.HasAppliedStereotypeExpressionTests) skipped
01:53:52 HasStereotypeExpressionTests_Test2(org.eclipse.papyrus.uml.expressions.tests.HasAppliedStereotypeExpressionTests) skipped
01:53:52 HasStereotypeExpressionTests_Test3(org.eclipse.papyrus.uml.expressions.tests.HasAppliedStereotypeExpressionTests) skipped
01:53:52 HasStereotypeExpressionTests_Test4(org.eclipse.papyrus.uml.expressions.tests.HasAppliedStereotypeExpressionTests) skipped
01:53:52 org.eclipse.papyrus.uml.expressions.tests.HasAppliedStereotypeExpressionTests skipped
01:53:52 metaclassAndNoContext(org.eclipse.papyrus.uml.expressions.tests.IsKindOfExpressionTest) skipped
01:53:52 noMetaclassAndNoContextTest(org.eclipse.papyrus.uml.expressions.tests.IsKindOfExpressionTest) skipped
01:53:52 metaclassAndValidContext_1(org.eclipse.papyrus.uml.expressions.tests.IsKindOfExpressionTest) skipped
01:53:52 metaclassAndValidContext_2(org.eclipse.papyrus.uml.expressions.tests.IsKindOfExpressionTest) skipped
01:53:52 metaclassAndInvalidContext(org.eclipse.papyrus.uml.expressions.tests.IsKindOfExpressionTest) skipped
01:53:52 org.eclipse.papyrus.uml.expressions.tests.IsKindOfExpressionTest skipped
01:53:52 metaclassAndNoContext(org.eclipse.papyrus.uml.expressions.tests.IsTypeOfExpressionTests) skipped
01:53:52 noMetaclassAndNoContextTest(org.eclipse.papyrus.uml.expressions.tests.IsTypeOfExpressionTests) skipped
01:53:52 metaclassAndValidContext_2(org.eclipse.papyrus.uml.expressions.tests.IsTypeOfExpressionTests) skipped
01:53:52 metaclassAndInValidContext_1(org.eclipse.papyrus.uml.expressions.tests.IsTypeOfExpressionTests) skipped
01:53:52 org.eclipse.papyrus.uml.expressions.tests.IsTypeOfExpressionTests skipped
01:53:52 org.eclipse.papyrus.uml.expressions.tests.AllTests skipped
01:53:52 
01:53:52 Results :
01:53:52 
01:53:52 Failed tests: 
01:53:52   DeleteCommentLinkTest.testDeletionWithSetRequest:219->checkModelAndDiagramsAfterLinkDeletion:333->checkDiagramAfterLinkDeletion:354 expected:<8> but was:<10>
01:53:52   StereotypeElementListenerTest.testModifiedSysMLStereotype:603 SysML dependency needs to be removed
01:53:52   StereotypeElementListenerTest.testUndoModifiedSysMLStereotype:632 SysML dependency needs to be removed
01:53:52   The label of stereotype for the Class is not good has not the good X coordinate expected:<0> but was:<1>
01:53:52   The figure of the Class  has not the good X coordinate expected:<0> but was:<1>
01:53:52   The label of stereotype for the Class is not good has not the good X coordinate expected:<0> but was:<1>
01:53:52   The figure of the Class  has not the good X coordinate expected:<0> but was:<1>
01:53:52   RegressionTest.basicUMLMigrateProfileExtendingStatic_bug481302:75->doTestMigrateProfileExtendingOther_bug481302:59 
01:53:52 Expected: is "R1"
01:53:52      but: was null
01:53:52 
01:53:52 Tests run: 655, Failures: 8, Errors: 0, Skipped: 594
01:53:52 
01:53:54 [ERROR] There are test failures.
01:53:54 
01:53:54 Please refer to /jobs/genie.papyrus/Papyrus-Oxygen-Tests-Failures/workspace/source/tests/junit/plugins/uml/org.eclipse.papyrus.uml.suite.tests/target/surefire-reports for the individual test results.
01:53:54 [INFO] 
01:53:54 [INFO] --- jacoco-maven-plugin:0.7.9:report (default-report) @ org.eclipse.papyrus.uml.suite.tests ---
01:53:54 [INFO] Loading execution data file /jobs/genie.papyrus/Papyrus-Oxygen-Tests-Failures/workspace/source/tests/junit/plugins/uml/org.eclipse.papyrus.uml.suite.tests/target/jacoco.exec
01:53:54 [INFO] Analyzed bundle 'org.eclipse.papyrus.uml.suite.tests' with 0 classes
01:53:54 [INFO] 
01:53:54 [INFO] --< org.eclipse.papyrus.tests:org.eclipse.papyrus.uml.alf.tests.releng >--
01:53:54 [INFO] Building org.eclipse.papyrus.uml.alf.tests.releng 0.0.1-SNAPSHOT [148/155]
01:53:54 [INFO] --------------------------------[ pom ]---------------------------------
01:53:54 [INFO] 
01:53:54 [INFO] --- maven-clean-plugin:2.6:clean (default-clean) @ org.eclipse.papyrus.uml.alf.tests.releng ---
01:53:54 [INFO] 
01:53:54 [INFO] --- jacoco-maven-plugin:0.7.9:prepare-agent (default-prepare-agent) @ org.eclipse.papyrus.uml.alf.tests.releng ---
01:53:54 [INFO] argLine set to -javaagent:/home/hudson/genie.papyrus/.jenkins/jobs/Papyrus-Oxygen-Tests-Failures/workspace/.repository/org/jacoco/org.jacoco.agent/0.7.9/org.jacoco.agent-0.7.9-runtime.jar=destfile=/jobs/genie.papyrus/Papyrus-Oxygen-Tests-Failures/workspace/source/tests/junit/plugins/uml/alf/target/jacoco.exec,includes=org.eclipse.papyrus.*,excludes=org.eclipse.uml2
01:53:54 [INFO] 
01:53:54 [INFO] --- jacoco-maven-plugin:0.7.9:report (default-report) @ org.eclipse.papyrus.uml.alf.tests.releng ---
01:53:54 [INFO] Skipping JaCoCo execution due to missing execution data file.
01:53:54 [INFO] 
01:53:54 [INFO] --< org.eclipse.papyrus.tests:org.eclipse.papyrus.uml.alf.backend.tests >--
01:53:54 [INFO] Building org.eclipse.papyrus.uml.alf.backend.tests 1.1.0-SNAPSHOT [149/155]
01:53:54 [INFO] ------------------------[ eclipse-test-plugin ]-------------------------
01:53:54 [INFO] 
01:53:54 [INFO] --- maven-clean-plugin:2.6:clean (default-clean) @ org.eclipse.papyrus.uml.alf.backend.tests ---
01:53:54 [INFO] 
01:53:54 [INFO] --- tycho-packaging-plugin:1.0.0:build-qualifier (default-build-qualifier) @ org.eclipse.papyrus.uml.alf.backend.tests ---
01:53:54 [INFO] The project's OSGi version is 1.1.0.201911100627
01:53:54 [INFO] 
01:53:54 [INFO] --- tycho-packaging-plugin:1.0.0:validate-id (default-validate-id) @ org.eclipse.papyrus.uml.alf.backend.tests ---
01:53:54 [INFO] 
01:53:54 [INFO] --- tycho-packaging-plugin:1.0.0:validate-version (default-validate-version) @ org.eclipse.papyrus.uml.alf.backend.tests ---
01:53:54 [INFO] 
01:53:54 [INFO] --- jacoco-maven-plugin:0.7.9:prepare-agent (default-prepare-agent) @ org.eclipse.papyrus.uml.alf.backend.tests ---
01:53:54 [INFO] tycho.testArgLine set to -javaagent:/home/hudson/genie.papyrus/.jenkins/jobs/Papyrus-Oxygen-Tests-Failures/workspace/.repository/org/jacoco/org.jacoco.agent/0.7.9/org.jacoco.agent-0.7.9-runtime.jar=destfile=/jobs/genie.papyrus/Papyrus-Oxygen-Tests-Failures/workspace/source/tests/junit/plugins/uml/alf/org.eclipse.papyrus.uml.alf.backend.tests/target/jacoco.exec,includes=org.eclipse.papyrus.*,excludes=org.eclipse.uml2
01:53:54 [INFO] 
01:53:54 [INFO] --- xtend-maven-plugin:2.11.0:compile (default) @ org.eclipse.papyrus.uml.alf.backend.tests ---
01:53:54 [INFO] 
01:53:54 [INFO] --- maven-resources-plugin:2.6:resources (default-resources) @ org.eclipse.papyrus.uml.alf.backend.tests ---
01:53:54 [INFO] Using 'UTF-8' encoding to copy filtered resources.
01:53:54 [INFO] skip non existing resourceDirectory /jobs/genie.papyrus/Papyrus-Oxygen-Tests-Failures/workspace/source/tests/junit/plugins/uml/alf/org.eclipse.papyrus.uml.alf.backend.tests/src/main/resources
01:53:54 [INFO] 
01:53:54 [INFO] --- tycho-compiler-plugin:1.0.0:compile (default-compile) @ org.eclipse.papyrus.uml.alf.backend.tests ---
01:53:54 [INFO] Compiling 4 source files to /jobs/genie.papyrus/Papyrus-Oxygen-Tests-Failures/workspace/source/tests/junit/plugins/uml/alf/org.eclipse.papyrus.uml.alf.backend.tests/target/classes
01:53:54 [INFO] 
01:53:54 [INFO] --- maven-resources-plugin:2.6:testResources (default-testResources) @ org.eclipse.papyrus.uml.alf.backend.tests ---
01:53:54 [INFO] Using 'UTF-8' encoding to copy filtered resources.
01:53:54 [INFO] skip non existing resourceDirectory /jobs/genie.papyrus/Papyrus-Oxygen-Tests-Failures/workspace/source/tests/junit/plugins/uml/alf/org.eclipse.papyrus.uml.alf.backend.tests/src/test/resources
01:53:54 [INFO] 
01:53:54 [INFO] --- target-platform-configuration:1.0.0:target-platform (default-target-platform) @ org.eclipse.papyrus.uml.alf.backend.tests ---
01:53:54 [INFO] 
01:53:54 [INFO] --- tycho-packaging-plugin:1.0.0:package-plugin (default-package-plugin) @ org.eclipse.papyrus.uml.alf.backend.tests ---
01:53:54 [INFO] Building jar: /jobs/genie.papyrus/Papyrus-Oxygen-Tests-Failures/workspace/source/tests/junit/plugins/uml/alf/org.eclipse.papyrus.uml.alf.backend.tests/target/org.eclipse.papyrus.uml.alf.backend.tests-1.1.0-SNAPSHOT.jar
01:53:54 [INFO] 
01:53:54 [INFO] --- tycho-p2-plugin:1.0.0:p2-metadata-default (default-p2-metadata-default) @ org.eclipse.papyrus.uml.alf.backend.tests ---
01:53:54 [INFO] 
01:53:54 [INFO] --- tycho-surefire-plugin:1.0.0:test (default-test) @ org.eclipse.papyrus.uml.alf.backend.tests ---
01:53:54 [INFO] Skipping tests
01:53:54 [INFO] 
01:53:54 [INFO] --- jacoco-maven-plugin:0.7.9:report (default-report) @ org.eclipse.papyrus.uml.alf.backend.tests ---
01:53:54 [INFO] Skipping JaCoCo execution due to missing execution data file.
01:53:54 [INFO] 
01:53:54 [INFO] --< org.eclipse.papyrus.tests:org.eclipse.papyrus.uml.internationalization.controlmode.tests >--
01:53:54 [INFO] Building org.eclipse.papyrus.uml.internationalization.controlmode.tests 1.0.0-SNAPSHOT [150/155]
01:53:54 [INFO] ------------------------[ eclipse-test-plugin ]-------------------------
01:53:54 [INFO] 
01:53:54 [INFO] --- maven-clean-plugin:2.6:clean (default-clean) @ org.eclipse.papyrus.uml.internationalization.controlmode.tests ---
01:53:54 [INFO] 
01:53:54 [INFO] --- tycho-packaging-plugin:1.0.0:build-qualifier (default-build-qualifier) @ org.eclipse.papyrus.uml.internationalization.controlmode.tests ---
01:53:54 [INFO] The project's OSGi version is 1.0.0.201911100627
01:53:54 [INFO] 
01:53:54 [INFO] --- tycho-packaging-plugin:1.0.0:validate-id (default-validate-id) @ org.eclipse.papyrus.uml.internationalization.controlmode.tests ---
01:53:54 [INFO] 
01:53:54 [INFO] --- tycho-packaging-plugin:1.0.0:validate-version (default-validate-version) @ org.eclipse.papyrus.uml.internationalization.controlmode.tests ---
01:53:54 [INFO] 
01:53:54 [INFO] --- jacoco-maven-plugin:0.7.9:prepare-agent (default-prepare-agent) @ org.eclipse.papyrus.uml.internationalization.controlmode.tests ---
01:53:54 [INFO] tycho.testArgLine set to -javaagent:/home/hudson/genie.papyrus/.jenkins/jobs/Papyrus-Oxygen-Tests-Failures/workspace/.repository/org/jacoco/org.jacoco.agent/0.7.9/org.jacoco.agent-0.7.9-runtime.jar=destfile=/jobs/genie.papyrus/Papyrus-Oxygen-Tests-Failures/workspace/source/tests/junit/plugins/uml/internationalization/org.eclipse.papyrus.uml.internationalization.controlmode.tests/target/jacoco.exec,includes=org.eclipse.papyrus.*,excludes=org.eclipse.uml2
01:53:54 [INFO] 
01:53:54 [INFO] --- maven-resources-plugin:2.6:resources (default-resources) @ org.eclipse.papyrus.uml.internationalization.controlmode.tests ---
01:53:54 [INFO] Using 'UTF-8' encoding to copy filtered resources.
01:53:54 [INFO] skip non existing resourceDirectory /jobs/genie.papyrus/Papyrus-Oxygen-Tests-Failures/workspace/source/tests/junit/plugins/uml/internationalization/org.eclipse.papyrus.uml.internationalization.controlmode.tests/src/main/resources
01:53:54 [INFO] 
01:53:54 [INFO] --- tycho-compiler-plugin:1.0.0:compile (default-compile) @ org.eclipse.papyrus.uml.internationalization.controlmode.tests ---
01:53:54 [INFO] Compiling 5 source files to /jobs/genie.papyrus/Papyrus-Oxygen-Tests-Failures/workspace/source/tests/junit/plugins/uml/internationalization/org.eclipse.papyrus.uml.internationalization.controlmode.tests/target/classes
01:53:55 [INFO] 
01:53:55 [INFO] --- maven-resources-plugin:2.6:testResources (default-testResources) @ org.eclipse.papyrus.uml.internationalization.controlmode.tests ---
01:53:55 [INFO] Using 'UTF-8' encoding to copy filtered resources.
01:53:55 [INFO] skip non existing resourceDirectory /jobs/genie.papyrus/Papyrus-Oxygen-Tests-Failures/workspace/source/tests/junit/plugins/uml/internationalization/org.eclipse.papyrus.uml.internationalization.controlmode.tests/src/test/resources
01:53:55 [INFO] 
01:53:55 [INFO] --- target-platform-configuration:1.0.0:target-platform (default-target-platform) @ org.eclipse.papyrus.uml.internationalization.controlmode.tests ---
01:53:55 [INFO] 
01:53:55 [INFO] --- tycho-packaging-plugin:1.0.0:package-plugin (default-package-plugin) @ org.eclipse.papyrus.uml.internationalization.controlmode.tests ---
01:53:55 [INFO] Building jar: /jobs/genie.papyrus/Papyrus-Oxygen-Tests-Failures/workspace/source/tests/junit/plugins/uml/internationalization/org.eclipse.papyrus.uml.internationalization.controlmode.tests/target/org.eclipse.papyrus.uml.internationalization.controlmode.tests-1.0.0-SNAPSHOT.jar
01:53:55 [INFO] 
01:53:55 [INFO] --- tycho-p2-plugin:1.0.0:p2-metadata-default (default-p2-metadata-default) @ org.eclipse.papyrus.uml.internationalization.controlmode.tests ---
01:53:55 [INFO] 
01:53:55 [INFO] --- tycho-surefire-plugin:1.0.0:test (default-test) @ org.eclipse.papyrus.uml.internationalization.controlmode.tests ---
01:53:55 [INFO] Skipping tests
01:53:55 [INFO] 
01:53:55 [INFO] --- jacoco-maven-plugin:0.7.9:report (default-report) @ org.eclipse.papyrus.uml.internationalization.controlmode.tests ---
01:53:55 [INFO] Skipping JaCoCo execution due to missing execution data file.
01:53:55 [INFO] 
01:53:55 [INFO] --< org.eclipse.papyrus.tests:org.eclipse.papyrus.views.properties.toolsmiths.tests >--
01:53:55 [INFO] Building org.eclipse.papyrus.views.properties.toolsmiths.tests 1.2.0-SNAPSHOT [151/155]
01:53:55 [INFO] ------------------------[ eclipse-test-plugin ]-------------------------
01:53:55 [INFO] 
01:53:55 [INFO] --- maven-clean-plugin:2.6:clean (default-clean) @ org.eclipse.papyrus.views.properties.toolsmiths.tests ---
01:53:55 [INFO] 
01:53:55 [INFO] --- tycho-packaging-plugin:1.0.0:build-qualifier (default-build-qualifier) @ org.eclipse.papyrus.views.properties.toolsmiths.tests ---
01:53:55 [INFO] The project's OSGi version is 1.2.0.201911100627
01:53:55 [INFO] 
01:53:55 [INFO] --- tycho-packaging-plugin:1.0.0:validate-id (default-validate-id) @ org.eclipse.papyrus.views.properties.toolsmiths.tests ---
01:53:55 [INFO] 
01:53:55 [INFO] --- tycho-packaging-plugin:1.0.0:validate-version (default-validate-version) @ org.eclipse.papyrus.views.properties.toolsmiths.tests ---
01:53:55 [INFO] 
01:53:55 [INFO] --- jacoco-maven-plugin:0.7.9:prepare-agent (default-prepare-agent) @ org.eclipse.papyrus.views.properties.toolsmiths.tests ---
01:53:55 [INFO] tycho.testArgLine set to -javaagent:/home/hudson/genie.papyrus/.jenkins/jobs/Papyrus-Oxygen-Tests-Failures/workspace/.repository/org/jacoco/org.jacoco.agent/0.7.9/org.jacoco.agent-0.7.9-runtime.jar=destfile=/jobs/genie.papyrus/Papyrus-Oxygen-Tests-Failures/workspace/source/tests/junit/plugins/views/org.eclipse.papyrus.views.properties.toolsmiths.tests/target/jacoco.exec,includes=org.eclipse.papyrus.*,excludes=org.eclipse.uml2
01:53:55 [INFO] 
01:53:55 [INFO] --- maven-resources-plugin:2.6:resources (default-resources) @ org.eclipse.papyrus.views.properties.toolsmiths.tests ---
01:53:55 [INFO] Using 'UTF-8' encoding to copy filtered resources.
01:53:55 [INFO] skip non existing resourceDirectory /jobs/genie.papyrus/Papyrus-Oxygen-Tests-Failures/workspace/source/tests/junit/plugins/views/org.eclipse.papyrus.views.properties.toolsmiths.tests/src/main/resources
01:53:55 [INFO] 
01:53:55 [INFO] --- tycho-compiler-plugin:1.0.0:compile (default-compile) @ org.eclipse.papyrus.views.properties.toolsmiths.tests ---
01:53:55 [INFO] Compiling 3 source files to /jobs/genie.papyrus/Papyrus-Oxygen-Tests-Failures/workspace/source/tests/junit/plugins/views/org.eclipse.papyrus.views.properties.toolsmiths.tests/target/classes
01:53:55 [WARNING] /jobs/genie.papyrus/Papyrus-Oxygen-Tests-Failures/workspace/source/tests/junit/plugins/views/org.eclipse.papyrus.views.properties.toolsmiths.tests/src/org/eclipse/papyrus/views/properties/toolsmiths/tests/qvt/TransformationsTests.java:[164] 
01:53:55 	ModelExtent temp = new BasicModelExtent();
01:53:55 	            ^^^^
01:53:55 The value of the local variable temp is not used
01:53:55 [WARNING] /jobs/genie.papyrus/Papyrus-Oxygen-Tests-Failures/workspace/source/tests/junit/plugins/views/org.eclipse.papyrus.views.properties.toolsmiths.tests/src/org/eclipse/papyrus/views/properties/toolsmiths/tests/qvt/TransformationsTests.java:[275] 
01:53:55 	DataContextElement st3Element = findContextElement(context, "Stereotype3");
01:53:55 	                   ^^^^^^^^^^
01:53:55 The value of the local variable st3Element is not used
01:53:55 2 problems (2 warnings)
01:53:55 [INFO] 
01:53:55 [INFO] --- maven-resources-plugin:2.6:testResources (default-testResources) @ org.eclipse.papyrus.views.properties.toolsmiths.tests ---
01:53:55 [INFO] Using 'UTF-8' encoding to copy filtered resources.
01:53:55 [INFO] skip non existing resourceDirectory /jobs/genie.papyrus/Papyrus-Oxygen-Tests-Failures/workspace/source/tests/junit/plugins/views/org.eclipse.papyrus.views.properties.toolsmiths.tests/src/test/resources
01:53:55 [INFO] 
01:53:55 [INFO] --- target-platform-configuration:1.0.0:target-platform (default-target-platform) @ org.eclipse.papyrus.views.properties.toolsmiths.tests ---
01:53:55 [INFO] 
01:53:55 [INFO] --- tycho-packaging-plugin:1.0.0:package-plugin (default-package-plugin) @ org.eclipse.papyrus.views.properties.toolsmiths.tests ---
01:53:55 [INFO] Building jar: /jobs/genie.papyrus/Papyrus-Oxygen-Tests-Failures/workspace/source/tests/junit/plugins/views/org.eclipse.papyrus.views.properties.toolsmiths.tests/target/org.eclipse.papyrus.views.properties.toolsmiths.tests-1.2.0-SNAPSHOT.jar
01:53:55 [INFO] 
01:53:55 [INFO] --- tycho-p2-plugin:1.0.0:p2-metadata-default (default-p2-metadata-default) @ org.eclipse.papyrus.views.properties.toolsmiths.tests ---
01:53:55 [INFO] 
01:53:55 [INFO] --- tycho-surefire-plugin:1.0.0:test (default-test) @ org.eclipse.papyrus.views.properties.toolsmiths.tests ---
01:53:55 [INFO] Skipping tests
01:53:55 [INFO] 
01:53:55 [INFO] --- jacoco-maven-plugin:0.7.9:report (default-report) @ org.eclipse.papyrus.views.properties.toolsmiths.tests ---
01:53:55 [INFO] Skipping JaCoCo execution due to missing execution data file.
01:53:55 [INFO] 
01:53:55 [INFO] --< org.eclipse.papyrus.tests:org.eclipse.papyrus.views.suite.tests >---
01:53:55 [INFO] Building org.eclipse.papyrus.views.suite.tests 0.0.1-SNAPSHOT  [152/155]
01:53:55 [INFO] ------------------------[ eclipse-test-plugin ]-------------------------
01:53:55 [INFO] 
01:53:55 [INFO] --- maven-clean-plugin:2.6:clean (default-clean) @ org.eclipse.papyrus.views.suite.tests ---
01:53:55 [INFO] 
01:53:55 [INFO] --- tycho-packaging-plugin:1.0.0:build-qualifier (default-build-qualifier) @ org.eclipse.papyrus.views.suite.tests ---
01:53:55 [INFO] The project's OSGi version is 0.0.1.201911100627
01:53:55 [INFO] 
01:53:55 [INFO] --- tycho-packaging-plugin:1.0.0:validate-id (default-validate-id) @ org.eclipse.papyrus.views.suite.tests ---
01:53:55 [INFO] 
01:53:55 [INFO] --- tycho-packaging-plugin:1.0.0:validate-version (default-validate-version) @ org.eclipse.papyrus.views.suite.tests ---
01:53:55 [INFO] 
01:53:55 [INFO] --- jacoco-maven-plugin:0.7.9:prepare-agent (default-prepare-agent) @ org.eclipse.papyrus.views.suite.tests ---
01:53:55 [INFO] tycho.testArgLine set to -javaagent:/home/hudson/genie.papyrus/.jenkins/jobs/Papyrus-Oxygen-Tests-Failures/workspace/.repository/org/jacoco/org.jacoco.agent/0.7.9/org.jacoco.agent-0.7.9-runtime.jar=destfile=/jobs/genie.papyrus/Papyrus-Oxygen-Tests-Failures/workspace/source/tests/junit/plugins/views/org.eclipse.papyrus.views.suite.tests/target/jacoco.exec,includes=org.eclipse.papyrus.*,excludes=org.eclipse.uml2
01:53:55 [INFO] 
01:53:55 [INFO] --- maven-resources-plugin:2.6:resources (default-resources) @ org.eclipse.papyrus.views.suite.tests ---
01:53:55 [INFO] Using 'UTF-8' encoding to copy filtered resources.
01:53:55 [INFO] skip non existing resourceDirectory /jobs/genie.papyrus/Papyrus-Oxygen-Tests-Failures/workspace/source/tests/junit/plugins/views/org.eclipse.papyrus.views.suite.tests/src/main/resources
01:53:55 [INFO] 
01:53:55 [INFO] --- tycho-compiler-plugin:1.0.0:compile (default-compile) @ org.eclipse.papyrus.views.suite.tests ---
01:53:55 [INFO] Compiling 2 source files to /jobs/genie.papyrus/Papyrus-Oxygen-Tests-Failures/workspace/source/tests/junit/plugins/views/org.eclipse.papyrus.views.suite.tests/target/classes
01:53:55 [INFO] 
01:53:55 [INFO] --- maven-resources-plugin:2.6:testResources (default-testResources) @ org.eclipse.papyrus.views.suite.tests ---
01:53:55 [INFO] Using 'UTF-8' encoding to copy filtered resources.
01:53:55 [INFO] skip non existing resourceDirectory /jobs/genie.papyrus/Papyrus-Oxygen-Tests-Failures/workspace/source/tests/junit/plugins/views/org.eclipse.papyrus.views.suite.tests/src/test/resources
01:53:55 [INFO] 
01:53:55 [INFO] --- target-platform-configuration:1.0.0:target-platform (default-target-platform) @ org.eclipse.papyrus.views.suite.tests ---
01:53:55 [INFO] 
01:53:55 [INFO] --- tycho-packaging-plugin:1.0.0:package-plugin (default-package-plugin) @ org.eclipse.papyrus.views.suite.tests ---
01:53:55 [INFO] Building jar: /jobs/genie.papyrus/Papyrus-Oxygen-Tests-Failures/workspace/source/tests/junit/plugins/views/org.eclipse.papyrus.views.suite.tests/target/org.eclipse.papyrus.views.suite.tests-0.0.1-SNAPSHOT.jar
01:53:55 [INFO] 
01:53:55 [INFO] --- tycho-p2-plugin:1.0.0:p2-metadata-default (default-p2-metadata-default) @ org.eclipse.papyrus.views.suite.tests ---
01:53:55 [INFO] 
01:53:55 [INFO] --- tycho-surefire-plugin:1.0.0:test (default-test) @ org.eclipse.papyrus.views.suite.tests ---
01:53:56 [INFO] Expected eclipse log file: /jobs/genie.papyrus/Papyrus-Oxygen-Tests-Failures/workspace/source/tests/junit/plugins/views/org.eclipse.papyrus.views.suite.tests/target/work/data/.metadata/.log
01:53:56 [INFO] Command line:
01:53:56 	[/opt/public/common/java/oracle/jdk1.8.0_192_x64/jre/bin/java, -Dosgi.noShutdown=false, -Dosgi.os=linux, -Dosgi.ws=gtk, -Dosgi.arch=x86_64, -javaagent:/home/hudson/genie.papyrus/.jenkins/jobs/Papyrus-Oxygen-Tests-Failures/workspace/.repository/org/jacoco/org.jacoco.agent/0.7.9/org.jacoco.agent-0.7.9-runtime.jar=destfile=/jobs/genie.papyrus/Papyrus-Oxygen-Tests-Failures/workspace/source/tests/junit/plugins/views/org.eclipse.papyrus.views.suite.tests/target/jacoco.exec,includes=org.eclipse.papyrus.*,excludes=org.eclipse.uml2, -Xms512m, -Xmx2048m, -XX:SoftRefLRUPolicyMSPerMB=100, -Dosgi.clean=true, -jar, /jobs/genie.papyrus/Papyrus-Oxygen-Tests-Failures/workspace/.repository/p2/osgi/bundle/org.eclipse.equinox.launcher/1.4.0.v20161219-1356/org.eclipse.equinox.launcher-1.4.0.v20161219-1356.jar, -data, /jobs/genie.papyrus/Papyrus-Oxygen-Tests-Failures/workspace/source/tests/junit/plugins/views/org.eclipse.papyrus.views.suite.tests/target/work/data, -install, /jobs/genie.papyrus/Papyrus-Oxygen-Tests-Failures/workspace/source/tests/junit/plugins/views/org.eclipse.papyrus.views.suite.tests/target/work, -configuration, /jobs/genie.papyrus/Papyrus-Oxygen-Tests-Failures/workspace/source/tests/junit/plugins/views/org.eclipse.papyrus.views.suite.tests/target/work/configuration, -application, org.eclipse.tycho.surefire.osgibooter.uitest, -testproperties, /jobs/genie.papyrus/Papyrus-Oxygen-Tests-Failures/workspace/source/tests/junit/plugins/views/org.eclipse.papyrus.views.suite.tests/target/surefire.properties, -product, org.eclipse.sdk.ide, -testConfig=FAILING_TESTS_CONFIG]
01:53:56 Picked up JAVA_TOOL_OPTIONS: -Xmx2G -Djava.io.tmpdir=/tmp/genie.papyrus -DforkCount=1
01:54:05 
01:54:05 -------------------------------------------------------
01:54:05  T E S T S
01:54:05 -------------------------------------------------------
01:54:06 Running org.eclipse.papyrus.views.suite.tests.AllTests
01:54:06 Tests run: 16, Failures: 0, Errors: 0, Skipped: 16, Time elapsed: 0.283 sec - in org.eclipse.papyrus.views.suite.tests.AllTests
01:54:06 revealSemanticElement_rootTest(org.eclipse.papyrus.views.modelexplorer.tests.ModelExplorerViewTests) skipped
01:54:06 org.eclipse.papyrus.views.modelexplorer.tests.ModelExplorerViewTests skipped
01:54:06 deleteDiagramTest(org.eclipse.papyrus.views.modelexplorer.tests.DeleteHandlerTest) skipped
01:54:06 deleteTableTest(org.eclipse.papyrus.views.modelexplorer.tests.DeleteHandlerTest) skipped
01:54:06 deleteLinkItemTest(org.eclipse.papyrus.views.modelexplorer.tests.DeleteHandlerTest) skipped
01:54:06 deleteRootOfTheModel(org.eclipse.papyrus.views.modelexplorer.tests.DeleteHandlerTest) skipped
01:54:06 org.eclipse.papyrus.views.modelexplorer.tests.DeleteHandlerTest skipped
01:54:06 testOpendiagramTest(org.eclipse.papyrus.views.modelexplorer.tests.OpendiagramTest) skipped
01:54:06 org.eclipse.papyrus.views.modelexplorer.tests.OpendiagramTest skipped
01:54:06 org.eclipse.papyrus.views.modelexplorer.tests.AllTests skipped
01:54:06 handleXWTFileFromResourceSet(org.eclipse.papyrus.views.properties.toolsmiths.tests.qvt.TransformationsTests) skipped
01:54:06 handleXWTFileFromResource(org.eclipse.papyrus.views.properties.toolsmiths.tests.qvt.TransformationsTests) skipped
01:54:06 generateEcoreContext(org.eclipse.papyrus.views.properties.toolsmiths.tests.qvt.TransformationsTests) skipped
01:54:06 generateProfileContext(org.eclipse.papyrus.views.properties.toolsmiths.tests.qvt.TransformationsTests) skipped
01:54:06 org.eclipse.papyrus.views.properties.toolsmiths.tests.qvt.TransformationsTests skipped
01:54:06 org.eclipse.papyrus.views.properties.toolsmiths.tests.AllTests skipped
01:54:06 
01:54:06 Results :
01:54:06 
01:54:06 Tests run: 16, Failures: 0, Errors: 0, Skipped: 16
01:54:06 
01:54:11 [INFO] All tests passed!
01:54:11 [INFO] 
01:54:11 [INFO] --- jacoco-maven-plugin:0.7.9:report (default-report) @ org.eclipse.papyrus.views.suite.tests ---
01:54:11 [INFO] Loading execution data file /jobs/genie.papyrus/Papyrus-Oxygen-Tests-Failures/workspace/source/tests/junit/plugins/views/org.eclipse.papyrus.views.suite.tests/target/jacoco.exec
01:54:11 [INFO] Analyzed bundle 'org.eclipse.papyrus.views.suite.tests' with 0 classes
01:54:11 [INFO] 
01:54:11 [INFO] --< org.eclipse.papyrus.tests:org.eclipse.papyrus.toolsmiths.suite.tests >--
01:54:11 [INFO] Building org.eclipse.papyrus.toolsmiths.suite.tests 0.0.1-SNAPSHOT [153/155]
01:54:11 [INFO] ------------------------[ eclipse-test-plugin ]-------------------------
01:54:11 [INFO] 
01:54:11 [INFO] --- maven-clean-plugin:2.6:clean (default-clean) @ org.eclipse.papyrus.toolsmiths.suite.tests ---
01:54:11 [INFO] 
01:54:11 [INFO] --- tycho-packaging-plugin:1.0.0:build-qualifier (default-build-qualifier) @ org.eclipse.papyrus.toolsmiths.suite.tests ---
01:54:11 [INFO] The project's OSGi version is 0.0.1.201911100627
01:54:11 [INFO] 
01:54:11 [INFO] --- tycho-packaging-plugin:1.0.0:validate-id (default-validate-id) @ org.eclipse.papyrus.toolsmiths.suite.tests ---
01:54:11 [INFO] 
01:54:11 [INFO] --- tycho-packaging-plugin:1.0.0:validate-version (default-validate-version) @ org.eclipse.papyrus.toolsmiths.suite.tests ---
01:54:11 [INFO] 
01:54:11 [INFO] --- jacoco-maven-plugin:0.7.9:prepare-agent (default-prepare-agent) @ org.eclipse.papyrus.toolsmiths.suite.tests ---
01:54:11 [INFO] tycho.testArgLine set to -javaagent:/home/hudson/genie.papyrus/.jenkins/jobs/Papyrus-Oxygen-Tests-Failures/workspace/.repository/org/jacoco/org.jacoco.agent/0.7.9/org.jacoco.agent-0.7.9-runtime.jar=destfile=/jobs/genie.papyrus/Papyrus-Oxygen-Tests-Failures/workspace/source/tests/junit/plugins/toolsmiths/org.eclipse.papyrus.toolsmiths.suite.tests/target/jacoco.exec,includes=org.eclipse.papyrus.*,excludes=org.eclipse.uml2
01:54:11 [INFO] 
01:54:11 [INFO] --- maven-resources-plugin:2.6:resources (default-resources) @ org.eclipse.papyrus.toolsmiths.suite.tests ---
01:54:11 [INFO] Using 'UTF-8' encoding to copy filtered resources.
01:54:11 [INFO] skip non existing resourceDirectory /jobs/genie.papyrus/Papyrus-Oxygen-Tests-Failures/workspace/source/tests/junit/plugins/toolsmiths/org.eclipse.papyrus.toolsmiths.suite.tests/src/main/resources
01:54:11 [INFO] 
01:54:11 [INFO] --- tycho-compiler-plugin:1.0.0:compile (default-compile) @ org.eclipse.papyrus.toolsmiths.suite.tests ---
01:54:11 [INFO] Compiling 2 source files to /jobs/genie.papyrus/Papyrus-Oxygen-Tests-Failures/workspace/source/tests/junit/plugins/toolsmiths/org.eclipse.papyrus.toolsmiths.suite.tests/target/classes
01:54:12 [INFO] 
01:54:12 [INFO] --- maven-resources-plugin:2.6:testResources (default-testResources) @ org.eclipse.papyrus.toolsmiths.suite.tests ---
01:54:12 [INFO] Using 'UTF-8' encoding to copy filtered resources.
01:54:12 [INFO] skip non existing resourceDirectory /jobs/genie.papyrus/Papyrus-Oxygen-Tests-Failures/workspace/source/tests/junit/plugins/toolsmiths/org.eclipse.papyrus.toolsmiths.suite.tests/src/test/resources
01:54:12 [INFO] 
01:54:12 [INFO] --- target-platform-configuration:1.0.0:target-platform (default-target-platform) @ org.eclipse.papyrus.toolsmiths.suite.tests ---
01:54:12 [INFO] 
01:54:12 [INFO] --- tycho-packaging-plugin:1.0.0:package-plugin (default-package-plugin) @ org.eclipse.papyrus.toolsmiths.suite.tests ---
01:54:12 [INFO] Building jar: /jobs/genie.papyrus/Papyrus-Oxygen-Tests-Failures/workspace/source/tests/junit/plugins/toolsmiths/org.eclipse.papyrus.toolsmiths.suite.tests/target/org.eclipse.papyrus.toolsmiths.suite.tests-0.0.1-SNAPSHOT.jar
01:54:12 [INFO] 
01:54:12 [INFO] --- tycho-p2-plugin:1.0.0:p2-metadata-default (default-p2-metadata-default) @ org.eclipse.papyrus.toolsmiths.suite.tests ---
01:54:12 [INFO] 
01:54:12 [INFO] --- tycho-surefire-plugin:1.0.0:test (default-test) @ org.eclipse.papyrus.toolsmiths.suite.tests ---
01:54:13 [INFO] Expected eclipse log file: /jobs/genie.papyrus/Papyrus-Oxygen-Tests-Failures/workspace/source/tests/junit/plugins/toolsmiths/org.eclipse.papyrus.toolsmiths.suite.tests/target/work/data/.metadata/.log
01:54:13 [INFO] Command line:
01:54:13 	[/opt/public/common/java/oracle/jdk1.8.0_192_x64/jre/bin/java, -Dosgi.noShutdown=false, -Dosgi.os=linux, -Dosgi.ws=gtk, -Dosgi.arch=x86_64, -javaagent:/home/hudson/genie.papyrus/.jenkins/jobs/Papyrus-Oxygen-Tests-Failures/workspace/.repository/org/jacoco/org.jacoco.agent/0.7.9/org.jacoco.agent-0.7.9-runtime.jar=destfile=/jobs/genie.papyrus/Papyrus-Oxygen-Tests-Failures/workspace/source/tests/junit/plugins/toolsmiths/org.eclipse.papyrus.toolsmiths.suite.tests/target/jacoco.exec,includes=org.eclipse.papyrus.*,excludes=org.eclipse.uml2, -Xms512m, -Xmx2048m, -XX:SoftRefLRUPolicyMSPerMB=100, -Dosgi.clean=true, -jar, /jobs/genie.papyrus/Papyrus-Oxygen-Tests-Failures/workspace/.repository/p2/osgi/bundle/org.eclipse.equinox.launcher/1.4.0.v20161219-1356/org.eclipse.equinox.launcher-1.4.0.v20161219-1356.jar, -data, /jobs/genie.papyrus/Papyrus-Oxygen-Tests-Failures/workspace/source/tests/junit/plugins/toolsmiths/org.eclipse.papyrus.toolsmiths.suite.tests/target/work/data, -install, /jobs/genie.papyrus/Papyrus-Oxygen-Tests-Failures/workspace/source/tests/junit/plugins/toolsmiths/org.eclipse.papyrus.toolsmiths.suite.tests/target/work, -configuration, /jobs/genie.papyrus/Papyrus-Oxygen-Tests-Failures/workspace/source/tests/junit/plugins/toolsmiths/org.eclipse.papyrus.toolsmiths.suite.tests/target/work/configuration, -application, org.eclipse.tycho.surefire.osgibooter.uitest, -testproperties, /jobs/genie.papyrus/Papyrus-Oxygen-Tests-Failures/workspace/source/tests/junit/plugins/toolsmiths/org.eclipse.papyrus.toolsmiths.suite.tests/target/surefire.properties, -product, org.eclipse.sdk.ide, -testConfig=FAILING_TESTS_CONFIG]
01:54:13 Picked up JAVA_TOOL_OPTIONS: -Xmx2G -Djava.io.tmpdir=/tmp/genie.papyrus -DforkCount=1
01:54:21 
01:54:21 -------------------------------------------------------
01:54:21  T E S T S
01:54:21 -------------------------------------------------------
01:54:21 Running org.eclipse.papyrus.toolsmiths.suite.tests.AllTests
01:54:22 log4j:WARN No appenders could be found for logger (org.eclipse.emf.compare.EMFCompare).
01:54:22 log4j:WARN Please initialize the log4j system properly.
01:54:24 Tests run: 21, Failures: 0, Errors: 0, Skipped: 0, Time elapsed: 2.448 sec - in org.eclipse.papyrus.toolsmiths.suite.tests.AllTests
01:54:24 ProfileAutomaticMigrationTest(org.eclipse.papyrus.toolsmiths.profilemigration.tests.automatic.AutomaticMigrationTest)  Time elapsed: 0.003 sec
01:54:24 PackageAutomaticMigrationTest(org.eclipse.papyrus.toolsmiths.profilemigration.tests.automatic.AutomaticMigrationTest)  Time elapsed: 0.01 sec
01:54:24 StereotypeAutomaticMigrationTest_Stereotype_delete_Property(org.eclipse.papyrus.toolsmiths.profilemigration.tests.automatic.AutomaticMigrationTest)  Time elapsed: 0.001 sec
01:54:24 PropertyAutomaticMigrationTest(org.eclipse.papyrus.toolsmiths.profilemigration.tests.automatic.AutomaticMigrationTest)  Time elapsed: 0.001 sec
01:54:24 StereotypeAutomaticMigrationTest(org.eclipse.papyrus.toolsmiths.profilemigration.tests.automatic.AutomaticMigrationTest)  Time elapsed: 0 sec
01:54:24 GeneralizationAutomaticMigrationTest(org.eclipse.papyrus.toolsmiths.profilemigration.tests.automatic.AutomaticMigrationTest)  Time elapsed: 0.002 sec
01:54:24 atomicListTest(org.eclipse.papyrus.toolsmiths.profilemigration.tests.migrators.ChangeIsAbstractFromStereotypeTest)  Time elapsed: 0.001 sec
01:54:24 atomicListMoveProfileIntoNonApplyProfileTest(org.eclipse.papyrus.toolsmiths.profilemigration.tests.migrators.MoveMigratorTest)  Time elapsed: 0.04 sec
01:54:24 atomicListMoveStereotypeIntoNonApplyProfileTest(org.eclipse.papyrus.toolsmiths.profilemigration.tests.migrators.MoveMigratorTest)  Time elapsed: 0.04 sec
01:54:24 atomicListMovePackageIntoAlreadyApplyProfileTest(org.eclipse.papyrus.toolsmiths.profilemigration.tests.migrators.MoveMigratorTest)  Time elapsed: 0.037 sec
01:54:24 atomicListMoveStereotypeIntoAlreadyApplyProfileTest(org.eclipse.papyrus.toolsmiths.profilemigration.tests.migrators.MoveMigratorTest)  Time elapsed: 0.032 sec
01:54:24 atomicListMovePackageIntoNonApplyProfileTest(org.eclipse.papyrus.toolsmiths.profilemigration.tests.migrators.MoveMigratorTest)  Time elapsed: 0.043 sec
01:54:24 atomicListMoveProfileIntoAlreadyApplyProfileTest(org.eclipse.papyrus.toolsmiths.profilemigration.tests.migrators.MoveMigratorTest)  Time elapsed: 0.036 sec
01:54:24 UpperMultiplicityTest(org.eclipse.papyrus.toolsmiths.profilemigration.tests.migrators.ChangeMultiplicityFromPropertyMigratorTest)  Time elapsed: 0.002 sec
01:54:24 atomicListTest(org.eclipse.papyrus.toolsmiths.profilemigration.tests.migrators.ChangeMultiplicityFromPropertyMigratorTest)  Time elapsed: 0 sec
01:54:24 LowerMultiplicityTest(org.eclipse.papyrus.toolsmiths.profilemigration.tests.migrators.ChangeMultiplicityFromPropertyMigratorTest)  Time elapsed: 0 sec
01:54:24 DeleteEnumerationLiteralTest(org.eclipse.papyrus.toolsmiths.profilemigration.tests.migrators.DeleteEnumLiteralFromEnumerationTest)  Time elapsed: 0.002 sec
01:54:24 MoveEnumerationLiteralTest(org.eclipse.papyrus.toolsmiths.profilemigration.tests.migrators.DeleteEnumLiteralFromEnumerationTest)  Time elapsed: 0.001 sec
01:54:24 atomicListTest(org.eclipse.papyrus.toolsmiths.profilemigration.tests.migrators.DeleteEnumLiteralFromEnumerationTest)  Time elapsed: 0 sec
01:54:24 atomicListTest(org.eclipse.papyrus.toolsmiths.profilemigration.tests.migrators.ChangeIsStaticFromPropertyTest)  Time elapsed: 0.001 sec
01:54:24 atomicListTest(org.eclipse.papyrus.toolsmiths.profilemigration.tests.migrators.AddPropertyToStereotypeTest)  Time elapsed: 0.001 sec
01:54:24 
01:54:24 Results :
01:54:24 
01:54:24 Tests run: 21, Failures: 0, Errors: 0, Skipped: 0
01:54:24 
01:54:26 [INFO] All tests passed!
01:54:26 [INFO] 
01:54:26 [INFO] --- jacoco-maven-plugin:0.7.9:report (default-report) @ org.eclipse.papyrus.toolsmiths.suite.tests ---
01:54:26 [INFO] Loading execution data file /jobs/genie.papyrus/Papyrus-Oxygen-Tests-Failures/workspace/source/tests/junit/plugins/toolsmiths/org.eclipse.papyrus.toolsmiths.suite.tests/target/jacoco.exec
01:54:26 [INFO] Analyzed bundle 'org.eclipse.papyrus.toolsmiths.suite.tests' with 0 classes
01:54:26 [INFO] 
01:54:26 [INFO] --< org.eclipse.papyrus:org.eclipse.papyrus.main.tests.target.parent >--
01:54:26 [INFO] Building org.eclipse.papyrus.main.tests.target.parent 0.0.1-SNAPSHOT [154/155]
01:54:26 [INFO] --------------------------------[ pom ]---------------------------------
01:54:26 [INFO] 
01:54:26 [INFO] --- maven-clean-plugin:2.6:clean (default-clean) @ org.eclipse.papyrus.main.tests.target.parent ---
01:54:26 [INFO] 
01:54:26 [INFO] --- jacoco-maven-plugin:0.7.9:prepare-agent (default-prepare-agent) @ org.eclipse.papyrus.main.tests.target.parent ---
01:54:26 [INFO] argLine set to -javaagent:/home/hudson/genie.papyrus/.jenkins/jobs/Papyrus-Oxygen-Tests-Failures/workspace/.repository/org/jacoco/org.jacoco.agent/0.7.9/org.jacoco.agent-0.7.9-runtime.jar=destfile=/jobs/genie.papyrus/Papyrus-Oxygen-Tests-Failures/workspace/source/releng/main-tests/targetPlatform/target/jacoco.exec,includes=org.eclipse.papyrus.*,excludes=org.eclipse.uml2
01:54:26 [INFO] 
01:54:26 [INFO] --- jacoco-maven-plugin:0.7.9:report (default-report) @ org.eclipse.papyrus.main.tests.target.parent ---
01:54:26 [INFO] Skipping JaCoCo execution due to missing execution data file.
01:54:26 [INFO] 
01:54:26 [INFO] --< org.eclipse.papyrus:org.eclipse.papyrus.main.tests.portable.target >--
01:54:26 [INFO] Building org.eclipse.papyrus.main.tests.portable.target 0.0.1-SNAPSHOT [155/155]
01:54:26 [INFO] ---------------------[ eclipse-target-definition ]----------------------
01:54:26 [INFO] 
01:54:26 [INFO] --- maven-clean-plugin:2.6:clean (default-clean) @ org.eclipse.papyrus.main.tests.portable.target ---
01:54:26 [INFO] 
01:54:26 [INFO] --- jacoco-maven-plugin:0.7.9:prepare-agent (default-prepare-agent) @ org.eclipse.papyrus.main.tests.portable.target ---
01:54:26 [INFO] argLine set to -javaagent:/home/hudson/genie.papyrus/.jenkins/jobs/Papyrus-Oxygen-Tests-Failures/workspace/.repository/org/jacoco/org.jacoco.agent/0.7.9/org.jacoco.agent-0.7.9-runtime.jar=destfile=/jobs/genie.papyrus/Papyrus-Oxygen-Tests-Failures/workspace/source/releng/main-tests/targetPlatform/portable/target/jacoco.exec,includes=org.eclipse.papyrus.*,excludes=org.eclipse.uml2
01:54:26 [INFO] 
01:54:26 [INFO] --- tycho-packaging-plugin:1.0.0:package-target-definition (default-package-target-definition) @ org.eclipse.papyrus.main.tests.portable.target ---
01:54:26 [INFO] 
01:54:26 [INFO] --- jacoco-maven-plugin:0.7.9:report (default-report) @ org.eclipse.papyrus.main.tests.portable.target ---
01:54:26 [INFO] Skipping JaCoCo execution due to missing execution data file.
01:54:26 [INFO] ------------------------------------------------------------------------
01:54:26 [INFO] Reactor Summary:
01:54:26 [INFO] 
01:54:26 [INFO] org.eclipse.papyrus.tests.releng 1.2.0-SNAPSHOT .... SUCCESS [01:26 min]
01:54:26 [INFO] org.eclipse.papyrus.plugins.tests.releng 0.0.1-SNAPSHOT SUCCESS [  0.005 s]
01:54:26 [INFO] org.eclipse.papyrus.editor.tests.releng 0.0.1-SNAPSHOT SUCCESS [  0.004 s]
01:54:26 [INFO] org.eclipse.papyrus.editor.integration.tests 1.3.100-SNAPSHOT SUCCESS [ 29.968 s]
01:54:26 [INFO] org.eclipse.papyrus.infra.tests.releng 0.0.1-SNAPSHOT SUCCESS [  0.005 s]
01:54:26 [INFO] org.eclipse.papyrus.infra.core.tests.releng 0.0.1-SNAPSHOT SUCCESS [  0.003 s]
01:54:26 [INFO] org.eclipse.papyrus.infra.core.clipboard.tests 1.3.0-SNAPSHOT SUCCESS [  0.434 s]
01:54:26 [INFO] org.eclipse.papyrus.infra.core.sasheditor.tests 1.2.0-SNAPSHOT SUCCESS [  1.231 s]
01:54:26 [INFO] org.eclipse.papyrus.infra.core.sasheditor.di.tests 1.2.0-SNAPSHOT SUCCESS [  0.297 s]
01:54:26 [INFO] org.eclipse.papyrus.infra.core.tests 3.0.1-SNAPSHOT  SUCCESS [  0.811 s]
01:54:26 [INFO] org.eclipse.papyrus.infra.editor.tests.releng 0.0.1-SNAPSHOT SUCCESS [  0.007 s]
01:54:26 [INFO] org.eclipse.papyrus.infra.editor.welcome.tests 1.2.0-SNAPSHOT SUCCESS [  0.471 s]
01:54:26 [INFO] org.eclipse.papyrus.infra.emf.tests.releng 0.0.1-SNAPSHOT SUCCESS [  0.004 s]
01:54:26 [INFO] org.eclipse.papyrus.infra.emf.gmf.tests 1.2.100-SNAPSHOT SUCCESS [  0.281 s]
01:54:26 [INFO] org.eclipse.papyrus.infra.emf.readonly.tests 1.2.0-SNAPSHOT SUCCESS [  0.282 s]
01:54:26 [INFO] org.eclipse.papyrus.infra.emf.tests 1.4.0-SNAPSHOT . SUCCESS [  0.474 s]
01:54:26 [INFO] org.eclipse.papyrus.infra.filters.tests 1.2.0-SNAPSHOT SUCCESS [  0.144 s]
01:54:26 [INFO] org.eclipse.papyrus.infra.gmfdiag.tests.releng 0.0.1-SNAPSHOT SUCCESS [  0.004 s]
01:54:26 [INFO] org.eclipse.papyrus.infra.gmfdiag.assistant.tests.releng 0.0.1-SNAPSHOT SUCCESS [  0.008 s]
01:54:26 [INFO] org.eclipse.papyrus.infra.gmfdiag.assistant.tests 1.2.0-SNAPSHOT SUCCESS [  0.421 s]
01:54:26 [INFO] org.eclipse.papyrus.infra.gmfdiag.canonical.tests 1.2.0-SNAPSHOT SUCCESS [  0.510 s]
01:54:26 [INFO] org.eclipse.papyrus.infra.gmfdiag.commands.tests 1.2.0-SNAPSHOT SUCCESS [  0.524 s]
01:54:26 [INFO] org.eclipse.papyrus.infra.gmfdiag.common.tests 3.0.0-SNAPSHOT SUCCESS [  0.504 s]
01:54:26 [INFO] org.eclipse.papyrus.infra.gmfdiag.css.tests 1.2.0-SNAPSHOT SUCCESS [  0.472 s]
01:54:26 [INFO] org.eclipse.papyrus.infra.gmfdiag.menu.tests 1.2.0-SNAPSHOT SUCCESS [  0.357 s]
01:54:26 [INFO] org.eclipse.papyrus.infra.gmfdiag.paletteconfiguration.tests 1.2.0-SNAPSHOT SUCCESS [  0.277 s]
01:54:26 [INFO] org.eclipse.papyrus.infra.gmfdiag.welcome.tests 1.2.0-SNAPSHOT SUCCESS [  0.407 s]
01:54:26 [INFO] org.eclipse.papyrus.infra.nattable.main.test 1.2.0-SNAPSHOT SUCCESS [  0.005 s]
01:54:26 [INFO] org.eclipse.papyrus.infra.nattable.common.tests 1.2.100-SNAPSHOT SUCCESS [  0.401 s]
01:54:26 [INFO] org.eclipse.papyrus.infra.nattable.model.editor.tests 1.2.100-SNAPSHOT SUCCESS [  0.313 s]
01:54:26 [INFO] org.eclipse.papyrus.infra.nattable.model.tests 1.2.100-SNAPSHOT SUCCESS [  0.374 s]
01:54:26 [INFO] org.eclipse.papyrus.infra.nattable.tests 1.2.100-SNAPSHOT SUCCESS [  0.402 s]
01:54:26 [INFO] org.eclipse.papyrus.infra.nattable.views.tests 1.2.100-SNAPSHOT SUCCESS [  0.383 s]
01:54:26 [INFO] org.eclipse.papyrus.infra.properties.tests.releng 0.0.1-SNAPSHOT SUCCESS [  0.002 s]
01:54:26 [INFO] org.eclipse.papyrus.infra.properties.ui.tests 2.0.0-SNAPSHOT SUCCESS [  0.294 s]
01:54:26 [INFO] org.eclipse.papyrus.infra.services.tests.releng 0.0.1-SNAPSHOT SUCCESS [  0.003 s]
01:54:26 [INFO] org.eclipse.papyrus.infra.services.controlmode.tests 1.4.0-SNAPSHOT SUCCESS [  1.109 s]
01:54:26 [INFO] org.eclipse.papyrus.infra.services.edit.tests 1.2.0-SNAPSHOT SUCCESS [  0.354 s]
01:54:26 [INFO] org.eclipse.papyrus.infra.services.edit.ui.tests 1.2.0-SNAPSHOT SUCCESS [  0.259 s]
01:54:26 [INFO] org.eclipse.papyrus.infra.services.resourceloading.tests 1.2.0-SNAPSHOT SUCCESS [  0.300 s]
01:54:26 [INFO] org.eclipse.papyrus.infra.services.semantic.tests 1.2.100-SNAPSHOT SUCCESS [  0.413 s]
01:54:26 [INFO] org.eclipse.papyrus.infra.tools.tests 1.2.0-SNAPSHOT SUCCESS [  0.521 s]
01:54:26 [INFO] org.eclipse.papyrus.infra.types.tests.releng 0.0.1-SNAPSHOT SUCCESS [  0.003 s]
01:54:26 [INFO] org.eclipse.papyrus.infra.types.tests 3.0.0-SNAPSHOT SUCCESS [  0.388 s]
01:54:26 [INFO] org.eclipse.papyrus.infra.types.ui.tests 3.0.0-SNAPSHOT SUCCESS [  0.551 s]
01:54:26 [INFO] org.eclipse.papyrus.infra.ui.emf.tests 1.2.0-SNAPSHOT SUCCESS [  0.420 s]
01:54:26 [INFO] org.eclipse.papyrus.infra.ui.tests 1.2.0-SNAPSHOT .. SUCCESS [  0.370 s]
01:54:26 [INFO] org.eclipse.papyrus.infra.viewpoints.tests.releng 1.2.0-SNAPSHOT SUCCESS [  0.003 s]
01:54:26 [INFO] org.eclipse.papyrus.infra.viewpoints.policy.tests 1.2.0-SNAPSHOT SUCCESS [  0.332 s]
01:54:26 [INFO] org.eclipse.papyrus.uml.tests.releng 0.0.1-SNAPSHOT  SUCCESS [  0.003 s]
01:54:26 [INFO] org.eclipse.papyrus.uml.diagram.tests.releng 1.2.0-SNAPSHOT SUCCESS [  0.002 s]
01:54:26 [INFO] org.eclipse.papyrus.uml.diagram.tests 1.3.0-SNAPSHOT SUCCESS [  0.704 s]
01:54:26 [INFO] org.eclipse.papyrus.uml.diagram.clazz.tests 1.3.0-SNAPSHOT SUCCESS [  0.545 s]
01:54:26 [INFO] org.eclipse.papyrus.uml.diagram.activity.tests 1.2.0-SNAPSHOT SUCCESS [  0.639 s]
01:54:26 [INFO] org.eclipse.papyrus.uml.diagram.usecase.tests 1.2.0-SNAPSHOT SUCCESS [  0.391 s]
01:54:26 [INFO] org.eclipse.papyrus.uml.diagram.deployment.tests 1.2.0-SNAPSHOT SUCCESS [  0.472 s]
01:54:26 [INFO] org.eclipse.papyrus.uml.diagram.component.tests 1.2.0-SNAPSHOT SUCCESS [  0.455 s]
01:54:26 [INFO] org.eclipse.papyrus.uml.diagram.timing.tests 1.2.0-SNAPSHOT SUCCESS [  0.624 s]
01:54:26 [INFO] org.eclipse.papyrus.uml.diagram.stereotypeproperty.tests 1.2.0-SNAPSHOT SUCCESS [  0.499 s]
01:54:26 [INFO] org.eclipse.papyrus.uml.diagram.sequence.tests 1.3.100-SNAPSHOT SUCCESS [  0.709 s]
01:54:26 [INFO] org.eclipse.papyrus.uml.diagram.composite.tests 1.2.0-SNAPSHOT SUCCESS [  0.495 s]
01:54:26 [INFO] org.eclipse.papyrus.uml.diagram.wizards.tests 1.2.0-SNAPSHOT SUCCESS [  0.428 s]
01:54:26 [INFO] org.eclipse.papyrus.uml.diagram.profile.tests 1.2.0-SNAPSHOT SUCCESS [  0.612 s]
01:54:26 [INFO] org.eclipse.papyrus.uml.dynamic.profile.tests 1.2.0-SNAPSHOT SUCCESS [  0.035 s]
01:54:26 [INFO] org.eclipse.papyrus.uml.diagram.common.tests 1.3.0-SNAPSHOT SUCCESS [  0.663 s]
01:54:26 [INFO] org.eclipse.papyrus.tests.uml.diagram.feature 1.2.0-SNAPSHOT SUCCESS [  0.189 s]
01:54:26 [INFO] org.eclipse.papyrus.tests.infra.services.feature 1.2.0-SNAPSHOT SUCCESS [  0.072 s]
01:54:26 [INFO] org.eclipse.papyrus.views.tests.releng 0.0.1-SNAPSHOT SUCCESS [  0.003 s]
01:54:26 [INFO] org.eclipse.papyrus.views.modelexplorer.tests 1.2.100-SNAPSHOT SUCCESS [  0.315 s]
01:54:26 [INFO] org.eclipse.papyrus.uml.modelexplorer.tests.releng 0.0.1-SNAPSHOT SUCCESS [  0.003 s]
01:54:26 [INFO] org.eclipse.papyrus.uml.modelexplorer.tests 1.3.100-SNAPSHOT SUCCESS [  0.356 s]
01:54:26 [INFO] org.eclipse.papyrus.uml.modelrepair.tests 1.2.100-SNAPSHOT SUCCESS [  0.495 s]
01:54:26 [INFO] org.eclipse.papyrus.uml.service.types.tests 1.2.0-SNAPSHOT SUCCESS [  0.480 s]
01:54:26 [INFO] org.eclipse.papyrus.uml.service.types.ui.tests 1.2.0-SNAPSHOT SUCCESS [  0.535 s]
01:54:26 [INFO] org.eclipse.papyrus.uml.profile.tests.releng 0.0.1-SNAPSHOT SUCCESS [  0.002 s]
01:54:26 [INFO] org.eclipse.papyrus.uml.profile.drafter.tests 1.2.0-SNAPSHOT SUCCESS [  0.443 s]
01:54:26 [INFO] org.eclipse.papyrus.uml.filters.tests 1.2.0-SNAPSHOT SUCCESS [  0.361 s]
01:54:26 [INFO] org.eclipse.papyrus.uml.profile.tests 1.2.0-SNAPSHOT SUCCESS [  0.300 s]
01:54:26 [INFO] org.eclipse.papyrus.tests.uml.feature 1.2.0-SNAPSHOT SUCCESS [  0.108 s]
01:54:26 [INFO] org.eclipse.papyrus.tests.views.feature 1.2.0-SNAPSHOT SUCCESS [  0.032 s]
01:54:26 [INFO] org.eclipse.papyrus.tests.infra.nattable.feature 1.3.0-SNAPSHOT SUCCESS [  0.122 s]
01:54:26 [INFO] org.eclipse.papyrus.uml.nattable.main.test 1.2.0-SNAPSHOT SUCCESS [  0.003 s]
01:54:26 [INFO] org.eclipse.papyrus.uml.nattable.tests 1.2.100-SNAPSHOT SUCCESS [  0.329 s]
01:54:26 [INFO] org.eclipse.papyrus.uml.nattable.generic.tests 1.2.100-SNAPSHOT SUCCESS [  0.658 s]
01:54:26 [INFO] org.eclipse.papyrus.uml.nattable.clazz.config.tests 1.2.100-SNAPSHOT SUCCESS [  0.888 s]
01:54:26 [INFO] org.eclipse.papyrus.uml.nattable.stereotyped.elements.tests 1.0.100-SNAPSHOT SUCCESS [  0.657 s]
01:54:26 [INFO] org.eclipse.papyrus.uml.nattable.matrix.tests 1.0.0-SNAPSHOT SUCCESS [  0.392 s]
01:54:26 [INFO] org.eclipse.papyrus.tests.uml.nattable.feature 1.3.0-SNAPSHOT SUCCESS [  0.138 s]
01:54:26 [INFO] org.eclipse.papyrus.tests.infra.feature 1.2.0-SNAPSHOT SUCCESS [  0.235 s]
01:54:26 [INFO] org.eclipse.papyrus.tests.infra.core.feature 1.2.0-SNAPSHOT SUCCESS [  0.099 s]
01:54:26 [INFO] org.eclipse.papyrus.uml.tools.tests.releng 0.0.1-SNAPSHOT SUCCESS [  0.005 s]
01:54:26 [INFO] org.eclipse.papyrus.uml.tools.tests 3.0.0-SNAPSHOT . SUCCESS [  0.638 s]
01:54:26 [INFO] org.eclipse.papyrus.uml.tools.utils.tests 1.3.0-SNAPSHOT SUCCESS [  0.378 s]
01:54:26 [INFO] org.eclipse.papyrus.tests.uml.tools.feature 1.2.0-SNAPSHOT SUCCESS [  0.045 s]
01:54:26 [INFO] org.eclipse.papyrus.uml.decoratormodel.tests.releng 0.0.1-SNAPSHOT SUCCESS [  0.002 s]
01:54:26 [INFO] org.eclipse.papyrus.uml.decoratormodel.tests 1.2.0-SNAPSHOT SUCCESS [  0.420 s]
01:54:26 [INFO] org.eclipse.papyrus.uml.decoratormodel.controlmode.tests 1.2.0-SNAPSHOT SUCCESS [  0.454 s]
01:54:26 [INFO] org.eclipse.papyrus.tests.uml.decoratormodel.feature 1.2.0-SNAPSHOT SUCCESS [  0.037 s]
01:54:26 [INFO] org.eclipse.papyrus.uml.textedit.tests.releng 0.0.1-SNAPSHOT SUCCESS [  0.002 s]
01:54:26 [INFO] org.eclipse.papyrus.uml.textedit.tests 1.2.0-SNAPSHOT SUCCESS [  0.292 s]
01:54:26 [INFO] org.eclipse.papyrus.uml.textedit.parameter.tests 1.2.0-SNAPSHOT SUCCESS [  0.375 s]
01:54:26 [INFO] org.eclipse.papyrus.uml.textedit.port.tests 1.2.0-SNAPSHOT SUCCESS [  0.382 s]
01:54:26 [INFO] org.eclipse.papyrus.uml.textedit.property.tests 1.2.0-SNAPSHOT SUCCESS [  0.339 s]
01:54:26 [INFO] org.eclipse.papyrus.uml.textedit.tests.feature 1.2.0-SNAPSHOT SUCCESS [  0.052 s]
01:54:26 [INFO] org.eclipse.papyrus.uml.assistants.tests.releng 0.0.1-SNAPSHOT SUCCESS [  0.002 s]
01:54:26 [INFO] org.eclipse.papyrus.uml.profile.types.generator.tests 1.2.0-SNAPSHOT SUCCESS [  0.509 s]
01:54:26 [INFO] org.eclipse.papyrus.uml.profile.assistants.generator.tests 1.2.0-SNAPSHOT SUCCESS [  0.521 s]
01:54:26 [INFO] org.eclipse.papyrus.tests.uml.assistants.feature 1.2.0-SNAPSHOT SUCCESS [  0.047 s]
01:54:26 [INFO] org.eclipse.papyrus.toolsmiths.tests.releng 0.0.1-SNAPSHOT SUCCESS [  0.003 s]
01:54:26 [INFO] org.eclipse.papyrus.toolsmiths.profilemigration.tests 0.7.0-SNAPSHOT SUCCESS [  0.395 s]
01:54:26 [INFO] org.eclipse.papyrus.tests.toolsmiths.feature 1.0.0-SNAPSHOT SUCCESS [  0.034 s]
01:54:26 [INFO] org.eclipse.papyrus.tests.feature 1.3.0-SNAPSHOT ... SUCCESS [  0.751 s]
01:54:26 [INFO] org.eclipse.papyrus.infra.emf.expressions.main.tests 0.0.1-SNAPSHOT SUCCESS [  0.003 s]
01:54:26 [INFO] org.eclipse.papyrus.infra.emf.expressions.tests 1.0.0-SNAPSHOT SUCCESS [  0.106 s]
01:54:26 [INFO] org.eclipse.papyrus.tests.infra.emf.expressions.feature 1.0.0-SNAPSHOT SUCCESS [  0.019 s]
01:54:26 [INFO] org.eclipse.papyrus.uml.expressions.tests.releng 0.0.1-SNAPSHOT SUCCESS [  0.003 s]
01:54:26 [INFO] org.eclipse.papyrus.uml.expressions.tests 1.0.0-SNAPSHOT SUCCESS [  0.382 s]
01:54:26 [INFO] org.eclipse.papyrus.tests.uml.expressions.feature 1.0.0-SNAPSHOT SUCCESS [  0.051 s]
01:54:26 [INFO] org.eclipse.papyrus.uml.alf.tests 1.2.0-SNAPSHOT ... SUCCESS [03:11 min]
01:54:26 [INFO] org.eclipse.papyrus.uml.alf.tests.feature 1.2.0-SNAPSHOT SUCCESS [  0.124 s]
01:54:26 [INFO] org.eclipse.papyrus.developer.suite.tests 0.0.1-SNAPSHOT SUCCESS [ 13.556 s]
01:54:26 [INFO] org.eclipse.papyrus.developer.tests.releng 0.0.1-SNAPSHOT SUCCESS [  0.004 s]
01:54:26 [INFO] org.eclipse.papyrus.eclipse.project.editors.tests 2.0.0-SNAPSHOT SUCCESS [  0.447 s]
01:54:26 [INFO] org.eclipse.papyrus.editors.suite.tests 0.0.1-SNAPSHOT SUCCESS [ 16.096 s]
01:54:26 [INFO] org.eclipse.papyrus.infra.core.suite.tests 0.0.1-SNAPSHOT SUCCESS [ 26.221 s]
01:54:26 [INFO] org.eclipse.papyrus.infra.nattable.suite.tests 0.0.1-SNAPSHOT SUCCESS [ 13.550 s]
01:54:26 [INFO] org.eclipse.papyrus.infra.internationalization.main.test 1.0.0-SNAPSHOT SUCCESS [  0.005 s]
01:54:26 [INFO] org.eclipse.papyrus.infra.internationalization.tests 1.1.0-SNAPSHOT SUCCESS [  0.486 s]
01:54:26 [INFO] org.eclipse.papyrus.infra.services.labelprovider.tests 1.2.1-SNAPSHOT SUCCESS [  0.301 s]
01:54:26 [INFO] org.eclipse.papyrus.infra.suite.tests 0.0.1-SNAPSHOT SUCCESS [ 26.854 s]
01:54:26 [INFO] org.eclipse.papyrus.infra.newchild.tests 1.2.0-SNAPSHOT SUCCESS [  0.328 s]
01:54:26 [INFO] org.eclipse.papyrus.uml.diagram.communication.tests 1.2.0-SNAPSHOT SUCCESS [  0.421 s]
01:54:26 [INFO] org.eclipse.papyrus.uml.diagram.interactionoverview.tests 1.2.0-SNAPSHOT SUCCESS [  0.320 s]
01:54:26 [INFO] org.eclipse.papyrus.uml.diagram.statemachine.tests 1.2.0-SNAPSHOT SUCCESS [  0.416 s]
01:54:26 [INFO] org.eclipse.papyrus.uml.diagram.suite.tests 0.0.1-SNAPSHOT SUCCESS [06:43 min]
01:54:26 [INFO] org.eclipse.papyrus.uml.diagram.dnd.tests 1.2.0-SNAPSHOT SUCCESS [  0.242 s]
01:54:26 [INFO] org.eclipse.papyrus.uml.nattable.stereotype.display.tests 1.2.100-SNAPSHOT SUCCESS [  0.376 s]
01:54:26 [INFO] org.eclipse.papyrus.uml.nattable.suite.tests 0.0.1-SNAPSHOT SUCCESS [02:54 min]
01:54:26 [INFO] org.eclipse.papyrus.uml.textedit.valuespecification.tests 1.2.0-SNAPSHOT SUCCESS [  0.498 s]
01:54:26 [INFO] org.eclipse.papyrus.uml.textedit.suite.tests 0.0.1-SNAPSHOT SUCCESS [ 18.758 s]
01:54:26 [INFO] org.eclipse.papyrus.uml.internationalization.main.test 1.0.0-SNAPSHOT SUCCESS [  0.004 s]
01:54:26 [INFO] org.eclipse.papyrus.uml.internationalization.tests 1.1.0-SNAPSHOT SUCCESS [  0.370 s]
01:54:26 [INFO] org.eclipse.papyrus.uml.validation.tests.releng 0.0.1-SNAPSHOT SUCCESS [  0.003 s]
01:54:26 [INFO] org.eclipse.papyrus.uml.validation.tests.staticprofile 1.2.0-SNAPSHOT SUCCESS [  0.177 s]
01:54:26 [INFO] org.eclipse.papyrus.uml.validation.tests.genvalidation 1.2.0-SNAPSHOT SUCCESS [  0.284 s]
01:54:26 [INFO] org.eclipse.papyrus.uml.validation.tests 1.2.0-SNAPSHOT SUCCESS [  0.342 s]
01:54:26 [INFO] org.eclipse.papyrus.uml.suite.tests 0.0.1-SNAPSHOT . SUCCESS [01:02 min]
01:54:26 [INFO] org.eclipse.papyrus.uml.alf.tests.releng 0.0.1-SNAPSHOT SUCCESS [  0.004 s]
01:54:26 [INFO] org.eclipse.papyrus.uml.alf.backend.tests 1.1.0-SNAPSHOT SUCCESS [  0.689 s]
01:54:26 [INFO] org.eclipse.papyrus.uml.internationalization.controlmode.tests 1.0.0-SNAPSHOT SUCCESS [  0.376 s]
01:54:26 [INFO] org.eclipse.papyrus.views.properties.toolsmiths.tests 1.2.0-SNAPSHOT SUCCESS [  0.226 s]
01:54:26 [INFO] org.eclipse.papyrus.views.suite.tests 0.0.1-SNAPSHOT SUCCESS [ 16.287 s]
01:54:26 [INFO] org.eclipse.papyrus.toolsmiths.suite.tests 0.0.1-SNAPSHOT SUCCESS [ 15.068 s]
01:54:26 [INFO] org.eclipse.papyrus.main.tests.target.parent 0.0.1-SNAPSHOT SUCCESS [  0.004 s]
01:54:26 [INFO] org.eclipse.papyrus.main.tests.portable.target 0.0.1-SNAPSHOT SUCCESS [  0.003 s]
01:54:26 [INFO] ------------------------------------------------------------------------
01:54:26 [INFO] BUILD SUCCESS
01:54:26 [INFO] ------------------------------------------------------------------------
01:54:26 [INFO] Total time:  26:54 min
01:54:26 [INFO] Finished at: 2019-11-10T01:54:26-05:00
01:54:26 [INFO] ------------------------------------------------------------------------
01:54:28 Taking screenshot.
01:54:28 [workspace] $ echo $XAUTHORITY
01:54:28 /home/hudson/genie.papyrus/.jenkins/jobs/Papyrus-Oxygen-Tests-Failures/workspace/.Xauthority-5001610379273905021
01:54:28 [workspace] $ ls -l $XAUTHORITY
01:54:28 -rw-rw-r-- 1 genie.papyrus modeling.mdt.papyrus 0 Nov 10 01:27 /home/hudson/genie.papyrus/.jenkins/jobs/Papyrus-Oxygen-Tests-Failures/workspace/.Xauthority-5001610379273905021
01:54:28 [workspace] $ import -window root -display :724 screenshot.jpg
01:54:28 Terminating xvnc.
01:54:39 Sending e-mails to: quentin.lemenez@cea.fr
01:54:39 Recording test results
01:54:41 Build step 'Publish JUnit test result report' changed build result to UNSTABLE
01:54:41 Started calculate disk usage of build
01:54:41 Finished Calculation of disk usage of build in 0 seconds
01:54:41 Started calculate disk usage of workspace
01:54:42 Finished Calculation of disk usage of workspace in  1 second
01:54:42 [WS-CLEANUP] Deleting project workspace...
01:54:42 [WS-CLEANUP] Deferred wipeout is used...
01:54:42 [WS-CLEANUP] done
01:54:42 Finished: UNSTABLE