UnstableConsole Output

Skipping 4,234 KB.. Full Log
g.eclipse.uml2
01:26:49 [INFO] 
01:26:49 [INFO] --- maven-resources-plugin:2.6:resources (default-resources) @ org.eclipse.papyrus.uml.validation.tests ---
01:26:49 [INFO] Using 'UTF-8' encoding to copy filtered resources.
01:26:49 [INFO] skip non existing resourceDirectory /jobs/genie.papyrus/Papyrus-Oxygen-Tests-Failures/workspace/source/tests/junit/plugins/uml/validation/org.eclipse.papyrus.uml.validation.tests/src/main/resources
01:26:49 [INFO] 
01:26:49 [INFO] --- tycho-compiler-plugin:1.0.0:compile (default-compile) @ org.eclipse.papyrus.uml.validation.tests ---
01:26:49 [INFO] Compiling 10 source files to /jobs/genie.papyrus/Papyrus-Oxygen-Tests-Failures/workspace/source/tests/junit/plugins/uml/validation/org.eclipse.papyrus.uml.validation.tests/target/classes
01:26:49 [INFO] 
01:26:49 [INFO] --- maven-resources-plugin:2.6:testResources (default-testResources) @ org.eclipse.papyrus.uml.validation.tests ---
01:26:49 [INFO] Using 'UTF-8' encoding to copy filtered resources.
01:26:49 [INFO] skip non existing resourceDirectory /jobs/genie.papyrus/Papyrus-Oxygen-Tests-Failures/workspace/source/tests/junit/plugins/uml/validation/org.eclipse.papyrus.uml.validation.tests/src/test/resources
01:26:49 [INFO] 
01:26:49 [INFO] --- target-platform-configuration:1.0.0:target-platform (default-target-platform) @ org.eclipse.papyrus.uml.validation.tests ---
01:26:49 [INFO] 
01:26:49 [INFO] --- tycho-packaging-plugin:1.0.0:package-plugin (default-package-plugin) @ org.eclipse.papyrus.uml.validation.tests ---
01:26:49 [INFO] Building jar: /jobs/genie.papyrus/Papyrus-Oxygen-Tests-Failures/workspace/source/tests/junit/plugins/uml/validation/org.eclipse.papyrus.uml.validation.tests/target/org.eclipse.papyrus.uml.validation.tests-1.2.0-SNAPSHOT.jar
01:26:49 [INFO] 
01:26:49 [INFO] --- tycho-p2-plugin:1.0.0:p2-metadata-default (default-p2-metadata-default) @ org.eclipse.papyrus.uml.validation.tests ---
01:26:49 [INFO] 
01:26:49 [INFO] --- tycho-surefire-plugin:1.0.0:test (default-test) @ org.eclipse.papyrus.uml.validation.tests ---
01:26:49 [INFO] Skipping tests
01:26:49 [INFO] 
01:26:49 [INFO] --- jacoco-maven-plugin:0.7.9:report (default-report) @ org.eclipse.papyrus.uml.validation.tests ---
01:26:49 [INFO] Skipping JaCoCo execution due to missing execution data file.
01:26:49 [INFO] 
01:26:49 [INFO] ---< org.eclipse.papyrus.tests:org.eclipse.papyrus.uml.suite.tests >----
01:26:49 [INFO] Building org.eclipse.papyrus.uml.suite.tests 0.0.1-SNAPSHOT    [147/155]
01:26:49 [INFO] ------------------------[ eclipse-test-plugin ]-------------------------
01:26:50 [INFO] 
01:26:50 [INFO] --- maven-clean-plugin:2.6:clean (default-clean) @ org.eclipse.papyrus.uml.suite.tests ---
01:26:50 [INFO] 
01:26:50 [INFO] --- tycho-packaging-plugin:1.0.0:build-qualifier (default-build-qualifier) @ org.eclipse.papyrus.uml.suite.tests ---
01:26:50 [INFO] The project's OSGi version is 0.0.1.201911030605
01:26:50 [INFO] 
01:26:50 [INFO] --- tycho-packaging-plugin:1.0.0:validate-id (default-validate-id) @ org.eclipse.papyrus.uml.suite.tests ---
01:26:50 [INFO] 
01:26:50 [INFO] --- tycho-packaging-plugin:1.0.0:validate-version (default-validate-version) @ org.eclipse.papyrus.uml.suite.tests ---
01:26:50 [INFO] 
01:26:50 [INFO] --- jacoco-maven-plugin:0.7.9:prepare-agent (default-prepare-agent) @ org.eclipse.papyrus.uml.suite.tests ---
01:26:50 [INFO] tycho.testArgLine set to -javaagent:/home/hudson/genie.papyrus/.jenkins/jobs/Papyrus-Oxygen-Tests-Failures/workspace/.repository/org/jacoco/org.jacoco.agent/0.7.9/org.jacoco.agent-0.7.9-runtime.jar=destfile=/jobs/genie.papyrus/Papyrus-Oxygen-Tests-Failures/workspace/source/tests/junit/plugins/uml/org.eclipse.papyrus.uml.suite.tests/target/jacoco.exec,includes=org.eclipse.papyrus.*,excludes=org.eclipse.uml2
01:26:50 [INFO] 
01:26:50 [INFO] --- maven-resources-plugin:2.6:resources (default-resources) @ org.eclipse.papyrus.uml.suite.tests ---
01:26:50 [INFO] Using 'UTF-8' encoding to copy filtered resources.
01:26:50 [INFO] skip non existing resourceDirectory /jobs/genie.papyrus/Papyrus-Oxygen-Tests-Failures/workspace/source/tests/junit/plugins/uml/org.eclipse.papyrus.uml.suite.tests/src/main/resources
01:26:50 [INFO] 
01:26:50 [INFO] --- tycho-compiler-plugin:1.0.0:compile (default-compile) @ org.eclipse.papyrus.uml.suite.tests ---
01:26:50 [INFO] Compiling 2 source files to /jobs/genie.papyrus/Papyrus-Oxygen-Tests-Failures/workspace/source/tests/junit/plugins/uml/org.eclipse.papyrus.uml.suite.tests/target/classes
01:26:50 [INFO] 
01:26:50 [INFO] --- maven-resources-plugin:2.6:testResources (default-testResources) @ org.eclipse.papyrus.uml.suite.tests ---
01:26:50 [INFO] Using 'UTF-8' encoding to copy filtered resources.
01:26:50 [INFO] skip non existing resourceDirectory /jobs/genie.papyrus/Papyrus-Oxygen-Tests-Failures/workspace/source/tests/junit/plugins/uml/org.eclipse.papyrus.uml.suite.tests/src/test/resources
01:26:50 [INFO] 
01:26:50 [INFO] --- target-platform-configuration:1.0.0:target-platform (default-target-platform) @ org.eclipse.papyrus.uml.suite.tests ---
01:26:50 [INFO] 
01:26:50 [INFO] --- tycho-packaging-plugin:1.0.0:package-plugin (default-package-plugin) @ org.eclipse.papyrus.uml.suite.tests ---
01:26:50 [INFO] Building jar: /jobs/genie.papyrus/Papyrus-Oxygen-Tests-Failures/workspace/source/tests/junit/plugins/uml/org.eclipse.papyrus.uml.suite.tests/target/org.eclipse.papyrus.uml.suite.tests-0.0.1-SNAPSHOT.jar
01:26:50 [INFO] 
01:26:50 [INFO] --- tycho-p2-plugin:1.0.0:p2-metadata-default (default-p2-metadata-default) @ org.eclipse.papyrus.uml.suite.tests ---
01:26:50 [INFO] 
01:26:50 [INFO] --- tycho-surefire-plugin:1.0.0:test (default-test) @ org.eclipse.papyrus.uml.suite.tests ---
01:26:52 [INFO] Expected eclipse log file: /jobs/genie.papyrus/Papyrus-Oxygen-Tests-Failures/workspace/source/tests/junit/plugins/uml/org.eclipse.papyrus.uml.suite.tests/target/work/data/.metadata/.log
01:26:52 [INFO] Command line:
01:26:52 	[/opt/public/common/java/oracle/jdk1.8.0_192_x64/jre/bin/java, -Dosgi.noShutdown=false, -Dosgi.os=linux, -Dosgi.ws=gtk, -Dosgi.arch=x86_64, -javaagent:/home/hudson/genie.papyrus/.jenkins/jobs/Papyrus-Oxygen-Tests-Failures/workspace/.repository/org/jacoco/org.jacoco.agent/0.7.9/org.jacoco.agent-0.7.9-runtime.jar=destfile=/jobs/genie.papyrus/Papyrus-Oxygen-Tests-Failures/workspace/source/tests/junit/plugins/uml/org.eclipse.papyrus.uml.suite.tests/target/jacoco.exec,includes=org.eclipse.papyrus.*,excludes=org.eclipse.uml2, -Xms512m, -Xmx2048m, -XX:SoftRefLRUPolicyMSPerMB=100, -Dosgi.clean=true, -jar, /jobs/genie.papyrus/Papyrus-Oxygen-Tests-Failures/workspace/.repository/p2/osgi/bundle/org.eclipse.equinox.launcher/1.4.0.v20161219-1356/org.eclipse.equinox.launcher-1.4.0.v20161219-1356.jar, -data, /jobs/genie.papyrus/Papyrus-Oxygen-Tests-Failures/workspace/source/tests/junit/plugins/uml/org.eclipse.papyrus.uml.suite.tests/target/work/data, -install, /jobs/genie.papyrus/Papyrus-Oxygen-Tests-Failures/workspace/source/tests/junit/plugins/uml/org.eclipse.papyrus.uml.suite.tests/target/work, -configuration, /jobs/genie.papyrus/Papyrus-Oxygen-Tests-Failures/workspace/source/tests/junit/plugins/uml/org.eclipse.papyrus.uml.suite.tests/target/work/configuration, -application, org.eclipse.tycho.surefire.osgibooter.uitest, -testproperties, /jobs/genie.papyrus/Papyrus-Oxygen-Tests-Failures/workspace/source/tests/junit/plugins/uml/org.eclipse.papyrus.uml.suite.tests/target/surefire.properties, -product, org.eclipse.sdk.ide, -testConfig=FAILING_TESTS_CONFIG]
01:26:52 Picked up JAVA_TOOL_OPTIONS: -Xmx2G -Djava.io.tmpdir=/tmp/genie.papyrus -DforkCount=1
01:27:01 
01:27:01 -------------------------------------------------------
01:27:01  T E S T S
01:27:01 -------------------------------------------------------
01:27:01 Running org.eclipse.papyrus.uml.suite.tests.AllTests
01:27:44 Tests run: 655, Failures: 8, Errors: 0, Skipped: 594, Time elapsed: 42.15 sec <<< FAILURE! - in org.eclipse.papyrus.uml.suite.tests.AllTests
01:27:44 testUML(org.eclipse.papyrus.uml.service.types.tests.creation.CreatePureUMLElementTest) skipped
01:27:44 test(org.eclipse.papyrus.uml.service.types.tests.creation.CreatePureUMLElementTest) skipped
01:27:44 testDeleteOneAddVariableValueAction(org.eclipse.papyrus.uml.service.types.tests.deletion.DeletePureUMLElementTest) skipped
01:27:44 testDeleteOneCentralBufferNode(org.eclipse.papyrus.uml.service.types.tests.deletion.DeletePureUMLElementTest) skipped
01:27:44 stereotypeApplicationsDeleted:command(org.eclipse.papyrus.uml.service.types.tests.deletion.DeleteDependentWithStereotypeApplications458685) skipped
01:27:44 stereotypeApplicationsDeleted:elements(org.eclipse.papyrus.uml.service.types.tests.deletion.DeleteDependentWithStereotypeApplications458685) skipped
01:27:44 stereotypeApplicationsDeleted:stereotypes(org.eclipse.papyrus.uml.service.types.tests.deletion.DeleteDependentWithStereotypeApplications458685) skipped
01:27:44 stereotypeApplicationsDeleted:undo(org.eclipse.papyrus.uml.service.types.tests.deletion.DeleteDependentWithStereotypeApplications458685) skipped
01:27:44 stereotypeApplicationsDeleted:redo(org.eclipse.papyrus.uml.service.types.tests.deletion.DeleteDependentWithStereotypeApplications458685) skipped
01:27:44 deleteInitialState(org.eclipse.papyrus.uml.service.types.tests.deletion.DeleteTransitionsWithVertexTest)  Time elapsed: 0.94 sec
01:27:44 deleteS1(org.eclipse.papyrus.uml.service.types.tests.deletion.DeleteTransitionsWithVertexTest)  Time elapsed: 0.392 sec
01:27:44 deleteS2(org.eclipse.papyrus.uml.service.types.tests.deletion.DeleteTransitionsWithVertexTest)  Time elapsed: 0.116 sec
01:27:44 deleteFinalState(org.eclipse.papyrus.uml.service.types.tests.deletion.DeleteTransitionsWithVertexTest)  Time elapsed: 0.132 sec
01:27:44 deleteFromContainmentSubset(org.eclipse.papyrus.uml.service.types.tests.deletion.DeleteContainmentSubsetTest) skipped
01:27:44 deleteFromTwoContainmentSupersetsAtOnce(org.eclipse.papyrus.uml.service.types.tests.deletion.DeleteContainmentSubsetTest) skipped
01:27:44 createAssociationWritable(org.eclipse.papyrus.uml.service.types.tests.creation.ConnectorReadOnlyTestBug465899) skipped
01:27:44 createAssociationReadOnly_usecase(org.eclipse.papyrus.uml.service.types.tests.creation.ConnectorReadOnlyTestBug465899) skipped
01:27:44 createAssociationReadOnly(org.eclipse.papyrus.uml.service.types.tests.creation.ConnectorReadOnlyTestBug465899) skipped
01:27:44 createConnectorTargetReadOnly(org.eclipse.papyrus.uml.service.types.tests.creation.ConnectorReadOnlyTestBug465899) skipped
01:27:44 createConnectorSourceReadOnly(org.eclipse.papyrus.uml.service.types.tests.creation.ConnectorReadOnlyTestBug465899) skipped
01:27:44 testDeletion(org.eclipse.papyrus.uml.service.types.tests.deletion.DeleteAssociationPropertyTypeTest) skipped
01:27:44 testDeletionInCompositeDiagram(org.eclipse.papyrus.uml.service.types.tests.deletion.DeleteCommentLinkTest) skipped
01:27:44 testDeletionWithSetRequest(org.eclipse.papyrus.uml.service.types.tests.deletion.DeleteCommentLinkTest)  Time elapsed: 7.769 sec  <<< FAILURE!
01:27:44 java.lang.AssertionError: expected:<8> but was:<10>
01:27:44 	at org.junit.Assert.fail(Assert.java:88)
01:27:44 	at org.junit.Assert.failNotEquals(Assert.java:834)
01:27:44 	at org.junit.Assert.assertEquals(Assert.java:645)
01:27:44 	at org.junit.Assert.assertEquals(Assert.java:631)
01:27:44 	at org.eclipse.papyrus.uml.service.types.tests.deletion.DeleteCommentLinkTest.checkDiagramAfterLinkDeletion(DeleteCommentLinkTest.java:354)
01:27:44 	at org.eclipse.papyrus.uml.service.types.tests.deletion.DeleteCommentLinkTest.checkModelAndDiagramsAfterLinkDeletion(DeleteCommentLinkTest.java:333)
01:27:44 	at org.eclipse.papyrus.uml.service.types.tests.deletion.DeleteCommentLinkTest.testDeletionWithSetRequest(DeleteCommentLinkTest.java:219)
01:27:44 
01:27:44 testDeletionInClassDiagram(org.eclipse.papyrus.uml.service.types.tests.deletion.DeleteCommentLinkTest) skipped
01:27:44 testDeletionInComponentDiagram(org.eclipse.papyrus.uml.service.types.tests.deletion.DeleteCommentLinkTest) skipped
01:27:44 testCreation(org.eclipse.papyrus.uml.service.types.tests.creation.CreateAssociationTest) skipped
01:27:44 testCreation(org.eclipse.papyrus.uml.service.types.tests.creation.CreateAssociationDirectedTest) skipped
01:27:44 testCreation(org.eclipse.papyrus.uml.service.types.tests.creation.CreateAssociationCompositeTest) skipped
01:27:44 testCreation(org.eclipse.papyrus.uml.service.types.tests.creation.CreateAssociationCompositeDirectedTest) skipped
01:27:44 testCreation(org.eclipse.papyrus.uml.service.types.tests.creation.CreateAssociationSharedTest) skipped
01:27:44 testCreation(org.eclipse.papyrus.uml.service.types.tests.creation.CreateAssociationSharedDirectedTest) skipped
01:27:44 deleteInteractionFragmentInOperand(org.eclipse.papyrus.uml.service.types.tests.deletion.InteractionDeletionTest)  Time elapsed: 0.593 sec
01:27:44 deleteAllOperandsOfCombinedFragment(org.eclipse.papyrus.uml.service.types.tests.deletion.InteractionDeletionTest)  Time elapsed: 0.538 sec
01:27:44 deleteCombinedFragment(org.eclipse.papyrus.uml.service.types.tests.deletion.InteractionDeletionTest)  Time elapsed: 0.409 sec
01:27:44 deleteCombinedFragmentNested(org.eclipse.papyrus.uml.service.types.tests.deletion.InteractionDeletionTest)  Time elapsed: 0.487 sec
01:27:44 deleteOperandsOfCombinedFragment(org.eclipse.papyrus.uml.service.types.tests.deletion.InteractionDeletionTest)  Time elapsed: 0.433 sec
01:27:44 deleteCombinedFragmentDeeplyNested(org.eclipse.papyrus.uml.service.types.tests.deletion.InteractionDeletionTest)  Time elapsed: 0.376 sec
01:27:44 deleteInteractionWithNesting(org.eclipse.papyrus.uml.service.types.tests.deletion.InteractionDeletionTest)  Time elapsed: 0.417 sec
01:27:44 deleteInteraction(org.eclipse.papyrus.uml.service.types.tests.deletion.InteractionDeletionTest)  Time elapsed: 0.403 sec
01:27:44 testCreateClassInModel(org.eclipse.papyrus.uml.service.types.ui.tests.creation.CreateElementTest) skipped
01:27:44 testCreateCentralBufferNodeInActivity(org.eclipse.papyrus.uml.service.types.ui.tests.creation.CreateElementTest) skipped
01:27:44 testCreateCentralBufferNodeInActivityWithNode(org.eclipse.papyrus.uml.service.types.ui.tests.creation.CreateElementTest) skipped
01:27:44 testCannotCreateOperationRedefinableTemplateSignature_bug468071(org.eclipse.papyrus.uml.service.types.ui.tests.creation.CreateElementTest) skipped
01:27:44 testCreateOperationTemplateSignature_bug468071(org.eclipse.papyrus.uml.service.types.ui.tests.creation.CreateElementTest) skipped
01:27:44 testCreateModelInClass(org.eclipse.papyrus.uml.service.types.ui.tests.creation.CreateElementTest) skipped
01:27:44 org.eclipse.papyrus.uml.service.types.ui.tests.creation.CreateElementTest skipped
01:27:44 testCreateDeploymentBetweenNodeAndArtifactInNode(org.eclipse.papyrus.uml.service.types.ui.tests.creation.CreateRelationshipTest) skipped
01:27:44 testCreatePackageMergeBetweenPackageAndPackageInPackage2(org.eclipse.papyrus.uml.service.types.ui.tests.creation.CreateRelationshipTest) skipped
01:27:44 testCreateTraceBetweenClassAndNullInPackage(org.eclipse.papyrus.uml.service.types.ui.tests.creation.CreateRelationshipTest) skipped
01:27:44 testCreateDependencyBetweenClassesInPackage(org.eclipse.papyrus.uml.service.types.ui.tests.creation.CreateRelationshipTest) skipped
01:27:44 testCreateProtocolConformanceBetweenPackageAndPackageInPackage(org.eclipse.papyrus.uml.service.types.ui.tests.creation.CreateRelationshipTest) skipped
01:27:44 testCreateInformationfloweBetweenClasses2InPackage(org.eclipse.papyrus.uml.service.types.ui.tests.creation.CreateRelationshipTest) skipped
01:27:44 testCreateUsageBetweenClassAndNullInPackage(org.eclipse.papyrus.uml.service.types.ui.tests.creation.CreateRelationshipTest) skipped
01:27:44 testCreateAbstractionBetweenPackageAndClassesInModel(org.eclipse.papyrus.uml.service.types.ui.tests.creation.CreateRelationshipTest) skipped
01:27:44 testCreateComponentRealizationBetweenClassAndComponentInComponent(org.eclipse.papyrus.uml.service.types.ui.tests.creation.CreateRelationshipTest) skipped
01:27:44 testCreateAbstractionBetweenClassesInPackage(org.eclipse.papyrus.uml.service.types.ui.tests.creation.CreateRelationshipTest) skipped
01:27:44 testCreateUsageBetweenClassesInPackage(org.eclipse.papyrus.uml.service.types.ui.tests.creation.CreateRelationshipTest) skipped
01:27:44 testCreatePackageImportBetweenPackageAndPackageInPackage(org.eclipse.papyrus.uml.service.types.ui.tests.creation.CreateRelationshipTest) skipped
01:27:44 testCreateComponentRealizationBetweenComponentAndClassInComponent(org.eclipse.papyrus.uml.service.types.ui.tests.creation.CreateRelationshipTest) skipped
01:27:44 testCreateElementImportBetweenPackageAndPackageInPackage(org.eclipse.papyrus.uml.service.types.ui.tests.creation.CreateRelationshipTest) skipped
01:27:44 testCreateDeploymentBetweenNodeAndArtifactInArtifact(org.eclipse.papyrus.uml.service.types.ui.tests.creation.CreateRelationshipTest) skipped
01:27:44 testCreateGeneralizationBetweenClassesInPackage(org.eclipse.papyrus.uml.service.types.ui.tests.creation.CreateRelationshipTest) skipped
01:27:44 testCreateGeneralizationBetweenClassAndNullInClass(org.eclipse.papyrus.uml.service.types.ui.tests.creation.CreateRelationshipTest) skipped
01:27:44 testCreateDeploymentBetweenArtifactAndNodeInArtifact(org.eclipse.papyrus.uml.service.types.ui.tests.creation.CreateRelationshipTest) skipped
01:27:44 testCreateExtendBetweenClasses2InPackage(org.eclipse.papyrus.uml.service.types.ui.tests.creation.CreateRelationshipTest) skipped
01:27:44 testCreateProtocolConformanceBetweenPackageAndPackageInPackage2(org.eclipse.papyrus.uml.service.types.ui.tests.creation.CreateRelationshipTest) skipped
01:27:44 testCreateTransitionBetweenInitialAndState(org.eclipse.papyrus.uml.service.types.ui.tests.creation.CreateRelationshipTest) skipped
01:27:44 testCreateInformationfloweBetweenUseCases2InUseCase(org.eclipse.papyrus.uml.service.types.ui.tests.creation.CreateRelationshipTest) skipped
01:27:44 testCreateRefineBetweenClassesInPackage(org.eclipse.papyrus.uml.service.types.ui.tests.creation.CreateRelationshipTest) skipped
01:27:44 testCreateComponentRealizationBetweenClassAndComponentInClass(org.eclipse.papyrus.uml.service.types.ui.tests.creation.CreateRelationshipTest) skipped
01:27:44 testCreateRealizationBetweenClassAndNullInPackage(org.eclipse.papyrus.uml.service.types.ui.tests.creation.CreateRelationshipTest) skipped
01:27:44 testCreateExtensionBetweenClassAndNullInNull(org.eclipse.papyrus.uml.service.types.ui.tests.creation.CreateRelationshipTest) skipped
01:27:44 testCreateExtendBetweenUseCases2InUseCase(org.eclipse.papyrus.uml.service.types.ui.tests.creation.CreateRelationshipTest) skipped
01:27:44 testCreateElementImportBetweenPackageAndPackageInPackage2(org.eclipse.papyrus.uml.service.types.ui.tests.creation.CreateRelationshipTest) skipped
01:27:44 testCreateAssociationBetweenClassesInPackage(org.eclipse.papyrus.uml.service.types.ui.tests.creation.CreateRelationshipTest) skipped
01:27:44 testCreateTraceBetweenClassesInClass(org.eclipse.papyrus.uml.service.types.ui.tests.creation.CreateRelationshipTest) skipped
01:27:44 testCreateManifestationBetweenArtifactAndPackage2InArtifact(org.eclipse.papyrus.uml.service.types.ui.tests.creation.CreateRelationshipTest) skipped
01:27:44 testCreateSubstitutionBetweenClassesInPackage(org.eclipse.papyrus.uml.service.types.ui.tests.creation.CreateRelationshipTest) skipped
01:27:44 testCreateAbstractionBetweenClassAndNullInPackage(org.eclipse.papyrus.uml.service.types.ui.tests.creation.CreateRelationshipTest) skipped
01:27:44 testCreateAbstractionBetweenClassAndClassInClass(org.eclipse.papyrus.uml.service.types.ui.tests.creation.CreateRelationshipTest) skipped
01:27:44 testCreatePackageMergeBetweenPackageAndPackageInPackage(org.eclipse.papyrus.uml.service.types.ui.tests.creation.CreateRelationshipTest) skipped
01:27:44 testCreateRealizationBetweenClassesInPackage(org.eclipse.papyrus.uml.service.types.ui.tests.creation.CreateRelationshipTest) skipped
01:27:44 testCreateTransitionBetweenStateAndInitial(org.eclipse.papyrus.uml.service.types.ui.tests.creation.CreateRelationshipTest) skipped
01:27:44 testCreateAssociationBetweenClassAndNullInPackage(org.eclipse.papyrus.uml.service.types.ui.tests.creation.CreateRelationshipTest) skipped
01:27:44 testCreateRefineBetweenClassAndNullInPackage(org.eclipse.papyrus.uml.service.types.ui.tests.creation.CreateRelationshipTest) skipped
01:27:44 testCreateDeploymentBetweenArtifactAndNodeInNode(org.eclipse.papyrus.uml.service.types.ui.tests.creation.CreateRelationshipTest) skipped
01:27:44 testCreateIncludeBetweenUseCases2InUseCase(org.eclipse.papyrus.uml.service.types.ui.tests.creation.CreateRelationshipTest) skipped
01:27:44 testCreateGeneralizationBetweenClassesInClass(org.eclipse.papyrus.uml.service.types.ui.tests.creation.CreateRelationshipTest) skipped
01:27:44 testCreateExtensionBetweenClassAndNullInClass(org.eclipse.papyrus.uml.service.types.ui.tests.creation.CreateRelationshipTest) skipped
01:27:44 testCreateDependencyBetweenClassAndNullInPackage(org.eclipse.papyrus.uml.service.types.ui.tests.creation.CreateRelationshipTest) skipped
01:27:44 testCreatePackageImportBetweenPackageAndPackageInPackage2(org.eclipse.papyrus.uml.service.types.ui.tests.creation.CreateRelationshipTest) skipped
01:27:44 testCreateComponentRealizationBetweenComponentAndClass(org.eclipse.papyrus.uml.service.types.ui.tests.creation.CreateRelationshipTest) skipped
01:27:44 testCreateSubstitutionBetweenClassAndNullInPackage(org.eclipse.papyrus.uml.service.types.ui.tests.creation.CreateRelationshipTest) skipped
01:27:44 testCreateInterfaceRealizationBetweenClassAndInterfaceInClass(org.eclipse.papyrus.uml.service.types.ui.tests.creation.CreateRelationshipTest) skipped
01:27:44 testCreateTraceBetweenClassesInPackage(org.eclipse.papyrus.uml.service.types.ui.tests.creation.CreateRelationshipTest) skipped
01:27:44 testCreateTransitionBetweenStateAndFinal(org.eclipse.papyrus.uml.service.types.ui.tests.creation.CreateRelationshipTest) skipped
01:27:44 testCreateAbstractionBetweenClassAndPackageInModel(org.eclipse.papyrus.uml.service.types.ui.tests.creation.CreateRelationshipTest) skipped
01:27:44 testCreateRefineBetweenClassesInClass(org.eclipse.papyrus.uml.service.types.ui.tests.creation.CreateRelationshipTest) skipped
01:27:44 testCreateTransitionBetweenFinalAndState(org.eclipse.papyrus.uml.service.types.ui.tests.creation.CreateRelationshipTest) skipped
01:27:44 testCreateManifestationBetweenClassAndPackage2InArtifact(org.eclipse.papyrus.uml.service.types.ui.tests.creation.CreateRelationshipTest) skipped
01:27:44 testCreateInterfaceRealizationBetweenUseCases2InUseCase(org.eclipse.papyrus.uml.service.types.ui.tests.creation.CreateRelationshipTest) skipped
01:27:44 testCreateIncludeBetweenClasses2InPackage(org.eclipse.papyrus.uml.service.types.ui.tests.creation.CreateRelationshipTest) skipped
01:27:44 org.eclipse.papyrus.uml.service.types.ui.tests.creation.CreateRelationshipTest skipped
01:27:44 testCreateExtensionBetweenStereotypeAndMetaClassInPackage(org.eclipse.papyrus.uml.service.types.ui.tests.creation.CreateProfileRelationshipTest) skipped
01:27:44 org.eclipse.papyrus.uml.service.types.ui.tests.creation.CreateProfileRelationshipTest skipped
01:27:44 testMoveTemplateSignatureToOperation_bug468071(org.eclipse.papyrus.uml.service.types.ui.tests.creation.MoveElementTest) skipped
01:27:44 testMoveRedefinableTemplateSignatureToClass_bug468071(org.eclipse.papyrus.uml.service.types.ui.tests.creation.MoveElementTest) skipped
01:27:44 testCannotMoveRedefinableTemplateSignatureToOperation_bug468071(org.eclipse.papyrus.uml.service.types.ui.tests.creation.MoveElementTest) skipped
01:27:44 org.eclipse.papyrus.uml.service.types.ui.tests.creation.MoveElementTest skipped
01:27:44 testSetTemplateSignatureOfOperation_bug468071(org.eclipse.papyrus.uml.service.types.ui.tests.creation.SetFeatureTest) skipped
01:27:44 testSetRedefinableTemplateSignatureOfClass_bug468071(org.eclipse.papyrus.uml.service.types.ui.tests.creation.SetFeatureTest) skipped
01:27:44 testCannotSetRedefinableTemplateSignatureOfOperation_bug468071(org.eclipse.papyrus.uml.service.types.ui.tests.creation.SetFeatureTest) skipped
01:27:44 org.eclipse.papyrus.uml.service.types.ui.tests.creation.SetFeatureTest skipped
01:27:44 deleteAssociation(org.eclipse.papyrus.uml.service.types.ui.tests.deletion.DeleteAssociationTest) skipped
01:27:44 deleteAssociationTarget(org.eclipse.papyrus.uml.service.types.ui.tests.deletion.DeleteAssociationTest) skipped
01:27:44 org.eclipse.papyrus.uml.service.types.ui.tests.deletion.DeleteAssociationTest skipped
01:27:44 org.eclipse.papyrus.uml.service.types.ui.tests.suites.AllTests skipped
01:27:44 deleteReadOnlyElement(org.eclipse.papyrus.uml.modelexplorer.tests.DeleteModelExplorerTest) skipped
01:27:44 deleteClassInTheModel(org.eclipse.papyrus.uml.modelexplorer.tests.DeleteModelExplorerTest) skipped
01:27:44 deleteRootOfTheModel(org.eclipse.papyrus.uml.modelexplorer.tests.DeleteModelExplorerTest) skipped
01:27:44 org.eclipse.papyrus.uml.modelexplorer.tests.DeleteModelExplorerTest skipped
01:27:44 renameUMLUnnamedElementTest(org.eclipse.papyrus.uml.modelexplorer.tests.RenameHandlerTest) skipped
01:27:44 renameUMLNamedElementTest(org.eclipse.papyrus.uml.modelexplorer.tests.RenameHandlerTest) skipped
01:27:44 org.eclipse.papyrus.uml.modelexplorer.tests.RenameHandlerTest skipped
01:27:44 revealSemanticElement_selectRootTest(org.eclipse.papyrus.uml.modelexplorer.tests.ModelExplorerViewTests) skipped
01:27:44 revealSemanticElement_selectChildrenTest(org.eclipse.papyrus.uml.modelexplorer.tests.ModelExplorerViewTests) skipped
01:27:44 revealSemanticElement_selectImportedPackage(org.eclipse.papyrus.uml.modelexplorer.tests.ModelExplorerViewTests) skipped
01:27:44 revealSemanticElement_selectImportedPackageList(org.eclipse.papyrus.uml.modelexplorer.tests.ModelExplorerViewTests) skipped
01:27:44 revealSemanticElement_selectChildrenTestList(org.eclipse.papyrus.uml.modelexplorer.tests.ModelExplorerViewTests) skipped
01:27:44 org.eclipse.papyrus.uml.modelexplorer.tests.ModelExplorerViewTests skipped
01:27:44 cutReadOnlyElement(org.eclipse.papyrus.uml.modelexplorer.tests.paste.CutPasteModelExplorerTest) skipped
01:27:44 cutClassTest(org.eclipse.papyrus.uml.modelexplorer.tests.paste.CutPasteModelExplorerTest) skipped
01:27:44 cutRootOfTheModel(org.eclipse.papyrus.uml.modelexplorer.tests.paste.CutPasteModelExplorerTest) skipped
01:27:44 org.eclipse.papyrus.uml.modelexplorer.tests.paste.CutPasteModelExplorerTest skipped
01:27:44 copyPasteofClass1Test(org.eclipse.papyrus.uml.modelexplorer.tests.paste.CopyPasteModelExplorerTest) skipped
01:27:44 pasteOnReadOnlyElement(org.eclipse.papyrus.uml.modelexplorer.tests.paste.CopyPasteModelExplorerTest) skipped
01:27:44 copyPasteofClass1And2Test(org.eclipse.papyrus.uml.modelexplorer.tests.paste.CopyPasteModelExplorerTest) skipped
01:27:44 org.eclipse.papyrus.uml.modelexplorer.tests.paste.CopyPasteModelExplorerTest skipped
01:27:44 copyPasteDiagramTest(org.eclipse.papyrus.uml.modelexplorer.tests.paste.DiagramCopyPasteModelExplorerTest) skipped
01:27:44 org.eclipse.papyrus.uml.modelexplorer.tests.paste.DiagramCopyPasteModelExplorerTest skipped
01:27:44 copyPasteTableTest(org.eclipse.papyrus.uml.modelexplorer.tests.paste.TableCopyPasteModelExplorerTest) skipped
01:27:44 org.eclipse.papyrus.uml.modelexplorer.tests.paste.TableCopyPasteModelExplorerTest skipped
01:27:44 copyPasteofClass1Test(org.eclipse.papyrus.uml.modelexplorer.tests.paste.StereotypeCopyPasteModelExplorerTest) skipped
01:27:44 org.eclipse.papyrus.uml.modelexplorer.tests.paste.StereotypeCopyPasteModelExplorerTest skipped
01:27:44 advancedModeDoesNotCollapseItself(org.eclipse.papyrus.uml.modelexplorer.tests.AdvancedModeTest) skipped
01:27:44 org.eclipse.papyrus.uml.modelexplorer.tests.AdvancedModeTest skipped
01:27:44 org.eclipse.papyrus.uml.modelexplorer.tests.AllTests skipped
01:27:44 dropInterface(org.eclipse.papyrus.uml.diagram.dnd.tests.tests.InstanceSpecificationTest) skipped
01:27:44 dropClass(org.eclipse.papyrus.uml.diagram.dnd.tests.tests.InstanceSpecificationTest) skipped
01:27:44 testPropertyContentProvider(org.eclipse.papyrus.uml.diagram.dnd.tests.tests.InstanceSpecificationTest) skipped
01:27:44 dropClassAndInterface(org.eclipse.papyrus.uml.diagram.dnd.tests.tests.InstanceSpecificationTest) skipped
01:27:44 dropClassAndSuperclass(org.eclipse.papyrus.uml.diagram.dnd.tests.tests.InstanceSpecificationTest) skipped
01:27:44 org.eclipse.papyrus.uml.diagram.dnd.tests.tests.InstanceSpecificationTest skipped
01:27:44 org.eclipse.papyrus.uml.diagram.dnd.tests.tests.AllTests skipped
01:27:44 singleValuePropertyGraphicalTest(org.eclipse.papyrus.uml.tools.tests.tests.ContentProviderTest) skipped
01:27:44 singleValuePropertyTest(org.eclipse.papyrus.uml.tools.tests.tests.ContentProviderTest) skipped
01:27:44 multipleValuePropertyTest(org.eclipse.papyrus.uml.tools.tests.tests.ContentProviderTest) skipped
01:27:44 enumPropertyTest(org.eclipse.papyrus.uml.tools.tests.tests.ContentProviderTest) skipped
01:27:44 testProfileContentWithBaseClassPropertyWithoutInheritedProperties(org.eclipse.papyrus.uml.tools.tests.tests.UMLStereotypePropertyContentProviderTest) skipped
01:27:44 testProfileContentWithoutBaseClassPropertyWithoutInheritedProperties(org.eclipse.papyrus.uml.tools.tests.tests.UMLStereotypePropertyContentProviderTest) skipped
01:27:44 testProfileContentWithBaseClassPropertyWithInheritedProperties(org.eclipse.papyrus.uml.tools.tests.tests.UMLStereotypePropertyContentProviderTest) skipped
01:27:44 testProfileContentWithoutBaseClassPropertyWithInheritedProperties(org.eclipse.papyrus.uml.tools.tests.tests.UMLStereotypePropertyContentProviderTest) skipped
01:27:44 testSwitchToProxy(org.eclipse.papyrus.uml.tools.tests.tests.DependencyManagementTest) skipped
01:27:44 testSwitchProfilesWithStereotypes(org.eclipse.papyrus.uml.tools.tests.tests.DependencyManagementTest) skipped
01:27:44 testSwitchFromRegistererdToLocal(org.eclipse.papyrus.uml.tools.tests.tests.DependencyManagementTest) skipped
01:27:44 testSwitchProfilesWithStereotypeProperties(org.eclipse.papyrus.uml.tools.tests.tests.DependencyManagementTest) skipped
01:27:44 testSwitchProfilesWithMissingDefinitions(org.eclipse.papyrus.uml.tools.tests.tests.DependencyManagementTest) skipped
01:27:44 testSwitchFromLocalToRegistered(org.eclipse.papyrus.uml.tools.tests.tests.DependencyManagementTest) skipped
01:27:44 testSwitchToDifferentVersion(org.eclipse.papyrus.uml.tools.tests.tests.DependencyManagementTest) skipped
01:27:44 testSimpleSwitch(org.eclipse.papyrus.uml.tools.tests.tests.DependencyManagementTest) skipped
01:27:44 testSwitchFromProxy(org.eclipse.papyrus.uml.tools.tests.tests.DependencyManagementTest) skipped
01:27:44 testSwitchProfilesStereotypeIdentities(org.eclipse.papyrus.uml.tools.tests.tests.DependencyManagementTest) skipped
01:27:44 testSwitchProfilesWithRequiredStereotypes(org.eclipse.papyrus.uml.tools.tests.tests.DependencyManagementTest) skipped
01:27:44 testOverloadDoesNotClash(org.eclipse.papyrus.uml.tools.tests.tests.NamedElementValidatorTest) skipped
01:27:44 testNameClash(org.eclipse.papyrus.uml.tools.tests.tests.NamedElementValidatorTest) skipped
01:27:44 testElementOfDifferentKindDoesNotClash(org.eclipse.papyrus.uml.tools.tests.tests.NamedElementValidatorTest) skipped
01:27:44 testModifiedSysMLStereotype(org.eclipse.papyrus.uml.tools.tests.tests.StereotypeElementListenerTest)  Time elapsed: 0.304 sec  <<< FAILURE!
01:27:44 java.lang.AssertionError: SysML dependency needs to be removed
01:27:44 	at org.junit.Assert.fail(Assert.java:88)
01:27:44 	at org.eclipse.papyrus.uml.tools.tests.tests.StereotypeElementListenerTest.testModifiedSysMLStereotype(StereotypeElementListenerTest.java:603)
01:27:44 
01:27:44 testUndoUnapplyProfile(org.eclipse.papyrus.uml.tools.tests.tests.StereotypeElementListenerTest) skipped
01:27:44 testAddStereotype(org.eclipse.papyrus.uml.tools.tests.tests.StereotypeElementListenerTest) skipped
01:27:44 testStereotypeUnsetAttributeChange(org.eclipse.papyrus.uml.tools.tests.tests.StereotypeElementListenerTest) skipped
01:27:44 testUndoAddStereotype(org.eclipse.papyrus.uml.tools.tests.tests.StereotypeElementListenerTest) skipped
01:27:44 testAddStereotypes(org.eclipse.papyrus.uml.tools.tests.tests.StereotypeElementListenerTest) skipped
01:27:44 testUndoRemoveStereotype(org.eclipse.papyrus.uml.tools.tests.tests.StereotypeElementListenerTest) skipped
01:27:44 testAddSysMLStereotype(org.eclipse.papyrus.uml.tools.tests.tests.StereotypeElementListenerTest) skipped
01:27:44 testModifiedStereotype(org.eclipse.papyrus.uml.tools.tests.tests.StereotypeElementListenerTest) skipped
01:27:44 testAddStereotypeOnSeveralElements(org.eclipse.papyrus.uml.tools.tests.tests.StereotypeElementListenerTest) skipped
01:27:44 testUndoAddStereotypes(org.eclipse.papyrus.uml.tools.tests.tests.StereotypeElementListenerTest) skipped
01:27:44 testFakeBasedProperty(org.eclipse.papyrus.uml.tools.tests.tests.StereotypeElementListenerTest) skipped
01:27:44 testRemoveStereotype(org.eclipse.papyrus.uml.tools.tests.tests.StereotypeElementListenerTest) skipped
01:27:44 testRemoveSysMLStereotype(org.eclipse.papyrus.uml.tools.tests.tests.StereotypeElementListenerTest) skipped
01:27:44 testUndoAddSysMLStereotype(org.eclipse.papyrus.uml.tools.tests.tests.StereotypeElementListenerTest) skipped
01:27:44 testUndoModifiedStereotype(org.eclipse.papyrus.uml.tools.tests.tests.StereotypeElementListenerTest) skipped
01:27:44 testUndoAddStereotypeOnSeveralElements(org.eclipse.papyrus.uml.tools.tests.tests.StereotypeElementListenerTest) skipped
01:27:44 testUndoRedoAddStereotypeTiming(org.eclipse.papyrus.uml.tools.tests.tests.StereotypeElementListenerTest) skipped
01:27:44 testUnapplyProfile(org.eclipse.papyrus.uml.tools.tests.tests.StereotypeElementListenerTest) skipped
01:27:44 testUndoRemoveSysMLStereotype(org.eclipse.papyrus.uml.tools.tests.tests.StereotypeElementListenerTest) skipped
01:27:44 testUndoModifiedSysMLStereotype(org.eclipse.papyrus.uml.tools.tests.tests.StereotypeElementListenerTest)  Time elapsed: 0.574 sec  <<< FAILURE!
01:27:44 java.lang.AssertionError: SysML dependency needs to be removed
01:27:44 	at org.junit.Assert.fail(Assert.java:88)
01:27:44 	at org.eclipse.papyrus.uml.tools.tests.tests.StereotypeElementListenerTest.testUndoModifiedSysMLStereotype(StereotypeElementListenerTest.java:632)
01:27:44 
01:27:44 testStereotypeListAttributeChange(org.eclipse.papyrus.uml.tools.tests.tests.StereotypeElementListenerTest) skipped
01:27:44 twoProfilesUnapplied(org.eclipse.papyrus.uml.tools.tests.tests.ProfileApplicationListenerTest) skipped
01:27:44 moveProfileApplication(org.eclipse.papyrus.uml.tools.tests.tests.ProfileApplicationListenerTest) skipped
01:27:44 applyProfileThenMoveApplication(org.eclipse.papyrus.uml.tools.tests.tests.ProfileApplicationListenerTest) skipped
01:27:44 twoProfilesApplied(org.eclipse.papyrus.uml.tools.tests.tests.ProfileApplicationListenerTest) skipped
01:27:44 profileReplacedInAnApplication(org.eclipse.papyrus.uml.tools.tests.tests.ProfileApplicationListenerTest) skipped
01:27:44 simpleNewProfileApplication(org.eclipse.papyrus.uml.tools.tests.tests.ProfileApplicationListenerTest) skipped
01:27:44 simpleProfileUnapplication(org.eclipse.papyrus.uml.tools.tests.tests.ProfileApplicationListenerTest) skipped
01:27:44 profileAppliedThenReplacedInSameApplication(org.eclipse.papyrus.uml.tools.tests.tests.ProfileApplicationListenerTest) skipped
01:27:44 testEditToDisplaySingleString_1(org.eclipse.papyrus.uml.tools.tests.tests.UMLReferenceConverterTest)  Time elapsed: 0.076 sec
01:27:44 testList(org.eclipse.papyrus.uml.tools.tests.tests.UMLReferenceConverterTest)  Time elapsed: 0.048 sec
01:27:44 testNull(org.eclipse.papyrus.uml.tools.tests.tests.UMLReferenceConverterTest)  Time elapsed: 0.049 sec
01:27:44 testDisplayToEditString_1(org.eclipse.papyrus.uml.tools.tests.tests.UMLReferenceConverterTest)  Time elapsed: 0.057 sec
01:27:44 testEmptyString(org.eclipse.papyrus.uml.tools.tests.tests.UMLReferenceConverterTest)  Time elapsed: 0.057 sec
01:27:44 testClass2(org.eclipse.papyrus.uml.tools.tests.tests.UMLReferenceConverterTest)  Time elapsed: 0.049 sec
01:27:44 testClass3(org.eclipse.papyrus.uml.tools.tests.tests.UMLReferenceConverterTest)  Time elapsed: 0.051 sec
01:27:44 testMatchingElementstSingleValue1(org.eclipse.papyrus.uml.tools.tests.tests.UMLReferenceConverterTest)  Time elapsed: 0.05 sec
01:27:44 testMatchingElementstSingleValue2(org.eclipse.papyrus.uml.tools.tests.tests.UMLReferenceConverterTest)  Time elapsed: 0.05 sec
01:27:44 testCompletionToFindClass_1(org.eclipse.papyrus.uml.tools.tests.tests.UMLReferenceConverterCompletionTest)  Time elapsed: 0.082 sec
01:27:44 testCompletionToFindClass_3(org.eclipse.papyrus.uml.tools.tests.tests.UMLReferenceConverterCompletionTest)  Time elapsed: 0.054 sec
01:27:44 testCompletionToFindClass_4(org.eclipse.papyrus.uml.tools.tests.tests.UMLReferenceConverterCompletionTest)  Time elapsed: 0.051 sec
01:27:44 testCompletionToFindClass_5(org.eclipse.papyrus.uml.tools.tests.tests.UMLReferenceConverterCompletionTest)  Time elapsed: 0.059 sec
01:27:44 testCompletionToFindClass_6(org.eclipse.papyrus.uml.tools.tests.tests.UMLReferenceConverterCompletionTest)  Time elapsed: 0.068 sec
01:27:44 testCompletionToFindClass_7(org.eclipse.papyrus.uml.tools.tests.tests.UMLReferenceConverterCompletionTest)  Time elapsed: 0.057 sec
01:27:44 testCompletionToFindClass_8(org.eclipse.papyrus.uml.tools.tests.tests.UMLReferenceConverterCompletionTest)  Time elapsed: 0.054 sec
01:27:44 testSplitString_1(org.eclipse.papyrus.uml.tools.tests.tests.UMLReferenceConverterCompletionTest)  Time elapsed: 0.057 sec
01:27:44 testSplitString_2(org.eclipse.papyrus.uml.tools.tests.tests.UMLReferenceConverterCompletionTest)  Time elapsed: 0.06 sec
01:27:44 testCompletionToFindConstraint_1(org.eclipse.papyrus.uml.tools.tests.tests.UMLReferenceConverterCompletionTest)  Time elapsed: 0.035 sec
01:27:44 testCompletionToFindConstraint_2(org.eclipse.papyrus.uml.tools.tests.tests.UMLReferenceConverterCompletionTest)  Time elapsed: 0.03 sec
01:27:44 testCompletionMultiValueConverterEmptyString(org.eclipse.papyrus.uml.tools.tests.tests.UMLReferenceConverterCompletionTest)  Time elapsed: 0.023 sec
01:27:44 testCompletionToFindPackage_1(org.eclipse.papyrus.uml.tools.tests.tests.UMLReferenceConverterCompletionTest)  Time elapsed: 0.03 sec
01:27:44 testCompletionToFindPackage_2(org.eclipse.papyrus.uml.tools.tests.tests.UMLReferenceConverterCompletionTest)  Time elapsed: 0.023 sec
01:27:44 testCompletionSingleValueConverterEmptyString(org.eclipse.papyrus.uml.tools.tests.tests.UMLReferenceConverterCompletionTest)  Time elapsed: 0.023 sec
01:27:44 profileLanguage(org.eclipse.papyrus.uml.tools.tests.tests.UMLLanguageProvidersTest)  Time elapsed: 0.001 sec
01:27:44 umlLanguage(org.eclipse.papyrus.uml.tools.tests.tests.UMLLanguageProvidersTest)  Time elapsed: 0 sec
01:27:44 ValidationStereotypesListClass1Test(org.eclipse.papyrus.uml.tools.tests.tests.IconsStereotypesTest)  Time elapsed: 1.193 sec
01:27:44 ValidationStereotypesListClass2Test(org.eclipse.papyrus.uml.tools.tests.tests.IconsStereotypesTest)  Time elapsed: 1.161 sec
01:27:44 ValidationStereotypesListClass3Test(org.eclipse.papyrus.uml.tools.tests.tests.IconsStereotypesTest)  Time elapsed: 1.132 sec
01:27:44 ValidationStereotypesListClass4Test(org.eclipse.papyrus.uml.tools.tests.tests.IconsStereotypesTest)  Time elapsed: 1.129 sec
01:27:44 ValidationImageClass1Test(org.eclipse.papyrus.uml.tools.tests.tests.IconsStereotypesTest)  Time elapsed: 1.125 sec
01:27:44 ValidationImageClass2Test(org.eclipse.papyrus.uml.tools.tests.tests.IconsStereotypesTest)  Time elapsed: 0.949 sec
01:27:44 ValidationImageClass3Test(org.eclipse.papyrus.uml.tools.tests.tests.IconsStereotypesTest)  Time elapsed: 1.575 sec
01:27:44 ValidationImageClass4Test(org.eclipse.papyrus.uml.tools.tests.tests.IconsStereotypesTest)  Time elapsed: 1.89 sec
01:27:44 returnedTextTest(org.eclipse.papyrus.uml.tools.tests.tests.CustomizableDelegatingItemLabelProviderTest)  Time elapsed: 1.338 sec
01:27:44 returnedStyledTextTest(org.eclipse.papyrus.uml.tools.tests.tests.CustomizableDelegatingItemLabelProviderTest)  Time elapsed: 0.994 sec
01:27:44 notifyChange(org.eclipse.papyrus.uml.tools.tests.tests.DelegatingItemLabelProviderTest)  Time elapsed: 0.063 sec
01:27:44 copyingInterfaceRealizationDoesNotCorruptTheModel(org.eclipse.papyrus.uml.tools.tests.tests.UMLCopyTest)  Time elapsed: 0.021 sec
01:27:44 recursiveImportPackage(org.eclipse.papyrus.uml.tools.utils.tests.tests.NameResolutionHelperTest) skipped
01:27:44 org.eclipse.papyrus.uml.tools.utils.tests.tests.NameResolutionHelperTest skipped
01:27:44 testIsAutoNamed(org.eclipse.papyrus.uml.tools.utils.tests.tests.NamedElementUtilTest) skipped
01:27:44 testGetDefaultNameWithIncrement(org.eclipse.papyrus.uml.tools.utils.tests.tests.NamedElementUtilTest) skipped
01:27:44 testAutoNameIncrement(org.eclipse.papyrus.uml.tools.utils.tests.tests.NamedElementUtilTest) skipped
01:27:44 testExistingElementHavingNameNotRenamed(org.eclipse.papyrus.uml.tools.utils.tests.tests.NamedElementUtilTest) skipped
01:27:44 org.eclipse.papyrus.uml.tools.utils.tests.tests.NamedElementUtilTest skipped
01:27:44 testGetAppliedSuperstereotype(org.eclipse.papyrus.uml.tools.utils.tests.tests.UMLUtilTest) skipped
01:27:44 testGetApplicableStereotype_notStrict_notApplicable(org.eclipse.papyrus.uml.tools.utils.tests.tests.UMLUtilTest) skipped
01:27:44 testGetApplicableStereotype_notStrict_applicable(org.eclipse.papyrus.uml.tools.utils.tests.tests.UMLUtilTest) skipped
01:27:44 testGetApplicableStereotype_strict_applicable(org.eclipse.papyrus.uml.tools.utils.tests.tests.UMLUtilTest) skipped
01:27:44 testGetAppliedSubstereotype_notApplied(org.eclipse.papyrus.uml.tools.utils.tests.tests.UMLUtilTest) skipped
01:27:44 testGetApplicableStereotype_strict_notApplicable(org.eclipse.papyrus.uml.tools.utils.tests.tests.UMLUtilTest) skipped
01:27:44 testGetAppliedSubstereotype_applied(org.eclipse.papyrus.uml.tools.utils.tests.tests.UMLUtilTest) skipped
01:27:44 org.eclipse.papyrus.uml.tools.utils.tests.tests.UMLUtilTest skipped
01:27:44 org.eclipse.papyrus.uml.tools.utils.tests.tests.AllTests skipped
01:27:44 testUnApplyStereotypeApplication(org.eclipse.papyrus.uml.diagram.stereotypeproperty.TestBadUnapplyProfile2ClosedDiagComment) skipped
01:27:44 testStereotypeApplicationOnClass(org.eclipse.papyrus.uml.diagram.stereotypeproperty.TestDropStereotypedClass) skipped
01:27:44 testProfileApplicationOnModel(org.eclipse.papyrus.uml.diagram.stereotypeproperty.TestProfileApplication) skipped
01:27:44 testBrace(org.eclipse.papyrus.uml.diagram.stereotypeproperty.tests.asbrace.TestDisplayAsBrace) skipped
01:27:44 testReopenStereotypeAsComment(org.eclipse.papyrus.uml.diagram.stereotypeproperty.tests.asbrace.TestReopenAsBrace) skipped
01:27:44 testStereotypeApplicationOnClass(org.eclipse.papyrus.uml.diagram.stereotypeproperty.tests.ascomment.TestDisplayAsComment) skipped
01:27:44 testReopenStereotypeAsComment(org.eclipse.papyrus.uml.diagram.stereotypeproperty.tests.ascomment.TestReopenAsComment) skipped
01:27:44 testStereotypeApplicationOnClass(org.eclipse.papyrus.uml.diagram.stereotypeproperty.tests.ascompartment.TestDisplayAsCompartment) skipped
01:27:44 testReopenStereotypeAsComment(org.eclipse.papyrus.uml.diagram.stereotypeproperty.tests.ascompartment.TestReopenAsCompartment) skipped
01:27:44 test2StereotypeApplicationsOnClass(org.eclipse.papyrus.uml.diagram.stereotypeproperty.tests.displayname.Test2StereotypeApplications) skipped
01:27:44 testStereotypeApplicationOnPackage(org.eclipse.papyrus.uml.diagram.stereotypeproperty.tests.displayname.TestStereotypeApplication) skipped
01:27:44 testStereotypeApplicationOnClass(org.eclipse.papyrus.uml.diagram.stereotypeproperty.tests.displayname.TestStereotypeApplication) skipped
01:27:44 testQNStereotypeApplicationOnClass(org.eclipse.papyrus.uml.diagram.stereotypeproperty.tests.displayname.TestStereotypeApplicationQualifiedName) skipped
01:27:44 testLayoutStereotypeApplicationOnClass(org.eclipse.papyrus.uml.diagram.stereotypeproperty.tests.layout.TestLayoutWithStereotype)  Time elapsed: 1.527 sec  <<< FAILURE!
01:27:44 java.lang.AssertionError: The label of stereotype for the Class is not good has not the good X coordinate expected:<0> but was:<1>
01:27:44 	at org.junit.Assert.fail(Assert.java:88)
01:27:44 	at org.junit.Assert.failNotEquals(Assert.java:834)
01:27:44 	at org.junit.Assert.assertEquals(Assert.java:645)
01:27:44 	at org.eclipse.papyrus.uml.diagram.stereotypeproperty.tests.layout.TestLayoutWithStereotype.assertDimension(TestLayoutWithStereotype.java:345)
01:27:44 	at org.eclipse.papyrus.uml.diagram.stereotypeproperty.tests.layout.TestLayoutWithStereotype.testToCreateANodeWithStereotype(TestLayoutWithStereotype.java:262)
01:27:44 	at org.eclipse.papyrus.uml.diagram.stereotypeproperty.tests.layout.TestLayoutWithStereotype.testLayoutStereotypeApplicationOnClass(TestLayoutWithStereotype.java:98)
01:27:44 
01:27:44 testLayoutOnClass(org.eclipse.papyrus.uml.diagram.stereotypeproperty.tests.layout.TestLayoutWithStereotype)  Time elapsed: 0.095 sec  <<< FAILURE!
01:27:44 java.lang.AssertionError: The figure of the Class  has not the good X coordinate expected:<0> but was:<1>
01:27:44 	at org.junit.Assert.fail(Assert.java:88)
01:27:44 	at org.junit.Assert.failNotEquals(Assert.java:834)
01:27:44 	at org.junit.Assert.assertEquals(Assert.java:645)
01:27:44 	at org.eclipse.papyrus.uml.diagram.stereotypeproperty.tests.layout.TestLayoutWithStereotype.assertDimension(TestLayoutWithStereotype.java:345)
01:27:44 	at org.eclipse.papyrus.uml.diagram.stereotypeproperty.tests.layout.TestLayoutWithStereotype.testToCreateANodeWithoutStereotype(TestLayoutWithStereotype.java:150)
01:27:44 	at org.eclipse.papyrus.uml.diagram.stereotypeproperty.tests.layout.TestLayoutWithStereotype.testLayoutOnClass(TestLayoutWithStereotype.java:92)
01:27:44 
01:27:44 testLayoutStereotypeApplicationOnClass(org.eclipse.papyrus.uml.diagram.stereotypeproperty.tests.layout.TestLayoutWithStereotypeOnEclipseHIPPInstance)  Time elapsed: 0.91 sec  <<< FAILURE!
01:27:44 java.lang.AssertionError: The label of stereotype for the Class is not good has not the good X coordinate expected:<0> but was:<1>
01:27:44 	at org.junit.Assert.fail(Assert.java:88)
01:27:44 	at org.junit.Assert.failNotEquals(Assert.java:834)
01:27:44 	at org.junit.Assert.assertEquals(Assert.java:645)
01:27:44 	at org.eclipse.papyrus.uml.diagram.stereotypeproperty.tests.layout.TestLayoutWithStereotypeOnEclipseHIPPInstance.assertDimension(TestLayoutWithStereotypeOnEclipseHIPPInstance.java:350)
01:27:44 	at org.eclipse.papyrus.uml.diagram.stereotypeproperty.tests.layout.TestLayoutWithStereotypeOnEclipseHIPPInstance.testToCreateANodeWithStereotype(TestLayoutWithStereotypeOnEclipseHIPPInstance.java:267)
01:27:44 	at org.eclipse.papyrus.uml.diagram.stereotypeproperty.tests.layout.TestLayoutWithStereotypeOnEclipseHIPPInstance.testLayoutStereotypeApplicationOnClass(TestLayoutWithStereotypeOnEclipseHIPPInstance.java:102)
01:27:44 
01:27:44 testLayoutOnClass(org.eclipse.papyrus.uml.diagram.stereotypeproperty.tests.layout.TestLayoutWithStereotypeOnEclipseHIPPInstance)  Time elapsed: 0.069 sec  <<< FAILURE!
01:27:44 java.lang.AssertionError: The figure of the Class  has not the good X coordinate expected:<0> but was:<1>
01:27:44 	at org.junit.Assert.fail(Assert.java:88)
01:27:44 	at org.junit.Assert.failNotEquals(Assert.java:834)
01:27:44 	at org.junit.Assert.assertEquals(Assert.java:645)
01:27:44 	at org.eclipse.papyrus.uml.diagram.stereotypeproperty.tests.layout.TestLayoutWithStereotypeOnEclipseHIPPInstance.assertDimension(TestLayoutWithStereotypeOnEclipseHIPPInstance.java:350)
01:27:44 	at org.eclipse.papyrus.uml.diagram.stereotypeproperty.tests.layout.TestLayoutWithStereotypeOnEclipseHIPPInstance.testToCreateANodeWithoutStereotype(TestLayoutWithStereotypeOnEclipseHIPPInstance.java:154)
01:27:44 	at org.eclipse.papyrus.uml.diagram.stereotypeproperty.tests.layout.TestLayoutWithStereotypeOnEclipseHIPPInstance.testLayoutOnClass(TestLayoutWithStereotypeOnEclipseHIPPInstance.java:96)
01:27:44 
01:27:44 testDiagramFileExtentionLabel(org.eclipse.papyrus.uml.diagram.wizards.TestCreateModelWizard) skipped
01:27:44 testDiagramFileExtenstionForUML(org.eclipse.papyrus.uml.diagram.wizards.TestCreateModelWizard) skipped
01:27:44 testOrderOfPages(org.eclipse.papyrus.uml.diagram.wizards.TestCreateModelWizard) skipped
01:27:44 org.eclipse.papyrus.uml.diagram.wizards.TestCreateModelWizard skipped
01:27:44 testDiagramFileExtentionLabel(org.eclipse.papyrus.uml.diagram.wizards.TestInitModelWizard) skipped
01:27:44 testDiagramFileExtenstionForUML(org.eclipse.papyrus.uml.diagram.wizards.TestInitModelWizard) skipped
01:27:44 testOrderOfPages(org.eclipse.papyrus.uml.diagram.wizards.TestInitModelWizard) skipped
01:27:44 org.eclipse.papyrus.uml.diagram.wizards.TestInitModelWizard skipped
01:27:44 testOrderOfPages(org.eclipse.papyrus.uml.diagram.wizards.TestNewProjectWizard) skipped
01:27:44 org.eclipse.papyrus.uml.diagram.wizards.TestNewProjectWizard skipped
01:27:44 testForSimpleModel(org.eclipse.papyrus.uml.diagram.wizards.TestCreateModelFromExistingModelWizard) skipped
01:27:44 testOrderOfPages(org.eclipse.papyrus.uml.diagram.wizards.TestCreateModelFromExistingModelWizard) skipped
01:27:44 testForModelWithDot(org.eclipse.papyrus.uml.diagram.wizards.TestCreateModelFromExistingModelWizard) skipped
01:27:44 org.eclipse.papyrus.uml.diagram.wizards.TestCreateModelFromExistingModelWizard skipped
01:27:44 org.eclipse.papyrus.uml.diagram.wizards.AllTests skipped
01:27:44 missingSchema(org.eclipse.papyrus.uml.modelrepair.internal.stereotypes.StereotypeApplicationRepairSnippetTest) skipped
01:27:44 noCorruptionControlCase(org.eclipse.papyrus.uml.modelrepair.internal.stereotypes.StereotypeApplicationRepairSnippetTest) skipped
01:27:44 wrongProfileVersion(org.eclipse.papyrus.uml.modelrepair.internal.stereotypes.StereotypeApplicationRepairSnippetTest) skipped
01:27:44 missingProfileApplication(org.eclipse.papyrus.uml.modelrepair.internal.stereotypes.StereotypeApplicationRepairSnippetTest) skipped
01:27:44 deleteStereotypes(org.eclipse.papyrus.uml.modelrepair.internal.stereotypes.StereotypeApplicationRepairSnippetTest) skipped
01:27:44 org.eclipse.papyrus.uml.modelrepair.internal.stereotypes.StereotypeApplicationRepairSnippetTest skipped
01:27:44 nestedProfileApplicationsMissingNamespace_bug434302(org.eclipse.papyrus.uml.modelrepair.internal.stereotypes.StereotypeRepairRegressionTest) skipped
01:27:44 orphansOfWrongProfileVersion_bug436666(org.eclipse.papyrus.uml.modelrepair.internal.stereotypes.StereotypeRepairRegressionTest) skipped
01:27:44 badSchemaLocationInNonPackageFragment_bug459488(org.eclipse.papyrus.uml.modelrepair.internal.stereotypes.StereotypeRepairRegressionTest) skipped
01:27:44 nestedProfilesAndNestedApplicationsWellFormed_bug434302(org.eclipse.papyrus.uml.modelrepair.internal.stereotypes.StereotypeRepairRegressionTest) skipped
01:27:44 registeredDynamicProfie_bug455329(org.eclipse.papyrus.uml.modelrepair.internal.stereotypes.StereotypeRepairRegressionTest) skipped
01:27:44 nestedPackageSchemaMissing_bug436666(org.eclipse.papyrus.uml.modelrepair.internal.stereotypes.StereotypeRepairRegressionTest) skipped
01:27:44 incorrectZombieGroupingWithoutProfileNamespaceURIPattern_bug496307(org.eclipse.papyrus.uml.modelrepair.internal.stereotypes.StereotypeRepairRegressionTest) skipped
01:27:44 nonStereotypeApplicationsAreOK_bug436666(org.eclipse.papyrus.uml.modelrepair.internal.stereotypes.StereotypeRepairRegressionTest) skipped
01:27:44 nestedProfileApplications2Pkgs1Profile_bug434302(org.eclipse.papyrus.uml.modelrepair.internal.stereotypes.StereotypeRepairRegressionTest) skipped
01:27:44 crossReferencedPackageUnitWithoutOwnProfileApplication_bug458736(org.eclipse.papyrus.uml.modelrepair.internal.stereotypes.StereotypeRepairRegressionTest) skipped
01:27:44 correctZombieGroupingWithProfileNamespaceURIPattern_bug496307(org.eclipse.papyrus.uml.modelrepair.internal.stereotypes.StereotypeRepairRegressionTest) skipped
01:27:44 orphansOfValidSchema_bug436666(org.eclipse.papyrus.uml.modelrepair.internal.stereotypes.StereotypeRepairRegressionTest) skipped
01:27:44 packageUnitWithoutOwnProfileApplication_bug455248(org.eclipse.papyrus.uml.modelrepair.internal.stereotypes.StereotypeRepairRegressionTest) skipped
01:27:44 nestedPackageInProfileIsOK_bug436666(org.eclipse.papyrus.uml.modelrepair.internal.stereotypes.StereotypeRepairRegressionTest) skipped
01:27:44 org.eclipse.papyrus.uml.modelrepair.internal.stereotypes.StereotypeRepairRegressionTest skipped
01:27:44 compareMultiVersionSameURISameVersion(org.eclipse.papyrus.uml.modelrepair.internal.uripattern.ProfileNamespaceURIPatternTest) skipped
01:27:44 compareMultiVersionDifferentURIDifferentVersion(org.eclipse.papyrus.uml.modelrepair.internal.uripattern.ProfileNamespaceURIPatternTest) skipped
01:27:44 compareSingleVersionDifferentURISameVersion(org.eclipse.papyrus.uml.modelrepair.internal.uripattern.ProfileNamespaceURIPatternTest) skipped
01:27:44 compareMultiVersionDifferentURISameVersion(org.eclipse.papyrus.uml.modelrepair.internal.uripattern.ProfileNamespaceURIPatternTest) skipped
01:27:44 compareCorrectInvalidComparisonConstantBehavior(org.eclipse.papyrus.uml.modelrepair.internal.uripattern.ProfileNamespaceURIPatternTest) skipped
01:27:44 compareNoVersionSameURI(org.eclipse.papyrus.uml.modelrepair.internal.uripattern.ProfileNamespaceURIPatternTest) skipped
01:27:44 compareSingleVersionDifferentURIDifferentVersion(org.eclipse.papyrus.uml.modelrepair.internal.uripattern.ProfileNamespaceURIPatternTest) skipped
01:27:44 matchCorrectNoMatchConstantBehavior(org.eclipse.papyrus.uml.modelrepair.internal.uripattern.ProfileNamespaceURIPatternTest) skipped
01:27:44 matchSingleVersionCorrectURIGivenVersion(org.eclipse.papyrus.uml.modelrepair.internal.uripattern.ProfileNamespaceURIPatternTest) skipped
01:27:44 matchNoVersionCorrectURIDefaultVersion(org.eclipse.papyrus.uml.modelrepair.internal.uripattern.ProfileNamespaceURIPatternTest) skipped
01:27:44 matchMultipleVersionCorrectURIGivenVersion(org.eclipse.papyrus.uml.modelrepair.internal.uripattern.ProfileNamespaceURIPatternTest) skipped
01:27:44 matchMultipleVersionCorrectURIDefaultVersion(org.eclipse.papyrus.uml.modelrepair.internal.uripattern.ProfileNamespaceURIPatternTest) skipped
01:27:44 compareCorrectInvalidComparisonBehaviorWrongLHS(org.eclipse.papyrus.uml.modelrepair.internal.uripattern.ProfileNamespaceURIPatternTest) skipped
01:27:44 compareCorrectInvalidComparisonBehaviorWrongRHS(org.eclipse.papyrus.uml.modelrepair.internal.uripattern.ProfileNamespaceURIPatternTest) skipped
01:27:44 registryExtensionPointCorrectMatch(org.eclipse.papyrus.uml.modelrepair.internal.uripattern.ProfileNamespaceURIPatternTest) skipped
01:27:44 compareSingleVersionSameURIDifferentVersion(org.eclipse.papyrus.uml.modelrepair.internal.uripattern.ProfileNamespaceURIPatternTest) skipped
01:27:44 compareSingleVersionSameURISameVersion(org.eclipse.papyrus.uml.modelrepair.internal.uripattern.ProfileNamespaceURIPatternTest) skipped
01:27:44 compareMultiVersionSameURIDifferentVersion(org.eclipse.papyrus.uml.modelrepair.internal.uripattern.ProfileNamespaceURIPatternTest) skipped
01:27:44 registryCorrectUnregisterAndRegister(org.eclipse.papyrus.uml.modelrepair.internal.uripattern.ProfileNamespaceURIPatternTest) skipped
01:27:44 registryExtensionPointRegistered(org.eclipse.papyrus.uml.modelrepair.internal.uripattern.ProfileNamespaceURIPatternTest) skipped
01:27:44 compareCorrectInvalidComparisonBehaviorWrongPattern(org.eclipse.papyrus.uml.modelrepair.internal.uripattern.ProfileNamespaceURIPatternTest) skipped
01:27:44 matchNoVersionCorrectURIGivenVersion(org.eclipse.papyrus.uml.modelrepair.internal.uripattern.ProfileNamespaceURIPatternTest) skipped
01:27:44 compareNoVersionDifferentURI(org.eclipse.papyrus.uml.modelrepair.internal.uripattern.ProfileNamespaceURIPatternTest) skipped
01:27:44 matchSingleVersionCorrectURIDefaultVersion(org.eclipse.papyrus.uml.modelrepair.internal.uripattern.ProfileNamespaceURIPatternTest) skipped
01:27:44 matchCorrectNoMatchBehavior(org.eclipse.papyrus.uml.modelrepair.internal.uripattern.ProfileNamespaceURIPatternTest) skipped
01:27:44 org.eclipse.papyrus.uml.modelrepair.internal.uripattern.ProfileNamespaceURIPatternTest skipped
01:27:44 org.eclipse.papyrus.uml.modelrepair.tests.AllTests skipped
01:27:44 outOfDateModelSkipMigration_papyrus(org.eclipse.papyrus.uml.profile.service.ReapplyProfilesServiceTest) skipped
01:27:44 upToDateModelDoesNotPromptForMigration_papyrus(org.eclipse.papyrus.uml.profile.service.ReapplyProfilesServiceTest) skipped
01:27:44 outOfDateModelDoMigration_dynamic(org.eclipse.papyrus.uml.profile.service.ReapplyProfilesServiceTest) skipped
01:27:44 outOfDateModelSkipMigration_uml2(org.eclipse.papyrus.uml.profile.service.ReapplyProfilesServiceTest) skipped
01:27:44 outOfDateModelDoMigration_papyrus(org.eclipse.papyrus.uml.profile.service.ReapplyProfilesServiceTest) skipped
01:27:44 outOfDateModelSkipMigration_dynamic(org.eclipse.papyrus.uml.profile.service.ReapplyProfilesServiceTest) skipped
01:27:44 outOfDateModelDoMigration_uml2(org.eclipse.papyrus.uml.profile.service.ReapplyProfilesServiceTest) skipped
01:27:44 upToDateModelDoesNotPromptForMigration_uml2(org.eclipse.papyrus.uml.profile.service.ReapplyProfilesServiceTest) skipped
01:27:44 upToDateModelDoesNotPromptForMigration_dynamic(org.eclipse.papyrus.uml.profile.service.ReapplyProfilesServiceTest) skipped
01:27:44 org.eclipse.papyrus.uml.profile.service.ReapplyProfilesServiceTest skipped
01:27:44 org.eclipse.papyrus.uml.profile.tests.AllTests skipped
01:27:44 loadDecoratorAsMainModel(org.eclipse.papyrus.uml.decoratormodel.tests.ExternalizeProfileApplicationTest) skipped
01:27:44 externalizeApplication(org.eclipse.papyrus.uml.decoratormodel.tests.ExternalizeProfileApplicationTest) skipped
01:27:44 unloadApplication(org.eclipse.papyrus.uml.decoratormodel.tests.ExternalizeProfileApplicationTest) skipped
01:27:44 externalizeApplication_undo(org.eclipse.papyrus.uml.decoratormodel.tests.ExternalizeProfileApplicationTest) skipped
01:27:44 unloadedApplicationNotAvailable(org.eclipse.papyrus.uml.decoratormodel.tests.ExternalizeProfileApplicationTest) skipped
01:27:44 loadApplication(org.eclipse.papyrus.uml.decoratormodel.tests.ExternalizeProfileApplicationTest) skipped
01:27:44 externalizeApplication_undo_redo(org.eclipse.papyrus.uml.decoratormodel.tests.ExternalizeProfileApplicationTest) skipped
01:27:44 nestedPackageApplicationOfSameProfile_bug459613(org.eclipse.papyrus.uml.decoratormodel.tests.ExternalizeProfileApplicationTest) skipped
01:27:44 externalizeApplication_forNestedPackage(org.eclipse.papyrus.uml.decoratormodel.tests.ExternalizeProfileApplicationTest) skipped
01:27:44 internalizeApplication_undo(org.eclipse.papyrus.uml.decoratormodel.tests.InternalizeProfileApplicationTest) skipped
01:27:44 internalizeApplication_undo_redo(org.eclipse.papyrus.uml.decoratormodel.tests.InternalizeProfileApplicationTest) skipped
01:27:44 internalizeApplication(org.eclipse.papyrus.uml.decoratormodel.tests.InternalizeProfileApplicationTest) skipped
01:27:44 migrateProfile(org.eclipse.papyrus.uml.decoratormodel.tests.ProfileMigrationTest) skipped
01:27:44 missingSchema(org.eclipse.papyrus.uml.decoratormodel.tests.StereotypeApplicationRepairTest) skipped
01:27:44 wrongProfileVersion(org.eclipse.papyrus.uml.decoratormodel.tests.StereotypeApplicationRepairTest) skipped
01:27:44 missingProfileApplication(org.eclipse.papyrus.uml.decoratormodel.tests.StereotypeApplicationRepairTest) skipped
01:27:44 decoratorModelsForPackageAsync(org.eclipse.papyrus.uml.decoratormodel.internal.resource.tests.DecoratorModelIndexTest) skipped
01:27:44 decoratorModelsForPackage_none(org.eclipse.papyrus.uml.decoratormodel.internal.resource.tests.DecoratorModelIndexTest) skipped
01:27:44 removeResource(org.eclipse.papyrus.uml.decoratormodel.internal.resource.tests.DecoratorModelIndexTest) skipped
01:27:44 decoratorModelsAsync_uri(org.eclipse.papyrus.uml.decoratormodel.internal.resource.tests.DecoratorModelIndexTest) skipped
01:27:44 decoratorModelName(org.eclipse.papyrus.uml.decoratormodel.internal.resource.tests.DecoratorModelIndexTest) skipped
01:27:44 baseline(org.eclipse.papyrus.uml.decoratormodel.internal.resource.tests.DecoratorModelIndexTest) skipped
01:27:44 decoratorModelsForPackage(org.eclipse.papyrus.uml.decoratormodel.internal.resource.tests.DecoratorModelIndexTest) skipped
01:27:44 decoratorModelNameAsync(org.eclipse.papyrus.uml.decoratormodel.internal.resource.tests.DecoratorModelIndexTest) skipped
01:27:44 appliedProfilesByResourceIndex(org.eclipse.papyrus.uml.decoratormodel.internal.resource.tests.DecoratorModelIndexTest) skipped
01:27:44 decoratorModels(org.eclipse.papyrus.uml.decoratormodel.internal.resource.tests.DecoratorModelIndexTest) skipped
01:27:44 decoratorModelsAsync(org.eclipse.papyrus.uml.decoratormodel.internal.resource.tests.DecoratorModelIndexTest) skipped
01:27:44 allAppliedProfiles(org.eclipse.papyrus.uml.decoratormodel.internal.resource.tests.DecoratorModelIndexTest) skipped
01:27:44 decoratorModelNames(org.eclipse.papyrus.uml.decoratormodel.internal.resource.tests.DecoratorModelIndexTest) skipped
01:27:44 decoratorModels_uri(org.eclipse.papyrus.uml.decoratormodel.internal.resource.tests.DecoratorModelIndexTest) skipped
01:27:44 decoratorModelNamesAsync(org.eclipse.papyrus.uml.decoratormodel.internal.resource.tests.DecoratorModelIndexTest) skipped
01:27:44 listener(org.eclipse.papyrus.uml.decoratormodel.internal.resource.tests.DecoratorModelIndexTest) skipped
01:27:44 allAppliedProfilesAsync(org.eclipse.papyrus.uml.decoratormodel.internal.resource.tests.DecoratorModelIndexTest) skipped
01:27:44 addNewResource(org.eclipse.papyrus.uml.decoratormodel.internal.resource.tests.DecoratorModelIndexTest) skipped
01:27:44 decoratorModelsForPackageAsync_none(org.eclipse.papyrus.uml.decoratormodel.internal.resource.tests.DecoratorModelIndexTest) skipped
01:27:44 copy_subsetOfProfiles(org.eclipse.papyrus.uml.decoratormodel.internal.resource.tests.DecoratorModelCopierTest) skipped
01:27:44 copy_allProfiles(org.eclipse.papyrus.uml.decoratormodel.internal.resource.tests.DecoratorModelCopierTest) skipped
01:27:44 testHasUnloadedDecoratorModelsAsync_recursive(org.eclipse.papyrus.uml.decoratormodel.helper.tests.DecoratorModelUtilsTest) skipped
01:27:44 testIsDecoratorModelFor(org.eclipse.papyrus.uml.decoratormodel.helper.tests.DecoratorModelUtilsTest) skipped
01:27:44 testIsDecoratorModelURI(org.eclipse.papyrus.uml.decoratormodel.helper.tests.DecoratorModelUtilsTest) skipped
01:27:44 testInternalizeProfileApplications(org.eclipse.papyrus.uml.decoratormodel.helper.tests.DecoratorModelUtilsTest) skipped
01:27:44 testHasUnloadedDecoratorModelsAsync(org.eclipse.papyrus.uml.decoratormodel.helper.tests.DecoratorModelUtilsTest) skipped
01:27:44 testExternalizeProfileApplication(org.eclipse.papyrus.uml.decoratormodel.helper.tests.DecoratorModelUtilsTest) skipped
01:27:44 testGetDecoratorPackages(org.eclipse.papyrus.uml.decoratormodel.helper.tests.DecoratorModelUtilsTest) skipped
01:27:44 testGetDecoratorModelAppliedProfiles(org.eclipse.papyrus.uml.decoratormodel.helper.tests.DecoratorModelUtilsTest) skipped
01:27:44 testGetUnloadedDecoratorModelsAsyncResource(org.eclipse.papyrus.uml.decoratormodel.helper.tests.DecoratorModelUtilsTest) skipped
01:27:44 testGetExternalizationProfile(org.eclipse.papyrus.uml.decoratormodel.helper.tests.DecoratorModelUtilsTest) skipped
01:27:44 testIsDecoratorModelResource(org.eclipse.papyrus.uml.decoratormodel.helper.tests.DecoratorModelUtilsTest) skipped
01:27:44 testGetDecoratorModelProfileApplications(org.eclipse.papyrus.uml.decoratormodel.helper.tests.DecoratorModelUtilsTest) skipped
01:27:44 testGetUnloadedDecoratorModelsAsyncPackage(org.eclipse.papyrus.uml.decoratormodel.helper.tests.DecoratorModelUtilsTest) skipped
01:27:44 testGetLoadedDecoratorModels(org.eclipse.papyrus.uml.decoratormodel.helper.tests.DecoratorModelUtilsTest) skipped
01:27:44 testGetLoadedSubUnitPackages(org.eclipse.papyrus.uml.decoratormodel.helper.tests.DecoratorModelUtilsTest) skipped
01:27:44 testGetUnloadedDecoratorModels(org.eclipse.papyrus.uml.decoratormodel.helper.tests.DecoratorModelUtilsTest) skipped
01:27:44 testHasExternalizationProfile(org.eclipse.papyrus.uml.decoratormodel.helper.tests.DecoratorModelUtilsTest) skipped
01:27:44 testGetUnloadedDecoratorModelsAsyncIterableOfResource(org.eclipse.papyrus.uml.decoratormodel.helper.tests.DecoratorModelUtilsTest) skipped
01:27:44 testGetUserModelResources(org.eclipse.papyrus.uml.decoratormodel.helper.tests.DecoratorModelUtilsTest) skipped
01:27:44 testGetDecoratorProfileApplications(org.eclipse.papyrus.uml.decoratormodel.helper.tests.DecoratorModelUtilsTest) skipped
01:27:44 stereotypeApplication_inNestedPackage(org.eclipse.papyrus.uml.decoratormodel.helper.tests.PapyrusStereotypeApplicationHelperTest) skipped
01:27:44 stereotypeApplication_inNonPackageSubmodelUnit_bug459613(org.eclipse.papyrus.uml.decoratormodel.helper.tests.PapyrusStereotypeApplicationHelperTest) skipped
01:27:44 applyStereotype_resourceSet(org.eclipse.papyrus.uml.decoratormodel.helper.tests.PapyrusStereotypeApplicationHelperTest) skipped
01:27:44 applyStereotype_freeFloating(org.eclipse.papyrus.uml.decoratormodel.helper.tests.PapyrusStereotypeApplicationHelperTest) skipped
01:27:44 isDecoratorModel_decoratorModelUML(org.eclipse.papyrus.uml.decoratormodel.internal.expressions.tests.FilePropertyTesterTest) skipped
01:27:44 isDecoratorModel_decoratorModelNotation(org.eclipse.papyrus.uml.decoratormodel.internal.expressions.tests.FilePropertyTesterTest) skipped
01:27:44 isDecoratorModel_userModelUML(org.eclipse.papyrus.uml.decoratormodel.internal.expressions.tests.FilePropertyTesterTest) skipped
01:27:44 decoratorIndexing(org.eclipse.papyrus.uml.decoratormodel.internal.resource.index.tests.ProfileIndexTest)  Time elapsed: 0.403 sec
01:27:44 userModelIndexing(org.eclipse.papyrus.uml.decoratormodel.internal.resource.index.tests.ProfileIndexTest)  Time elapsed: 0.001 sec
01:27:44 decoratorAsUserModelIndexing(org.eclipse.papyrus.uml.decoratormodel.internal.resource.index.tests.ProfileIndexTest)  Time elapsed: 0 sec
01:27:44 migrateProfileExtendingDynamic_bug481302(org.eclipse.papyrus.uml.decoratormodel.tests.RegressionTest) skipped
01:27:44 basicUMLMigrateProfileExtendingStatic_bug481302(org.eclipse.papyrus.uml.decoratormodel.tests.RegressionTest)  Time elapsed: 0.35 sec  <<< FAILURE!
01:27:44 java.lang.AssertionError: 
01:27:44 Expected: is "R1"
01:27:44      but: was null
01:27:44 	at org.hamcrest.MatcherAssert.assertThat(MatcherAssert.java:20)
01:27:44 	at org.hamcrest.MatcherAssert.assertThat(MatcherAssert.java:8)
01:27:44 	at org.eclipse.papyrus.uml.decoratormodel.tests.RegressionTest.doTestMigrateProfileExtendingOther_bug481302(RegressionTest.java:59)
01:27:44 	at org.eclipse.papyrus.uml.decoratormodel.tests.RegressionTest.basicUMLMigrateProfileExtendingStatic_bug481302(RegressionTest.java:75)
01:27:44 
01:27:44 migrateProfileExtendingStatic_bug481302(org.eclipse.papyrus.uml.decoratormodel.tests.RegressionTest) skipped
01:27:44 control_undo_redo_allDecoratorsLoaded(org.eclipse.papyrus.uml.decoratormodel.controlmode.tests.ControlModeWithDecoratorModelsTest) skipped
01:27:44 uncontrol_undo_redo_allDecoratorsUnloaded(org.eclipse.papyrus.uml.decoratormodel.controlmode.tests.ControlModeWithDecoratorModelsTest) skipped
01:27:44 control_someDecoratorsLoaded(org.eclipse.papyrus.uml.decoratormodel.controlmode.tests.ControlModeWithDecoratorModelsTest) skipped
01:27:44 uncontrol_someDecoratorsLoaded(org.eclipse.papyrus.uml.decoratormodel.controlmode.tests.ControlModeWithDecoratorModelsTest) skipped
01:27:44 uncontrol_allDecoratorsUnloaded(org.eclipse.papyrus.uml.decoratormodel.controlmode.tests.ControlModeWithDecoratorModelsTest) skipped
01:27:44 control_undo_redo_someDecoratorsLoaded(org.eclipse.papyrus.uml.decoratormodel.controlmode.tests.ControlModeWithDecoratorModelsTest) skipped
01:27:44 control_allDecoratorsLoaded(org.eclipse.papyrus.uml.decoratormodel.controlmode.tests.ControlModeWithDecoratorModelsTest) skipped
01:27:44 control_undo_redo_allDecoratorsUnloaded(org.eclipse.papyrus.uml.decoratormodel.controlmode.tests.ControlModeWithDecoratorModelsTest) skipped
01:27:44 control_allDecoratorsUnloaded(org.eclipse.papyrus.uml.decoratormodel.controlmode.tests.ControlModeWithDecoratorModelsTest) skipped
01:27:44 uncontrol_undo_redo_someDecoratorsLoaded(org.eclipse.papyrus.uml.decoratormodel.controlmode.tests.ControlModeWithDecoratorModelsTest) skipped
01:27:44 uncontrol_undo_redo_allDecoratorsLoaded(org.eclipse.papyrus.uml.decoratormodel.controlmode.tests.ControlModeWithDecoratorModelsTest) skipped
01:27:44 uncontrol_allDecoratorsLoaded(org.eclipse.papyrus.uml.decoratormodel.controlmode.tests.ControlModeWithDecoratorModelsTest) skipped
01:27:44 org.eclipse.papyrus.uml.decoratormodel.controlmode.tests.ControlModeWithDecoratorModelsTest skipped
01:27:44 nonBaseElementStereotypeCrossReferences(org.eclipse.papyrus.uml.decoratormodel.controlmode.tests.AdditionalModelStructuresTest) skipped
01:27:44 classUnitExternalizeParentUnitProfileApplication_bug459613(org.eclipse.papyrus.uml.decoratormodel.controlmode.tests.AdditionalModelStructuresTest) skipped
01:27:44 nestedPackagesInheritingExternalProfileApplications(org.eclipse.papyrus.uml.decoratormodel.controlmode.tests.AdditionalModelStructuresTest) skipped
01:27:44 org.eclipse.papyrus.uml.decoratormodel.controlmode.tests.AdditionalModelStructuresTest skipped
01:27:44 org.eclipse.papyrus.uml.decoratormodel.controlmode.tests.AllTests skipped
01:27:44 validateOCLOnInstanceSpec(org.eclipse.papyrus.uml.validation.tests.rules.TestOCLConstraintOnInstanceSpec) skipped
01:27:44 validateCamelCaseRule(org.eclipse.papyrus.uml.validation.tests.rules.TestOCLValidationRuleFromFile) skipped
01:27:44 validateIsActiveOCLRule_inactiveClass(org.eclipse.papyrus.uml.validation.tests.rules.TestValidationRulesInPluginXML) skipped
01:27:44 validateIsPassiveJavaRule_inactiveClass(org.eclipse.papyrus.uml.validation.tests.rules.TestValidationRulesInPluginXML) skipped
01:27:44 validateIsPassiveJavaRule_activeClass(org.eclipse.papyrus.uml.validation.tests.rules.TestValidationRulesInPluginXML) skipped
01:27:44 validateMalformedActiveRule_notActiveCapsule(org.eclipse.papyrus.uml.validation.tests.rules.TestValidationRulesInProfile) skipped
01:27:44 validateIsActiveRule_notActiveCapsule(org.eclipse.papyrus.uml.validation.tests.rules.TestValidationRulesInProfile) skipped
01:27:44 validateIsActiveRule_ActiveCapsule(org.eclipse.papyrus.uml.validation.tests.rules.TestValidationRulesInProfile) skipped
01:27:44 validateNameClashDetection(org.eclipse.papyrus.uml.validation.tests.rules.TestUMLValidationRules) skipped
01:27:44 validateNonStandardMultiplicity(org.eclipse.papyrus.uml.validation.tests.rules.TestUMLValidationRules) skipped
01:27:44 validateUnsetStereotypeAttribute(org.eclipse.papyrus.uml.validation.tests.rules.TestStereotypeValidation) skipped
01:27:44 testResolveProfile__Object(org.eclipse.papyrus.uml.filters.tests.ProfileAppliedTest) skipped
01:27:44 testMatches__Object(org.eclipse.papyrus.uml.filters.tests.ProfileAppliedTest) skipped
01:27:44 org.eclipse.papyrus.uml.filters.tests.ProfileAppliedTest skipped
01:27:44 filters Tests skipped
01:27:44 UMLFilters Tests skipped
01:27:44 profileAppliedFilterResourceURI_bug480221(org.eclipse.papyrus.uml.filters.tests.ProfileAppliedRegressionTest) skipped
01:27:44 profileAppliedFilterDoesNotLoadProfiles_miss_bug480221(org.eclipse.papyrus.uml.filters.tests.ProfileAppliedRegressionTest) skipped
01:27:44 profileAppliedFilterDoesNotLoadProfiles_hit_bug480221(org.eclipse.papyrus.uml.filters.tests.ProfileAppliedRegressionTest) skipped
01:27:44 org.eclipse.papyrus.uml.filters.tests.ProfileAppliedRegressionTest skipped
01:27:44 org.eclipse.papyrus.uml.filters.tests.AllTests skipped
01:27:44 popupsGenerated(org.eclipse.papyrus.uml.profile.assistants.generator.tests.BasicAssistantsGenerationTest) skipped
01:27:44 connectionTargetFilters(org.eclipse.papyrus.uml.profile.assistants.generator.tests.BasicAssistantsGenerationTest) skipped
01:27:44 popupFilters(org.eclipse.papyrus.uml.profile.assistants.generator.tests.BasicAssistantsGenerationTest) skipped
01:27:44 connectionSourceFilters(org.eclipse.papyrus.uml.profile.assistants.generator.tests.BasicAssistantsGenerationTest) skipped
01:27:44 connectionsGenerated(org.eclipse.papyrus.uml.profile.assistants.generator.tests.BasicAssistantsGenerationTest) skipped
01:27:44 org.eclipse.papyrus.uml.profile.assistants.generator.tests.BasicAssistantsGenerationTest skipped
01:27:44 popupsGenerated(org.eclipse.papyrus.uml.profile.assistants.generator.tests.DiagramSpecificAssistantsGenerationTest) skipped
01:27:44 connectionTargetFilters(org.eclipse.papyrus.uml.profile.assistants.generator.tests.DiagramSpecificAssistantsGenerationTest) skipped
01:27:44 distinctConnectionHintsGenerated(org.eclipse.papyrus.uml.profile.assistants.generator.tests.DiagramSpecificAssistantsGenerationTest) skipped
01:27:44 popupFilters(org.eclipse.papyrus.uml.profile.assistants.generator.tests.DiagramSpecificAssistantsGenerationTest) skipped
01:27:44 connectionSourceFilters(org.eclipse.papyrus.uml.profile.assistants.generator.tests.DiagramSpecificAssistantsGenerationTest) skipped
01:27:44 distinctPopupHintsGenerated(org.eclipse.papyrus.uml.profile.assistants.generator.tests.DiagramSpecificAssistantsGenerationTest) skipped
01:27:44 connectionsGenerated(org.eclipse.papyrus.uml.profile.assistants.generator.tests.DiagramSpecificAssistantsGenerationTest) skipped
01:27:44 org.eclipse.papyrus.uml.profile.assistants.generator.tests.DiagramSpecificAssistantsGenerationTest skipped
01:27:44 popupsGenerated(org.eclipse.papyrus.uml.profile.assistants.generator.tests.ProfilesWithPackageNestingTest) skipped
01:27:44 connectionTargetFilters(org.eclipse.papyrus.uml.profile.assistants.generator.tests.ProfilesWithPackageNestingTest) skipped
01:27:44 popupFilters(org.eclipse.papyrus.uml.profile.assistants.generator.tests.ProfilesWithPackageNestingTest) skipped
01:27:44 connectionSourceFilters(org.eclipse.papyrus.uml.profile.assistants.generator.tests.ProfilesWithPackageNestingTest) skipped
01:27:44 connectionsGenerated(org.eclipse.papyrus.uml.profile.assistants.generator.tests.ProfilesWithPackageNestingTest) skipped
01:27:44 org.eclipse.papyrus.uml.profile.assistants.generator.tests.ProfilesWithPackageNestingTest skipped
01:27:44 connectionsGenerated[<<Indirect>> Generalization](org.eclipse.papyrus.uml.profile.assistants.generator.tests.ConnectionTypesTest) skipped
01:27:44 [<<Indirect>> Generalization] skipped
01:27:44 connectionsGenerated[<<Indirect>> GeneralizationSet](org.eclipse.papyrus.uml.profile.assistants.generator.tests.ConnectionTypesTest) skipped
01:27:44 [<<Indirect>> GeneralizationSet] skipped
01:27:44 connectionsGenerated[<<Virtual>> ControlFlow](org.eclipse.papyrus.uml.profile.assistants.generator.tests.ConnectionTypesTest) skipped
01:27:44 [<<Virtual>> ControlFlow] skipped
01:27:44 connectionsGenerated[<<Virtual>> ObjectFlow](org.eclipse.papyrus.uml.profile.assistants.generator.tests.ConnectionTypesTest) skipped
01:27:44 [<<Virtual>> ObjectFlow] skipped
01:27:44 connectionsGenerated[<<Virtual>> Transition](org.eclipse.papyrus.uml.profile.assistants.generator.tests.ConnectionTypesTest) skipped
01:27:44 [<<Virtual>> Transition] skipped
01:27:44 connectionsGenerated[<<Virtual>> Message](org.eclipse.papyrus.uml.profile.assistants.generator.tests.ConnectionTypesTest) skipped
01:27:44 [<<Virtual>> Message] skipped
01:27:44 connectionsGenerated[<<Indirect>> Connector](org.eclipse.papyrus.uml.profile.assistants.generator.tests.ConnectionTypesTest) skipped
01:27:44 [<<Indirect>> Connector] skipped
01:27:44 org.eclipse.papyrus.uml.profile.assistants.generator.tests.ConnectionTypesTest skipped
01:27:44 org.eclipse.papyrus.uml.profile.assistants.generator.tests.AllTests skipped
01:27:44 iconGenerated(org.eclipse.papyrus.uml.profile.types.generator.tests.BasicElementTypesGenerationTest) skipped
01:27:44 elementTypeSpecializedTypes_bug461717(org.eclipse.papyrus.uml.profile.types.generator.tests.BasicElementTypesGenerationTest) skipped
01:27:44 multipleElementTypesForOneStereotypeGenerated(org.eclipse.papyrus.uml.profile.types.generator.tests.BasicElementTypesGenerationTest) skipped
01:27:44 stereotypeAdviceGenerated(org.eclipse.papyrus.uml.profile.types.generator.tests.BasicElementTypesGenerationTest) skipped
01:27:44 elementTypesGenerated(org.eclipse.papyrus.uml.profile.types.generator.tests.BasicElementTypesGenerationTest) skipped
01:27:44 stereotypeMatcherGenerated(org.eclipse.papyrus.uml.profile.types.generator.tests.BasicElementTypesGenerationTest) skipped
01:27:44 org.eclipse.papyrus.uml.profile.types.generator.tests.BasicElementTypesGenerationTest skipped
01:27:44 stereotypeAdviceNotGenerated(org.eclipse.papyrus.uml.profile.types.generator.tests.DiagramSpecificElementTypesGenerationTest) skipped
01:27:44 distinctHintsGenerated(org.eclipse.papyrus.uml.profile.types.generator.tests.DiagramSpecificElementTypesGenerationTest) skipped
01:27:44 stereotypeMatcherNotGenerated(org.eclipse.papyrus.uml.profile.types.generator.tests.DiagramSpecificElementTypesGenerationTest) skipped
01:27:44 iconGenerated(org.eclipse.papyrus.uml.profile.types.generator.tests.DiagramSpecificElementTypesGenerationTest) skipped
01:27:44 elementTypeSpecializedTypes_bug461717(org.eclipse.papyrus.uml.profile.types.generator.tests.DiagramSpecificElementTypesGenerationTest) skipped
01:27:44 elementTypesGenerated(org.eclipse.papyrus.uml.profile.types.generator.tests.DiagramSpecificElementTypesGenerationTest) skipped
01:27:44 org.eclipse.papyrus.uml.profile.types.generator.tests.DiagramSpecificElementTypesGenerationTest skipped
01:27:44 iconGenerated(org.eclipse.papyrus.uml.profile.types.generator.tests.ProfilesWithPackageNestingTest) skipped
01:27:44 stereotypeAdviceGenerated(org.eclipse.papyrus.uml.profile.types.generator.tests.ProfilesWithPackageNestingTest) skipped
01:27:44 elementTypesGenerated(org.eclipse.papyrus.uml.profile.types.generator.tests.ProfilesWithPackageNestingTest) skipped
01:27:44 stereotypeMatcherGenerated(org.eclipse.papyrus.uml.profile.types.generator.tests.ProfilesWithPackageNestingTest) skipped
01:27:44 org.eclipse.papyrus.uml.profile.types.generator.tests.ProfilesWithPackageNestingTest skipped
01:27:44 elementTypeSpecializedTypes(org.eclipse.papyrus.uml.profile.types.generator.tests.DiagramSpecificElementTypesGenerationBug461717Test) skipped
01:27:44 stereotypeAdviceGenerated(org.eclipse.papyrus.uml.profile.types.generator.tests.DiagramSpecificElementTypesGenerationBug461717Test) skipped
01:27:44 stereotypeMatcherGenerated(org.eclipse.papyrus.uml.profile.types.generator.tests.DiagramSpecificElementTypesGenerationBug461717Test) skipped
01:27:44 org.eclipse.papyrus.uml.profile.types.generator.tests.DiagramSpecificElementTypesGenerationBug461717Test skipped
01:27:44 org.eclipse.papyrus.uml.profile.types.generator.tests.AllTests skipped
01:27:44 testGetStereotypeNames(org.eclipse.papyrus.uml.profile.drafter.tests.ProfileCatalogTest) skipped
01:27:44 testGetStereotypes(org.eclipse.papyrus.uml.profile.drafter.tests.ProfileCatalogTest) skipped
01:27:44 testGetAllStereotypeNames(org.eclipse.papyrus.uml.profile.drafter.tests.ProfileCatalogTest) skipped
01:27:44 testGetProfileNames(org.eclipse.papyrus.uml.profile.drafter.tests.ProfileCatalogTest) skipped
01:27:44 testProfileCatalog(org.eclipse.papyrus.uml.profile.drafter.tests.ProfileCatalogTest) skipped
01:27:44 testLookupStereotype(org.eclipse.papyrus.uml.profile.drafter.tests.ProfileCatalogTest) skipped
01:27:44 testLookupStereotypeInAppliedProfile(org.eclipse.papyrus.uml.profile.drafter.tests.ProfileCatalogTest) skipped
01:27:44 testProfileCopy(org.eclipse.papyrus.uml.profile.drafter.tests.ProfileCatalogTest) skipped
01:27:44 testGetProfiles(org.eclipse.papyrus.uml.profile.drafter.tests.ProfileCatalogTest) skipped
01:27:44 testGetNamedElement(org.eclipse.papyrus.uml.profile.drafter.tests.ProfileCatalogTest) skipped
01:27:44 testIsModelsExist(org.eclipse.papyrus.uml.profile.drafter.tests.ProfileCatalogTest) skipped
01:27:44 testGetStereotypeQualifiedNames(org.eclipse.papyrus.uml.profile.drafter.tests.ProfileCatalogTest) skipped
01:27:44 testGetProfileQualifiedNames(org.eclipse.papyrus.uml.profile.drafter.tests.ProfileCatalogTest) skipped
01:27:44 org.eclipse.papyrus.uml.profile.drafter.tests.ProfileCatalogTest skipped
01:27:44 testCopyResources(org.eclipse.papyrus.uml.profile.drafter.tests.EclipseProjectTest) skipped
01:27:44 testCopyResource(org.eclipse.papyrus.uml.profile.drafter.tests.EclipseProjectTest) skipped
01:27:44 testGetProject(org.eclipse.papyrus.uml.profile.drafter.tests.EclipseProjectTest) skipped
01:27:44 testEclipseProject(org.eclipse.papyrus.uml.profile.drafter.tests.EclipseProjectTest) skipped
01:27:44 org.eclipse.papyrus.uml.profile.drafter.tests.EclipseProjectTest skipped
01:27:44 testGetUmlModelWithIFile(org.eclipse.papyrus.uml.profile.drafter.tests.ModelSetManagerTest) skipped
01:27:44 testModelSetManagerString(org.eclipse.papyrus.uml.profile.drafter.tests.ModelSetManagerTest) skipped
01:27:44 testModelSetManagerURI(org.eclipse.papyrus.uml.profile.drafter.tests.ModelSetManagerTest) skipped
01:27:44 testGetNamedElementByNameString(org.eclipse.papyrus.uml.profile.drafter.tests.ModelSetManagerTest) skipped
01:27:44 testGetUmlModel(org.eclipse.papyrus.uml.profile.drafter.tests.ModelSetManagerTest) skipped
01:27:44 testModelSetManagerStringModels(org.eclipse.papyrus.uml.profile.drafter.tests.ModelSetManagerTest) skipped
01:27:44 testGetNamedElementByNameWithSterotype(org.eclipse.papyrus.uml.profile.drafter.tests.ModelSetManagerTest) skipped
01:27:44 org.eclipse.papyrus.uml.profile.drafter.tests.ModelSetManagerTest skipped
01:27:44 testCreation(org.eclipse.papyrus.uml.profile.drafter.tests.utils.UMLModelCreatorTest) skipped
01:27:44 testCreateClass(org.eclipse.papyrus.uml.profile.drafter.tests.utils.UMLModelCreatorTest) skipped
01:27:44 testCreateModel(org.eclipse.papyrus.uml.profile.drafter.tests.utils.UMLModelCreatorTest) skipped
01:27:44 testCreatePackage(org.eclipse.papyrus.uml.profile.drafter.tests.utils.UMLModelCreatorTest) skipped
01:27:44 testCd(org.eclipse.papyrus.uml.profile.drafter.tests.utils.UMLModelCreatorTest) skipped
01:27:44 testUMLModelCreatorResourceFailing(org.eclipse.papyrus.uml.profile.drafter.tests.utils.UMLModelCreatorTest) skipped
01:27:44 testUMLModelCreatorStringString(org.eclipse.papyrus.uml.profile.drafter.tests.utils.UMLModelCreatorTest) skipped
01:27:44 testUMLModelCreatorResource(org.eclipse.papyrus.uml.profile.drafter.tests.utils.UMLModelCreatorTest) skipped
01:27:44 testCreateDatatype(org.eclipse.papyrus.uml.profile.drafter.tests.utils.UMLModelCreatorTest) skipped
01:27:44 org.eclipse.papyrus.uml.profile.drafter.tests.utils.UMLModelCreatorTest skipped
01:27:44 testCompoundTypeProvider(org.eclipse.papyrus.uml.profile.drafter.ui.model.CompoundTypeProviderTest) skipped
01:27:44 testGetTypes(org.eclipse.papyrus.uml.profile.drafter.ui.model.CompoundTypeProviderTest) skipped
01:27:44 testAddITypeProvider(org.eclipse.papyrus.uml.profile.drafter.ui.model.CompoundTypeProviderTest) skipped
01:27:44 testIterator(org.eclipse.papyrus.uml.profile.drafter.ui.model.CompoundTypeProviderTest) skipped
01:27:44 org.eclipse.papyrus.uml.profile.drafter.ui.model.CompoundTypeProviderTest skipped
01:27:44 testVisitMetaclassesModel(org.eclipse.papyrus.uml.profile.drafter.ui.model.SimpleModelVisitorTest) skipped
01:27:44 testVisitPropertyModel(org.eclipse.papyrus.uml.profile.drafter.ui.model.SimpleModelVisitorTest) skipped
01:27:44 testSimpleModelVisitor(org.eclipse.papyrus.uml.profile.drafter.ui.model.SimpleModelVisitorTest) skipped
01:27:44 testDoVisitStereoptypeModel(org.eclipse.papyrus.uml.profile.drafter.ui.model.SimpleModelVisitorTest) skipped
01:27:44 testDoVisitPropertyModel(org.eclipse.papyrus.uml.profile.drafter.ui.model.SimpleModelVisitorTest) skipped
01:27:44 testVisitStereoptypeModel(org.eclipse.papyrus.uml.profile.drafter.ui.model.SimpleModelVisitorTest) skipped
01:27:44 testDoVisitMetaclassesModel(org.eclipse.papyrus.uml.profile.drafter.ui.model.SimpleModelVisitorTest) skipped
01:27:44 org.eclipse.papyrus.uml.profile.drafter.ui.model.SimpleModelVisitorTest skipped
01:27:44 testSetStereotypeName(org.eclipse.papyrus.uml.profile.drafter.ui.model.StereotypeURLTest) skipped
01:27:44 testGetProfileName(org.eclipse.papyrus.uml.profile.drafter.ui.model.StereotypeURLTest) skipped
01:27:44 testAddPropertyChangeListenerPropertyChangeListener(org.eclipse.papyrus.uml.profile.drafter.ui.model.StereotypeURLTest) skipped
01:27:44 testSetQualifiedNameComplex(org.eclipse.papyrus.uml.profile.drafter.ui.model.StereotypeURLTest) skipped
01:27:44 testClear(org.eclipse.papyrus.uml.profile.drafter.ui.model.StereotypeURLTest) skipped
01:27:44 testStereotypeURLString(org.eclipse.papyrus.uml.profile.drafter.ui.model.StereotypeURLTest) skipped
01:27:44 testToString(org.eclipse.papyrus.uml.profile.drafter.ui.model.StereotypeURLTest) skipped
01:27:44 testGetStereotypeName(org.eclipse.papyrus.uml.profile.drafter.ui.model.StereotypeURLTest) skipped
01:27:44 testAddPropertyChangeListenerStringPropertyChangeListener(org.eclipse.papyrus.uml.profile.drafter.ui.model.StereotypeURLTest) skipped
01:27:44 testStereotypeURL(org.eclipse.papyrus.uml.profile.drafter.ui.model.StereotypeURLTest) skipped
01:27:44 testRemovePropertyChangeListenerPropertyChangeListener(org.eclipse.papyrus.uml.profile.drafter.ui.model.StereotypeURLTest) skipped
01:27:44 testSetQualifiedNameSimple(org.eclipse.papyrus.uml.profile.drafter.ui.model.StereotypeURLTest) skipped
01:27:44 testSetProfileName(org.eclipse.papyrus.uml.profile.drafter.ui.model.StereotypeURLTest) skipped
01:27:44 testRemovePropertyChangeListenerStringPropertyChangeListener(org.eclipse.papyrus.uml.profile.drafter.ui.model.StereotypeURLTest) skipped
01:27:44 testComputeQualifiedName(org.eclipse.papyrus.uml.profile.drafter.ui.model.StereotypeURLTest) skipped
01:27:44 testGetQualifiedName(org.eclipse.papyrus.uml.profile.drafter.ui.model.StereotypeURLTest) skipped
01:27:44 testStereotypeURLStringString(org.eclipse.papyrus.uml.profile.drafter.ui.model.StereotypeURLTest) skipped
01:27:44 org.eclipse.papyrus.uml.profile.drafter.ui.model.StereotypeURLTest skipped
01:27:44 testGetTypes(org.eclipse.papyrus.uml.profile.drafter.ui.model.TypeProviderTest) skipped
01:27:44 testTypeProvider(org.eclipse.papyrus.uml.profile.drafter.ui.model.TypeProviderTest) skipped
01:27:44 testIterator(org.eclipse.papyrus.uml.profile.drafter.ui.model.TypeProviderTest) skipped
01:27:44 org.eclipse.papyrus.uml.profile.drafter.ui.model.TypeProviderTest skipped
01:27:44 testGetTypes(org.eclipse.papyrus.uml.profile.drafter.ui.model.TypeProviderTest2) skipped
01:27:44 testAddType(org.eclipse.papyrus.uml.profile.drafter.ui.model.TypeProviderTest2) skipped
01:27:44 testAddTypeFromConstructor(org.eclipse.papyrus.uml.profile.drafter.ui.model.TypeProviderTest2) skipped
01:27:44 testTypeProvider(org.eclipse.papyrus.uml.profile.drafter.ui.model.TypeProviderTest2) skipped
01:27:44 testTypeProviderTypeArray(org.eclipse.papyrus.uml.profile.drafter.ui.model.TypeProviderTest2) skipped
01:27:44 testIterator(org.eclipse.papyrus.uml.profile.drafter.ui.model.TypeProviderTest2) skipped
01:27:44 org.eclipse.papyrus.uml.profile.drafter.ui.model.TypeProviderTest2 skipped
01:27:44 testUMLPrimitiveTypesModel(org.eclipse.papyrus.uml.profile.drafter.utils.UMLPrimitiveTypesModelTest) skipped
01:27:44 testGetLibraryPackage(org.eclipse.papyrus.uml.profile.drafter.utils.UMLPrimitiveTypesModelTest) skipped
01:27:44 org.eclipse.papyrus.uml.profile.drafter.utils.UMLPrimitiveTypesModelTest skipped
01:27:44 org.eclipse.papyrus.uml.profile.drafter.tests.AllTests skipped
01:27:44 testUseInternationalizationModification(org.eclipse.papyrus.uml.internationalization.tests.tests.UMLInternationalizationChangePreferencesTest) skipped
01:27:44 org.eclipse.papyrus.uml.internationalization.tests.tests.UMLInternationalizationChangePreferencesTest skipped
01:27:44 testLanguageModification(org.eclipse.papyrus.uml.internationalization.tests.tests.UMLInternationalizationChangeLanguageTest) skipped
01:27:44 org.eclipse.papyrus.uml.internationalization.tests.tests.UMLInternationalizationChangeLanguageTest skipped
01:27:44 rebuildAdapters(org.eclipse.papyrus.uml.internationalization.tests.tests.InternationalizationUMLItemProviderAdapterFactoryTest) skipped
01:27:44 normalAdapters(org.eclipse.papyrus.uml.internationalization.tests.tests.InternationalizationUMLItemProviderAdapterFactoryTest) skipped
01:27:44 org.eclipse.papyrus.uml.internationalization.tests.tests.InternationalizationUMLItemProviderAdapterFactoryTest skipped
01:27:44 org.eclipse.papyrus.uml.internationalization.tests.tests.AllTests skipped
01:27:44 testMapping(org.eclipse.papyrus.uml.alf.tests.mapper.MappingTest) skipped
01:27:44 org.eclipse.papyrus.uml.alf.tests.mapper.MappingTest skipped
01:27:44 testMerging(org.eclipse.papyrus.uml.alf.tests.mapper.MergeTest) skipped
01:27:44 org.eclipse.papyrus.uml.alf.tests.mapper.MergeTest skipped
01:27:44 testStaticSemantics(org.eclipse.papyrus.uml.alf.tests.SemanticTest) skipped
01:27:44 org.eclipse.papyrus.uml.alf.tests.SemanticTest skipped
01:27:44 testOneFile(org.eclipse.papyrus.uml.alf.tests.SingleTest) skipped
01:27:44 org.eclipse.papyrus.uml.alf.tests.SingleTest skipped
01:27:44 testSyntax(org.eclipse.papyrus.uml.alf.tests.SyntacticTest) skipped
01:27:44 org.eclipse.papyrus.uml.alf.tests.SyntacticTest skipped
01:27:44 testGeneration(org.eclipse.papyrus.uml.alf.tests.generator.GenerationTest) skipped
01:27:44 org.eclipse.papyrus.uml.alf.tests.generator.GenerationTest skipped
01:27:44 org.eclipse.papyrus.uml.alf.tests.AllTests skipped
01:27:44 IsStereotypedWithExpression_Test10(org.eclipse.papyrus.uml.expressions.tests.IsStereotypedWithExpressionTests) skipped
01:27:44 IsStereotypedWithExpression_Test11(org.eclipse.papyrus.uml.expressions.tests.IsStereotypedWithExpressionTests) skipped
01:27:44 IsStereotypedWithExpression_Test12(org.eclipse.papyrus.uml.expressions.tests.IsStereotypedWithExpressionTests) skipped
01:27:44 IsStereotypedWithExpression_Test13(org.eclipse.papyrus.uml.expressions.tests.IsStereotypedWithExpressionTests) skipped
01:27:44 IsStereotypedWithExpression_Test1(org.eclipse.papyrus.uml.expressions.tests.IsStereotypedWithExpressionTests) skipped
01:27:44 IsStereotypedWithExpression_Test2(org.eclipse.papyrus.uml.expressions.tests.IsStereotypedWithExpressionTests) skipped
01:27:44 IsStereotypedWithExpression_Test3(org.eclipse.papyrus.uml.expressions.tests.IsStereotypedWithExpressionTests) skipped
01:27:44 IsStereotypedWithExpression_Test4(org.eclipse.papyrus.uml.expressions.tests.IsStereotypedWithExpressionTests) skipped
01:27:44 IsStereotypedWithExpression_Test5(org.eclipse.papyrus.uml.expressions.tests.IsStereotypedWithExpressionTests) skipped
01:27:44 IsStereotypedWithExpression_Test6(org.eclipse.papyrus.uml.expressions.tests.IsStereotypedWithExpressionTests) skipped
01:27:44 IsStereotypedWithExpression_Test7(org.eclipse.papyrus.uml.expressions.tests.IsStereotypedWithExpressionTests) skipped
01:27:44 IsStereotypedWithExpression_Test8(org.eclipse.papyrus.uml.expressions.tests.IsStereotypedWithExpressionTests) skipped
01:27:44 IsStereotypedWithExpression_Test9(org.eclipse.papyrus.uml.expressions.tests.IsStereotypedWithExpressionTests) skipped
01:27:44 org.eclipse.papyrus.uml.expressions.tests.IsStereotypedWithExpressionTests skipped
01:27:44 HasStereotypeExpressionTests_Test1(org.eclipse.papyrus.uml.expressions.tests.HasAppliedStereotypeExpressionTests) skipped
01:27:44 HasStereotypeExpressionTests_Test2(org.eclipse.papyrus.uml.expressions.tests.HasAppliedStereotypeExpressionTests) skipped
01:27:44 HasStereotypeExpressionTests_Test3(org.eclipse.papyrus.uml.expressions.tests.HasAppliedStereotypeExpressionTests) skipped
01:27:44 HasStereotypeExpressionTests_Test4(org.eclipse.papyrus.uml.expressions.tests.HasAppliedStereotypeExpressionTests) skipped
01:27:44 org.eclipse.papyrus.uml.expressions.tests.HasAppliedStereotypeExpressionTests skipped
01:27:44 metaclassAndNoContext(org.eclipse.papyrus.uml.expressions.tests.IsKindOfExpressionTest) skipped
01:27:44 noMetaclassAndNoContextTest(org.eclipse.papyrus.uml.expressions.tests.IsKindOfExpressionTest) skipped
01:27:44 metaclassAndValidContext_1(org.eclipse.papyrus.uml.expressions.tests.IsKindOfExpressionTest) skipped
01:27:44 metaclassAndValidContext_2(org.eclipse.papyrus.uml.expressions.tests.IsKindOfExpressionTest) skipped
01:27:44 metaclassAndInvalidContext(org.eclipse.papyrus.uml.expressions.tests.IsKindOfExpressionTest) skipped
01:27:44 org.eclipse.papyrus.uml.expressions.tests.IsKindOfExpressionTest skipped
01:27:44 metaclassAndNoContext(org.eclipse.papyrus.uml.expressions.tests.IsTypeOfExpressionTests) skipped
01:27:44 noMetaclassAndNoContextTest(org.eclipse.papyrus.uml.expressions.tests.IsTypeOfExpressionTests) skipped
01:27:44 metaclassAndValidContext_2(org.eclipse.papyrus.uml.expressions.tests.IsTypeOfExpressionTests) skipped
01:27:44 metaclassAndInValidContext_1(org.eclipse.papyrus.uml.expressions.tests.IsTypeOfExpressionTests) skipped
01:27:44 org.eclipse.papyrus.uml.expressions.tests.IsTypeOfExpressionTests skipped
01:27:44 org.eclipse.papyrus.uml.expressions.tests.AllTests skipped
01:27:44 
01:27:44 Results :
01:27:44 
01:27:44 Failed tests: 
01:27:44   DeleteCommentLinkTest.testDeletionWithSetRequest:219->checkModelAndDiagramsAfterLinkDeletion:333->checkDiagramAfterLinkDeletion:354 expected:<8> but was:<10>
01:27:44   StereotypeElementListenerTest.testModifiedSysMLStereotype:603 SysML dependency needs to be removed
01:27:44   StereotypeElementListenerTest.testUndoModifiedSysMLStereotype:632 SysML dependency needs to be removed
01:27:44   The label of stereotype for the Class is not good has not the good X coordinate expected:<0> but was:<1>
01:27:44   The figure of the Class  has not the good X coordinate expected:<0> but was:<1>
01:27:44   The label of stereotype for the Class is not good has not the good X coordinate expected:<0> but was:<1>
01:27:44   The figure of the Class  has not the good X coordinate expected:<0> but was:<1>
01:27:44   RegressionTest.basicUMLMigrateProfileExtendingStatic_bug481302:75->doTestMigrateProfileExtendingOther_bug481302:59 
01:27:44 Expected: is "R1"
01:27:44      but: was null
01:27:44 
01:27:44 Tests run: 655, Failures: 8, Errors: 0, Skipped: 594
01:27:44 
01:27:45 [ERROR] There are test failures.
01:27:45 
01:27:45 Please refer to /jobs/genie.papyrus/Papyrus-Oxygen-Tests-Failures/workspace/source/tests/junit/plugins/uml/org.eclipse.papyrus.uml.suite.tests/target/surefire-reports for the individual test results.
01:27:45 [INFO] 
01:27:45 [INFO] --- jacoco-maven-plugin:0.7.9:report (default-report) @ org.eclipse.papyrus.uml.suite.tests ---
01:27:45 [INFO] Loading execution data file /jobs/genie.papyrus/Papyrus-Oxygen-Tests-Failures/workspace/source/tests/junit/plugins/uml/org.eclipse.papyrus.uml.suite.tests/target/jacoco.exec
01:27:45 [INFO] Analyzed bundle 'org.eclipse.papyrus.uml.suite.tests' with 0 classes
01:27:46 [INFO] 
01:27:46 [INFO] --< org.eclipse.papyrus.tests:org.eclipse.papyrus.uml.alf.tests.releng >--
01:27:46 [INFO] Building org.eclipse.papyrus.uml.alf.tests.releng 0.0.1-SNAPSHOT [148/155]
01:27:46 [INFO] --------------------------------[ pom ]---------------------------------
01:27:46 [INFO] 
01:27:46 [INFO] --- maven-clean-plugin:2.6:clean (default-clean) @ org.eclipse.papyrus.uml.alf.tests.releng ---
01:27:46 [INFO] 
01:27:46 [INFO] --- jacoco-maven-plugin:0.7.9:prepare-agent (default-prepare-agent) @ org.eclipse.papyrus.uml.alf.tests.releng ---
01:27:46 [INFO] argLine set to -javaagent:/home/hudson/genie.papyrus/.jenkins/jobs/Papyrus-Oxygen-Tests-Failures/workspace/.repository/org/jacoco/org.jacoco.agent/0.7.9/org.jacoco.agent-0.7.9-runtime.jar=destfile=/jobs/genie.papyrus/Papyrus-Oxygen-Tests-Failures/workspace/source/tests/junit/plugins/uml/alf/target/jacoco.exec,includes=org.eclipse.papyrus.*,excludes=org.eclipse.uml2
01:27:46 [INFO] 
01:27:46 [INFO] --- jacoco-maven-plugin:0.7.9:report (default-report) @ org.eclipse.papyrus.uml.alf.tests.releng ---
01:27:46 [INFO] Skipping JaCoCo execution due to missing execution data file.
01:27:46 [INFO] 
01:27:46 [INFO] --< org.eclipse.papyrus.tests:org.eclipse.papyrus.uml.alf.backend.tests >--
01:27:46 [INFO] Building org.eclipse.papyrus.uml.alf.backend.tests 1.1.0-SNAPSHOT [149/155]
01:27:46 [INFO] ------------------------[ eclipse-test-plugin ]-------------------------
01:27:46 [INFO] 
01:27:46 [INFO] --- maven-clean-plugin:2.6:clean (default-clean) @ org.eclipse.papyrus.uml.alf.backend.tests ---
01:27:46 [INFO] 
01:27:46 [INFO] --- tycho-packaging-plugin:1.0.0:build-qualifier (default-build-qualifier) @ org.eclipse.papyrus.uml.alf.backend.tests ---
01:27:46 [INFO] The project's OSGi version is 1.1.0.201911030605
01:27:46 [INFO] 
01:27:46 [INFO] --- tycho-packaging-plugin:1.0.0:validate-id (default-validate-id) @ org.eclipse.papyrus.uml.alf.backend.tests ---
01:27:46 [INFO] 
01:27:46 [INFO] --- tycho-packaging-plugin:1.0.0:validate-version (default-validate-version) @ org.eclipse.papyrus.uml.alf.backend.tests ---
01:27:46 [INFO] 
01:27:46 [INFO] --- jacoco-maven-plugin:0.7.9:prepare-agent (default-prepare-agent) @ org.eclipse.papyrus.uml.alf.backend.tests ---
01:27:46 [INFO] tycho.testArgLine set to -javaagent:/home/hudson/genie.papyrus/.jenkins/jobs/Papyrus-Oxygen-Tests-Failures/workspace/.repository/org/jacoco/org.jacoco.agent/0.7.9/org.jacoco.agent-0.7.9-runtime.jar=destfile=/jobs/genie.papyrus/Papyrus-Oxygen-Tests-Failures/workspace/source/tests/junit/plugins/uml/alf/org.eclipse.papyrus.uml.alf.backend.tests/target/jacoco.exec,includes=org.eclipse.papyrus.*,excludes=org.eclipse.uml2
01:27:46 [INFO] 
01:27:46 [INFO] --- xtend-maven-plugin:2.11.0:compile (default) @ org.eclipse.papyrus.uml.alf.backend.tests ---
01:27:46 [INFO] 
01:27:46 [INFO] --- maven-resources-plugin:2.6:resources (default-resources) @ org.eclipse.papyrus.uml.alf.backend.tests ---
01:27:46 [INFO] Using 'UTF-8' encoding to copy filtered resources.
01:27:46 [INFO] skip non existing resourceDirectory /jobs/genie.papyrus/Papyrus-Oxygen-Tests-Failures/workspace/source/tests/junit/plugins/uml/alf/org.eclipse.papyrus.uml.alf.backend.tests/src/main/resources
01:27:46 [INFO] 
01:27:46 [INFO] --- tycho-compiler-plugin:1.0.0:compile (default-compile) @ org.eclipse.papyrus.uml.alf.backend.tests ---
01:27:46 [INFO] Compiling 4 source files to /jobs/genie.papyrus/Papyrus-Oxygen-Tests-Failures/workspace/source/tests/junit/plugins/uml/alf/org.eclipse.papyrus.uml.alf.backend.tests/target/classes
01:27:47 [INFO] 
01:27:47 [INFO] --- maven-resources-plugin:2.6:testResources (default-testResources) @ org.eclipse.papyrus.uml.alf.backend.tests ---
01:27:47 [INFO] Using 'UTF-8' encoding to copy filtered resources.
01:27:47 [INFO] skip non existing resourceDirectory /jobs/genie.papyrus/Papyrus-Oxygen-Tests-Failures/workspace/source/tests/junit/plugins/uml/alf/org.eclipse.papyrus.uml.alf.backend.tests/src/test/resources
01:27:47 [INFO] 
01:27:47 [INFO] --- target-platform-configuration:1.0.0:target-platform (default-target-platform) @ org.eclipse.papyrus.uml.alf.backend.tests ---
01:27:47 [INFO] 
01:27:47 [INFO] --- tycho-packaging-plugin:1.0.0:package-plugin (default-package-plugin) @ org.eclipse.papyrus.uml.alf.backend.tests ---
01:27:47 [INFO] Building jar: /jobs/genie.papyrus/Papyrus-Oxygen-Tests-Failures/workspace/source/tests/junit/plugins/uml/alf/org.eclipse.papyrus.uml.alf.backend.tests/target/org.eclipse.papyrus.uml.alf.backend.tests-1.1.0-SNAPSHOT.jar
01:27:47 [INFO] 
01:27:47 [INFO] --- tycho-p2-plugin:1.0.0:p2-metadata-default (default-p2-metadata-default) @ org.eclipse.papyrus.uml.alf.backend.tests ---
01:27:47 [INFO] 
01:27:47 [INFO] --- tycho-surefire-plugin:1.0.0:test (default-test) @ org.eclipse.papyrus.uml.alf.backend.tests ---
01:27:47 [INFO] Skipping tests
01:27:47 [INFO] 
01:27:47 [INFO] --- jacoco-maven-plugin:0.7.9:report (default-report) @ org.eclipse.papyrus.uml.alf.backend.tests ---
01:27:47 [INFO] Skipping JaCoCo execution due to missing execution data file.
01:27:47 [INFO] 
01:27:47 [INFO] --< org.eclipse.papyrus.tests:org.eclipse.papyrus.uml.internationalization.controlmode.tests >--
01:27:47 [INFO] Building org.eclipse.papyrus.uml.internationalization.controlmode.tests 1.0.0-SNAPSHOT [150/155]
01:27:47 [INFO] ------------------------[ eclipse-test-plugin ]-------------------------
01:27:47 [INFO] 
01:27:47 [INFO] --- maven-clean-plugin:2.6:clean (default-clean) @ org.eclipse.papyrus.uml.internationalization.controlmode.tests ---
01:27:47 [INFO] 
01:27:47 [INFO] --- tycho-packaging-plugin:1.0.0:build-qualifier (default-build-qualifier) @ org.eclipse.papyrus.uml.internationalization.controlmode.tests ---
01:27:47 [INFO] The project's OSGi version is 1.0.0.201911030605
01:27:47 [INFO] 
01:27:47 [INFO] --- tycho-packaging-plugin:1.0.0:validate-id (default-validate-id) @ org.eclipse.papyrus.uml.internationalization.controlmode.tests ---
01:27:47 [INFO] 
01:27:47 [INFO] --- tycho-packaging-plugin:1.0.0:validate-version (default-validate-version) @ org.eclipse.papyrus.uml.internationalization.controlmode.tests ---
01:27:47 [INFO] 
01:27:47 [INFO] --- jacoco-maven-plugin:0.7.9:prepare-agent (default-prepare-agent) @ org.eclipse.papyrus.uml.internationalization.controlmode.tests ---
01:27:47 [INFO] tycho.testArgLine set to -javaagent:/home/hudson/genie.papyrus/.jenkins/jobs/Papyrus-Oxygen-Tests-Failures/workspace/.repository/org/jacoco/org.jacoco.agent/0.7.9/org.jacoco.agent-0.7.9-runtime.jar=destfile=/jobs/genie.papyrus/Papyrus-Oxygen-Tests-Failures/workspace/source/tests/junit/plugins/uml/internationalization/org.eclipse.papyrus.uml.internationalization.controlmode.tests/target/jacoco.exec,includes=org.eclipse.papyrus.*,excludes=org.eclipse.uml2
01:27:47 [INFO] 
01:27:47 [INFO] --- maven-resources-plugin:2.6:resources (default-resources) @ org.eclipse.papyrus.uml.internationalization.controlmode.tests ---
01:27:47 [INFO] Using 'UTF-8' encoding to copy filtered resources.
01:27:47 [INFO] skip non existing resourceDirectory /jobs/genie.papyrus/Papyrus-Oxygen-Tests-Failures/workspace/source/tests/junit/plugins/uml/internationalization/org.eclipse.papyrus.uml.internationalization.controlmode.tests/src/main/resources
01:27:47 [INFO] 
01:27:47 [INFO] --- tycho-compiler-plugin:1.0.0:compile (default-compile) @ org.eclipse.papyrus.uml.internationalization.controlmode.tests ---
01:27:47 [INFO] Compiling 5 source files to /jobs/genie.papyrus/Papyrus-Oxygen-Tests-Failures/workspace/source/tests/junit/plugins/uml/internationalization/org.eclipse.papyrus.uml.internationalization.controlmode.tests/target/classes
01:27:47 [INFO] 
01:27:47 [INFO] --- maven-resources-plugin:2.6:testResources (default-testResources) @ org.eclipse.papyrus.uml.internationalization.controlmode.tests ---
01:27:47 [INFO] Using 'UTF-8' encoding to copy filtered resources.
01:27:47 [INFO] skip non existing resourceDirectory /jobs/genie.papyrus/Papyrus-Oxygen-Tests-Failures/workspace/source/tests/junit/plugins/uml/internationalization/org.eclipse.papyrus.uml.internationalization.controlmode.tests/src/test/resources
01:27:47 [INFO] 
01:27:47 [INFO] --- target-platform-configuration:1.0.0:target-platform (default-target-platform) @ org.eclipse.papyrus.uml.internationalization.controlmode.tests ---
01:27:47 [INFO] 
01:27:47 [INFO] --- tycho-packaging-plugin:1.0.0:package-plugin (default-package-plugin) @ org.eclipse.papyrus.uml.internationalization.controlmode.tests ---
01:27:47 [INFO] Building jar: /jobs/genie.papyrus/Papyrus-Oxygen-Tests-Failures/workspace/source/tests/junit/plugins/uml/internationalization/org.eclipse.papyrus.uml.internationalization.controlmode.tests/target/org.eclipse.papyrus.uml.internationalization.controlmode.tests-1.0.0-SNAPSHOT.jar
01:27:47 [INFO] 
01:27:47 [INFO] --- tycho-p2-plugin:1.0.0:p2-metadata-default (default-p2-metadata-default) @ org.eclipse.papyrus.uml.internationalization.controlmode.tests ---
01:27:47 [INFO] 
01:27:47 [INFO] --- tycho-surefire-plugin:1.0.0:test (default-test) @ org.eclipse.papyrus.uml.internationalization.controlmode.tests ---
01:27:47 [INFO] Skipping tests
01:27:47 [INFO] 
01:27:47 [INFO] --- jacoco-maven-plugin:0.7.9:report (default-report) @ org.eclipse.papyrus.uml.internationalization.controlmode.tests ---
01:27:47 [INFO] Skipping JaCoCo execution due to missing execution data file.
01:27:47 [INFO] 
01:27:47 [INFO] --< org.eclipse.papyrus.tests:org.eclipse.papyrus.views.properties.toolsmiths.tests >--
01:27:47 [INFO] Building org.eclipse.papyrus.views.properties.toolsmiths.tests 1.2.0-SNAPSHOT [151/155]
01:27:47 [INFO] ------------------------[ eclipse-test-plugin ]-------------------------
01:27:47 [INFO] 
01:27:47 [INFO] --- maven-clean-plugin:2.6:clean (default-clean) @ org.eclipse.papyrus.views.properties.toolsmiths.tests ---
01:27:47 [INFO] 
01:27:47 [INFO] --- tycho-packaging-plugin:1.0.0:build-qualifier (default-build-qualifier) @ org.eclipse.papyrus.views.properties.toolsmiths.tests ---
01:27:47 [INFO] The project's OSGi version is 1.2.0.201911030605
01:27:47 [INFO] 
01:27:47 [INFO] --- tycho-packaging-plugin:1.0.0:validate-id (default-validate-id) @ org.eclipse.papyrus.views.properties.toolsmiths.tests ---
01:27:47 [INFO] 
01:27:47 [INFO] --- tycho-packaging-plugin:1.0.0:validate-version (default-validate-version) @ org.eclipse.papyrus.views.properties.toolsmiths.tests ---
01:27:47 [INFO] 
01:27:47 [INFO] --- jacoco-maven-plugin:0.7.9:prepare-agent (default-prepare-agent) @ org.eclipse.papyrus.views.properties.toolsmiths.tests ---
01:27:47 [INFO] tycho.testArgLine set to -javaagent:/home/hudson/genie.papyrus/.jenkins/jobs/Papyrus-Oxygen-Tests-Failures/workspace/.repository/org/jacoco/org.jacoco.agent/0.7.9/org.jacoco.agent-0.7.9-runtime.jar=destfile=/jobs/genie.papyrus/Papyrus-Oxygen-Tests-Failures/workspace/source/tests/junit/plugins/views/org.eclipse.papyrus.views.properties.toolsmiths.tests/target/jacoco.exec,includes=org.eclipse.papyrus.*,excludes=org.eclipse.uml2
01:27:47 [INFO] 
01:27:47 [INFO] --- maven-resources-plugin:2.6:resources (default-resources) @ org.eclipse.papyrus.views.properties.toolsmiths.tests ---
01:27:47 [INFO] Using 'UTF-8' encoding to copy filtered resources.
01:27:47 [INFO] skip non existing resourceDirectory /jobs/genie.papyrus/Papyrus-Oxygen-Tests-Failures/workspace/source/tests/junit/plugins/views/org.eclipse.papyrus.views.properties.toolsmiths.tests/src/main/resources
01:27:47 [INFO] 
01:27:47 [INFO] --- tycho-compiler-plugin:1.0.0:compile (default-compile) @ org.eclipse.papyrus.views.properties.toolsmiths.tests ---
01:27:47 [INFO] Compiling 3 source files to /jobs/genie.papyrus/Papyrus-Oxygen-Tests-Failures/workspace/source/tests/junit/plugins/views/org.eclipse.papyrus.views.properties.toolsmiths.tests/target/classes
01:27:47 [WARNING] /jobs/genie.papyrus/Papyrus-Oxygen-Tests-Failures/workspace/source/tests/junit/plugins/views/org.eclipse.papyrus.views.properties.toolsmiths.tests/src/org/eclipse/papyrus/views/properties/toolsmiths/tests/qvt/TransformationsTests.java:[164] 
01:27:47 	ModelExtent temp = new BasicModelExtent();
01:27:47 	            ^^^^
01:27:47 The value of the local variable temp is not used
01:27:47 [WARNING] /jobs/genie.papyrus/Papyrus-Oxygen-Tests-Failures/workspace/source/tests/junit/plugins/views/org.eclipse.papyrus.views.properties.toolsmiths.tests/src/org/eclipse/papyrus/views/properties/toolsmiths/tests/qvt/TransformationsTests.java:[275] 
01:27:47 	DataContextElement st3Element = findContextElement(context, "Stereotype3");
01:27:47 	                   ^^^^^^^^^^
01:27:47 The value of the local variable st3Element is not used
01:27:47 2 problems (2 warnings)
01:27:47 [INFO] 
01:27:47 [INFO] --- maven-resources-plugin:2.6:testResources (default-testResources) @ org.eclipse.papyrus.views.properties.toolsmiths.tests ---
01:27:47 [INFO] Using 'UTF-8' encoding to copy filtered resources.
01:27:47 [INFO] skip non existing resourceDirectory /jobs/genie.papyrus/Papyrus-Oxygen-Tests-Failures/workspace/source/tests/junit/plugins/views/org.eclipse.papyrus.views.properties.toolsmiths.tests/src/test/resources
01:27:47 [INFO] 
01:27:47 [INFO] --- target-platform-configuration:1.0.0:target-platform (default-target-platform) @ org.eclipse.papyrus.views.properties.toolsmiths.tests ---
01:27:47 [INFO] 
01:27:47 [INFO] --- tycho-packaging-plugin:1.0.0:package-plugin (default-package-plugin) @ org.eclipse.papyrus.views.properties.toolsmiths.tests ---
01:27:47 [INFO] Building jar: /jobs/genie.papyrus/Papyrus-Oxygen-Tests-Failures/workspace/source/tests/junit/plugins/views/org.eclipse.papyrus.views.properties.toolsmiths.tests/target/org.eclipse.papyrus.views.properties.toolsmiths.tests-1.2.0-SNAPSHOT.jar
01:27:47 [INFO] 
01:27:47 [INFO] --- tycho-p2-plugin:1.0.0:p2-metadata-default (default-p2-metadata-default) @ org.eclipse.papyrus.views.properties.toolsmiths.tests ---
01:27:47 [INFO] 
01:27:47 [INFO] --- tycho-surefire-plugin:1.0.0:test (default-test) @ org.eclipse.papyrus.views.properties.toolsmiths.tests ---
01:27:47 [INFO] Skipping tests
01:27:47 [INFO] 
01:27:47 [INFO] --- jacoco-maven-plugin:0.7.9:report (default-report) @ org.eclipse.papyrus.views.properties.toolsmiths.tests ---
01:27:47 [INFO] Skipping JaCoCo execution due to missing execution data file.
01:27:47 [INFO] 
01:27:47 [INFO] --< org.eclipse.papyrus.tests:org.eclipse.papyrus.views.suite.tests >---
01:27:47 [INFO] Building org.eclipse.papyrus.views.suite.tests 0.0.1-SNAPSHOT  [152/155]
01:27:47 [INFO] ------------------------[ eclipse-test-plugin ]-------------------------
01:27:47 [INFO] 
01:27:47 [INFO] --- maven-clean-plugin:2.6:clean (default-clean) @ org.eclipse.papyrus.views.suite.tests ---
01:27:47 [INFO] 
01:27:47 [INFO] --- tycho-packaging-plugin:1.0.0:build-qualifier (default-build-qualifier) @ org.eclipse.papyrus.views.suite.tests ---
01:27:47 [INFO] The project's OSGi version is 0.0.1.201911030605
01:27:47 [INFO] 
01:27:47 [INFO] --- tycho-packaging-plugin:1.0.0:validate-id (default-validate-id) @ org.eclipse.papyrus.views.suite.tests ---
01:27:47 [INFO] 
01:27:47 [INFO] --- tycho-packaging-plugin:1.0.0:validate-version (default-validate-version) @ org.eclipse.papyrus.views.suite.tests ---
01:27:47 [INFO] 
01:27:47 [INFO] --- jacoco-maven-plugin:0.7.9:prepare-agent (default-prepare-agent) @ org.eclipse.papyrus.views.suite.tests ---
01:27:47 [INFO] tycho.testArgLine set to -javaagent:/home/hudson/genie.papyrus/.jenkins/jobs/Papyrus-Oxygen-Tests-Failures/workspace/.repository/org/jacoco/org.jacoco.agent/0.7.9/org.jacoco.agent-0.7.9-runtime.jar=destfile=/jobs/genie.papyrus/Papyrus-Oxygen-Tests-Failures/workspace/source/tests/junit/plugins/views/org.eclipse.papyrus.views.suite.tests/target/jacoco.exec,includes=org.eclipse.papyrus.*,excludes=org.eclipse.uml2
01:27:47 [INFO] 
01:27:47 [INFO] --- maven-resources-plugin:2.6:resources (default-resources) @ org.eclipse.papyrus.views.suite.tests ---
01:27:47 [INFO] Using 'UTF-8' encoding to copy filtered resources.
01:27:47 [INFO] skip non existing resourceDirectory /jobs/genie.papyrus/Papyrus-Oxygen-Tests-Failures/workspace/source/tests/junit/plugins/views/org.eclipse.papyrus.views.suite.tests/src/main/resources
01:27:47 [INFO] 
01:27:47 [INFO] --- tycho-compiler-plugin:1.0.0:compile (default-compile) @ org.eclipse.papyrus.views.suite.tests ---
01:27:47 [INFO] Compiling 2 source files to /jobs/genie.papyrus/Papyrus-Oxygen-Tests-Failures/workspace/source/tests/junit/plugins/views/org.eclipse.papyrus.views.suite.tests/target/classes
01:27:48 [INFO] 
01:27:48 [INFO] --- maven-resources-plugin:2.6:testResources (default-testResources) @ org.eclipse.papyrus.views.suite.tests ---
01:27:48 [INFO] Using 'UTF-8' encoding to copy filtered resources.
01:27:48 [INFO] skip non existing resourceDirectory /jobs/genie.papyrus/Papyrus-Oxygen-Tests-Failures/workspace/source/tests/junit/plugins/views/org.eclipse.papyrus.views.suite.tests/src/test/resources
01:27:48 [INFO] 
01:27:48 [INFO] --- target-platform-configuration:1.0.0:target-platform (default-target-platform) @ org.eclipse.papyrus.views.suite.tests ---
01:27:48 [INFO] 
01:27:48 [INFO] --- tycho-packaging-plugin:1.0.0:package-plugin (default-package-plugin) @ org.eclipse.papyrus.views.suite.tests ---
01:27:48 [INFO] Building jar: /jobs/genie.papyrus/Papyrus-Oxygen-Tests-Failures/workspace/source/tests/junit/plugins/views/org.eclipse.papyrus.views.suite.tests/target/org.eclipse.papyrus.views.suite.tests-0.0.1-SNAPSHOT.jar
01:27:48 [INFO] 
01:27:48 [INFO] --- tycho-p2-plugin:1.0.0:p2-metadata-default (default-p2-metadata-default) @ org.eclipse.papyrus.views.suite.tests ---
01:27:48 [INFO] 
01:27:48 [INFO] --- tycho-surefire-plugin:1.0.0:test (default-test) @ org.eclipse.papyrus.views.suite.tests ---
01:27:49 [INFO] Expected eclipse log file: /jobs/genie.papyrus/Papyrus-Oxygen-Tests-Failures/workspace/source/tests/junit/plugins/views/org.eclipse.papyrus.views.suite.tests/target/work/data/.metadata/.log
01:27:49 [INFO] Command line:
01:27:49 	[/opt/public/common/java/oracle/jdk1.8.0_192_x64/jre/bin/java, -Dosgi.noShutdown=false, -Dosgi.os=linux, -Dosgi.ws=gtk, -Dosgi.arch=x86_64, -javaagent:/home/hudson/genie.papyrus/.jenkins/jobs/Papyrus-Oxygen-Tests-Failures/workspace/.repository/org/jacoco/org.jacoco.agent/0.7.9/org.jacoco.agent-0.7.9-runtime.jar=destfile=/jobs/genie.papyrus/Papyrus-Oxygen-Tests-Failures/workspace/source/tests/junit/plugins/views/org.eclipse.papyrus.views.suite.tests/target/jacoco.exec,includes=org.eclipse.papyrus.*,excludes=org.eclipse.uml2, -Xms512m, -Xmx2048m, -XX:SoftRefLRUPolicyMSPerMB=100, -Dosgi.clean=true, -jar, /jobs/genie.papyrus/Papyrus-Oxygen-Tests-Failures/workspace/.repository/p2/osgi/bundle/org.eclipse.equinox.launcher/1.4.0.v20161219-1356/org.eclipse.equinox.launcher-1.4.0.v20161219-1356.jar, -data, /jobs/genie.papyrus/Papyrus-Oxygen-Tests-Failures/workspace/source/tests/junit/plugins/views/org.eclipse.papyrus.views.suite.tests/target/work/data, -install, /jobs/genie.papyrus/Papyrus-Oxygen-Tests-Failures/workspace/source/tests/junit/plugins/views/org.eclipse.papyrus.views.suite.tests/target/work, -configuration, /jobs/genie.papyrus/Papyrus-Oxygen-Tests-Failures/workspace/source/tests/junit/plugins/views/org.eclipse.papyrus.views.suite.tests/target/work/configuration, -application, org.eclipse.tycho.surefire.osgibooter.uitest, -testproperties, /jobs/genie.papyrus/Papyrus-Oxygen-Tests-Failures/workspace/source/tests/junit/plugins/views/org.eclipse.papyrus.views.suite.tests/target/surefire.properties, -product, org.eclipse.sdk.ide, -testConfig=FAILING_TESTS_CONFIG]
01:27:49 Picked up JAVA_TOOL_OPTIONS: -Xmx2G -Djava.io.tmpdir=/tmp/genie.papyrus -DforkCount=1
01:27:57 
01:27:57 -------------------------------------------------------
01:27:57  T E S T S
01:27:57 -------------------------------------------------------
01:27:57 Running org.eclipse.papyrus.views.suite.tests.AllTests
01:27:57 Tests run: 16, Failures: 0, Errors: 0, Skipped: 16, Time elapsed: 0.293 sec - in org.eclipse.papyrus.views.suite.tests.AllTests
01:27:57 revealSemanticElement_rootTest(org.eclipse.papyrus.views.modelexplorer.tests.ModelExplorerViewTests) skipped
01:27:57 org.eclipse.papyrus.views.modelexplorer.tests.ModelExplorerViewTests skipped
01:27:57 deleteDiagramTest(org.eclipse.papyrus.views.modelexplorer.tests.DeleteHandlerTest) skipped
01:27:57 deleteTableTest(org.eclipse.papyrus.views.modelexplorer.tests.DeleteHandlerTest) skipped
01:27:57 deleteLinkItemTest(org.eclipse.papyrus.views.modelexplorer.tests.DeleteHandlerTest) skipped
01:27:57 deleteRootOfTheModel(org.eclipse.papyrus.views.modelexplorer.tests.DeleteHandlerTest) skipped
01:27:57 org.eclipse.papyrus.views.modelexplorer.tests.DeleteHandlerTest skipped
01:27:57 testOpendiagramTest(org.eclipse.papyrus.views.modelexplorer.tests.OpendiagramTest) skipped
01:27:57 org.eclipse.papyrus.views.modelexplorer.tests.OpendiagramTest skipped
01:27:57 org.eclipse.papyrus.views.modelexplorer.tests.AllTests skipped
01:27:57 handleXWTFileFromResourceSet(org.eclipse.papyrus.views.properties.toolsmiths.tests.qvt.TransformationsTests) skipped
01:27:57 handleXWTFileFromResource(org.eclipse.papyrus.views.properties.toolsmiths.tests.qvt.TransformationsTests) skipped
01:27:57 generateEcoreContext(org.eclipse.papyrus.views.properties.toolsmiths.tests.qvt.TransformationsTests) skipped
01:27:57 generateProfileContext(org.eclipse.papyrus.views.properties.toolsmiths.tests.qvt.TransformationsTests) skipped
01:27:57 org.eclipse.papyrus.views.properties.toolsmiths.tests.qvt.TransformationsTests skipped
01:27:57 org.eclipse.papyrus.views.properties.toolsmiths.tests.AllTests skipped
01:27:57 
01:27:57 Results :
01:27:57 
01:27:57 Tests run: 16, Failures: 0, Errors: 0, Skipped: 16
01:27:57 
01:27:59 [INFO] All tests passed!
01:27:59 [INFO] 
01:27:59 [INFO] --- jacoco-maven-plugin:0.7.9:report (default-report) @ org.eclipse.papyrus.views.suite.tests ---
01:27:59 [INFO] Loading execution data file /jobs/genie.papyrus/Papyrus-Oxygen-Tests-Failures/workspace/source/tests/junit/plugins/views/org.eclipse.papyrus.views.suite.tests/target/jacoco.exec
01:27:59 [INFO] Analyzed bundle 'org.eclipse.papyrus.views.suite.tests' with 0 classes
01:27:59 [INFO] 
01:27:59 [INFO] --< org.eclipse.papyrus.tests:org.eclipse.papyrus.toolsmiths.suite.tests >--
01:27:59 [INFO] Building org.eclipse.papyrus.toolsmiths.suite.tests 0.0.1-SNAPSHOT [153/155]
01:27:59 [INFO] ------------------------[ eclipse-test-plugin ]-------------------------
01:28:00 [INFO] 
01:28:00 [INFO] --- maven-clean-plugin:2.6:clean (default-clean) @ org.eclipse.papyrus.toolsmiths.suite.tests ---
01:28:00 [INFO] 
01:28:00 [INFO] --- tycho-packaging-plugin:1.0.0:build-qualifier (default-build-qualifier) @ org.eclipse.papyrus.toolsmiths.suite.tests ---
01:28:00 [INFO] The project's OSGi version is 0.0.1.201911030605
01:28:00 [INFO] 
01:28:00 [INFO] --- tycho-packaging-plugin:1.0.0:validate-id (default-validate-id) @ org.eclipse.papyrus.toolsmiths.suite.tests ---
01:28:00 [INFO] 
01:28:00 [INFO] --- tycho-packaging-plugin:1.0.0:validate-version (default-validate-version) @ org.eclipse.papyrus.toolsmiths.suite.tests ---
01:28:00 [INFO] 
01:28:00 [INFO] --- jacoco-maven-plugin:0.7.9:prepare-agent (default-prepare-agent) @ org.eclipse.papyrus.toolsmiths.suite.tests ---
01:28:00 [INFO] tycho.testArgLine set to -javaagent:/home/hudson/genie.papyrus/.jenkins/jobs/Papyrus-Oxygen-Tests-Failures/workspace/.repository/org/jacoco/org.jacoco.agent/0.7.9/org.jacoco.agent-0.7.9-runtime.jar=destfile=/jobs/genie.papyrus/Papyrus-Oxygen-Tests-Failures/workspace/source/tests/junit/plugins/toolsmiths/org.eclipse.papyrus.toolsmiths.suite.tests/target/jacoco.exec,includes=org.eclipse.papyrus.*,excludes=org.eclipse.uml2
01:28:00 [INFO] 
01:28:00 [INFO] --- maven-resources-plugin:2.6:resources (default-resources) @ org.eclipse.papyrus.toolsmiths.suite.tests ---
01:28:00 [INFO] Using 'UTF-8' encoding to copy filtered resources.
01:28:00 [INFO] skip non existing resourceDirectory /jobs/genie.papyrus/Papyrus-Oxygen-Tests-Failures/workspace/source/tests/junit/plugins/toolsmiths/org.eclipse.papyrus.toolsmiths.suite.tests/src/main/resources
01:28:00 [INFO] 
01:28:00 [INFO] --- tycho-compiler-plugin:1.0.0:compile (default-compile) @ org.eclipse.papyrus.toolsmiths.suite.tests ---
01:28:00 [INFO] Compiling 2 source files to /jobs/genie.papyrus/Papyrus-Oxygen-Tests-Failures/workspace/source/tests/junit/plugins/toolsmiths/org.eclipse.papyrus.toolsmiths.suite.tests/target/classes
01:28:00 [INFO] 
01:28:00 [INFO] --- maven-resources-plugin:2.6:testResources (default-testResources) @ org.eclipse.papyrus.toolsmiths.suite.tests ---
01:28:00 [INFO] Using 'UTF-8' encoding to copy filtered resources.
01:28:00 [INFO] skip non existing resourceDirectory /jobs/genie.papyrus/Papyrus-Oxygen-Tests-Failures/workspace/source/tests/junit/plugins/toolsmiths/org.eclipse.papyrus.toolsmiths.suite.tests/src/test/resources
01:28:00 [INFO] 
01:28:00 [INFO] --- target-platform-configuration:1.0.0:target-platform (default-target-platform) @ org.eclipse.papyrus.toolsmiths.suite.tests ---
01:28:00 [INFO] 
01:28:00 [INFO] --- tycho-packaging-plugin:1.0.0:package-plugin (default-package-plugin) @ org.eclipse.papyrus.toolsmiths.suite.tests ---
01:28:00 [INFO] Building jar: /jobs/genie.papyrus/Papyrus-Oxygen-Tests-Failures/workspace/source/tests/junit/plugins/toolsmiths/org.eclipse.papyrus.toolsmiths.suite.tests/target/org.eclipse.papyrus.toolsmiths.suite.tests-0.0.1-SNAPSHOT.jar
01:28:00 [INFO] 
01:28:00 [INFO] --- tycho-p2-plugin:1.0.0:p2-metadata-default (default-p2-metadata-default) @ org.eclipse.papyrus.toolsmiths.suite.tests ---
01:28:00 [INFO] 
01:28:00 [INFO] --- tycho-surefire-plugin:1.0.0:test (default-test) @ org.eclipse.papyrus.toolsmiths.suite.tests ---
01:28:01 [INFO] Expected eclipse log file: /jobs/genie.papyrus/Papyrus-Oxygen-Tests-Failures/workspace/source/tests/junit/plugins/toolsmiths/org.eclipse.papyrus.toolsmiths.suite.tests/target/work/data/.metadata/.log
01:28:01 [INFO] Command line:
01:28:01 	[/opt/public/common/java/oracle/jdk1.8.0_192_x64/jre/bin/java, -Dosgi.noShutdown=false, -Dosgi.os=linux, -Dosgi.ws=gtk, -Dosgi.arch=x86_64, -javaagent:/home/hudson/genie.papyrus/.jenkins/jobs/Papyrus-Oxygen-Tests-Failures/workspace/.repository/org/jacoco/org.jacoco.agent/0.7.9/org.jacoco.agent-0.7.9-runtime.jar=destfile=/jobs/genie.papyrus/Papyrus-Oxygen-Tests-Failures/workspace/source/tests/junit/plugins/toolsmiths/org.eclipse.papyrus.toolsmiths.suite.tests/target/jacoco.exec,includes=org.eclipse.papyrus.*,excludes=org.eclipse.uml2, -Xms512m, -Xmx2048m, -XX:SoftRefLRUPolicyMSPerMB=100, -Dosgi.clean=true, -jar, /jobs/genie.papyrus/Papyrus-Oxygen-Tests-Failures/workspace/.repository/p2/osgi/bundle/org.eclipse.equinox.launcher/1.4.0.v20161219-1356/org.eclipse.equinox.launcher-1.4.0.v20161219-1356.jar, -data, /jobs/genie.papyrus/Papyrus-Oxygen-Tests-Failures/workspace/source/tests/junit/plugins/toolsmiths/org.eclipse.papyrus.toolsmiths.suite.tests/target/work/data, -install, /jobs/genie.papyrus/Papyrus-Oxygen-Tests-Failures/workspace/source/tests/junit/plugins/toolsmiths/org.eclipse.papyrus.toolsmiths.suite.tests/target/work, -configuration, /jobs/genie.papyrus/Papyrus-Oxygen-Tests-Failures/workspace/source/tests/junit/plugins/toolsmiths/org.eclipse.papyrus.toolsmiths.suite.tests/target/work/configuration, -application, org.eclipse.tycho.surefire.osgibooter.uitest, -testproperties, /jobs/genie.papyrus/Papyrus-Oxygen-Tests-Failures/workspace/source/tests/junit/plugins/toolsmiths/org.eclipse.papyrus.toolsmiths.suite.tests/target/surefire.properties, -product, org.eclipse.sdk.ide, -testConfig=FAILING_TESTS_CONFIG]
01:28:01 Picked up JAVA_TOOL_OPTIONS: -Xmx2G -Djava.io.tmpdir=/tmp/genie.papyrus -DforkCount=1
01:28:10 
01:28:10 -------------------------------------------------------
01:28:10  T E S T S
01:28:10 -------------------------------------------------------
01:28:10 Running org.eclipse.papyrus.toolsmiths.suite.tests.AllTests
01:28:11 log4j:WARN No appenders could be found for logger (org.eclipse.emf.compare.EMFCompare).
01:28:11 log4j:WARN Please initialize the log4j system properly.
01:28:12 Tests run: 21, Failures: 0, Errors: 0, Skipped: 0, Time elapsed: 2.302 sec - in org.eclipse.papyrus.toolsmiths.suite.tests.AllTests
01:28:12 ProfileAutomaticMigrationTest(org.eclipse.papyrus.toolsmiths.profilemigration.tests.automatic.AutomaticMigrationTest)  Time elapsed: 0.002 sec
01:28:12 PackageAutomaticMigrationTest(org.eclipse.papyrus.toolsmiths.profilemigration.tests.automatic.AutomaticMigrationTest)  Time elapsed: 0.01 sec
01:28:12 StereotypeAutomaticMigrationTest_Stereotype_delete_Property(org.eclipse.papyrus.toolsmiths.profilemigration.tests.automatic.AutomaticMigrationTest)  Time elapsed: 0 sec
01:28:12 PropertyAutomaticMigrationTest(org.eclipse.papyrus.toolsmiths.profilemigration.tests.automatic.AutomaticMigrationTest)  Time elapsed: 0.001 sec
01:28:12 StereotypeAutomaticMigrationTest(org.eclipse.papyrus.toolsmiths.profilemigration.tests.automatic.AutomaticMigrationTest)  Time elapsed: 0.001 sec
01:28:12 GeneralizationAutomaticMigrationTest(org.eclipse.papyrus.toolsmiths.profilemigration.tests.automatic.AutomaticMigrationTest)  Time elapsed: 0.001 sec
01:28:12 atomicListTest(org.eclipse.papyrus.toolsmiths.profilemigration.tests.migrators.ChangeIsAbstractFromStereotypeTest)  Time elapsed: 0.002 sec
01:28:12 atomicListMoveProfileIntoNonApplyProfileTest(org.eclipse.papyrus.toolsmiths.profilemigration.tests.migrators.MoveMigratorTest)  Time elapsed: 0.031 sec
01:28:12 atomicListMoveStereotypeIntoNonApplyProfileTest(org.eclipse.papyrus.toolsmiths.profilemigration.tests.migrators.MoveMigratorTest)  Time elapsed: 0.031 sec
01:28:12 atomicListMovePackageIntoAlreadyApplyProfileTest(org.eclipse.papyrus.toolsmiths.profilemigration.tests.migrators.MoveMigratorTest)  Time elapsed: 0.029 sec
01:28:12 atomicListMoveStereotypeIntoAlreadyApplyProfileTest(org.eclipse.papyrus.toolsmiths.profilemigration.tests.migrators.MoveMigratorTest)  Time elapsed: 0.033 sec
01:28:12 atomicListMovePackageIntoNonApplyProfileTest(org.eclipse.papyrus.toolsmiths.profilemigration.tests.migrators.MoveMigratorTest)  Time elapsed: 0.036 sec
01:28:12 atomicListMoveProfileIntoAlreadyApplyProfileTest(org.eclipse.papyrus.toolsmiths.profilemigration.tests.migrators.MoveMigratorTest)  Time elapsed: 0.037 sec
01:28:12 UpperMultiplicityTest(org.eclipse.papyrus.toolsmiths.profilemigration.tests.migrators.ChangeMultiplicityFromPropertyMigratorTest)  Time elapsed: 0.002 sec
01:28:12 atomicListTest(org.eclipse.papyrus.toolsmiths.profilemigration.tests.migrators.ChangeMultiplicityFromPropertyMigratorTest)  Time elapsed: 0 sec
01:28:12 LowerMultiplicityTest(org.eclipse.papyrus.toolsmiths.profilemigration.tests.migrators.ChangeMultiplicityFromPropertyMigratorTest)  Time elapsed: 0.001 sec
01:28:12 DeleteEnumerationLiteralTest(org.eclipse.papyrus.toolsmiths.profilemigration.tests.migrators.DeleteEnumLiteralFromEnumerationTest)  Time elapsed: 0.001 sec
01:28:12 MoveEnumerationLiteralTest(org.eclipse.papyrus.toolsmiths.profilemigration.tests.migrators.DeleteEnumLiteralFromEnumerationTest)  Time elapsed: 0.001 sec
01:28:12 atomicListTest(org.eclipse.papyrus.toolsmiths.profilemigration.tests.migrators.DeleteEnumLiteralFromEnumerationTest)  Time elapsed: 0 sec
01:28:12 atomicListTest(org.eclipse.papyrus.toolsmiths.profilemigration.tests.migrators.ChangeIsStaticFromPropertyTest)  Time elapsed: 0.001 sec
01:28:12 atomicListTest(org.eclipse.papyrus.toolsmiths.profilemigration.tests.migrators.AddPropertyToStereotypeTest)  Time elapsed: 0.002 sec
01:28:12 
01:28:12 Results :
01:28:12 
01:28:12 Tests run: 21, Failures: 0, Errors: 0, Skipped: 0
01:28:12 
01:28:15 [INFO] All tests passed!
01:28:15 [INFO] 
01:28:15 [INFO] --- jacoco-maven-plugin:0.7.9:report (default-report) @ org.eclipse.papyrus.toolsmiths.suite.tests ---
01:28:15 [INFO] Loading execution data file /jobs/genie.papyrus/Papyrus-Oxygen-Tests-Failures/workspace/source/tests/junit/plugins/toolsmiths/org.eclipse.papyrus.toolsmiths.suite.tests/target/jacoco.exec
01:28:15 [INFO] Analyzed bundle 'org.eclipse.papyrus.toolsmiths.suite.tests' with 0 classes
01:28:15 [INFO] 
01:28:15 [INFO] --< org.eclipse.papyrus:org.eclipse.papyrus.main.tests.target.parent >--
01:28:15 [INFO] Building org.eclipse.papyrus.main.tests.target.parent 0.0.1-SNAPSHOT [154/155]
01:28:15 [INFO] --------------------------------[ pom ]---------------------------------
01:28:15 [INFO] 
01:28:15 [INFO] --- maven-clean-plugin:2.6:clean (default-clean) @ org.eclipse.papyrus.main.tests.target.parent ---
01:28:15 [INFO] 
01:28:15 [INFO] --- jacoco-maven-plugin:0.7.9:prepare-agent (default-prepare-agent) @ org.eclipse.papyrus.main.tests.target.parent ---
01:28:15 [INFO] argLine set to -javaagent:/home/hudson/genie.papyrus/.jenkins/jobs/Papyrus-Oxygen-Tests-Failures/workspace/.repository/org/jacoco/org.jacoco.agent/0.7.9/org.jacoco.agent-0.7.9-runtime.jar=destfile=/jobs/genie.papyrus/Papyrus-Oxygen-Tests-Failures/workspace/source/releng/main-tests/targetPlatform/target/jacoco.exec,includes=org.eclipse.papyrus.*,excludes=org.eclipse.uml2
01:28:15 [INFO] 
01:28:15 [INFO] --- jacoco-maven-plugin:0.7.9:report (default-report) @ org.eclipse.papyrus.main.tests.target.parent ---
01:28:15 [INFO] Skipping JaCoCo execution due to missing execution data file.
01:28:15 [INFO] 
01:28:15 [INFO] --< org.eclipse.papyrus:org.eclipse.papyrus.main.tests.portable.target >--
01:28:15 [INFO] Building org.eclipse.papyrus.main.tests.portable.target 0.0.1-SNAPSHOT [155/155]
01:28:15 [INFO] ---------------------[ eclipse-target-definition ]----------------------
01:28:15 [INFO] 
01:28:15 [INFO] --- maven-clean-plugin:2.6:clean (default-clean) @ org.eclipse.papyrus.main.tests.portable.target ---
01:28:15 [INFO] 
01:28:15 [INFO] --- jacoco-maven-plugin:0.7.9:prepare-agent (default-prepare-agent) @ org.eclipse.papyrus.main.tests.portable.target ---
01:28:15 [INFO] argLine set to -javaagent:/home/hudson/genie.papyrus/.jenkins/jobs/Papyrus-Oxygen-Tests-Failures/workspace/.repository/org/jacoco/org.jacoco.agent/0.7.9/org.jacoco.agent-0.7.9-runtime.jar=destfile=/jobs/genie.papyrus/Papyrus-Oxygen-Tests-Failures/workspace/source/releng/main-tests/targetPlatform/portable/target/jacoco.exec,includes=org.eclipse.papyrus.*,excludes=org.eclipse.uml2
01:28:15 [INFO] 
01:28:15 [INFO] --- tycho-packaging-plugin:1.0.0:package-target-definition (default-package-target-definition) @ org.eclipse.papyrus.main.tests.portable.target ---
01:28:15 [INFO] 
01:28:15 [INFO] --- jacoco-maven-plugin:0.7.9:report (default-report) @ org.eclipse.papyrus.main.tests.portable.target ---
01:28:15 [INFO] Skipping JaCoCo execution due to missing execution data file.
01:28:15 [INFO] ------------------------------------------------------------------------
01:28:15 [INFO] Reactor Summary:
01:28:15 [INFO] 
01:28:15 [INFO] org.eclipse.papyrus.tests.releng 1.2.0-SNAPSHOT .... SUCCESS [01:23 min]
01:28:15 [INFO] org.eclipse.papyrus.plugins.tests.releng 0.0.1-SNAPSHOT SUCCESS [  0.007 s]
01:28:15 [INFO] org.eclipse.papyrus.editor.tests.releng 0.0.1-SNAPSHOT SUCCESS [  0.008 s]
01:28:15 [INFO] org.eclipse.papyrus.editor.integration.tests 1.3.100-SNAPSHOT SUCCESS [ 39.013 s]
01:28:15 [INFO] org.eclipse.papyrus.infra.tests.releng 0.0.1-SNAPSHOT SUCCESS [  0.005 s]
01:28:15 [INFO] org.eclipse.papyrus.infra.core.tests.releng 0.0.1-SNAPSHOT SUCCESS [  0.005 s]
01:28:15 [INFO] org.eclipse.papyrus.infra.core.clipboard.tests 1.3.0-SNAPSHOT SUCCESS [  0.454 s]
01:28:15 [INFO] org.eclipse.papyrus.infra.core.sasheditor.tests 1.2.0-SNAPSHOT SUCCESS [  1.362 s]
01:28:15 [INFO] org.eclipse.papyrus.infra.core.sasheditor.di.tests 1.2.0-SNAPSHOT SUCCESS [  0.384 s]
01:28:15 [INFO] org.eclipse.papyrus.infra.core.tests 3.0.1-SNAPSHOT  SUCCESS [  0.939 s]
01:28:15 [INFO] org.eclipse.papyrus.infra.editor.tests.releng 0.0.1-SNAPSHOT SUCCESS [  0.004 s]
01:28:15 [INFO] org.eclipse.papyrus.infra.editor.welcome.tests 1.2.0-SNAPSHOT SUCCESS [  0.534 s]
01:28:15 [INFO] org.eclipse.papyrus.infra.emf.tests.releng 0.0.1-SNAPSHOT SUCCESS [  0.005 s]
01:28:15 [INFO] org.eclipse.papyrus.infra.emf.gmf.tests 1.2.100-SNAPSHOT SUCCESS [  0.348 s]
01:28:15 [INFO] org.eclipse.papyrus.infra.emf.readonly.tests 1.2.0-SNAPSHOT SUCCESS [  0.401 s]
01:28:15 [INFO] org.eclipse.papyrus.infra.emf.tests 1.4.0-SNAPSHOT . SUCCESS [  0.704 s]
01:28:15 [INFO] org.eclipse.papyrus.infra.filters.tests 1.2.0-SNAPSHOT SUCCESS [  0.171 s]
01:28:15 [INFO] org.eclipse.papyrus.infra.gmfdiag.tests.releng 0.0.1-SNAPSHOT SUCCESS [  0.004 s]
01:28:15 [INFO] org.eclipse.papyrus.infra.gmfdiag.assistant.tests.releng 0.0.1-SNAPSHOT SUCCESS [  0.004 s]
01:28:15 [INFO] org.eclipse.papyrus.infra.gmfdiag.assistant.tests 1.2.0-SNAPSHOT SUCCESS [  0.505 s]
01:28:15 [INFO] org.eclipse.papyrus.infra.gmfdiag.canonical.tests 1.2.0-SNAPSHOT SUCCESS [  0.574 s]
01:28:15 [INFO] org.eclipse.papyrus.infra.gmfdiag.commands.tests 1.2.0-SNAPSHOT SUCCESS [  0.438 s]
01:28:15 [INFO] org.eclipse.papyrus.infra.gmfdiag.common.tests 3.0.0-SNAPSHOT SUCCESS [  0.503 s]
01:28:15 [INFO] org.eclipse.papyrus.infra.gmfdiag.css.tests 1.2.0-SNAPSHOT SUCCESS [  0.490 s]
01:28:15 [INFO] org.eclipse.papyrus.infra.gmfdiag.menu.tests 1.2.0-SNAPSHOT SUCCESS [  0.339 s]
01:28:15 [INFO] org.eclipse.papyrus.infra.gmfdiag.paletteconfiguration.tests 1.2.0-SNAPSHOT SUCCESS [  0.381 s]
01:28:15 [INFO] org.eclipse.papyrus.infra.gmfdiag.welcome.tests 1.2.0-SNAPSHOT SUCCESS [  0.516 s]
01:28:15 [INFO] org.eclipse.papyrus.infra.nattable.main.test 1.2.0-SNAPSHOT SUCCESS [  0.006 s]
01:28:15 [INFO] org.eclipse.papyrus.infra.nattable.common.tests 1.2.100-SNAPSHOT SUCCESS [  0.404 s]
01:28:15 [INFO] org.eclipse.papyrus.infra.nattable.model.editor.tests 1.2.100-SNAPSHOT SUCCESS [  0.370 s]
01:28:15 [INFO] org.eclipse.papyrus.infra.nattable.model.tests 1.2.100-SNAPSHOT SUCCESS [  1.781 s]
01:28:15 [INFO] org.eclipse.papyrus.infra.nattable.tests 1.2.100-SNAPSHOT SUCCESS [  0.475 s]
01:28:15 [INFO] org.eclipse.papyrus.infra.nattable.views.tests 1.2.100-SNAPSHOT SUCCESS [  0.573 s]
01:28:15 [INFO] org.eclipse.papyrus.infra.properties.tests.releng 0.0.1-SNAPSHOT SUCCESS [  0.003 s]
01:28:15 [INFO] org.eclipse.papyrus.infra.properties.ui.tests 2.0.0-SNAPSHOT SUCCESS [  0.386 s]
01:28:15 [INFO] org.eclipse.papyrus.infra.services.tests.releng 0.0.1-SNAPSHOT SUCCESS [  0.003 s]
01:28:15 [INFO] org.eclipse.papyrus.infra.services.controlmode.tests 1.4.0-SNAPSHOT SUCCESS [  0.476 s]
01:28:15 [INFO] org.eclipse.papyrus.infra.services.edit.tests 1.2.0-SNAPSHOT SUCCESS [  0.413 s]
01:28:15 [INFO] org.eclipse.papyrus.infra.services.edit.ui.tests 1.2.0-SNAPSHOT SUCCESS [  0.241 s]
01:28:15 [INFO] org.eclipse.papyrus.infra.services.resourceloading.tests 1.2.0-SNAPSHOT SUCCESS [  0.288 s]
01:28:15 [INFO] org.eclipse.papyrus.infra.services.semantic.tests 1.2.100-SNAPSHOT SUCCESS [  0.402 s]
01:28:15 [INFO] org.eclipse.papyrus.infra.tools.tests 1.2.0-SNAPSHOT SUCCESS [  0.472 s]
01:28:15 [INFO] org.eclipse.papyrus.infra.types.tests.releng 0.0.1-SNAPSHOT SUCCESS [  0.003 s]
01:28:15 [INFO] org.eclipse.papyrus.infra.types.tests 3.0.0-SNAPSHOT SUCCESS [  0.350 s]
01:28:15 [INFO] org.eclipse.papyrus.infra.types.ui.tests 3.0.0-SNAPSHOT SUCCESS [  0.581 s]
01:28:15 [INFO] org.eclipse.papyrus.infra.ui.emf.tests 1.2.0-SNAPSHOT SUCCESS [  0.429 s]
01:28:15 [INFO] org.eclipse.papyrus.infra.ui.tests 1.2.0-SNAPSHOT .. SUCCESS [  0.378 s]
01:28:15 [INFO] org.eclipse.papyrus.infra.viewpoints.tests.releng 1.2.0-SNAPSHOT SUCCESS [  0.004 s]
01:28:15 [INFO] org.eclipse.papyrus.infra.viewpoints.policy.tests 1.2.0-SNAPSHOT SUCCESS [  0.331 s]
01:28:15 [INFO] org.eclipse.papyrus.uml.tests.releng 0.0.1-SNAPSHOT  SUCCESS [  0.003 s]
01:28:15 [INFO] org.eclipse.papyrus.uml.diagram.tests.releng 1.2.0-SNAPSHOT SUCCESS [  0.002 s]
01:28:15 [INFO] org.eclipse.papyrus.uml.diagram.tests 1.3.0-SNAPSHOT SUCCESS [  0.725 s]
01:28:15 [INFO] org.eclipse.papyrus.uml.diagram.clazz.tests 1.3.0-SNAPSHOT SUCCESS [  0.648 s]
01:28:15 [INFO] org.eclipse.papyrus.uml.diagram.activity.tests 1.2.0-SNAPSHOT SUCCESS [  0.762 s]
01:28:15 [INFO] org.eclipse.papyrus.uml.diagram.usecase.tests 1.2.0-SNAPSHOT SUCCESS [  0.468 s]
01:28:15 [INFO] org.eclipse.papyrus.uml.diagram.deployment.tests 1.2.0-SNAPSHOT SUCCESS [  0.507 s]
01:28:15 [INFO] org.eclipse.papyrus.uml.diagram.component.tests 1.2.0-SNAPSHOT SUCCESS [  0.401 s]
01:28:15 [INFO] org.eclipse.papyrus.uml.diagram.timing.tests 1.2.0-SNAPSHOT SUCCESS [  1.829 s]
01:28:15 [INFO] org.eclipse.papyrus.uml.diagram.stereotypeproperty.tests 1.2.0-SNAPSHOT SUCCESS [  0.648 s]
01:28:15 [INFO] org.eclipse.papyrus.uml.diagram.sequence.tests 1.3.100-SNAPSHOT SUCCESS [  0.802 s]
01:28:15 [INFO] org.eclipse.papyrus.uml.diagram.composite.tests 1.2.0-SNAPSHOT SUCCESS [  0.663 s]
01:28:15 [INFO] org.eclipse.papyrus.uml.diagram.wizards.tests 1.2.0-SNAPSHOT SUCCESS [  0.509 s]
01:28:15 [INFO] org.eclipse.papyrus.uml.diagram.profile.tests 1.2.0-SNAPSHOT SUCCESS [  0.494 s]
01:28:15 [INFO] org.eclipse.papyrus.uml.dynamic.profile.tests 1.2.0-SNAPSHOT SUCCESS [  0.030 s]
01:28:15 [INFO] org.eclipse.papyrus.uml.diagram.common.tests 1.3.0-SNAPSHOT SUCCESS [  0.832 s]
01:28:15 [INFO] org.eclipse.papyrus.tests.uml.diagram.feature 1.2.0-SNAPSHOT SUCCESS [  0.196 s]
01:28:15 [INFO] org.eclipse.papyrus.tests.infra.services.feature 1.2.0-SNAPSHOT SUCCESS [  0.070 s]
01:28:15 [INFO] org.eclipse.papyrus.views.tests.releng 0.0.1-SNAPSHOT SUCCESS [  0.003 s]
01:28:15 [INFO] org.eclipse.papyrus.views.modelexplorer.tests 1.2.100-SNAPSHOT SUCCESS [  0.273 s]
01:28:15 [INFO] org.eclipse.papyrus.uml.modelexplorer.tests.releng 0.0.1-SNAPSHOT SUCCESS [  0.003 s]
01:28:15 [INFO] org.eclipse.papyrus.uml.modelexplorer.tests 1.3.100-SNAPSHOT SUCCESS [  0.384 s]
01:28:15 [INFO] org.eclipse.papyrus.uml.modelrepair.tests 1.2.100-SNAPSHOT SUCCESS [  0.576 s]
01:28:15 [INFO] org.eclipse.papyrus.uml.service.types.tests 1.2.0-SNAPSHOT SUCCESS [  0.408 s]
01:28:15 [INFO] org.eclipse.papyrus.uml.service.types.ui.tests 1.2.0-SNAPSHOT SUCCESS [  0.473 s]
01:28:15 [INFO] org.eclipse.papyrus.uml.profile.tests.releng 0.0.1-SNAPSHOT SUCCESS [  0.004 s]
01:28:15 [INFO] org.eclipse.papyrus.uml.profile.drafter.tests 1.2.0-SNAPSHOT SUCCESS [  0.509 s]
01:28:15 [INFO] org.eclipse.papyrus.uml.filters.tests 1.2.0-SNAPSHOT SUCCESS [  0.383 s]
01:28:15 [INFO] org.eclipse.papyrus.uml.profile.tests 1.2.0-SNAPSHOT SUCCESS [  0.424 s]
01:28:15 [INFO] org.eclipse.papyrus.tests.uml.feature 1.2.0-SNAPSHOT SUCCESS [  0.138 s]
01:28:15 [INFO] org.eclipse.papyrus.tests.views.feature 1.2.0-SNAPSHOT SUCCESS [  0.038 s]
01:28:15 [INFO] org.eclipse.papyrus.tests.infra.nattable.feature 1.3.0-SNAPSHOT SUCCESS [  0.083 s]
01:28:15 [INFO] org.eclipse.papyrus.uml.nattable.main.test 1.2.0-SNAPSHOT SUCCESS [  0.004 s]
01:28:15 [INFO] org.eclipse.papyrus.uml.nattable.tests 1.2.100-SNAPSHOT SUCCESS [  0.360 s]
01:28:15 [INFO] org.eclipse.papyrus.uml.nattable.generic.tests 1.2.100-SNAPSHOT SUCCESS [  0.650 s]
01:28:15 [INFO] org.eclipse.papyrus.uml.nattable.clazz.config.tests 1.2.100-SNAPSHOT SUCCESS [  1.099 s]
01:28:15 [INFO] org.eclipse.papyrus.uml.nattable.stereotyped.elements.tests 1.0.100-SNAPSHOT SUCCESS [  0.643 s]
01:28:15 [INFO] org.eclipse.papyrus.uml.nattable.matrix.tests 1.0.0-SNAPSHOT SUCCESS [  0.476 s]
01:28:15 [INFO] org.eclipse.papyrus.tests.uml.nattable.feature 1.3.0-SNAPSHOT SUCCESS [  0.112 s]
01:28:15 [INFO] org.eclipse.papyrus.tests.infra.feature 1.2.0-SNAPSHOT SUCCESS [  0.189 s]
01:28:15 [INFO] org.eclipse.papyrus.tests.infra.core.feature 1.2.0-SNAPSHOT SUCCESS [  0.043 s]
01:28:15 [INFO] org.eclipse.papyrus.uml.tools.tests.releng 0.0.1-SNAPSHOT SUCCESS [  0.003 s]
01:28:15 [INFO] org.eclipse.papyrus.uml.tools.tests 3.0.0-SNAPSHOT . SUCCESS [  0.428 s]
01:28:15 [INFO] org.eclipse.papyrus.uml.tools.utils.tests 1.3.0-SNAPSHOT SUCCESS [  0.399 s]
01:28:15 [INFO] org.eclipse.papyrus.tests.uml.tools.feature 1.2.0-SNAPSHOT SUCCESS [  0.054 s]
01:28:15 [INFO] org.eclipse.papyrus.uml.decoratormodel.tests.releng 0.0.1-SNAPSHOT SUCCESS [  0.003 s]
01:28:15 [INFO] org.eclipse.papyrus.uml.decoratormodel.tests 1.2.0-SNAPSHOT SUCCESS [  0.490 s]
01:28:15 [INFO] org.eclipse.papyrus.uml.decoratormodel.controlmode.tests 1.2.0-SNAPSHOT SUCCESS [  0.389 s]
01:28:15 [INFO] org.eclipse.papyrus.tests.uml.decoratormodel.feature 1.2.0-SNAPSHOT SUCCESS [  0.048 s]
01:28:15 [INFO] org.eclipse.papyrus.uml.textedit.tests.releng 0.0.1-SNAPSHOT SUCCESS [  0.003 s]
01:28:15 [INFO] org.eclipse.papyrus.uml.textedit.tests 1.2.0-SNAPSHOT SUCCESS [  0.380 s]
01:28:15 [INFO] org.eclipse.papyrus.uml.textedit.parameter.tests 1.2.0-SNAPSHOT SUCCESS [  0.377 s]
01:28:15 [INFO] org.eclipse.papyrus.uml.textedit.port.tests 1.2.0-SNAPSHOT SUCCESS [  0.354 s]
01:28:15 [INFO] org.eclipse.papyrus.uml.textedit.property.tests 1.2.0-SNAPSHOT SUCCESS [  0.471 s]
01:28:15 [INFO] org.eclipse.papyrus.uml.textedit.tests.feature 1.2.0-SNAPSHOT SUCCESS [  0.057 s]
01:28:15 [INFO] org.eclipse.papyrus.uml.assistants.tests.releng 0.0.1-SNAPSHOT SUCCESS [  0.002 s]
01:28:15 [INFO] org.eclipse.papyrus.uml.profile.types.generator.tests 1.2.0-SNAPSHOT SUCCESS [  0.443 s]
01:28:15 [INFO] org.eclipse.papyrus.uml.profile.assistants.generator.tests 1.2.0-SNAPSHOT SUCCESS [  0.509 s]
01:28:15 [INFO] org.eclipse.papyrus.tests.uml.assistants.feature 1.2.0-SNAPSHOT SUCCESS [  0.050 s]
01:28:15 [INFO] org.eclipse.papyrus.toolsmiths.tests.releng 0.0.1-SNAPSHOT SUCCESS [  0.003 s]
01:28:15 [INFO] org.eclipse.papyrus.toolsmiths.profilemigration.tests 0.7.0-SNAPSHOT SUCCESS [  0.500 s]
01:28:15 [INFO] org.eclipse.papyrus.tests.toolsmiths.feature 1.0.0-SNAPSHOT SUCCESS [  0.040 s]
01:28:15 [INFO] org.eclipse.papyrus.tests.feature 1.3.0-SNAPSHOT ... SUCCESS [  0.934 s]
01:28:15 [INFO] org.eclipse.papyrus.infra.emf.expressions.main.tests 0.0.1-SNAPSHOT SUCCESS [  0.003 s]
01:28:15 [INFO] org.eclipse.papyrus.infra.emf.expressions.tests 1.0.0-SNAPSHOT SUCCESS [  0.127 s]
01:28:15 [INFO] org.eclipse.papyrus.tests.infra.emf.expressions.feature 1.0.0-SNAPSHOT SUCCESS [  0.022 s]
01:28:15 [INFO] org.eclipse.papyrus.uml.expressions.tests.releng 0.0.1-SNAPSHOT SUCCESS [  0.003 s]
01:28:15 [INFO] org.eclipse.papyrus.uml.expressions.tests 1.0.0-SNAPSHOT SUCCESS [  0.431 s]
01:28:15 [INFO] org.eclipse.papyrus.tests.uml.expressions.feature 1.0.0-SNAPSHOT SUCCESS [  0.058 s]
01:28:15 [INFO] org.eclipse.papyrus.uml.alf.tests 1.2.0-SNAPSHOT ... SUCCESS [03:27 min]
01:28:15 [INFO] org.eclipse.papyrus.uml.alf.tests.feature 1.2.0-SNAPSHOT SUCCESS [  0.170 s]
01:28:15 [INFO] org.eclipse.papyrus.developer.suite.tests 0.0.1-SNAPSHOT SUCCESS [ 22.030 s]
01:28:15 [INFO] org.eclipse.papyrus.developer.tests.releng 0.0.1-SNAPSHOT SUCCESS [  0.007 s]
01:28:15 [INFO] org.eclipse.papyrus.eclipse.project.editors.tests 2.0.0-SNAPSHOT SUCCESS [  0.473 s]
01:28:15 [INFO] org.eclipse.papyrus.editors.suite.tests 0.0.1-SNAPSHOT SUCCESS [ 16.859 s]
01:28:15 [INFO] org.eclipse.papyrus.infra.core.suite.tests 0.0.1-SNAPSHOT SUCCESS [ 24.137 s]
01:28:15 [INFO] org.eclipse.papyrus.infra.nattable.suite.tests 0.0.1-SNAPSHOT SUCCESS [ 15.280 s]
01:28:15 [INFO] org.eclipse.papyrus.infra.internationalization.main.test 1.0.0-SNAPSHOT SUCCESS [  0.006 s]
01:28:15 [INFO] org.eclipse.papyrus.infra.internationalization.tests 1.1.0-SNAPSHOT SUCCESS [  0.401 s]
01:28:15 [INFO] org.eclipse.papyrus.infra.services.labelprovider.tests 1.2.1-SNAPSHOT SUCCESS [  0.264 s]
01:28:15 [INFO] org.eclipse.papyrus.infra.suite.tests 0.0.1-SNAPSHOT SUCCESS [ 44.751 s]
01:28:15 [INFO] org.eclipse.papyrus.infra.newchild.tests 1.2.0-SNAPSHOT SUCCESS [  0.415 s]
01:28:15 [INFO] org.eclipse.papyrus.uml.diagram.communication.tests 1.2.0-SNAPSHOT SUCCESS [  0.521 s]
01:28:15 [INFO] org.eclipse.papyrus.uml.diagram.interactionoverview.tests 1.2.0-SNAPSHOT SUCCESS [  0.369 s]
01:28:15 [INFO] org.eclipse.papyrus.uml.diagram.statemachine.tests 1.2.0-SNAPSHOT SUCCESS [  0.459 s]
01:28:15 [INFO] org.eclipse.papyrus.uml.diagram.suite.tests 0.0.1-SNAPSHOT SUCCESS [01:59 min]
01:28:15 [INFO] org.eclipse.papyrus.uml.diagram.dnd.tests 1.2.0-SNAPSHOT SUCCESS [  0.376 s]
01:28:15 [INFO] org.eclipse.papyrus.uml.nattable.stereotype.display.tests 1.2.100-SNAPSHOT SUCCESS [  0.387 s]
01:28:15 [INFO] org.eclipse.papyrus.uml.nattable.suite.tests 0.0.1-SNAPSHOT SUCCESS [02:35 min]
01:28:15 [INFO] org.eclipse.papyrus.uml.textedit.valuespecification.tests 1.2.0-SNAPSHOT SUCCESS [  0.451 s]
01:28:15 [INFO] org.eclipse.papyrus.uml.textedit.suite.tests 0.0.1-SNAPSHOT SUCCESS [ 16.520 s]
01:28:15 [INFO] org.eclipse.papyrus.uml.internationalization.main.test 1.0.0-SNAPSHOT SUCCESS [  0.005 s]
01:28:15 [INFO] org.eclipse.papyrus.uml.internationalization.tests 1.1.0-SNAPSHOT SUCCESS [  0.363 s]
01:28:15 [INFO] org.eclipse.papyrus.uml.validation.tests.releng 0.0.1-SNAPSHOT SUCCESS [  0.004 s]
01:28:15 [INFO] org.eclipse.papyrus.uml.validation.tests.staticprofile 1.2.0-SNAPSHOT SUCCESS [  0.192 s]
01:28:15 [INFO] org.eclipse.papyrus.uml.validation.tests.genvalidation 1.2.0-SNAPSHOT SUCCESS [  0.398 s]
01:28:15 [INFO] org.eclipse.papyrus.uml.validation.tests 1.2.0-SNAPSHOT SUCCESS [  0.430 s]
01:28:15 [INFO] org.eclipse.papyrus.uml.suite.tests 0.0.1-SNAPSHOT . SUCCESS [ 56.062 s]
01:28:15 [INFO] org.eclipse.papyrus.uml.alf.tests.releng 0.0.1-SNAPSHOT SUCCESS [  0.005 s]
01:28:15 [INFO] org.eclipse.papyrus.uml.alf.backend.tests 1.1.0-SNAPSHOT SUCCESS [  1.015 s]
01:28:15 [INFO] org.eclipse.papyrus.uml.internationalization.controlmode.tests 1.0.0-SNAPSHOT SUCCESS [  0.374 s]
01:28:15 [INFO] org.eclipse.papyrus.views.properties.toolsmiths.tests 1.2.0-SNAPSHOT SUCCESS [  0.264 s]
01:28:15 [INFO] org.eclipse.papyrus.views.suite.tests 0.0.1-SNAPSHOT SUCCESS [ 12.273 s]
01:28:15 [INFO] org.eclipse.papyrus.toolsmiths.suite.tests 0.0.1-SNAPSHOT SUCCESS [ 15.732 s]
01:28:15 [INFO] org.eclipse.papyrus.main.tests.target.parent 0.0.1-SNAPSHOT SUCCESS [  0.004 s]
01:28:15 [INFO] org.eclipse.papyrus.main.tests.portable.target 0.0.1-SNAPSHOT SUCCESS [  0.005 s]
01:28:15 [INFO] ------------------------------------------------------------------------
01:28:15 [INFO] BUILD SUCCESS
01:28:15 [INFO] ------------------------------------------------------------------------
01:28:15 [INFO] Total time:  22:54 min
01:28:15 [INFO] Finished at: 2019-11-03T01:28:15-05:00
01:28:15 [INFO] ------------------------------------------------------------------------
01:28:17 Taking screenshot.
01:28:17 [workspace] $ echo $XAUTHORITY
01:28:17 /home/hudson/genie.papyrus/.jenkins/jobs/Papyrus-Oxygen-Tests-Failures/workspace/.Xauthority-4493029614142036918
01:28:17 [workspace] $ ls -l $XAUTHORITY
01:28:17 -rw-rw-r-- 1 genie.papyrus modeling.mdt.papyrus 0 Nov  3 01:05 /home/hudson/genie.papyrus/.jenkins/jobs/Papyrus-Oxygen-Tests-Failures/workspace/.Xauthority-4493029614142036918
01:28:17 [workspace] $ import -window root -display :720 screenshot.jpg
01:28:17 Terminating xvnc.
01:28:29 Sending e-mails to: quentin.lemenez@cea.fr
01:28:29 Recording test results
01:28:31 Build step 'Publish JUnit test result report' changed build result to UNSTABLE
01:28:31 Started calculate disk usage of build
01:28:31 Finished Calculation of disk usage of build in 0 seconds
01:28:31 Started calculate disk usage of workspace
01:28:33 Finished Calculation of disk usage of workspace in  1 second
01:28:33 [WS-CLEANUP] Deleting project workspace...
01:28:33 [WS-CLEANUP] Deferred wipeout is used...
01:28:33 [WS-CLEANUP] done
01:28:33 Finished: UNSTABLE