AbortedConsole Output

Skipping 3,385 KB.. Full Log
14/289 kB
Progress (2): 197/230 kB | 114/289 kB
Progress (2): 197/230 kB | 118/289 kB
Progress (2): 197/230 kB | 122/289 kB
Progress (2): 201/230 kB | 122/289 kB
Progress (2): 205/230 kB | 122/289 kB
Progress (2): 205/230 kB | 126/289 kB
Progress (2): 205/230 kB | 130/289 kB
Progress (2): 205/230 kB | 131/289 kB
Progress (2): 209/230 kB | 131/289 kB
Progress (2): 213/230 kB | 131/289 kB
Progress (2): 213/230 kB | 135/289 kB
Progress (2): 213/230 kB | 139/289 kB
Progress (2): 217/230 kB | 139/289 kB
Progress (2): 221/230 kB | 139/289 kB
Progress (2): 221/230 kB | 143/289 kB
Progress (2): 221/230 kB | 147/289 kB
Progress (2): 225/230 kB | 147/289 kB
Progress (2): 225/230 kB | 151/289 kB
Progress (2): 229/230 kB | 151/289 kB
Progress (2): 229/230 kB | 155/289 kB
Progress (2): 230 kB | 155/289 kB    
Progress (2): 230 kB | 159/289 kB
Progress (2): 230 kB | 163/289 kB
Progress (2): 230 kB | 164/289 kB
Progress (2): 230 kB | 168/289 kB
Progress (2): 230 kB | 172/289 kB
Progress (2): 230 kB | 176/289 kB
Progress (2): 230 kB | 180/289 kB
Progress (2): 230 kB | 184/289 kB
Progress (2): 230 kB | 188/289 kB
Progress (2): 230 kB | 192/289 kB
Progress (2): 230 kB | 196/289 kB
Progress (2): 230 kB | 197/289 kB
Progress (2): 230 kB | 201/289 kB
Progress (2): 230 kB | 205/289 kB
Progress (2): 230 kB | 209/289 kB
Progress (2): 230 kB | 213/289 kB
Progress (2): 230 kB | 217/289 kB
Progress (2): 230 kB | 221/289 kB
Progress (2): 230 kB | 225/289 kB
Progress (2): 230 kB | 229/289 kB
Progress (2): 230 kB | 229/289 kB
Progress (2): 230 kB | 233/289 kB
Progress (2): 230 kB | 237/289 kB
Progress (2): 230 kB | 241/289 kB
Progress (2): 230 kB | 245/289 kB
Progress (2): 230 kB | 249/289 kB
Progress (2): 230 kB | 253/289 kB
Progress (2): 230 kB | 257/289 kB
Progress (2): 230 kB | 261/289 kB
Progress (2): 230 kB | 262/289 kB
Progress (2): 230 kB | 266/289 kB
Progress (2): 230 kB | 270/289 kB
Progress (2): 230 kB | 274/289 kB
Progress (2): 230 kB | 278/289 kB
Progress (2): 230 kB | 282/289 kB
Progress (2): 230 kB | 286/289 kB
Progress (2): 230 kB | 289 kB    
                             
Downloaded from eclipse.maven.central.mirror: https://repo.eclipse.org/content/repositories/maven_central/org/eclipse/emf/org.eclipse.emf.ecore.xmi/2.12.0/org.eclipse.emf.ecore.xmi-2.12.0.jar (230 kB at 205 kB/s)
01:38:11 Downloaded from eclipse.maven.central.mirror: https://repo.eclipse.org/content/repositories/maven_central/org/eclipse/emf/org.eclipse.emf.codegen/2.11.0/org.eclipse.emf.codegen-2.11.0.jar (289 kB at 256 kB/s)
01:38:11 Progress (1): 4.1/33 kB
Progress (1): 7.7/33 kB
Progress (1): 12/33 kB 
Progress (1): 16/33 kB
Progress (1): 20/33 kB
Progress (1): 24/33 kB
Progress (1): 28/33 kB
Progress (1): 32/33 kB
Progress (1): 33 kB   
Progress (2): 33 kB | 4.1/50 kB
Progress (2): 33 kB | 7.7/50 kB
Progress (2): 33 kB | 12/50 kB 
Progress (2): 33 kB | 16/50 kB
Progress (2): 33 kB | 20/50 kB
Progress (2): 33 kB | 24/50 kB
Progress (2): 33 kB | 28/50 kB
Progress (2): 33 kB | 32/50 kB
Progress (2): 33 kB | 36/50 kB
Progress (2): 33 kB | 40/50 kB
                              
Downloaded from eclipse.maven.central.mirror: https://repo.eclipse.org/content/repositories/maven_central/org/ow2/asm/asm-analysis/7.0/asm-analysis-7.0.jar (33 kB at 26 kB/s)
01:38:11 Progress (1): 44/50 kB
Progress (1): 48/50 kB
Progress (1): 50 kB   
                   
Downloaded from eclipse.maven.central.mirror: https://repo.eclipse.org/content/repositories/maven_central/org/ow2/asm/asm-tree/7.0/asm-tree-7.0.jar (50 kB at 39 kB/s)
01:38:18 [WARNING] 
01:38:18 WARNING: 	ParserTest.xtend - /jobs/genie.papyrus/Papyrus-Master-Tests-Release/workspace/source/tests/junit/plugins/uml/alf/org.eclipse.papyrus.uml.alf.tests/src/org/eclipse/papyrus/uml/alf/tests/ParserTest.xtend
01:38:18 57: The operator '==' should be replaced by '===' when null is one of the arguments.
01:38:18 [WARNING] 
01:38:18 WARNING: 	ParserTest.xtend - /jobs/genie.papyrus/Papyrus-Master-Tests-Release/workspace/source/tests/junit/plugins/uml/alf/org.eclipse.papyrus.uml.alf.tests/src/org/eclipse/papyrus/uml/alf/tests/ParserTest.xtend
01:38:18 62: The operator '==' should be replaced by '===' when null is one of the arguments.
01:38:18 [WARNING] 
01:38:18 WARNING: 	ParserTest.xtend - /jobs/genie.papyrus/Papyrus-Master-Tests-Release/workspace/source/tests/junit/plugins/uml/alf/org.eclipse.papyrus.uml.alf.tests/src/org/eclipse/papyrus/uml/alf/tests/ParserTest.xtend
01:38:18 83: The operator '!=' should be replaced by '!==' when null is one of the arguments.
01:38:18 [WARNING] 
01:38:18 WARNING: 	ParserTest.xtend - /jobs/genie.papyrus/Papyrus-Master-Tests-Release/workspace/source/tests/junit/plugins/uml/alf/org.eclipse.papyrus.uml.alf.tests/src/org/eclipse/papyrus/uml/alf/tests/ParserTest.xtend
01:38:18 85: The operator '!=' should be replaced by '!==' when null is one of the arguments.
01:38:18 [WARNING] 
01:38:18 WARNING: 	Parse.xtend - /jobs/genie.papyrus/Papyrus-Master-Tests-Release/workspace/source/tests/junit/plugins/uml/alf/org.eclipse.papyrus.uml.alf.tests/src/org/eclipse/papyrus/uml/alf/tests/Parse.xtend
01:38:18 57: The operator '==' should be replaced by '===' when null is one of the arguments.
01:38:18 [WARNING] 
01:38:18 WARNING: 	SingleTest.xtend - /jobs/genie.papyrus/Papyrus-Master-Tests-Release/workspace/source/tests/junit/plugins/uml/alf/org.eclipse.papyrus.uml.alf.tests/src/org/eclipse/papyrus/uml/alf/tests/SingleTest.xtend
01:38:18 24: The type InjectWith is deprecated
01:38:18 [WARNING] 
01:38:18 WARNING: 	SingleTest.xtend - /jobs/genie.papyrus/Papyrus-Master-Tests-Release/workspace/source/tests/junit/plugins/uml/alf/org.eclipse.papyrus.uml.alf.tests/src/org/eclipse/papyrus/uml/alf/tests/SingleTest.xtend
01:38:18 25: The type XtextRunner is deprecated
01:38:18 [WARNING] 
01:38:18 WARNING: 	SingleTest.xtend - /jobs/genie.papyrus/Papyrus-Master-Tests-Release/workspace/source/tests/junit/plugins/uml/alf/org.eclipse.papyrus.uml.alf.tests/src/org/eclipse/papyrus/uml/alf/tests/SingleTest.xtend
01:38:18 38: The type XtextRunner is deprecated
01:38:18 [WARNING] 
01:38:18 WARNING: 	MergeTest.xtend - /jobs/genie.papyrus/Papyrus-Master-Tests-Release/workspace/source/tests/junit/plugins/uml/alf/org.eclipse.papyrus.uml.alf.tests/src/org/eclipse/papyrus/uml/alf/tests/mapper/MergeTest.xtend
01:38:18 37: The type XtextRunner is deprecated
01:38:18 [WARNING] 
01:38:18 WARNING: 	MergeTest.xtend - /jobs/genie.papyrus/Papyrus-Master-Tests-Release/workspace/source/tests/junit/plugins/uml/alf/org.eclipse.papyrus.uml.alf.tests/src/org/eclipse/papyrus/uml/alf/tests/mapper/MergeTest.xtend
01:38:18 45: The type XtextRunner is deprecated
01:38:18 [WARNING] 
01:38:18 WARNING: 	SemanticTest.xtend - /jobs/genie.papyrus/Papyrus-Master-Tests-Release/workspace/source/tests/junit/plugins/uml/alf/org.eclipse.papyrus.uml.alf.tests/src/org/eclipse/papyrus/uml/alf/tests/SemanticTest.xtend
01:38:18 24: The type InjectWith is deprecated
01:38:18 [WARNING] 
01:38:18 WARNING: 	SemanticTest.xtend - /jobs/genie.papyrus/Papyrus-Master-Tests-Release/workspace/source/tests/junit/plugins/uml/alf/org.eclipse.papyrus.uml.alf.tests/src/org/eclipse/papyrus/uml/alf/tests/SemanticTest.xtend
01:38:18 25: The type XtextRunner is deprecated
01:38:18 [WARNING] 
01:38:18 WARNING: 	SemanticTest.xtend - /jobs/genie.papyrus/Papyrus-Master-Tests-Release/workspace/source/tests/junit/plugins/uml/alf/org.eclipse.papyrus.uml.alf.tests/src/org/eclipse/papyrus/uml/alf/tests/SemanticTest.xtend
01:38:18 38: The type XtextRunner is deprecated
01:38:18 [WARNING] 
01:38:18 WARNING: 	MappingTest.xtend - /jobs/genie.papyrus/Papyrus-Master-Tests-Release/workspace/source/tests/junit/plugins/uml/alf/org.eclipse.papyrus.uml.alf.tests/src/org/eclipse/papyrus/uml/alf/tests/mapper/MappingTest.xtend
01:38:18 23: The type XtextRunner is deprecated
01:38:18 [WARNING] 
01:38:18 WARNING: 	MappingTest.xtend - /jobs/genie.papyrus/Papyrus-Master-Tests-Release/workspace/source/tests/junit/plugins/uml/alf/org.eclipse.papyrus.uml.alf.tests/src/org/eclipse/papyrus/uml/alf/tests/mapper/MappingTest.xtend
01:38:18 32: The type XtextRunner is deprecated
01:38:18 [WARNING] 
01:38:18 WARNING: 	MappingTest.xtend - /jobs/genie.papyrus/Papyrus-Master-Tests-Release/workspace/source/tests/junit/plugins/uml/alf/org.eclipse.papyrus.uml.alf.tests/src/org/eclipse/papyrus/uml/alf/tests/mapper/MappingTest.xtend
01:38:18 54: The operator '==' should be replaced by '===' when null is one of the arguments.
01:38:18 [WARNING] 
01:38:18 WARNING: 	SyntacticTest.xtend - /jobs/genie.papyrus/Papyrus-Master-Tests-Release/workspace/source/tests/junit/plugins/uml/alf/org.eclipse.papyrus.uml.alf.tests/src/org/eclipse/papyrus/uml/alf/tests/SyntacticTest.xtend
01:38:18 23: The type InjectWith is deprecated
01:38:18 [WARNING] 
01:38:18 WARNING: 	SyntacticTest.xtend - /jobs/genie.papyrus/Papyrus-Master-Tests-Release/workspace/source/tests/junit/plugins/uml/alf/org.eclipse.papyrus.uml.alf.tests/src/org/eclipse/papyrus/uml/alf/tests/SyntacticTest.xtend
01:38:18 24: The type XtextRunner is deprecated
01:38:18 [WARNING] 
01:38:18 WARNING: 	SyntacticTest.xtend - /jobs/genie.papyrus/Papyrus-Master-Tests-Release/workspace/source/tests/junit/plugins/uml/alf/org.eclipse.papyrus.uml.alf.tests/src/org/eclipse/papyrus/uml/alf/tests/SyntacticTest.xtend
01:38:18 37: The type XtextRunner is deprecated
01:38:18 [WARNING] 
01:38:18 WARNING: 	GenerationTest.xtend - /jobs/genie.papyrus/Papyrus-Master-Tests-Release/workspace/source/tests/junit/plugins/uml/alf/org.eclipse.papyrus.uml.alf.tests/src/org/eclipse/papyrus/uml/alf/tests/generator/GenerationTest.xtend
01:38:18 25: The type XtextRunner is deprecated
01:38:18 [WARNING] 
01:38:18 WARNING: 	GenerationTest.xtend - /jobs/genie.papyrus/Papyrus-Master-Tests-Release/workspace/source/tests/junit/plugins/uml/alf/org.eclipse.papyrus.uml.alf.tests/src/org/eclipse/papyrus/uml/alf/tests/generator/GenerationTest.xtend
01:38:18 33: The type XtextRunner is deprecated
01:38:18 [WARNING] 
01:38:18 WARNING: 	GenerationTest.xtend - /jobs/genie.papyrus/Papyrus-Master-Tests-Release/workspace/source/tests/junit/plugins/uml/alf/org.eclipse.papyrus.uml.alf.tests/src/org/eclipse/papyrus/uml/alf/tests/generator/GenerationTest.xtend
01:38:18 69: The operator '!=' should be replaced by '!==' when null is one of the arguments.
01:38:18 [INFO] 
01:38:18 [INFO] --- maven-resources-plugin:3.1.0:resources (default-resources) @ org.eclipse.papyrus.uml.alf.tests ---
01:38:18 [INFO] Using 'UTF-8' encoding to copy filtered resources.
01:38:18 [INFO] skip non existing resourceDirectory /jobs/genie.papyrus/Papyrus-Master-Tests-Release/workspace/source/tests/junit/plugins/uml/alf/org.eclipse.papyrus.uml.alf.tests/src/main/resources
01:38:18 [INFO] 
01:38:18 [INFO] --- tycho-compiler-plugin:1.3.0:compile (default-compile) @ org.eclipse.papyrus.uml.alf.tests ---
01:38:18 [WARNING] The effective compiler target level 1.8 is incompatible with the following OSGi execution environments: [JavaSE-1.7 (assumes 1.7)] @ MavenProject: org.eclipse.papyrus.tests:org.eclipse.papyrus.uml.alf.tests:1.2.0-SNAPSHOT @ /jobs/genie.papyrus/Papyrus-Master-Tests-Release/workspace/source/tests/junit/plugins/uml/alf/org.eclipse.papyrus.uml.alf.tests/pom.xml
01:38:18 [INFO] Compiling 17 source files to /jobs/genie.papyrus/Papyrus-Master-Tests-Release/workspace/source/tests/junit/plugins/uml/alf/org.eclipse.papyrus.uml.alf.tests/bin
01:38:18 [WARNING] /jobs/genie.papyrus/Papyrus-Master-Tests-Release/workspace/source/tests/junit/plugins/uml/alf/org.eclipse.papyrus.uml.alf.tests/src-gen/org/eclipse/papyrus/uml/alf/AlfUiInjectorProvider.java:[6] 
01:38:18 	import org.eclipse.xtext.junit4.IInjectorProvider;
01:38:18 	       ^^^^^^^^^^^^^^^^^^^^^^^^^^^^^^^^^^^^^^^^^^
01:38:18 The type IInjectorProvider is deprecated
01:38:18 [WARNING] /jobs/genie.papyrus/Papyrus-Master-Tests-Release/workspace/source/tests/junit/plugins/uml/alf/org.eclipse.papyrus.uml.alf.tests/src-gen/org/eclipse/papyrus/uml/alf/AlfUiInjectorProvider.java:[10] 
01:38:18 	public class AlfUiInjectorProvider implements IInjectorProvider {
01:38:18 	                                              ^^^^^^^^^^^^^^^^^
01:38:18 The type IInjectorProvider is deprecated
01:38:18 [WARNING] /jobs/genie.papyrus/Papyrus-Master-Tests-Release/workspace/source/tests/junit/plugins/uml/alf/org.eclipse.papyrus.uml.alf.tests/src/org/eclipse/papyrus/uml/alf/tests/generator/AlfGenerator.java:[49] 
01:38:18 	static final private SaveOptions options = SaveOptions.newBuilder().format().noValidation().getOptions();
01:38:18 	                                                                             ^^^^^^^^^^^^^^
01:38:18 The method noValidation() from the type SaveOptions.Builder is deprecated
01:38:18 [WARNING] /jobs/genie.papyrus/Papyrus-Master-Tests-Release/workspace/source/tests/junit/plugins/uml/alf/org.eclipse.papyrus.uml.alf.tests/src-gen/org/eclipse/papyrus/uml/alf/AlfInjectorProvider.java:[6] 
01:38:18 	import org.eclipse.xtext.junit4.GlobalRegistries;
01:38:18 	       ^^^^^^^^^^^^^^^^^^^^^^^^^^^^^^^^^^^^^^^^^
01:38:18 The type GlobalRegistries is deprecated
01:38:18 [WARNING] /jobs/genie.papyrus/Papyrus-Master-Tests-Release/workspace/source/tests/junit/plugins/uml/alf/org.eclipse.papyrus.uml.alf.tests/src-gen/org/eclipse/papyrus/uml/alf/AlfInjectorProvider.java:[7] 
01:38:18 	import org.eclipse.xtext.junit4.GlobalRegistries.GlobalStateMemento;
01:38:18 	       ^^^^^^^^^^^^^^^^^^^^^^^^^^^^^^^^^^^^^^^^^^^^^^^^^^^^^^^^^^^^
01:38:18 The type GlobalRegistries.GlobalStateMemento is deprecated
01:38:18 [WARNING] /jobs/genie.papyrus/Papyrus-Master-Tests-Release/workspace/source/tests/junit/plugins/uml/alf/org.eclipse.papyrus.uml.alf.tests/src-gen/org/eclipse/papyrus/uml/alf/AlfInjectorProvider.java:[8] 
01:38:18 	import org.eclipse.xtext.junit4.IInjectorProvider;
01:38:18 	       ^^^^^^^^^^^^^^^^^^^^^^^^^^^^^^^^^^^^^^^^^^
01:38:18 The type IInjectorProvider is deprecated
01:38:18 [WARNING] /jobs/genie.papyrus/Papyrus-Master-Tests-Release/workspace/source/tests/junit/plugins/uml/alf/org.eclipse.papyrus.uml.alf.tests/src-gen/org/eclipse/papyrus/uml/alf/AlfInjectorProvider.java:[9] 
01:38:18 	import org.eclipse.xtext.junit4.IRegistryConfigurator;
01:38:18 	       ^^^^^^^^^^^^^^^^^^^^^^^^^^^^^^^^^^^^^^^^^^^^^^
01:38:18 The type IRegistryConfigurator is deprecated
01:38:18 [WARNING] /jobs/genie.papyrus/Papyrus-Master-Tests-Release/workspace/source/tests/junit/plugins/uml/alf/org.eclipse.papyrus.uml.alf.tests/src-gen/org/eclipse/papyrus/uml/alf/AlfInjectorProvider.java:[13] 
01:38:18 	public class AlfInjectorProvider implements IInjectorProvider, IRegistryConfigurator {
01:38:18 	                                            ^^^^^^^^^^^^^^^^^
01:38:18 The type IInjectorProvider is deprecated
01:38:18 [WARNING] /jobs/genie.papyrus/Papyrus-Master-Tests-Release/workspace/source/tests/junit/plugins/uml/alf/org.eclipse.papyrus.uml.alf.tests/src-gen/org/eclipse/papyrus/uml/alf/AlfInjectorProvider.java:[13] 
01:38:18 	public class AlfInjectorProvider implements IInjectorProvider, IRegistryConfigurator {
01:38:18 	                                                               ^^^^^^^^^^^^^^^^^^^^^
01:38:18 The type IRegistryConfigurator is deprecated
01:38:18 [WARNING] /jobs/genie.papyrus/Papyrus-Master-Tests-Release/workspace/source/tests/junit/plugins/uml/alf/org.eclipse.papyrus.uml.alf.tests/src-gen/org/eclipse/papyrus/uml/alf/AlfInjectorProvider.java:[15] 
01:38:18 	protected GlobalStateMemento stateBeforeInjectorCreation;
01:38:18 	          ^^^^^^^^^^^^^^^^^^
01:38:18 The type GlobalRegistries.GlobalStateMemento is deprecated
01:38:18 [WARNING] /jobs/genie.papyrus/Papyrus-Master-Tests-Release/workspace/source/tests/junit/plugins/uml/alf/org.eclipse.papyrus.uml.alf.tests/src-gen/org/eclipse/papyrus/uml/alf/AlfInjectorProvider.java:[16] 
01:38:18 	protected GlobalStateMemento stateAfterInjectorCreation;
01:38:18 	          ^^^^^^^^^^^^^^^^^^
01:38:18 The type GlobalRegistries.GlobalStateMemento is deprecated
01:38:18 [WARNING] /jobs/genie.papyrus/Papyrus-Master-Tests-Release/workspace/source/tests/junit/plugins/uml/alf/org.eclipse.papyrus.uml.alf.tests/src-gen/org/eclipse/papyrus/uml/alf/AlfInjectorProvider.java:[20] 
01:38:18 	GlobalRegistries.initializeDefaults();
01:38:18 	^^^^^^^^^^^^^^^^
01:38:18 The type GlobalRegistries is deprecated
01:38:18 [WARNING] /jobs/genie.papyrus/Papyrus-Master-Tests-Release/workspace/source/tests/junit/plugins/uml/alf/org.eclipse.papyrus.uml.alf.tests/src-gen/org/eclipse/papyrus/uml/alf/AlfInjectorProvider.java:[20] 
01:38:18 	GlobalRegistries.initializeDefaults();
01:38:18 	                 ^^^^^^^^^^^^^^^^^^^^
01:38:18 The method initializeDefaults() from the type GlobalRegistries is deprecated
01:38:18 [WARNING] /jobs/genie.papyrus/Papyrus-Master-Tests-Release/workspace/source/tests/junit/plugins/uml/alf/org.eclipse.papyrus.uml.alf.tests/src-gen/org/eclipse/papyrus/uml/alf/AlfInjectorProvider.java:[26] 
01:38:18 	stateBeforeInjectorCreation = GlobalRegistries.makeCopyOfGlobalState();
01:38:18 	                              ^^^^^^^^^^^^^^^^
01:38:18 The type GlobalRegistries is deprecated
01:38:18 [WARNING] /jobs/genie.papyrus/Papyrus-Master-Tests-Release/workspace/source/tests/junit/plugins/uml/alf/org.eclipse.papyrus.uml.alf.tests/src-gen/org/eclipse/papyrus/uml/alf/AlfInjectorProvider.java:[26] 
01:38:18 	stateBeforeInjectorCreation = GlobalRegistries.makeCopyOfGlobalState();
01:38:18 	                                               ^^^^^^^^^^^^^^^^^^^^^^^
01:38:18 The method makeCopyOfGlobalState() from the type GlobalRegistries is deprecated
01:38:18 [WARNING] /jobs/genie.papyrus/Papyrus-Master-Tests-Release/workspace/source/tests/junit/plugins/uml/alf/org.eclipse.papyrus.uml.alf.tests/src-gen/org/eclipse/papyrus/uml/alf/AlfInjectorProvider.java:[28] 
01:38:18 	stateAfterInjectorCreation = GlobalRegistries.makeCopyOfGlobalState();
01:38:18 	                             ^^^^^^^^^^^^^^^^
01:38:18 The type GlobalRegistries is deprecated
01:38:18 [WARNING] /jobs/genie.papyrus/Papyrus-Master-Tests-Release/workspace/source/tests/junit/plugins/uml/alf/org.eclipse.papyrus.uml.alf.tests/src-gen/org/eclipse/papyrus/uml/alf/AlfInjectorProvider.java:[28] 
01:38:18 	stateAfterInjectorCreation = GlobalRegistries.makeCopyOfGlobalState();
01:38:18 	                                              ^^^^^^^^^^^^^^^^^^^^^^^
01:38:18 The method makeCopyOfGlobalState() from the type GlobalRegistries is deprecated
01:38:18 [WARNING] /jobs/genie.papyrus/Papyrus-Master-Tests-Release/workspace/source/tests/junit/plugins/uml/alf/org.eclipse.papyrus.uml.alf.tests/src-gen/org/eclipse/papyrus/uml/alf/AlfInjectorProvider.java:[38] 
01:38:18 	stateBeforeInjectorCreation.restoreGlobalState();
01:38:18 	                            ^^^^^^^^^^^^^^^^^^^^
01:38:18 The method restoreGlobalState() from the type GlobalRegistries.GlobalStateMemento is deprecated
01:38:18 [WARNING] /jobs/genie.papyrus/Papyrus-Master-Tests-Release/workspace/source/tests/junit/plugins/uml/alf/org.eclipse.papyrus.uml.alf.tests/src-gen/org/eclipse/papyrus/uml/alf/AlfInjectorProvider.java:[43] 
01:38:18 	stateAfterInjectorCreation.restoreGlobalState();
01:38:18 	                           ^^^^^^^^^^^^^^^^^^^^
01:38:18 The method restoreGlobalState() from the type GlobalRegistries.GlobalStateMemento is deprecated
01:38:18 [WARNING] /jobs/genie.papyrus/Papyrus-Master-Tests-Release/workspace/source/tests/junit/plugins/uml/alf/org.eclipse.papyrus.uml.alf.tests/src/org/eclipse/papyrus/uml/alf/tests/mapper/CompilerTests.java:[64] 
01:38:18 	import org.eclipse.xtext.junit4.XtextRunner;
01:38:18 	       ^^^^^^^^^^^^^^^^^^^^^^^^^^^^^^^^^^^^
01:38:18 The type XtextRunner is deprecated
01:38:18 [WARNING] /jobs/genie.papyrus/Papyrus-Master-Tests-Release/workspace/source/tests/junit/plugins/uml/alf/org.eclipse.papyrus.uml.alf.tests/src/org/eclipse/papyrus/uml/alf/tests/mapper/CompilerTests.java:[70] 
01:38:18 	@RunWith(XtextRunner.class)
01:38:18 	         ^^^^^^^^^^^
01:38:18 The type XtextRunner is deprecated
01:38:18 21 problems (21 warnings)
01:38:18 [INFO] 
01:38:18 [INFO] --- maven-resources-plugin:3.1.0:testResources (default-testResources) @ org.eclipse.papyrus.uml.alf.tests ---
01:38:18 [INFO] Using 'UTF-8' encoding to copy filtered resources.
01:38:18 [INFO] skip non existing resourceDirectory /jobs/genie.papyrus/Papyrus-Master-Tests-Release/workspace/source/tests/junit/plugins/uml/alf/org.eclipse.papyrus.uml.alf.tests/src/test/resources
01:38:18 [INFO] 
01:38:18 [INFO] --- target-platform-configuration:1.3.0:target-platform (default-target-platform) @ org.eclipse.papyrus.uml.alf.tests ---
01:38:18 [INFO] 
01:38:18 [INFO] --- tycho-packaging-plugin:1.3.0:package-plugin (default-package-plugin) @ org.eclipse.papyrus.uml.alf.tests ---
01:38:18 [INFO] Building jar: /jobs/genie.papyrus/Papyrus-Master-Tests-Release/workspace/source/tests/junit/plugins/uml/alf/org.eclipse.papyrus.uml.alf.tests/target/org.eclipse.papyrus.uml.alf.tests-1.2.0-SNAPSHOT.jar
01:38:18 [INFO] 
01:38:18 [INFO] --- tycho-p2-plugin:1.3.0:p2-metadata-default (default-p2-metadata-default) @ org.eclipse.papyrus.uml.alf.tests ---
01:38:18 [INFO] 
01:38:18 [INFO] --- tycho-surefire-plugin:1.3.0:test (default-test) @ org.eclipse.papyrus.uml.alf.tests ---
01:38:18 [INFO] Skipping tests
01:38:18 [INFO] 
01:38:18 [INFO] --- jacoco-maven-plugin:0.8.2:report (default-report) @ org.eclipse.papyrus.uml.alf.tests ---
01:38:18 [INFO] Skipping JaCoCo execution due to missing execution data file.
01:38:18 [INFO] 
01:38:18 [INFO] ---< org.eclipse.papyrus:org.eclipse.papyrus.uml.alf.tests.feature >----
01:38:18 [INFO] Building org.eclipse.papyrus.uml.alf.tests.feature 1.2.0-SNAPSHOT [130/166]
01:38:18 [INFO] --------------------------[ eclipse-feature ]---------------------------
01:38:18 [INFO] 
01:38:18 [INFO] --- maven-clean-plugin:3.1.0:clean (default-clean) @ org.eclipse.papyrus.uml.alf.tests.feature ---
01:38:18 [INFO] 
01:38:18 [INFO] --- tycho-packaging-plugin:1.3.0:build-qualifier-aggregator (default-build-qualifier-aggregator) @ org.eclipse.papyrus.uml.alf.tests.feature ---
01:38:18 [INFO] The project's OSGi version is 1.2.0.201909270520
01:38:18 [INFO] 
01:38:18 [INFO] --- tycho-packaging-plugin:1.3.0:validate-id (default-validate-id) @ org.eclipse.papyrus.uml.alf.tests.feature ---
01:38:18 [INFO] 
01:38:18 [INFO] --- tycho-packaging-plugin:1.3.0:validate-version (default-validate-version) @ org.eclipse.papyrus.uml.alf.tests.feature ---
01:38:18 [INFO] 
01:38:18 [INFO] --- jacoco-maven-plugin:0.8.2:prepare-agent (default-prepare-agent) @ org.eclipse.papyrus.uml.alf.tests.feature ---
01:38:18 [INFO] argLine set to -javaagent:/home/hudson/genie.papyrus/.jenkins/jobs/Papyrus-Master-Tests-Release/workspace/.repository/org/jacoco/org.jacoco.agent/0.8.2/org.jacoco.agent-0.8.2-runtime.jar=destfile=/jobs/genie.papyrus/Papyrus-Master-Tests-Release/workspace/source/features/papyrus-tests-features/org.eclipse.papyrus.uml.alf.tests.feature/target/jacoco.exec,includes=org.eclipse.papyrus.*,excludes=org.eclipse.uml2
01:38:18 [INFO] 
01:38:18 [INFO] --- target-platform-configuration:1.3.0:target-platform (default-target-platform) @ org.eclipse.papyrus.uml.alf.tests.feature ---
01:38:18 [INFO] 
01:38:18 [INFO] --- tycho-packaging-plugin:1.3.0:package-feature (default-package-feature) @ org.eclipse.papyrus.uml.alf.tests.feature ---
01:38:18 [INFO] Building jar: /jobs/genie.papyrus/Papyrus-Master-Tests-Release/workspace/source/features/papyrus-tests-features/org.eclipse.papyrus.uml.alf.tests.feature/target/org.eclipse.papyrus.uml.alf.tests.feature-1.2.0-SNAPSHOT.jar
01:38:18 [INFO] 
01:38:18 [INFO] --- tycho-p2-plugin:1.3.0:p2-metadata-default (default-p2-metadata-default) @ org.eclipse.papyrus.uml.alf.tests.feature ---
01:38:18 [INFO] 
01:38:18 [INFO] --- tycho-p2-plugin:1.3.0:feature-p2-metadata (default-feature-p2-metadata) @ org.eclipse.papyrus.uml.alf.tests.feature ---
01:38:18 [INFO] 
01:38:18 [INFO] --- jacoco-maven-plugin:0.8.2:report (default-report) @ org.eclipse.papyrus.uml.alf.tests.feature ---
01:38:18 [INFO] Skipping JaCoCo execution due to missing execution data file.
01:38:18 [INFO] 
01:38:18 [INFO] -------< org.eclipse.papyrus:org.eclipse.papyrus.tests.features >-------
01:38:18 [INFO] Building Papyrus Tests Features 0.0.1-SNAPSHOT                 [131/166]
01:38:18 [INFO] --------------------------------[ pom ]---------------------------------
01:38:18 [INFO] 
01:38:18 [INFO] --- maven-clean-plugin:3.1.0:clean (default-clean) @ org.eclipse.papyrus.tests.features ---
01:38:18 [INFO] 
01:38:18 [INFO] --- jacoco-maven-plugin:0.8.2:prepare-agent (default-prepare-agent) @ org.eclipse.papyrus.tests.features ---
01:38:19 [INFO] argLine set to -javaagent:/home/hudson/genie.papyrus/.jenkins/jobs/Papyrus-Master-Tests-Release/workspace/.repository/org/jacoco/org.jacoco.agent/0.8.2/org.jacoco.agent-0.8.2-runtime.jar=destfile=/jobs/genie.papyrus/Papyrus-Master-Tests-Release/workspace/source/features/papyrus-tests-features/target/jacoco.exec,includes=org.eclipse.papyrus.*,excludes=org.eclipse.uml2
01:38:19 [INFO] 
01:38:19 [INFO] --- jacoco-maven-plugin:0.8.2:report (default-report) @ org.eclipse.papyrus.tests.features ---
01:38:19 [INFO] Skipping JaCoCo execution due to missing execution data file.
01:38:19 [INFO] 
01:38:19 [INFO] --< org.eclipse.papyrus.tests:org.eclipse.papyrus.developer.suite.tests >--
01:38:19 [INFO] Building org.eclipse.papyrus.developer.suite.tests 0.0.1-SNAPSHOT [132/166]
01:38:19 [INFO] ------------------------[ eclipse-test-plugin ]-------------------------
01:38:19 [INFO] 
01:38:19 [INFO] --- maven-clean-plugin:3.1.0:clean (default-clean) @ org.eclipse.papyrus.developer.suite.tests ---
01:38:19 [INFO] 
01:38:19 [INFO] --- tycho-packaging-plugin:1.3.0:build-qualifier (default-build-qualifier) @ org.eclipse.papyrus.developer.suite.tests ---
01:38:19 [INFO] The project's OSGi version is 0.0.1.201909270520
01:38:19 [INFO] 
01:38:19 [INFO] --- tycho-packaging-plugin:1.3.0:validate-id (default-validate-id) @ org.eclipse.papyrus.developer.suite.tests ---
01:38:19 [INFO] 
01:38:19 [INFO] --- tycho-packaging-plugin:1.3.0:validate-version (default-validate-version) @ org.eclipse.papyrus.developer.suite.tests ---
01:38:19 [INFO] 
01:38:19 [INFO] --- jacoco-maven-plugin:0.8.2:prepare-agent (default-prepare-agent) @ org.eclipse.papyrus.developer.suite.tests ---
01:38:19 [INFO] tycho.testArgLine set to -javaagent:/home/hudson/genie.papyrus/.jenkins/jobs/Papyrus-Master-Tests-Release/workspace/.repository/org/jacoco/org.jacoco.agent/0.8.2/org.jacoco.agent-0.8.2-runtime.jar=destfile=/jobs/genie.papyrus/Papyrus-Master-Tests-Release/workspace/source/tests/junit/plugins/bundlestests/org.eclipse.papyrus.developer.suite.tests/target/jacoco.exec,includes=org.eclipse.papyrus.*,excludes=org.eclipse.uml2
01:38:19 [INFO] 
01:38:19 [INFO] --- maven-resources-plugin:3.1.0:resources (default-resources) @ org.eclipse.papyrus.developer.suite.tests ---
01:38:19 [INFO] Using 'UTF-8' encoding to copy filtered resources.
01:38:19 [INFO] skip non existing resourceDirectory /jobs/genie.papyrus/Papyrus-Master-Tests-Release/workspace/source/tests/junit/plugins/bundlestests/org.eclipse.papyrus.developer.suite.tests/src/main/resources
01:38:19 [INFO] 
01:38:19 [INFO] --- tycho-compiler-plugin:1.3.0:compile (default-compile) @ org.eclipse.papyrus.developer.suite.tests ---
01:38:19 [INFO] Compiling 2 source files to /jobs/genie.papyrus/Papyrus-Master-Tests-Release/workspace/source/tests/junit/plugins/bundlestests/org.eclipse.papyrus.developer.suite.tests/bin
01:38:19 [INFO] 
01:38:19 [INFO] --- maven-resources-plugin:3.1.0:testResources (default-testResources) @ org.eclipse.papyrus.developer.suite.tests ---
01:38:19 [INFO] Using 'UTF-8' encoding to copy filtered resources.
01:38:19 [INFO] skip non existing resourceDirectory /jobs/genie.papyrus/Papyrus-Master-Tests-Release/workspace/source/tests/junit/plugins/bundlestests/org.eclipse.papyrus.developer.suite.tests/src/test/resources
01:38:19 [INFO] 
01:38:19 [INFO] --- target-platform-configuration:1.3.0:target-platform (default-target-platform) @ org.eclipse.papyrus.developer.suite.tests ---
01:38:19 [INFO] 
01:38:19 [INFO] --- tycho-packaging-plugin:1.3.0:package-plugin (default-package-plugin) @ org.eclipse.papyrus.developer.suite.tests ---
01:38:19 [INFO] Building jar: /jobs/genie.papyrus/Papyrus-Master-Tests-Release/workspace/source/tests/junit/plugins/bundlestests/org.eclipse.papyrus.developer.suite.tests/target/org.eclipse.papyrus.developer.suite.tests-0.0.1-SNAPSHOT.jar
01:38:19 [INFO] 
01:38:19 [INFO] --- tycho-p2-plugin:1.3.0:p2-metadata-default (default-p2-metadata-default) @ org.eclipse.papyrus.developer.suite.tests ---
01:38:19 [INFO] 
01:38:19 [INFO] --- tycho-surefire-plugin:1.3.0:test (default-test) @ org.eclipse.papyrus.developer.suite.tests ---
01:38:29 [INFO] Expected eclipse log file: /jobs/genie.papyrus/Papyrus-Master-Tests-Release/workspace/source/tests/junit/plugins/bundlestests/org.eclipse.papyrus.developer.suite.tests/target/work/data/.metadata/.log
01:38:29 [INFO] Command line:
01:38:29 	[/opt/public/common/java/oracle/jdk1.8.0_192_x64/jre/bin/java, -Dosgi.noShutdown=false, -Dosgi.os=linux, -Dosgi.ws=gtk, -Dosgi.arch=x86_64, -javaagent:/home/hudson/genie.papyrus/.jenkins/jobs/Papyrus-Master-Tests-Release/workspace/.repository/org/jacoco/org.jacoco.agent/0.8.2/org.jacoco.agent-0.8.2-runtime.jar=destfile=/jobs/genie.papyrus/Papyrus-Master-Tests-Release/workspace/source/tests/junit/plugins/bundlestests/org.eclipse.papyrus.developer.suite.tests/target/jacoco.exec,includes=org.eclipse.papyrus.*,excludes=org.eclipse.uml2, -Xms512m, -Xmx2048m, -XX:SoftRefLRUPolicyMSPerMB=100, -Dosgi.clean=true, -jar, /jobs/genie.papyrus/Papyrus-Master-Tests-Release/workspace/.repository/p2/osgi/bundle/org.eclipse.equinox.launcher/1.5.500.v20190715-1310/org.eclipse.equinox.launcher-1.5.500.v20190715-1310.jar, -data, /jobs/genie.papyrus/Papyrus-Master-Tests-Release/workspace/source/tests/junit/plugins/bundlestests/org.eclipse.papyrus.developer.suite.tests/target/work/data, -install, /jobs/genie.papyrus/Papyrus-Master-Tests-Release/workspace/source/tests/junit/plugins/bundlestests/org.eclipse.papyrus.developer.suite.tests/target/work, -configuration, /jobs/genie.papyrus/Papyrus-Master-Tests-Release/workspace/source/tests/junit/plugins/bundlestests/org.eclipse.papyrus.developer.suite.tests/target/work/configuration, -application, org.eclipse.tycho.surefire.osgibooter.uitest, -testproperties, /jobs/genie.papyrus/Papyrus-Master-Tests-Release/workspace/source/tests/junit/plugins/bundlestests/org.eclipse.papyrus.developer.suite.tests/target/surefire.properties, -product, org.eclipse.sdk.ide, -testConfig=CI_TESTS_CONFIG]
01:38:29 Picked up JAVA_TOOL_OPTIONS: -Xmx2G -Djava.io.tmpdir=/tmp/genie.papyrus -DforkCount=1
01:38:38 Running org.eclipse.papyrus.developer.suite.tests.AllTests
01:38:40 Tests run: 12, Failures: 0, Errors: 0, Skipped: 2, Time elapsed: 1.379 s - in org.eclipse.papyrus.developer.suite.tests.AllTests
01:38:40 uml2umlDependencyVersionTest(org.eclipse.papyrus.bundles.tests.BundlesTests)  Time elapsed: 0.049 s
01:38:40 batikDependencyVersionTest(org.eclipse.papyrus.bundles.tests.BundlesTests)  Time elapsed: 0.009 s
01:38:40 aboutTest(org.eclipse.papyrus.bundles.tests.BundlesTests)  Time elapsed: 0.022 s
01:38:40 guavaDependencyVersionTest(org.eclipse.papyrus.bundles.tests.BundlesTests)  Time elapsed: 0.007 s
01:38:40 vendorTest(org.eclipse.papyrus.bundles.tests.BundlesTests)  Time elapsed: 0.005 s
01:38:40 javaVersionTest(org.eclipse.papyrus.bundles.tests.BundlesTests)  Time elapsed: 0.054 s
01:38:40 checkPapyrusEMFPluginDependency(org.eclipse.papyrus.bundles.tests.BundlesTests)  Time elapsed: 0.005 s
01:38:40 glazedListDependencyVersionTest(org.eclipse.papyrus.bundles.tests.BundlesTests)  Time elapsed: 0.007 s
01:38:40 pluginIDTest(org.eclipse.papyrus.bundles.tests.BundlesTests)  Time elapsed: 0.977 s
01:38:40 incubationTest(org.eclipse.papyrus.bundles.tests.BundlesTests) skipped
01:38:40 importPackage(org.eclipse.papyrus.bundles.tests.BundlesTests) skipped
01:38:40 natTableDependencyVersionTest(org.eclipse.papyrus.bundles.tests.BundlesTests)  Time elapsed: 0.013 s
01:38:40 
01:38:40 Results:
01:38:40 
01:38:40 Tests run: 12, Failures: 0, Errors: 0, Skipped: 2
01:38:40 
01:38:42 [INFO] All tests passed!
01:38:42 [INFO] 
01:38:42 [INFO] --- jacoco-maven-plugin:0.8.2:report (default-report) @ org.eclipse.papyrus.developer.suite.tests ---
01:38:42 [INFO] Loading execution data file /jobs/genie.papyrus/Papyrus-Master-Tests-Release/workspace/source/tests/junit/plugins/bundlestests/org.eclipse.papyrus.developer.suite.tests/target/jacoco.exec
01:38:42 [INFO] Analyzed bundle 'org.eclipse.papyrus.developer.suite.tests' with 0 classes
01:38:42 [INFO] 
01:38:42 [INFO] ----< org.eclipse.papyrus.tests:org.eclipse.papyrus.bundles.tests >-----
01:38:42 [INFO] Building org.eclipse.papyrus.bundles.tests 0.0.1-SNAPSHOT      [133/166]
01:38:42 [INFO] --------------------------------[ pom ]---------------------------------
01:38:42 [INFO] 
01:38:42 [INFO] --- maven-clean-plugin:3.1.0:clean (default-clean) @ org.eclipse.papyrus.bundles.tests ---
01:38:42 [INFO] 
01:38:42 [INFO] --- jacoco-maven-plugin:0.8.2:prepare-agent (default-prepare-agent) @ org.eclipse.papyrus.bundles.tests ---
01:38:42 [INFO] argLine set to -javaagent:/home/hudson/genie.papyrus/.jenkins/jobs/Papyrus-Master-Tests-Release/workspace/.repository/org/jacoco/org.jacoco.agent/0.8.2/org.jacoco.agent-0.8.2-runtime.jar=destfile=/jobs/genie.papyrus/Papyrus-Master-Tests-Release/workspace/source/tests/junit/plugins/bundlestests/target/jacoco.exec,includes=org.eclipse.papyrus.*,excludes=org.eclipse.uml2
01:38:42 [INFO] 
01:38:42 [INFO] --- jacoco-maven-plugin:0.8.2:report (default-report) @ org.eclipse.papyrus.bundles.tests ---
01:38:42 [INFO] Skipping JaCoCo execution due to missing execution data file.
01:38:42 [INFO] 
01:38:42 [INFO] --< org.eclipse.papyrus.tests:org.eclipse.papyrus.eclipse.project.editors.tests >--
01:38:42 [INFO] Building org.eclipse.papyrus.eclipse.project.editors.tests 2.1.0-SNAPSHOT [134/166]
01:38:42 [INFO] ------------------------[ eclipse-test-plugin ]-------------------------
01:38:42 [INFO] 
01:38:42 [INFO] --- maven-clean-plugin:3.1.0:clean (default-clean) @ org.eclipse.papyrus.eclipse.project.editors.tests ---
01:38:42 [INFO] 
01:38:42 [INFO] --- tycho-packaging-plugin:1.3.0:build-qualifier (default-build-qualifier) @ org.eclipse.papyrus.eclipse.project.editors.tests ---
01:38:42 [INFO] The project's OSGi version is 2.1.0.201909270520
01:38:42 [INFO] 
01:38:42 [INFO] --- tycho-packaging-plugin:1.3.0:validate-id (default-validate-id) @ org.eclipse.papyrus.eclipse.project.editors.tests ---
01:38:42 [INFO] 
01:38:42 [INFO] --- tycho-packaging-plugin:1.3.0:validate-version (default-validate-version) @ org.eclipse.papyrus.eclipse.project.editors.tests ---
01:38:42 [INFO] 
01:38:42 [INFO] --- jacoco-maven-plugin:0.8.2:prepare-agent (default-prepare-agent) @ org.eclipse.papyrus.eclipse.project.editors.tests ---
01:38:42 [INFO] tycho.testArgLine set to -javaagent:/home/hudson/genie.papyrus/.jenkins/jobs/Papyrus-Master-Tests-Release/workspace/.repository/org/jacoco/org.jacoco.agent/0.8.2/org.jacoco.agent-0.8.2-runtime.jar=destfile=/jobs/genie.papyrus/Papyrus-Master-Tests-Release/workspace/source/tests/junit/plugins/editor/org.eclipse.papyrus.eclipse.project.editors.tests/target/jacoco.exec,includes=org.eclipse.papyrus.*,excludes=org.eclipse.uml2
01:38:42 [INFO] 
01:38:42 [INFO] --- maven-resources-plugin:3.1.0:resources (default-resources) @ org.eclipse.papyrus.eclipse.project.editors.tests ---
01:38:42 [INFO] Using 'UTF-8' encoding to copy filtered resources.
01:38:42 [INFO] skip non existing resourceDirectory /jobs/genie.papyrus/Papyrus-Master-Tests-Release/workspace/source/tests/junit/plugins/editor/org.eclipse.papyrus.eclipse.project.editors.tests/src/main/resources
01:38:42 [INFO] 
01:38:42 [INFO] --- tycho-compiler-plugin:1.3.0:compile (default-compile) @ org.eclipse.papyrus.eclipse.project.editors.tests ---
01:38:42 [INFO] Compiling 12 source files to /jobs/genie.papyrus/Papyrus-Master-Tests-Release/workspace/source/tests/junit/plugins/editor/org.eclipse.papyrus.eclipse.project.editors.tests/bin
01:38:42 [INFO] 
01:38:42 [INFO] --- maven-resources-plugin:3.1.0:testResources (default-testResources) @ org.eclipse.papyrus.eclipse.project.editors.tests ---
01:38:42 [INFO] Using 'UTF-8' encoding to copy filtered resources.
01:38:42 [INFO] skip non existing resourceDirectory /jobs/genie.papyrus/Papyrus-Master-Tests-Release/workspace/source/tests/junit/plugins/editor/org.eclipse.papyrus.eclipse.project.editors.tests/src/test/resources
01:38:42 [INFO] 
01:38:42 [INFO] --- target-platform-configuration:1.3.0:target-platform (default-target-platform) @ org.eclipse.papyrus.eclipse.project.editors.tests ---
01:38:42 [INFO] 
01:38:42 [INFO] --- tycho-packaging-plugin:1.3.0:package-plugin (default-package-plugin) @ org.eclipse.papyrus.eclipse.project.editors.tests ---
01:38:42 [INFO] Building jar: /jobs/genie.papyrus/Papyrus-Master-Tests-Release/workspace/source/tests/junit/plugins/editor/org.eclipse.papyrus.eclipse.project.editors.tests/target/org.eclipse.papyrus.eclipse.project.editors.tests-2.1.0-SNAPSHOT.jar
01:38:42 [INFO] 
01:38:42 [INFO] --- tycho-p2-plugin:1.3.0:p2-metadata-default (default-p2-metadata-default) @ org.eclipse.papyrus.eclipse.project.editors.tests ---
01:38:42 [INFO] 
01:38:42 [INFO] --- tycho-surefire-plugin:1.3.0:test (default-test) @ org.eclipse.papyrus.eclipse.project.editors.tests ---
01:38:42 [INFO] Skipping tests
01:38:42 [INFO] 
01:38:42 [INFO] --- jacoco-maven-plugin:0.8.2:report (default-report) @ org.eclipse.papyrus.eclipse.project.editors.tests ---
01:38:42 [INFO] Skipping JaCoCo execution due to missing execution data file.
01:38:42 [INFO] 
01:38:42 [INFO] --< org.eclipse.papyrus.tests:org.eclipse.papyrus.editors.suite.tests >--
01:38:42 [INFO] Building org.eclipse.papyrus.editors.suite.tests 0.0.1-SNAPSHOT [135/166]
01:38:42 [INFO] ------------------------[ eclipse-test-plugin ]-------------------------
01:38:43 [INFO] 
01:38:43 [INFO] --- maven-clean-plugin:3.1.0:clean (default-clean) @ org.eclipse.papyrus.editors.suite.tests ---
01:38:43 [INFO] 
01:38:43 [INFO] --- tycho-packaging-plugin:1.3.0:build-qualifier (default-build-qualifier) @ org.eclipse.papyrus.editors.suite.tests ---
01:38:43 [INFO] The project's OSGi version is 0.0.1.201909270520
01:38:43 [INFO] 
01:38:43 [INFO] --- tycho-packaging-plugin:1.3.0:validate-id (default-validate-id) @ org.eclipse.papyrus.editors.suite.tests ---
01:38:43 [INFO] 
01:38:43 [INFO] --- tycho-packaging-plugin:1.3.0:validate-version (default-validate-version) @ org.eclipse.papyrus.editors.suite.tests ---
01:38:43 [INFO] 
01:38:43 [INFO] --- jacoco-maven-plugin:0.8.2:prepare-agent (default-prepare-agent) @ org.eclipse.papyrus.editors.suite.tests ---
01:38:43 [INFO] tycho.testArgLine set to -javaagent:/home/hudson/genie.papyrus/.jenkins/jobs/Papyrus-Master-Tests-Release/workspace/.repository/org/jacoco/org.jacoco.agent/0.8.2/org.jacoco.agent-0.8.2-runtime.jar=destfile=/jobs/genie.papyrus/Papyrus-Master-Tests-Release/workspace/source/tests/junit/plugins/editor/org.eclipse.papyrus.editors.suite.tests/target/jacoco.exec,includes=org.eclipse.papyrus.*,excludes=org.eclipse.uml2
01:38:43 [INFO] 
01:38:43 [INFO] --- maven-resources-plugin:3.1.0:resources (default-resources) @ org.eclipse.papyrus.editors.suite.tests ---
01:38:43 [INFO] Using 'UTF-8' encoding to copy filtered resources.
01:38:43 [INFO] skip non existing resourceDirectory /jobs/genie.papyrus/Papyrus-Master-Tests-Release/workspace/source/tests/junit/plugins/editor/org.eclipse.papyrus.editors.suite.tests/src/main/resources
01:38:43 [INFO] 
01:38:43 [INFO] --- tycho-compiler-plugin:1.3.0:compile (default-compile) @ org.eclipse.papyrus.editors.suite.tests ---
01:38:43 [INFO] Compiling 2 source files to /jobs/genie.papyrus/Papyrus-Master-Tests-Release/workspace/source/tests/junit/plugins/editor/org.eclipse.papyrus.editors.suite.tests/bin
01:38:43 [INFO] 
01:38:43 [INFO] --- maven-resources-plugin:3.1.0:testResources (default-testResources) @ org.eclipse.papyrus.editors.suite.tests ---
01:38:43 [INFO] Using 'UTF-8' encoding to copy filtered resources.
01:38:43 [INFO] skip non existing resourceDirectory /jobs/genie.papyrus/Papyrus-Master-Tests-Release/workspace/source/tests/junit/plugins/editor/org.eclipse.papyrus.editors.suite.tests/src/test/resources
01:38:43 [INFO] 
01:38:43 [INFO] --- target-platform-configuration:1.3.0:target-platform (default-target-platform) @ org.eclipse.papyrus.editors.suite.tests ---
01:38:43 [INFO] 
01:38:43 [INFO] --- tycho-packaging-plugin:1.3.0:package-plugin (default-package-plugin) @ org.eclipse.papyrus.editors.suite.tests ---
01:38:43 [INFO] Building jar: /jobs/genie.papyrus/Papyrus-Master-Tests-Release/workspace/source/tests/junit/plugins/editor/org.eclipse.papyrus.editors.suite.tests/target/org.eclipse.papyrus.editors.suite.tests-0.0.1-SNAPSHOT.jar
01:38:43 [INFO] 
01:38:43 [INFO] --- tycho-p2-plugin:1.3.0:p2-metadata-default (default-p2-metadata-default) @ org.eclipse.papyrus.editors.suite.tests ---
01:38:43 [INFO] 
01:38:43 [INFO] --- tycho-surefire-plugin:1.3.0:test (default-test) @ org.eclipse.papyrus.editors.suite.tests ---
01:38:52 [INFO] Expected eclipse log file: /jobs/genie.papyrus/Papyrus-Master-Tests-Release/workspace/source/tests/junit/plugins/editor/org.eclipse.papyrus.editors.suite.tests/target/work/data/.metadata/.log
01:38:52 [INFO] Command line:
01:38:52 	[/opt/public/common/java/oracle/jdk1.8.0_192_x64/jre/bin/java, -Dosgi.noShutdown=false, -Dosgi.os=linux, -Dosgi.ws=gtk, -Dosgi.arch=x86_64, -javaagent:/home/hudson/genie.papyrus/.jenkins/jobs/Papyrus-Master-Tests-Release/workspace/.repository/org/jacoco/org.jacoco.agent/0.8.2/org.jacoco.agent-0.8.2-runtime.jar=destfile=/jobs/genie.papyrus/Papyrus-Master-Tests-Release/workspace/source/tests/junit/plugins/editor/org.eclipse.papyrus.editors.suite.tests/target/jacoco.exec,includes=org.eclipse.papyrus.*,excludes=org.eclipse.uml2, -Xms512m, -Xmx2048m, -XX:SoftRefLRUPolicyMSPerMB=100, -Dosgi.clean=true, -jar, /jobs/genie.papyrus/Papyrus-Master-Tests-Release/workspace/.repository/p2/osgi/bundle/org.eclipse.equinox.launcher/1.5.500.v20190715-1310/org.eclipse.equinox.launcher-1.5.500.v20190715-1310.jar, -data, /jobs/genie.papyrus/Papyrus-Master-Tests-Release/workspace/source/tests/junit/plugins/editor/org.eclipse.papyrus.editors.suite.tests/target/work/data, -install, /jobs/genie.papyrus/Papyrus-Master-Tests-Release/workspace/source/tests/junit/plugins/editor/org.eclipse.papyrus.editors.suite.tests/target/work, -configuration, /jobs/genie.papyrus/Papyrus-Master-Tests-Release/workspace/source/tests/junit/plugins/editor/org.eclipse.papyrus.editors.suite.tests/target/work/configuration, -application, org.eclipse.tycho.surefire.osgibooter.uitest, -testproperties, /jobs/genie.papyrus/Papyrus-Master-Tests-Release/workspace/source/tests/junit/plugins/editor/org.eclipse.papyrus.editors.suite.tests/target/surefire.properties, -product, org.eclipse.sdk.ide, -testConfig=CI_TESTS_CONFIG]
01:38:53 Picked up JAVA_TOOL_OPTIONS: -Xmx2G -Djava.io.tmpdir=/tmp/genie.papyrus -DforkCount=1
01:39:06 Running org.eclipse.papyrus.editors.suite.tests.AllTests
01:39:29 No JFaces support for org.eclipse.jface.viewers.TableTreeViewer
01:39:40 log4j:WARN No appenders could be found for logger (org.eclipse.ocl.pivot.internal.resource.StandaloneProjectMap).
01:39:40 log4j:WARN Please initialize the log4j system properly.
01:41:38 Plugin org.eclipse.papyrus.uml.architecture, extension org.eclipse.papyrus.infra.nattable.common.tableReconciler
01:41:38 Error processing extension: ConfigurationElementHandle [name: tableReconciler, handle id: 16565, namespace: org.eclipse.papyrus.uml.architecture]
01:43:37 Tests run: 204, Failures: 2, Errors: 0, Skipped: 6, Time elapsed: 270.666 s <<< FAILURE! - in org.eclipse.papyrus.editors.suite.tests.AllTests
01:43:37 addFile(org.eclipse.papyrus.eclipse.project.editors.tests.ProjectEditorTest)  Time elapsed: 0.133 s
01:43:37 getMissingFiles(org.eclipse.papyrus.eclipse.project.editors.tests.ProjectEditorTest)  Time elapsed: 0.045 s
01:43:37 getExtensions(org.eclipse.papyrus.eclipse.project.editors.tests.PluginProjectEditorTest)  Time elapsed: 0.186 s
01:43:37 exists(org.eclipse.papyrus.eclipse.project.editors.tests.PluginProjectEditorTest)  Time elapsed: 0.115 s
01:43:37 addExtension(org.eclipse.papyrus.eclipse.project.editors.tests.PluginProjectEditorTest)  Time elapsed: 0.14 s
01:43:37 getMissingBuildCommand(org.eclipse.papyrus.eclipse.project.editors.tests.PluginProjectEditorTest)  Time elapsed: 0.087 s
01:43:37 getMissingFiles(org.eclipse.papyrus.eclipse.project.editors.tests.PluginProjectEditorTest)  Time elapsed: 0.041 s
01:43:37 getMissingNature(org.eclipse.papyrus.eclipse.project.editors.tests.PluginProjectEditorTest)  Time elapsed: 0.093 s
01:43:37 setAttribute(org.eclipse.papyrus.eclipse.project.editors.tests.PluginProjectEditorTest)  Time elapsed: 0.152 s
01:43:37 isSourceFolderRegistered(org.eclipse.papyrus.eclipse.project.editors.tests.JavaProjectEditorTest)  Time elapsed: 0.156 s
01:43:37 getSourceFolders(org.eclipse.papyrus.eclipse.project.editors.tests.JavaProjectEditorTest)  Time elapsed: 0.031 s
01:43:37 exists(org.eclipse.papyrus.eclipse.project.editors.tests.JavaProjectEditorTest)  Time elapsed: 0.045 s
01:43:37 isRegisteredSourceFolder(org.eclipse.papyrus.eclipse.project.editors.tests.JavaProjectEditorTest)  Time elapsed: 0.029 s
01:43:37 addBuildCommands(org.eclipse.papyrus.eclipse.project.editors.tests.JavaProjectEditorTest)  Time elapsed: 0.056 s
01:43:37 createFiles(org.eclipse.papyrus.eclipse.project.editors.tests.JavaProjectEditorTest)  Time elapsed: 0.055 s
01:43:37 hasNature(org.eclipse.papyrus.eclipse.project.editors.tests.JavaProjectEditorTest)  Time elapsed: 0.094 s
01:43:37 registerBinFolder(org.eclipse.papyrus.eclipse.project.editors.tests.JavaProjectEditorTest)  Time elapsed: 0.089 s
01:43:37 addSourceFolderToClasspath(org.eclipse.papyrus.eclipse.project.editors.tests.JavaProjectEditorTest)  Time elapsed: 0.145 s
01:43:37 getMissingBuildCommand(org.eclipse.papyrus.eclipse.project.editors.tests.JavaProjectEditorTest)  Time elapsed: 0.061 s
01:43:37 isRegisteredBinFolder(org.eclipse.papyrus.eclipse.project.editors.tests.JavaProjectEditorTest)  Time elapsed: 0.066 s
01:43:37 registerSourceFolder(org.eclipse.papyrus.eclipse.project.editors.tests.JavaProjectEditorTest)  Time elapsed: 0.067 s
01:43:37 getMissingFiles(org.eclipse.papyrus.eclipse.project.editors.tests.JavaProjectEditorTest)  Time elapsed: 0.054 s
01:43:37 getBinFolders(org.eclipse.papyrus.eclipse.project.editors.tests.JavaProjectEditorTest)  Time elapsed: 0.135 s
01:43:37 addToBuild(org.eclipse.papyrus.eclipse.project.editors.tests.JavaProjectEditorTest)  Time elapsed: 0.096 s
01:43:37 hasBuildCommand(org.eclipse.papyrus.eclipse.project.editors.tests.JavaProjectEditorTest)  Time elapsed: 0.108 s
01:43:37 addJavaSourceFolder(org.eclipse.papyrus.eclipse.project.editors.tests.JavaProjectEditorTest)  Time elapsed: 0.157 s
01:43:37 getMissingNature(org.eclipse.papyrus.eclipse.project.editors.tests.JavaProjectEditorTest)  Time elapsed: 0.066 s
01:43:37 getElementsInBuild(org.eclipse.papyrus.eclipse.project.editors.tests.JavaProjectEditorTest)  Time elapsed: 0.084 s
01:43:37 getValueString(org.eclipse.papyrus.eclipse.project.editors.tests.ManifestEditorTest)  Time elapsed: 0.07 s
01:43:37 setBundleVersion(org.eclipse.papyrus.eclipse.project.editors.tests.ManifestEditorTest)  Time elapsed: 0.097 s
01:43:37 getBundleVendor(org.eclipse.papyrus.eclipse.project.editors.tests.ManifestEditorTest)  Time elapsed: 0.05 s
01:43:37 headerOrderMaintained_bug489075(org.eclipse.papyrus.eclipse.project.editors.tests.ManifestEditorTest)  Time elapsed: 0.06 s
01:43:37 setSymbolicBundleName(org.eclipse.papyrus.eclipse.project.editors.tests.ManifestEditorTest)  Time elapsed: 0.059 s
01:43:37 removeRequiredBundle(org.eclipse.papyrus.eclipse.project.editors.tests.ManifestEditorTest)  Time elapsed: 0.059 s
01:43:37 exists(org.eclipse.papyrus.eclipse.project.editors.tests.ManifestEditorTest)  Time elapsed: 0.057 s
01:43:37 removeImportedPackage(org.eclipse.papyrus.eclipse.project.editors.tests.ManifestEditorTest)  Time elapsed: 0.071 s
01:43:37 addImportPackageString(org.eclipse.papyrus.eclipse.project.editors.tests.ManifestEditorTest)  Time elapsed: 0.064 s
01:43:37 setBundleVendor(org.eclipse.papyrus.eclipse.project.editors.tests.ManifestEditorTest)  Time elapsed: 0.077 s
01:43:37 addExportPackageStringString(org.eclipse.papyrus.eclipse.project.editors.tests.ManifestEditorTest)  Time elapsed: 0.049 s
01:43:37 addDependencyString(org.eclipse.papyrus.eclipse.project.editors.tests.ManifestEditorTest)  Time elapsed: 0.059 s
01:43:37 createFiles(org.eclipse.papyrus.eclipse.project.editors.tests.ManifestEditorTest)  Time elapsed: 0.065 s
01:43:37 addExportPackageString(org.eclipse.papyrus.eclipse.project.editors.tests.ManifestEditorTest)  Time elapsed: 0.093 s
01:43:37 getBundleVersion(org.eclipse.papyrus.eclipse.project.editors.tests.ManifestEditorTest)  Time elapsed: 0.048 s
01:43:37 setSingleton(org.eclipse.papyrus.eclipse.project.editors.tests.ManifestEditorTest)  Time elapsed: 0.053 s
01:43:37 addImportPackageStringString(org.eclipse.papyrus.eclipse.project.editors.tests.ManifestEditorTest)  Time elapsed: 0.057 s
01:43:37 getSymbolicBundleName(org.eclipse.papyrus.eclipse.project.editors.tests.ManifestEditorTest)  Time elapsed: 0.062 s
01:43:37 getImportedPackages(org.eclipse.papyrus.eclipse.project.editors.tests.ManifestEditorTest)  Time elapsed: 0.056 s
01:43:37 setValueStringStringString(org.eclipse.papyrus.eclipse.project.editors.tests.ManifestEditorTest)  Time elapsed: 0.07 s
01:43:37 getMissingFiles(org.eclipse.papyrus.eclipse.project.editors.tests.ManifestEditorTest)  Time elapsed: 0.053 s
01:43:37 removeValueStringString(org.eclipse.papyrus.eclipse.project.editors.tests.ManifestEditorTest)  Time elapsed: 0.071 s
01:43:37 setValueStringString(org.eclipse.papyrus.eclipse.project.editors.tests.ManifestEditorTest)  Time elapsed: 0.053 s
01:43:37 removeValueString(org.eclipse.papyrus.eclipse.project.editors.tests.ManifestEditorTest)  Time elapsed: 0.056 s
01:43:37 hasDependency(org.eclipse.papyrus.eclipse.project.editors.tests.ManifestEditorTest)  Time elapsed: 0.058 s
01:43:37 getRequiredBundles(org.eclipse.papyrus.eclipse.project.editors.tests.ManifestEditorTest)  Time elapsed: 0.066 s
01:43:37 setRequiredBundleExported(org.eclipse.papyrus.eclipse.project.editors.tests.ManifestEditorTest)  Time elapsed: 0.069 s
01:43:37 getBundleName(org.eclipse.papyrus.eclipse.project.editors.tests.ManifestEditorTest)  Time elapsed: 0.05 s
01:43:37 removeCustomSection_bug489075(org.eclipse.papyrus.eclipse.project.editors.tests.ManifestEditorTest)  Time elapsed: 0.063 s
01:43:37 getValueStringString(org.eclipse.papyrus.eclipse.project.editors.tests.ManifestEditorTest)  Time elapsed: 0.046 s
01:43:37 addNewCustomSection_bug489075(org.eclipse.papyrus.eclipse.project.editors.tests.ManifestEditorTest)  Time elapsed: 0.071 s
01:43:37 addDependencyStringString(org.eclipse.papyrus.eclipse.project.editors.tests.ManifestEditorTest)  Time elapsed: 0.086 s
01:43:37 setBundleName(org.eclipse.papyrus.eclipse.project.editors.tests.ManifestEditorTest)  Time elapsed: 0.077 s
01:43:37 getBundleLocalization(org.eclipse.papyrus.eclipse.project.editors.tests.ManifestEditorTest)  Time elapsed: 0.058 s
01:43:37 getExtensions(org.eclipse.papyrus.eclipse.project.editors.tests.PluginEditorTest)  Time elapsed: 0.17 s
01:43:37 getValueString(org.eclipse.papyrus.eclipse.project.editors.tests.PluginEditorTest)  Time elapsed: 0.13 s
01:43:37 isSourceFolderRegistered(org.eclipse.papyrus.eclipse.project.editors.tests.PluginEditorTest)  Time elapsed: 0.196 s
01:43:37 setBundleVersion(org.eclipse.papyrus.eclipse.project.editors.tests.PluginEditorTest)  Time elapsed: 0.258 s
01:43:37 getBundleVendor(org.eclipse.papyrus.eclipse.project.editors.tests.PluginEditorTest)  Time elapsed: 0.103 s
01:43:37 getSourceFolders(org.eclipse.papyrus.eclipse.project.editors.tests.PluginEditorTest)  Time elapsed: 0.146 s
01:43:37 getMissingNature_java(org.eclipse.papyrus.eclipse.project.editors.tests.PluginEditorTest)  Time elapsed: 0.055 s
01:43:37 setSymbolicBundleName(org.eclipse.papyrus.eclipse.project.editors.tests.PluginEditorTest)  Time elapsed: 0.254 s
01:43:37 removeRequiredBundle(org.eclipse.papyrus.eclipse.project.editors.tests.PluginEditorTest)  Time elapsed: 0.166 s
01:43:37 getMissingFiles_manifest(org.eclipse.papyrus.eclipse.project.editors.tests.PluginEditorTest)  Time elapsed: 0.055 s
01:43:37 isRegisteredSourceFolder(org.eclipse.papyrus.eclipse.project.editors.tests.PluginEditorTest)  Time elapsed: 0.088 s
01:43:37 removeImportedPackage(org.eclipse.papyrus.eclipse.project.editors.tests.PluginEditorTest)  Time elapsed: 0.192 s
01:43:37 addBuildCommands(org.eclipse.papyrus.eclipse.project.editors.tests.PluginEditorTest)  Time elapsed: 0.089 s
01:43:37 addImportPackageString(org.eclipse.papyrus.eclipse.project.editors.tests.PluginEditorTest)  Time elapsed: 0.195 s
01:43:37 addFile(org.eclipse.papyrus.eclipse.project.editors.tests.PluginEditorTest)  Time elapsed: 0.039 s
01:43:37 setBundleVendor(org.eclipse.papyrus.eclipse.project.editors.tests.PluginEditorTest)  Time elapsed: 0.224 s
01:43:37 getMissingFiles_plugin(org.eclipse.papyrus.eclipse.project.editors.tests.PluginEditorTest)  Time elapsed: 0.037 s
01:43:37 addExportPackageStringString(org.eclipse.papyrus.eclipse.project.editors.tests.PluginEditorTest)  Time elapsed: 0.154 s
01:43:37 addDependencyString(org.eclipse.papyrus.eclipse.project.editors.tests.PluginEditorTest)  Time elapsed: 0.173 s
01:43:37 addExtension(org.eclipse.papyrus.eclipse.project.editors.tests.PluginEditorTest)  Time elapsed: 0.175 s
01:43:37 getMissingFiles_project(org.eclipse.papyrus.eclipse.project.editors.tests.PluginEditorTest)  Time elapsed: 0.04 s
01:43:37 exists_manifest(org.eclipse.papyrus.eclipse.project.editors.tests.PluginEditorTest)  Time elapsed: 0.151 s
01:43:37 hasNature(org.eclipse.papyrus.eclipse.project.editors.tests.PluginEditorTest)  Time elapsed: 0.127 s
01:43:37 registerBinFolder(org.eclipse.papyrus.eclipse.project.editors.tests.PluginEditorTest)  Time elapsed: 0.1 s
01:43:37 addSourceFolderToClasspath(org.eclipse.papyrus.eclipse.project.editors.tests.PluginEditorTest)  Time elapsed: 0.186 s
01:43:37 addExportPackageString(org.eclipse.papyrus.eclipse.project.editors.tests.PluginEditorTest)  Time elapsed: 0.154 s
01:43:37 getBundleVersion(org.eclipse.papyrus.eclipse.project.editors.tests.PluginEditorTest)  Time elapsed: 0.111 s
01:43:37 setSingleton(org.eclipse.papyrus.eclipse.project.editors.tests.PluginEditorTest)  Time elapsed: 0.201 s
01:43:37 addImportPackageStringString(org.eclipse.papyrus.eclipse.project.editors.tests.PluginEditorTest)  Time elapsed: 0.168 s
01:43:37 getSymbolicBundleName(org.eclipse.papyrus.eclipse.project.editors.tests.PluginEditorTest)  Time elapsed: 0.104 s
01:43:37 getImportedPackages(org.eclipse.papyrus.eclipse.project.editors.tests.PluginEditorTest)  Time elapsed: 0.106 s
01:43:37 setValueStringStringString(org.eclipse.papyrus.eclipse.project.editors.tests.PluginEditorTest)  Time elapsed: 0.119 s
01:43:37 createFiles_java(org.eclipse.papyrus.eclipse.project.editors.tests.PluginEditorTest)  Time elapsed: 0.054 s
01:43:37 isRegisteredBinFolder(org.eclipse.papyrus.eclipse.project.editors.tests.PluginEditorTest)  Time elapsed: 0.118 s
01:43:37 registerSourceFolder(org.eclipse.papyrus.eclipse.project.editors.tests.PluginEditorTest)  Time elapsed: 0.084 s
01:43:37 getBinFolders(org.eclipse.papyrus.eclipse.project.editors.tests.PluginEditorTest)  Time elapsed: 0.228 s
01:43:37 removeValueStringString(org.eclipse.papyrus.eclipse.project.editors.tests.PluginEditorTest)  Time elapsed: 0.157 s
01:43:37 setValueStringString(org.eclipse.papyrus.eclipse.project.editors.tests.PluginEditorTest)  Time elapsed: 0.173 s
01:43:37 removeValueString(org.eclipse.papyrus.eclipse.project.editors.tests.PluginEditorTest)  Time elapsed: 0.157 s
01:43:37 getMissingFiles_java(org.eclipse.papyrus.eclipse.project.editors.tests.PluginEditorTest)  Time elapsed: 0.041 s
01:43:37 hasDependency(org.eclipse.papyrus.eclipse.project.editors.tests.PluginEditorTest)  Time elapsed: 0.043 s
01:43:37 pluginManifestExists(org.eclipse.papyrus.eclipse.project.editors.tests.PluginEditorTest)  Time elapsed: 0.106 s
01:43:37 getMissingBuildCommand_java(org.eclipse.papyrus.eclipse.project.editors.tests.PluginEditorTest)  Time elapsed: 0.042 s
01:43:37 addToBuild(org.eclipse.papyrus.eclipse.project.editors.tests.PluginEditorTest)  Time elapsed: 0.098 s
01:43:37 getRequiredBundles(org.eclipse.papyrus.eclipse.project.editors.tests.PluginEditorTest)  Time elapsed: 0.124 s
01:43:37 setRequiredBundleExported(org.eclipse.papyrus.eclipse.project.editors.tests.PluginEditorTest)  Time elapsed: 0.232 s
01:43:37 hasBuildCommand(org.eclipse.papyrus.eclipse.project.editors.tests.PluginEditorTest)  Time elapsed: 0.121 s
01:43:37 addJavaSourceFolder(org.eclipse.papyrus.eclipse.project.editors.tests.PluginEditorTest)  Time elapsed: 0.186 s
01:43:37 getBundleName(org.eclipse.papyrus.eclipse.project.editors.tests.PluginEditorTest)  Time elapsed: 0.119 s
01:43:37 getValueStringString(org.eclipse.papyrus.eclipse.project.editors.tests.PluginEditorTest)  Time elapsed: 0.133 s
01:43:37 createFiles_manifest(org.eclipse.papyrus.eclipse.project.editors.tests.PluginEditorTest)  Time elapsed: 0.073 s
01:43:37 getMissingNature_plugin(org.eclipse.papyrus.eclipse.project.editors.tests.PluginEditorTest)  Time elapsed: 0.104 s
01:43:37 getMissingBuildCommand_plugin(org.eclipse.papyrus.eclipse.project.editors.tests.PluginEditorTest)  Time elapsed: 0.137 s
01:43:37 setAttribute(org.eclipse.papyrus.eclipse.project.editors.tests.PluginEditorTest)  Time elapsed: 0.176 s
01:43:37 getElementsInBuild(org.eclipse.papyrus.eclipse.project.editors.tests.PluginEditorTest)  Time elapsed: 0.116 s
01:43:37 addDependencyStringString(org.eclipse.papyrus.eclipse.project.editors.tests.PluginEditorTest)  Time elapsed: 0.15 s
01:43:37 setBundleName(org.eclipse.papyrus.eclipse.project.editors.tests.PluginEditorTest)  Time elapsed: 0.22 s
01:43:37 getBundleLocalization(org.eclipse.papyrus.eclipse.project.editors.tests.PluginEditorTest)  Time elapsed: 0.107 s
01:43:37 exists_java(org.eclipse.papyrus.eclipse.project.editors.tests.PluginEditorTest)  Time elapsed: 0.158 s
01:43:37 getCopyrightURL(org.eclipse.papyrus.eclipse.project.editors.tests.FeatureProjectEditorTest)  Time elapsed: 0.066 s
01:43:37 getCopyrightText(org.eclipse.papyrus.eclipse.project.editors.tests.FeatureProjectEditorTest)  Time elapsed: 0.061 s
01:43:37 getLicenseURL(org.eclipse.papyrus.eclipse.project.editors.tests.FeatureProjectEditorTest)  Time elapsed: 0.066 s
01:43:37 getLicenseText(org.eclipse.papyrus.eclipse.project.editors.tests.FeatureProjectEditorTest)  Time elapsed: 0.059 s
01:43:37 setCopyright(org.eclipse.papyrus.eclipse.project.editors.tests.FeatureProjectEditorTest)  Time elapsed: 0.083 s
01:43:37 setLicense(org.eclipse.papyrus.eclipse.project.editors.tests.FeatureProjectEditorTest)  Time elapsed: 0.078 s
01:43:37 setVersion(org.eclipse.papyrus.eclipse.project.editors.tests.FeatureProjectEditorTest)  Time elapsed: 0.084 s
01:43:37 createFiles(org.eclipse.papyrus.eclipse.project.editors.tests.FeatureProjectEditorTest)  Time elapsed: 0.048 s
01:43:37 addRequiredFeature(org.eclipse.papyrus.eclipse.project.editors.tests.FeatureProjectEditorTest)  Time elapsed: 0.077 s
01:43:37 addInclude(org.eclipse.papyrus.eclipse.project.editors.tests.FeatureProjectEditorTest)  Time elapsed: 0.075 s
01:43:37 setUpdateURL(org.eclipse.papyrus.eclipse.project.editors.tests.FeatureProjectEditorTest)  Time elapsed: 0.084 s
01:43:37 getMissingBuildCommand(org.eclipse.papyrus.eclipse.project.editors.tests.FeatureProjectEditorTest)  Time elapsed: 0.102 s
01:43:37 addPlugin(org.eclipse.papyrus.eclipse.project.editors.tests.FeatureProjectEditorTest)  Time elapsed: 0.073 s
01:43:37 getArch(org.eclipse.papyrus.eclipse.project.editors.tests.FeatureProjectEditorTest)  Time elapsed: 0.062 s
01:43:37 getId(org.eclipse.papyrus.eclipse.project.editors.tests.FeatureProjectEditorTest)  Time elapsed: 0.032 s
01:43:37 getNL(org.eclipse.papyrus.eclipse.project.editors.tests.FeatureProjectEditorTest)  Time elapsed: 0.028 s
01:43:37 getOS(org.eclipse.papyrus.eclipse.project.editors.tests.FeatureProjectEditorTest)  Time elapsed: 0.029 s
01:43:37 getWS(org.eclipse.papyrus.eclipse.project.editors.tests.FeatureProjectEditorTest)  Time elapsed: 0.021 s
01:43:37 setId(org.eclipse.papyrus.eclipse.project.editors.tests.FeatureProjectEditorTest)  Time elapsed: 0.032 s
01:43:37 setNL(org.eclipse.papyrus.eclipse.project.editors.tests.FeatureProjectEditorTest)  Time elapsed: 0.049 s
01:43:37 setOS(org.eclipse.papyrus.eclipse.project.editors.tests.FeatureProjectEditorTest)  Time elapsed: 0.05 s
01:43:37 setWS(org.eclipse.papyrus.eclipse.project.editors.tests.FeatureProjectEditorTest)  Time elapsed: 0.032 s
01:43:37 getDescriptionURL(org.eclipse.papyrus.eclipse.project.editors.tests.FeatureProjectEditorTest)  Time elapsed: 0.012 s
01:43:37 setDescription(org.eclipse.papyrus.eclipse.project.editors.tests.FeatureProjectEditorTest)  Time elapsed: 0.039 s
01:43:37 addRequiredPlugin(org.eclipse.papyrus.eclipse.project.editors.tests.FeatureProjectEditorTest)  Time elapsed: 0.044 s
01:43:37 getMissingFiles(org.eclipse.papyrus.eclipse.project.editors.tests.FeatureProjectEditorTest)  Time elapsed: 0.032 s
01:43:37 getDescriptionText(org.eclipse.papyrus.eclipse.project.editors.tests.FeatureProjectEditorTest)  Time elapsed: 0.027 s
01:43:37 getProviderName(org.eclipse.papyrus.eclipse.project.editors.tests.FeatureProjectEditorTest)  Time elapsed: 0.033 s
01:43:37 getVersion(org.eclipse.papyrus.eclipse.project.editors.tests.FeatureProjectEditorTest)  Time elapsed: 0.025 s
01:43:37 setLabel(org.eclipse.papyrus.eclipse.project.editors.tests.FeatureProjectEditorTest)  Time elapsed: 0.054 s
01:43:37 getMissingNature(org.eclipse.papyrus.eclipse.project.editors.tests.FeatureProjectEditorTest)  Time elapsed: 0.074 s
01:43:37 getLabel(org.eclipse.papyrus.eclipse.project.editors.tests.FeatureProjectEditorTest)  Time elapsed: 0.041 s
01:43:37 setArch(org.eclipse.papyrus.eclipse.project.editors.tests.FeatureProjectEditorTest)  Time elapsed: 0.084 s
01:43:37 setProviderName(org.eclipse.papyrus.eclipse.project.editors.tests.FeatureProjectEditorTest)  Time elapsed: 0.067 s
01:43:37 testDiagramContentDoesNotLeak(org.eclipse.papyrus.editor.integration.tests.tests.EditorMemoryLeakTest)  Time elapsed: 15.447 s
01:43:37 testValidatedProfiledModelContentDoesNotLeak_noEGenericTypes(org.eclipse.papyrus.editor.integration.tests.tests.EditorMemoryLeakTest)  Time elapsed: 62.108 s  <<< FAILURE!
01:43:37 java.lang.AssertionError: 
01:43:37 One or more objects leaked:
01:43:37 <Profile> j2ee
01:43:37 
01:43:37 testCleanUpListenersOnItemProviders(org.eclipse.papyrus.editor.integration.tests.tests.EditorMemoryLeakTest)  Time elapsed: 4.021 s
01:43:37 testProfileContentDoesNotLeak_noEGenericTypes(org.eclipse.papyrus.editor.integration.tests.tests.EditorMemoryLeakTest)  Time elapsed: 5.249 s
01:43:37 testModelSetDoesNotLeak(org.eclipse.papyrus.editor.integration.tests.tests.EditorMemoryLeakTest)  Time elapsed: 3.724 s
01:43:37 testValidatedProfiledModelContentDoesNotLeak(org.eclipse.papyrus.editor.integration.tests.tests.EditorMemoryLeakTest)  Time elapsed: 28.993 s  <<< FAILURE!
01:43:37 java.lang.AssertionError: 
01:43:37 One or more objects leaked:
01:43:37 <Profile> j2ee
01:43:37 
01:43:37 testProfileContentDoesNotLeak(org.eclipse.papyrus.editor.integration.tests.tests.EditorMemoryLeakTest)  Time elapsed: 4.054 s
01:43:37 testPropertySheetContentDoesNotLeak(org.eclipse.papyrus.editor.integration.tests.tests.EditorMemoryLeakTest)  Time elapsed: 3.375 s
01:43:37 testModelExplorerContentDoesNotLeak(org.eclipse.papyrus.editor.integration.tests.tests.EditorMemoryLeakTest)  Time elapsed: 3.319 s
01:43:37 testCreateNewElement(org.eclipse.papyrus.editor.integration.tests.tests.EditingScenariosMemoryLeakTest)  Time elapsed: 6.275 s
01:43:37 testCreateNewElement_table(org.eclipse.papyrus.editor.integration.tests.tests.EditingScenariosMemoryLeakTest)  Time elapsed: 8.824 s
01:43:37 testCanonicalEditPolicy_bug433206(org.eclipse.papyrus.editor.integration.tests.tests.EditingScenariosMemoryLeakTest)  Time elapsed: 8.069 s
01:43:37 testOpenModel(org.eclipse.papyrus.editor.integration.tests.tests.PageManagerTests)  Time elapsed: 0.9 s
01:43:37 testDiagramCreation(org.eclipse.papyrus.editor.integration.tests.tests.PageManagerTests)  Time elapsed: 0.913 s
01:43:37 testAvailableAndActivePageWithNatTable(org.eclipse.papyrus.editor.integration.tests.tests.PageManagerTests) skipped
01:43:37 testDiagramIndirectDeletion_bug433371(org.eclipse.papyrus.editor.integration.tests.tests.PageManagerTests)  Time elapsed: 3.348 s
01:43:37 testAvailableAndActivePage(org.eclipse.papyrus.editor.integration.tests.tests.PageManagerTests)  Time elapsed: 0.731 s
01:43:37 testModelWithDiagramCreation(org.eclipse.papyrus.editor.integration.tests.tests.PageManagerTests)  Time elapsed: 0.751 s
01:43:37 testContainedDiagramDeletion(org.eclipse.papyrus.editor.integration.tests.tests.PageManagerTests)  Time elapsed: 0.568 s
01:43:37 testMultipageEditor(org.eclipse.papyrus.editor.integration.tests.tests.PageManagerTests)  Time elapsed: 1.002 s
01:43:37 testNatTableDeletion(org.eclipse.papyrus.editor.integration.tests.tests.PageManagerTests) skipped
01:43:37 testOpenEmptyModel(org.eclipse.papyrus.editor.integration.tests.tests.PageManagerTests)  Time elapsed: 0.518 s
01:43:37 testEmptyModelCreation(org.eclipse.papyrus.editor.integration.tests.tests.PageManagerTests)  Time elapsed: 0.512 s
01:43:37 testContainedNatTableDeletion(org.eclipse.papyrus.editor.integration.tests.tests.PageManagerTests)  Time elapsed: 1.519 s
01:43:37 testContainedTableDeletion(org.eclipse.papyrus.editor.integration.tests.tests.PageManagerTests) skipped
01:43:37 testDiagramDeletion(org.eclipse.papyrus.editor.integration.tests.tests.PageManagerTests)  Time elapsed: 1.227 s
01:43:37 testTableCreation(org.eclipse.papyrus.editor.integration.tests.tests.PageManagerTests)  Time elapsed: 0.456 s
01:43:37 testUnavailablePageRecovery(org.eclipse.papyrus.editor.integration.tests.tests.RecoveryTest) skipped
01:43:37 testEmptyDiModel(org.eclipse.papyrus.editor.integration.tests.tests.RecoveryTest) skipped
01:43:37 testInvalidAvailablePage(org.eclipse.papyrus.editor.integration.tests.tests.RecoveryTest)  Time elapsed: 0.793 s
01:43:37 testCompleteCase(org.eclipse.papyrus.editor.integration.tests.tests.RecoveryTest)  Time elapsed: 1.036 s
01:43:37 testProxyDiagram(org.eclipse.papyrus.editor.integration.tests.tests.RecoveryTest)  Time elapsed: 0.525 s
01:43:37 testDeleteDiagramWithInvalidAvailablePage(org.eclipse.papyrus.editor.integration.tests.tests.RecoveryTest)  Time elapsed: 0.864 s
01:43:37 testProxyTable(org.eclipse.papyrus.editor.integration.tests.tests.RecoveryTest) skipped
01:43:37 testInvalidTab(org.eclipse.papyrus.editor.integration.tests.tests.RecoveryTest)  Time elapsed: 0.766 s
01:43:37 testOpenModelWithSpecialChars(org.eclipse.papyrus.editor.integration.tests.tests.ModelSetTests)  Time elapsed: 0.881 s
01:43:37 testCreateModelWithSpecialChars(org.eclipse.papyrus.editor.integration.tests.tests.ModelSetTests)  Time elapsed: 0.696 s
01:43:37 testSashFoldersRestored(org.eclipse.papyrus.editor.integration.tests.tests.EditorReloadTest)  Time elapsed: 8.303 s
01:43:37 testPropertySheetRestoredShowingCorrectInput(org.eclipse.papyrus.editor.integration.tests.tests.EditorReloadTest)  Time elapsed: 7.039 s
01:43:37 testPerspectiveLayoutUnperturbed(org.eclipse.papyrus.editor.integration.tests.tests.EditorReloadTest)  Time elapsed: 7.257 s
01:43:37 testEditPartSelectionRestored(org.eclipse.papyrus.editor.integration.tests.tests.EditorReloadTest)  Time elapsed: 8.045 s
01:43:37 testActiveEditorRestoredSaveAll(org.eclipse.papyrus.editor.integration.tests.tests.EditorReloadTest)  Time elapsed: 7.369 s
01:43:37 testModelExplorerExpansionRestored(org.eclipse.papyrus.editor.integration.tests.tests.EditorReloadTest)  Time elapsed: 6.125 s
01:43:37 testPaletteStateRestored_paletteView(org.eclipse.papyrus.editor.integration.tests.tests.EditorReloadTest)  Time elapsed: 8.429 s
01:43:37 testReloadIsDeferred(org.eclipse.papyrus.editor.integration.tests.tests.EditorReloadTest)  Time elapsed: 5.514 s
01:43:37 testPaletteStateRestored(org.eclipse.papyrus.editor.integration.tests.tests.EditorReloadTest)  Time elapsed: 9.226 s
01:43:37 testModelExplorerReferencedLibrariesRestored(org.eclipse.papyrus.editor.integration.tests.tests.EditorReloadTest)  Time elapsed: 4.652 s
01:43:37 testActiveDiagramRestored(org.eclipse.papyrus.editor.integration.tests.tests.EditorReloadTest)  Time elapsed: 7.413 s
01:43:37 testModelExplorerSelectionRestored(org.eclipse.papyrus.editor.integration.tests.tests.EditorReloadTest)  Time elapsed: 4.389 s
01:43:37 
01:43:37 Results:
01:43:37 
01:43:37 Failures: 
01:43:37   EditorMemoryLeakTest.testValidatedProfiledModelContentDoesNotLeak One or more objects leaked:
01:43:37 <Profile> j2ee
01:43:37   EditorMemoryLeakTest.testValidatedProfiledModelContentDoesNotLeak_noEGenericTypes One or more objects leaked:
01:43:37 <Profile> j2ee
01:43:37 
01:43:37 Tests run: 204, Failures: 2, Errors: 0, Skipped: 6
01:43:37 
01:43:39 [ERROR] There are test failures.
01:43:39 
01:43:39 Please refer to /jobs/genie.papyrus/Papyrus-Master-Tests-Release/workspace/source/tests/junit/plugins/editor/org.eclipse.papyrus.editors.suite.tests/target/surefire-reports for the individual test results.
01:43:39 [INFO] 
01:43:39 [INFO] --- jacoco-maven-plugin:0.8.2:report (default-report) @ org.eclipse.papyrus.editors.suite.tests ---
01:43:39 [INFO] Loading execution data file /jobs/genie.papyrus/Papyrus-Master-Tests-Release/workspace/source/tests/junit/plugins/editor/org.eclipse.papyrus.editors.suite.tests/target/jacoco.exec
01:43:39 [INFO] Analyzed bundle 'org.eclipse.papyrus.editors.suite.tests' with 0 classes
01:43:39 [INFO] 
01:43:39 [INFO] --< org.eclipse.papyrus.tests:org.eclipse.papyrus.infra.core.suite.tests >--
01:43:39 [INFO] Building org.eclipse.papyrus.infra.core.suite.tests 0.0.1-SNAPSHOT [136/166]
01:43:39 [INFO] ------------------------[ eclipse-test-plugin ]-------------------------
01:43:39 [INFO] 
01:43:39 [INFO] --- maven-clean-plugin:3.1.0:clean (default-clean) @ org.eclipse.papyrus.infra.core.suite.tests ---
01:43:39 [INFO] 
01:43:39 [INFO] --- tycho-packaging-plugin:1.3.0:build-qualifier (default-build-qualifier) @ org.eclipse.papyrus.infra.core.suite.tests ---
01:43:39 [INFO] The project's OSGi version is 0.0.1.201909270520
01:43:39 [INFO] 
01:43:39 [INFO] --- tycho-packaging-plugin:1.3.0:validate-id (default-validate-id) @ org.eclipse.papyrus.infra.core.suite.tests ---
01:43:39 [INFO] 
01:43:39 [INFO] --- tycho-packaging-plugin:1.3.0:validate-version (default-validate-version) @ org.eclipse.papyrus.infra.core.suite.tests ---
01:43:39 [INFO] 
01:43:39 [INFO] --- jacoco-maven-plugin:0.8.2:prepare-agent (default-prepare-agent) @ org.eclipse.papyrus.infra.core.suite.tests ---
01:43:39 [INFO] tycho.testArgLine set to -javaagent:/home/hudson/genie.papyrus/.jenkins/jobs/Papyrus-Master-Tests-Release/workspace/.repository/org/jacoco/org.jacoco.agent/0.8.2/org.jacoco.agent-0.8.2-runtime.jar=destfile=/jobs/genie.papyrus/Papyrus-Master-Tests-Release/workspace/source/tests/junit/plugins/infra/core/org.eclipse.papyrus.infra.core.suite.tests/target/jacoco.exec,includes=org.eclipse.papyrus.*,excludes=org.eclipse.uml2
01:43:39 [INFO] 
01:43:39 [INFO] --- maven-resources-plugin:3.1.0:resources (default-resources) @ org.eclipse.papyrus.infra.core.suite.tests ---
01:43:39 [INFO] Using 'UTF-8' encoding to copy filtered resources.
01:43:39 [INFO] skip non existing resourceDirectory /jobs/genie.papyrus/Papyrus-Master-Tests-Release/workspace/source/tests/junit/plugins/infra/core/org.eclipse.papyrus.infra.core.suite.tests/src/main/resources
01:43:39 [INFO] 
01:43:39 [INFO] --- tycho-compiler-plugin:1.3.0:compile (default-compile) @ org.eclipse.papyrus.infra.core.suite.tests ---
01:43:39 [INFO] Compiling 2 source files to /jobs/genie.papyrus/Papyrus-Master-Tests-Release/workspace/source/tests/junit/plugins/infra/core/org.eclipse.papyrus.infra.core.suite.tests/bin
01:43:40 [INFO] 
01:43:40 [INFO] --- maven-resources-plugin:3.1.0:testResources (default-testResources) @ org.eclipse.papyrus.infra.core.suite.tests ---
01:43:40 [INFO] Using 'UTF-8' encoding to copy filtered resources.
01:43:40 [INFO] skip non existing resourceDirectory /jobs/genie.papyrus/Papyrus-Master-Tests-Release/workspace/source/tests/junit/plugins/infra/core/org.eclipse.papyrus.infra.core.suite.tests/src/test/resources
01:43:40 [INFO] 
01:43:40 [INFO] --- target-platform-configuration:1.3.0:target-platform (default-target-platform) @ org.eclipse.papyrus.infra.core.suite.tests ---
01:43:40 [INFO] 
01:43:40 [INFO] --- tycho-packaging-plugin:1.3.0:package-plugin (default-package-plugin) @ org.eclipse.papyrus.infra.core.suite.tests ---
01:43:40 [INFO] Building jar: /jobs/genie.papyrus/Papyrus-Master-Tests-Release/workspace/source/tests/junit/plugins/infra/core/org.eclipse.papyrus.infra.core.suite.tests/target/org.eclipse.papyrus.infra.core.suite.tests-0.0.1-SNAPSHOT.jar
01:43:40 [INFO] 
01:43:40 [INFO] --- tycho-p2-plugin:1.3.0:p2-metadata-default (default-p2-metadata-default) @ org.eclipse.papyrus.infra.core.suite.tests ---
01:43:40 [INFO] 
01:43:40 [INFO] --- tycho-surefire-plugin:1.3.0:test (default-test) @ org.eclipse.papyrus.infra.core.suite.tests ---
01:43:48 [INFO] Expected eclipse log file: /jobs/genie.papyrus/Papyrus-Master-Tests-Release/workspace/source/tests/junit/plugins/infra/core/org.eclipse.papyrus.infra.core.suite.tests/target/work/data/.metadata/.log
01:43:48 [INFO] Command line:
01:43:48 	[/opt/public/common/java/oracle/jdk1.8.0_192_x64/jre/bin/java, -Dosgi.noShutdown=false, -Dosgi.os=linux, -Dosgi.ws=gtk, -Dosgi.arch=x86_64, -javaagent:/home/hudson/genie.papyrus/.jenkins/jobs/Papyrus-Master-Tests-Release/workspace/.repository/org/jacoco/org.jacoco.agent/0.8.2/org.jacoco.agent-0.8.2-runtime.jar=destfile=/jobs/genie.papyrus/Papyrus-Master-Tests-Release/workspace/source/tests/junit/plugins/infra/core/org.eclipse.papyrus.infra.core.suite.tests/target/jacoco.exec,includes=org.eclipse.papyrus.*,excludes=org.eclipse.uml2, -Xms512m, -Xmx2048m, -XX:SoftRefLRUPolicyMSPerMB=100, -Dosgi.clean=true, -jar, /jobs/genie.papyrus/Papyrus-Master-Tests-Release/workspace/.repository/p2/osgi/bundle/org.eclipse.equinox.launcher/1.5.500.v20190715-1310/org.eclipse.equinox.launcher-1.5.500.v20190715-1310.jar, -data, /jobs/genie.papyrus/Papyrus-Master-Tests-Release/workspace/source/tests/junit/plugins/infra/core/org.eclipse.papyrus.infra.core.suite.tests/target/work/data, -install, /jobs/genie.papyrus/Papyrus-Master-Tests-Release/workspace/source/tests/junit/plugins/infra/core/org.eclipse.papyrus.infra.core.suite.tests/target/work, -configuration, /jobs/genie.papyrus/Papyrus-Master-Tests-Release/workspace/source/tests/junit/plugins/infra/core/org.eclipse.papyrus.infra.core.suite.tests/target/work/configuration, -application, org.eclipse.tycho.surefire.osgibooter.uitest, -testproperties, /jobs/genie.papyrus/Papyrus-Master-Tests-Release/workspace/source/tests/junit/plugins/infra/core/org.eclipse.papyrus.infra.core.suite.tests/target/surefire.properties, -product, org.eclipse.sdk.ide, -testConfig=CI_TESTS_CONFIG]
01:43:48 Picked up JAVA_TOOL_OPTIONS: -Xmx2G -Djava.io.tmpdir=/tmp/genie.papyrus -DforkCount=1
01:43:57 Running org.eclipse.papyrus.infra.core.suite.tests.AllTests
01:44:00 org.eclipse.papyrus.infra.core.resource.ModelMultiException: Problems encountered while loading one of the models.
01:44:00 ----- exceptions : ----------
01:44:00 org.eclipse.papyrus.infra.core.resource.uml.UmlModel : org.eclipse.core.internal.resources.ResourceException: Resource '/LanguageServiceTest/My.uml' does not exist.
01:44:00 ----------------------------- 
01:44:00 
01:44:00 	at org.eclipse.papyrus.infra.core.resource.ModelSet.loadModels(ModelSet.java:589)
01:44:00 	at org.eclipse.papyrus.junit.utils.rules.AbstractModelFixture.initModelResources(AbstractModelFixture.java:298)
01:44:00 	at org.eclipse.papyrus.junit.utils.rules.AbstractModelFixture.starting(AbstractModelFixture.java:253)
01:44:00 	at org.junit.rules.TestWatcher.startingQuietly(TestWatcher.java:108)
01:44:00 	at org.junit.rules.TestWatcher.access$000(TestWatcher.java:46)
01:44:00 	at org.junit.rules.TestWatcher$1.evaluate(TestWatcher.java:53)
01:44:00 	at org.eclipse.papyrus.junit.utils.rules.ProjectFixture$1.evaluate(ProjectFixture.java:238)
01:44:00 	at org.junit.rules.RunRules.evaluate(RunRules.java:20)
01:44:00 	at org.junit.runners.ParentRunner.run(ParentRunner.java:363)
01:44:00 	at org.junit.runners.Suite.runChild(Suite.java:128)
01:44:00 	at org.junit.runners.Suite.runChild(Suite.java:27)
01:44:00 	at org.junit.runners.ParentRunner$3.run(ParentRunner.java:290)
01:44:00 	at org.junit.runners.ParentRunner$1.schedule(ParentRunner.java:71)
01:44:00 	at org.junit.runners.ParentRunner.runChildren(ParentRunner.java:288)
01:44:00 	at org.junit.runners.ParentRunner.access$000(ParentRunner.java:58)
01:44:00 	at org.junit.runners.ParentRunner$2.evaluate(ParentRunner.java:268)
01:44:00 	at org.junit.runners.ParentRunner.run(ParentRunner.java:363)
01:44:00 	at org.eclipse.papyrus.junit.framework.classification.ClassificationSuite.run(ClassificationSuite.java:130)
01:44:00 	at org.junit.runners.Suite.runChild(Suite.java:128)
01:44:00 	at org.junit.runners.Suite.runChild(Suite.java:27)
01:44:00 	at org.junit.runners.ParentRunner$3.run(ParentRunner.java:290)
01:44:00 	at org.junit.runners.ParentRunner$1.schedule(ParentRunner.java:71)
01:44:00 	at org.junit.runners.ParentRunner.runChildren(ParentRunner.java:288)
01:44:00 	at org.junit.runners.ParentRunner.access$000(ParentRunner.java:58)
01:44:00 	at org.junit.runners.ParentRunner$2.evaluate(ParentRunner.java:268)
01:44:00 	at org.junit.runners.ParentRunner.run(ParentRunner.java:363)
01:44:00 	at org.apache.maven.surefire.junit4.JUnit4Provider.execute(JUnit4Provider.java:365)
01:44:00 	at org.apache.maven.surefire.junit4.JUnit4Provider.executeWithRerun(JUnit4Provider.java:273)
01:44:00 	at org.apache.maven.surefire.junit4.JUnit4Provider.executeTestSet(JUnit4Provider.java:238)
01:44:00 	at org.apache.maven.surefire.junit4.JUnit4Provider.invoke(JUnit4Provider.java:159)
01:44:00 	at sun.reflect.NativeMethodAccessorImpl.invoke0(Native Method)
01:44:00 	at sun.reflect.NativeMethodAccessorImpl.invoke(NativeMethodAccessorImpl.java:62)
01:44:00 	at sun.reflect.DelegatingMethodAccessorImpl.invoke(DelegatingMethodAccessorImpl.java:43)
01:44:00 	at java.lang.reflect.Method.invoke(Method.java:498)
01:44:00 	at org.apache.maven.surefire.util.ReflectionUtils.invokeMethodWithArray2(ReflectionUtils.java:206)
01:44:00 	at org.apache.maven.surefire.booter.ProviderFactory$ProviderProxy.invoke(ProviderFactory.java:161)
01:44:00 	at org.apache.maven.surefire.booter.ProviderFactory.invokeProvider(ProviderFactory.java:84)
01:44:00 	at org.eclipse.tycho.surefire.osgibooter.OsgiSurefireBooter.run(OsgiSurefireBooter.java:110)
01:44:00 	at org.eclipse.tycho.surefire.osgibooter.AbstractUITestApplication$1.run(AbstractUITestApplication.java:35)
01:44:00 	at org.eclipse.swt.widgets.RunnableLock.run(RunnableLock.java:40)
01:44:00 	at org.eclipse.swt.widgets.Synchronizer.runAsyncMessages(Synchronizer.java:185)
01:44:00 	at org.eclipse.swt.widgets.Display.runAsyncMessages(Display.java:4857)
01:44:00 	at org.eclipse.swt.widgets.Display.readAndDispatch(Display.java:4409)
01:44:00 	at org.eclipse.e4.ui.internal.workbench.swt.PartRenderingEngine$5.run(PartRenderingEngine.java:1160)
01:44:00 	at org.eclipse.core.databinding.observable.Realm.runWithDefault(Realm.java:338)
01:44:00 	at org.eclipse.e4.ui.internal.workbench.swt.PartRenderingEngine.run(PartRenderingEngine.java:1049)
01:44:00 	at org.eclipse.e4.ui.internal.workbench.E4Workbench.createAndRunUI(E4Workbench.java:155)
01:44:00 	at org.eclipse.ui.internal.Workbench.lambda$3(Workbench.java:633)
01:44:00 	at org.eclipse.core.databinding.observable.Realm.runWithDefault(Realm.java:338)
01:44:00 	at org.eclipse.ui.internal.Workbench.createAndRunWorkbench(Workbench.java:557)
01:44:00 	at org.eclipse.ui.PlatformUI.createAndRunWorkbench(PlatformUI.java:150)
01:44:00 	at org.eclipse.ui.internal.ide.application.IDEApplication.start(IDEApplication.java:150)
01:44:00 	at org.eclipse.tycho.surefire.osgibooter.UITestApplication.runApplication(UITestApplication.java:31)
01:44:00 	at org.eclipse.tycho.surefire.osgibooter.AbstractUITestApplication.run(AbstractUITestApplication.java:120)
01:44:00 	at org.eclipse.tycho.surefire.osgibooter.UITestApplication.start(UITestApplication.java:37)
01:44:00 	at org.eclipse.equinox.internal.app.EclipseAppHandle.run(EclipseAppHandle.java:203)
01:44:00 	at org.eclipse.core.runtime.internal.adaptor.EclipseAppLauncher.runApplication(EclipseAppLauncher.java:137)
01:44:00 	at org.eclipse.core.runtime.internal.adaptor.EclipseAppLauncher.start(EclipseAppLauncher.java:107)
01:44:00 	at org.eclipse.core.runtime.adaptor.EclipseStarter.run(EclipseStarter.java:400)
01:44:00 	at org.eclipse.core.runtime.adaptor.EclipseStarter.run(EclipseStarter.java:255)
01:44:00 	at sun.reflect.NativeMethodAccessorImpl.invoke0(Native Method)
01:44:00 	at sun.reflect.NativeMethodAccessorImpl.invoke(NativeMethodAccessorImpl.java:62)
01:44:00 	at sun.reflect.DelegatingMethodAccessorImpl.invoke(DelegatingMethodAccessorImpl.java:43)
01:44:00 	at java.lang.reflect.Method.invoke(Method.java:498)
01:44:00 	at org.eclipse.equinox.launcher.Main.invokeFramework(Main.java:660)
01:44:00 	at org.eclipse.equinox.launcher.Main.basicRun(Main.java:597)
01:44:00 	at org.eclipse.equinox.launcher.Main.run(Main.java:1468)
01:44:00 	at org.eclipse.equinox.launcher.Main.main(Main.java:1441)
01:44:00 Caused by: org.eclipse.emf.ecore.resource.impl.ResourceSetImpl$1DiagnosticWrappedException: org.eclipse.core.internal.resources.ResourceException: Resource '/LanguageServiceTest/My.uml' does not exist.
01:44:00 	at org.eclipse.emf.ecore.resource.impl.ResourceSetImpl.handleDemandLoadException(ResourceSetImpl.java:319)
01:44:00 	at org.eclipse.papyrus.infra.core.resource.ModelSet.handleDemandLoadException(ModelSet.java:240)
01:44:00 	at org.eclipse.emf.ecore.resource.impl.ResourceSetImpl.demandLoadHelper(ResourceSetImpl.java:278)
01:44:00 	at org.eclipse.emf.ecore.resource.impl.ResourceSetImpl.getResource(ResourceSetImpl.java:406)
01:44:00 	at org.eclipse.papyrus.infra.core.resource.ModelSet.getResource(ModelSet.java:220)
01:44:00 	at org.eclipse.emf.ecore.resource.impl.ResourceSetImpl$ResourceLocator.basicGetResource(ResourceSetImpl.java:751)
01:44:00 	at org.eclipse.papyrus.infra.editor.welcome.internal.WelcomeModelManager$WelcomeLocator.getResource(WelcomeModelManager.java:233)
01:44:00 	at org.eclipse.emf.ecore.resource.impl.ResourceSetImpl.getResource(ResourceSetImpl.java:352)
01:44:00 	at org.eclipse.papyrus.infra.core.resource.ModelSet.getResource(ModelSet.java:220)
01:44:00 	at org.eclipse.papyrus.infra.core.resource.AbstractBaseModel.loadModel(AbstractBaseModel.java:189)
01:44:00 	at org.eclipse.papyrus.infra.core.resource.ModelSet.loadModels(ModelSet.java:584)
01:44:00 	... 67 more
01:44:00 Caused by: org.eclipse.core.internal.resources.ResourceException: Resource '/LanguageServiceTest/My.uml' does not exist.
01:44:00 	at org.eclipse.core.internal.resources.Resource.checkExists(Resource.java:330)
01:44:00 	at org.eclipse.core.internal.resources.Resource.checkAccessible(Resource.java:204)
01:44:00 	at org.eclipse.core.internal.resources.File.getContents(File.java:278)
01:44:00 	at org.eclipse.core.internal.resources.File.getContents(File.java:271)
01:44:00 	at org.eclipse.emf.ecore.resource.impl.PlatformResourceURIHandlerImpl$WorkbenchHelper.createPlatformResourceInputStream(PlatformResourceURIHandlerImpl.java:207)
01:44:00 	at org.eclipse.emf.ecore.resource.impl.PlatformResourceURIHandlerImpl.createInputStream(PlatformResourceURIHandlerImpl.java:525)
01:44:00 	at org.eclipse.emf.ecore.resource.impl.ExtensibleURIConverterImpl.createInputStream(ExtensibleURIConverterImpl.java:360)
01:44:00 	at org.eclipse.emf.ecore.resource.impl.ResourceImpl.load(ResourceImpl.java:1314)
01:44:00 	at org.eclipse.emf.ecore.resource.impl.ResourceSetImpl.demandLoad(ResourceSetImpl.java:259)
01:44:00 	at org.eclipse.papyrus.infra.core.resource.ModelSet.demandLoad(ModelSet.java:380)
01:44:00 	at org.eclipse.emf.ecore.resource.impl.ResourceSetImpl.demandLoadHelper(ResourceSetImpl.java:274)
01:44:00 	... 75 more
01:44:00 Caused by: java.lang.Exception: Resource '/LanguageServiceTest/My.uml' does not exist.
01:44:00 	at org.eclipse.core.internal.resources.ResourceException.provideStackTrace(ResourceException.java:42)
01:44:00 	at org.eclipse.core.internal.resources.ResourceException.<init>(ResourceException.java:38)
01:44:00 	... 86 more
01:44:23 
01:44:23 Test privileged runnable.. Done.
01:44:23 
01:44:23 Test privileged callable.. Done.
01:44:31 Tests run: 206, Failures: 0, Errors: 0, Skipped: 10, Time elapsed: 33.623 s - in org.eclipse.papyrus.infra.core.suite.tests.AllTests
01:44:31 testGetModel(org.eclipse.papyrus.infra.core.resource.ModelSetTest)  Time elapsed: 0.035 s
01:44:31 testSave(org.eclipse.papyrus.infra.core.resource.ModelSetTest)  Time elapsed: 0.659 s
01:44:31 testLoadModels(org.eclipse.papyrus.infra.core.resource.ModelSetTest)  Time elapsed: 0.02 s
01:44:31 testGetTransactionalEditingDomain(org.eclipse.papyrus.infra.core.resource.ModelSetTest)  Time elapsed: 0.001 s
01:44:31 testCreateResource(org.eclipse.papyrus.infra.core.resource.ModelSetTest)  Time elapsed: 0.017 s
01:44:31 testImportAfterCreate(org.eclipse.papyrus.infra.core.resource.ModelSetTest)  Time elapsed: 0.082 s
01:44:31 testCreatesModels(org.eclipse.papyrus.infra.core.resource.ModelSetTest)  Time elapsed: 0.001 s
01:44:31 testSnippetCalledAfterLoadModels(org.eclipse.papyrus.infra.core.resource.ModelSetTest)  Time elapsed: 0.002 s
01:44:31 testSnippetCalledAfterCreateModels(org.eclipse.papyrus.infra.core.resource.ModelSetTest)  Time elapsed: 0.001 s
01:44:31 testRegisterModel(org.eclipse.papyrus.infra.core.resource.ModelSetTest)  Time elapsed: 0 s
01:44:31 testStartLateSnippet_bug481149(org.eclipse.papyrus.infra.core.resource.ModelSetTest)  Time elapsed: 0.006 s
01:44:31 testAddModelSetSnippet(org.eclipse.papyrus.infra.core.resource.ModelSetTest)  Time elapsed: 0 s
01:44:31 testSaveAs(org.eclipse.papyrus.infra.core.resource.ModelSetTest)  Time elapsed: 0.019 s
01:44:31 testUnload(org.eclipse.papyrus.infra.core.resource.ModelSetTest)  Time elapsed: 0.001 s
01:44:31 testSave_onlyModifiedResources1(org.eclipse.papyrus.infra.core.resource.ModelSetTest)  Time elapsed: 0.209 s
01:44:31 testSave_onlyModifiedResources2(org.eclipse.papyrus.infra.core.resource.ModelSetTest)  Time elapsed: 0.292 s
01:44:31 testCreateModel(org.eclipse.papyrus.infra.core.resource.AbstractModelWithSharedResourceTest)  Time elapsed: 0.004 s
01:44:31 testAddModelRoot(org.eclipse.papyrus.infra.core.resource.AbstractModelWithSharedResourceTest)  Time elapsed: 0.007 s
01:44:31 testGetModelRoot(org.eclipse.papyrus.infra.core.resource.AbstractModelWithSharedResourceTest)  Time elapsed: 0.003 s
01:44:31 testGetModelRoots(org.eclipse.papyrus.infra.core.resource.AbstractModelWithSharedResourceTest)  Time elapsed: 0.005 s
01:44:31 testSaveModel(org.eclipse.papyrus.infra.core.resource.AbstractModelWithSharedResourceTest)  Time elapsed: 0.004 s
01:44:31 testLoadModelIPath(org.eclipse.papyrus.infra.core.resource.AbstractModelWithSharedResourceTest)  Time elapsed: 0.006 s
01:44:31 testCancelUnnestedCommand(org.eclipse.papyrus.infra.core.resource.NestingTransactionalCommandStackTest)  Time elapsed: 0.01 s
01:44:31 testCompleteNestedCommand(org.eclipse.papyrus.infra.core.resource.NestingTransactionalCommandStackTest)  Time elapsed: 0.005 s
01:44:31 testCancelTripleNestedCommand(org.eclipse.papyrus.infra.core.resource.NestingTransactionalCommandStackTest)  Time elapsed: 0.016 s
01:44:31 testCompleteTripleNestedCommand(org.eclipse.papyrus.infra.core.resource.NestingTransactionalCommandStackTest)  Time elapsed: 0.008 s
01:44:31 testCancelNestedCommand(org.eclipse.papyrus.infra.core.resource.NestingTransactionalCommandStackTest)  Time elapsed: 0.006 s
01:44:31 testCompleteUnnestedCommand(org.eclipse.papyrus.infra.core.resource.NestingTransactionalCommandStackTest)  Time elapsed: 0.004 s
01:44:31 testChangesInPreexistingResources_bug481151(org.eclipse.papyrus.infra.core.resource.ResourceAdapterTest)  Time elapsed: 0.005 s
01:44:31 testResourceLoaded(org.eclipse.papyrus.infra.core.resource.ResourceAdapterTest)  Time elapsed: 0.002 s
01:44:31 testResourceAdded(org.eclipse.papyrus.infra.core.resource.ResourceAdapterTest)  Time elapsed: 0.001 s
01:44:31 testUninstallResourceAdapter_bug482949(org.eclipse.papyrus.infra.core.resource.ResourceAdapterTest)  Time elapsed: 0 s
01:44:31 testRootAdded(org.eclipse.papyrus.infra.core.resource.ResourceAdapterTest)  Time elapsed: 0.002 s
01:44:31 testRootRemoved(org.eclipse.papyrus.infra.core.resource.ResourceAdapterTest)  Time elapsed: 0.002 s
01:44:31 testResourceURI(org.eclipse.papyrus.infra.core.resource.ResourceAdapterTest)  Time elapsed: 0.002 s
01:44:31 testResourceUnloaded(org.eclipse.papyrus.infra.core.resource.ResourceAdapterTest)  Time elapsed: 0.002 s
01:44:31 testResourceRemoved(org.eclipse.papyrus.infra.core.resource.ResourceAdapterTest)  Time elapsed: 0.001 s
01:44:31 testChangesInPreexistingResources_bug481151(org.eclipse.papyrus.infra.core.resource.ResourceAdapterTransactionalTest)  Time elapsed: 0.007 s
01:44:31 testResourceLoaded(org.eclipse.papyrus.infra.core.resource.ResourceAdapterTransactionalTest)  Time elapsed: 0.004 s
01:44:31 testResourceAdded(org.eclipse.papyrus.infra.core.resource.ResourceAdapterTransactionalTest)  Time elapsed: 0.001 s
01:44:31 testUninstallResourceAdapter_bug482949(org.eclipse.papyrus.infra.core.resource.ResourceAdapterTransactionalTest)  Time elapsed: 0.001 s
01:44:31 testRootAdded(org.eclipse.papyrus.infra.core.resource.ResourceAdapterTransactionalTest)  Time elapsed: 0.003 s
01:44:31 testRootRemoved(org.eclipse.papyrus.infra.core.resource.ResourceAdapterTransactionalTest)  Time elapsed: 0.003 s
01:44:31 testResourceURI(org.eclipse.papyrus.infra.core.resource.ResourceAdapterTransactionalTest)  Time elapsed: 0.004 s
01:44:31 testResourceUnloaded(org.eclipse.papyrus.infra.core.resource.ResourceAdapterTransactionalTest)  Time elapsed: 0.003 s
01:44:31 testResourceRemoved(org.eclipse.papyrus.infra.core.resource.ResourceAdapterTransactionalTest)  Time elapsed: 0.001 s
01:44:31 equals(org.eclipse.papyrus.infra.core.resource.PapyrusProjectScopeTest)  Time elapsed: 0 s
01:44:31 getLocation(org.eclipse.papyrus.infra.core.resource.PapyrusProjectScopeTest)  Time elapsed: 0 s
01:44:31 getName(org.eclipse.papyrus.infra.core.resource.PapyrusProjectScopeTest)  Time elapsed: 0.001 s
01:44:31 getNode(org.eclipse.papyrus.infra.core.resource.PapyrusProjectScopeTest)  Time elapsed: 0 s
01:44:31 hashCode_(org.eclipse.papyrus.infra.core.resource.PapyrusProjectScopeTest)  Time elapsed: 0 s
01:44:31 contentBasedLanguagesInNewModel(org.eclipse.papyrus.infra.core.language.LanguageServiceTest)  Time elapsed: 0.063 s
01:44:31 contentTypeBasedLanguages(org.eclipse.papyrus.infra.core.language.LanguageServiceTest)  Time elapsed: 0.001 s
01:44:31 contentTypeBasedLanguages_uriWithoutExtension(org.eclipse.papyrus.infra.core.language.LanguageServiceTest)  Time elapsed: 0.001 s
01:44:31 languageBindings(org.eclipse.papyrus.infra.core.language.LanguageServiceTest)  Time elapsed: 0.001 s
01:44:31 testPartAutomaticRegistration(org.eclipse.papyrus.infra.core.services.ComposedServiceTest)  Time elapsed: 0.006 s
01:44:31 testAddServicePart(org.eclipse.papyrus.infra.core.services.ComposedServiceTest)  Time elapsed: 0 s
01:44:31 testRemoveServicePart(org.eclipse.papyrus.infra.core.services.ComposedServiceTest)  Time elapsed: 0 s
01:44:31 testGetService(org.eclipse.papyrus.infra.core.services.ServicesRegistryTest)  Time elapsed: 0.001 s
01:44:31 testServiceFactoryWithClassKey(org.eclipse.papyrus.infra.core.services.ServicesRegistryTest)  Time elapsed: 0.003 s
01:44:31 testAdd(org.eclipse.papyrus.infra.core.services.ServicesRegistryTest)  Time elapsed: 0 s
01:44:31 testStartService(org.eclipse.papyrus.infra.core.services.ServicesRegistryTest)  Time elapsed: 0.001 s
01:44:31 testCallsOrderForDescriptors(org.eclipse.papyrus.infra.core.services.ServicesRegistryTest)  Time elapsed: 0.001 s
01:44:31 testStartDependantOrder(org.eclipse.papyrus.infra.core.services.ServicesRegistryTest)  Time elapsed: 0.001 s
01:44:31 testPriority(org.eclipse.papyrus.infra.core.services.ServicesRegistryTest)  Time elapsed: 0 s
01:44:31 testServiceFactoryCreation(org.eclipse.papyrus.infra.core.services.ServicesRegistryTest)  Time elapsed: 0.001 s
01:44:31 testGetServiceByClass(org.eclipse.papyrus.infra.core.services.ServicesRegistryTest)  Time elapsed: 0.001 s
01:44:31 testAddDirectInstance(org.eclipse.papyrus.infra.core.services.ServicesRegistryTest)  Time elapsed: 0 s
01:44:31 testServiceFactoryWithRequiredInInit(org.eclipse.papyrus.infra.core.services.ServicesRegistryTest)  Time elapsed: 0.002 s
01:44:31 testStartRegistryAndThenAddNewServiceAndStartIt(org.eclipse.papyrus.infra.core.services.ServicesRegistryTest)  Time elapsed: 0.001 s
01:44:31 testCallsOrder(org.eclipse.papyrus.infra.core.services.ServicesRegistryTest)  Time elapsed: 0 s
01:44:31 serviceStartedOnce(org.eclipse.papyrus.infra.core.services.SharedServiceFactoryTest)  Time elapsed: 0.013 s
01:44:31 uniqueServiceInstances(org.eclipse.papyrus.infra.core.services.SharedServiceFactoryTest)  Time elapsed: 0.002 s
01:44:31 servicesRecreated(org.eclipse.papyrus.infra.core.services.SharedServiceFactoryTest)  Time elapsed: 0.003 s
01:44:31 serviceDisposedOnce(org.eclipse.papyrus.infra.core.services.SharedServiceFactoryTest)  Time elapsed: 0.002 s
01:44:31 parallelAccess(org.eclipse.papyrus.infra.core.services.SharedServiceFactoryTest)  Time elapsed: 3.063 s
01:44:31 serviceNotInitialized(org.eclipse.papyrus.infra.core.services.SharedServiceFactoryTest)  Time elapsed: 0.002 s
01:44:31 testAdaptEMFOptionalPresent(org.eclipse.papyrus.infra.core.utils.AdapterUtilsTest)  Time elapsed: 0.005 s
01:44:31 testAdaptEMFOptionalNull(org.eclipse.papyrus.infra.core.utils.AdapterUtilsTest)  Time elapsed: 0 s
01:44:31 testAdaptAdaptableDefaultNull(org.eclipse.papyrus.infra.core.utils.AdapterUtilsTest)  Time elapsed: 0.001 s
01:44:31 testAdaptAdaptableOptionalNull(org.eclipse.papyrus.infra.core.utils.AdapterUtilsTest)  Time elapsed: 0 s
01:44:31 testAdaptInstanceDefaultPresent(org.eclipse.papyrus.infra.core.utils.AdapterUtilsTest)  Time elapsed: 0 s
01:44:31 testAdaptAdaptableOptionalPresent(org.eclipse.papyrus.infra.core.utils.AdapterUtilsTest)  Time elapsed: 0.001 s
01:44:31 testAdaptInstanceOptionalPresent(org.eclipse.papyrus.infra.core.utils.AdapterUtilsTest)  Time elapsed: 0 s
01:44:31 testAdaptEMFDefaultPresent(org.eclipse.papyrus.infra.core.utils.AdapterUtilsTest)  Time elapsed: 0 s
01:44:31 testAdaptAdaptableDefaultPresent(org.eclipse.papyrus.infra.core.utils.AdapterUtilsTest)  Time elapsed: 0 s
01:44:31 testAdaptInstanceOptionalNull(org.eclipse.papyrus.infra.core.utils.AdapterUtilsTest)  Time elapsed: 0 s
01:44:31 testAdaptAdaptableDefaultDefault(org.eclipse.papyrus.infra.core.utils.AdapterUtilsTest)  Time elapsed: 0 s
01:44:31 computeFails(org.eclipse.papyrus.infra.core.utils.JobBasedFutureTest)  Time elapsed: 3.01 s
01:44:31 cancel(org.eclipse.papyrus.infra.core.utils.JobBasedFutureTest)  Time elapsed: 0.001 s
01:44:31 timeOut(org.eclipse.papyrus.infra.core.utils.JobBasedFutureTest)  Time elapsed: 2.003 s
01:44:31 normalCompletion(org.eclipse.papyrus.infra.core.utils.JobBasedFutureTest)  Time elapsed: 3.002 s
01:44:31 listen_success(org.eclipse.papyrus.infra.core.utils.JobBasedFutureTest)  Time elapsed: 3.001 s
01:44:31 timeOutWithSchedulingRule(org.eclipse.papyrus.infra.core.utils.JobBasedFutureTest)  Time elapsed: 2.005 s
01:44:31 listen_failure(org.eclipse.papyrus.infra.core.utils.JobBasedFutureTest)  Time elapsed: 3.001 s
01:44:31 normalCompletionWithSchedulingRule(org.eclipse.papyrus.infra.core.utils.JobBasedFutureTest)  Time elapsed: 3.003 s
01:44:31 executeAndShutDown(org.eclipse.papyrus.infra.core.utils.JobExecutorServiceTest)  Time elapsed: 0.003 s
01:44:31 executeAndShutDownNow(org.eclipse.papyrus.infra.core.utils.JobExecutorServiceTest)  Time elapsed: 0.001 s
01:44:31 testPrivilegedProgressRunnable(org.eclipse.papyrus.infra.core.utils.TransactionHelperTest)  Time elapsed: 0.012 s
01:44:31 testDisposeTransactionExecutor(org.eclipse.papyrus.infra.core.utils.TransactionHelperTest)  Time elapsed: 0.003 s
01:44:31 testSimpleTransactionExecutor_readWrite(org.eclipse.papyrus.infra.core.utils.TransactionHelperTest)  Time elapsed: 0.006 s
01:44:31 testPrivilegedProgressCallable(org.eclipse.papyrus.infra.core.utils.TransactionHelperTest)  Time elapsed: 0.005 s
01:44:31 testSimpleTransactionExecutor_readOnly(org.eclipse.papyrus.infra.core.utils.TransactionHelperTest)  Time elapsed: 0.002 s
01:44:31 fillAWT_readAWT(org.eclipse.papyrus.infra.core.clipboard.tests.ClipboardTests)  Time elapsed: 0.13 s
01:44:31 fillAWT_readSWT(org.eclipse.papyrus.infra.core.clipboard.tests.ClipboardTests)  Time elapsed: 0.015 s
01:44:31 fillSWT_readAWT(org.eclipse.papyrus.infra.core.clipboard.tests.ClipboardTests) skipped
01:44:31 fillSWT_readSWT(org.eclipse.papyrus.infra.core.clipboard.tests.ClipboardTests)  Time elapsed: 0.002 s
01:44:31 defaultCopierFactory(org.eclipse.papyrus.infra.core.clipboard.tests.CopierFactoryTest)  Time elapsed: 0.02 s
01:44:31 oneOffCopierFactory(org.eclipse.papyrus.infra.core.clipboard.tests.CopierFactoryTest)  Time elapsed: 0.002 s
01:44:31 testCreateFolder(org.eclipse.papyrus.infra.core.sasheditor.contentprovider.simple.SimpleSashWindowsContentProviderTest)  Time elapsed: 0.007 s
01:44:31 testCreateFolder2(org.eclipse.papyrus.infra.core.sasheditor.contentprovider.simple.SimpleSashWindowsContentProviderTest)  Time elapsed: 0.008 s
01:44:31 testCreateFolder_ITabFolderModel_int(org.eclipse.papyrus.infra.core.sasheditor.contentprovider.simple.SimpleSashWindowsContentProviderTest)  Time elapsed: 0 s
01:44:31 testAddTabIPageModel(org.eclipse.papyrus.infra.core.sasheditor.contentprovider.simple.SimpleSashWindowsContentProviderTest)  Time elapsed: 0 s
01:44:31 testRefreshTabs(org.eclipse.papyrus.infra.core.sasheditor.editor.SashMultiPageEditorTest) skipped
01:44:31 org.eclipse.papyrus.infra.core.sasheditor.editor.SashMultiPageEditorTest skipped
01:44:31 org.eclipse.papyrus.infra.core.sasheditor.editor.AllTests skipped
01:44:31 testFirePageAboutToBeOpenedEvent(org.eclipse.papyrus.infra.core.sasheditor.internal.SashContainerEventsProviderTest)  Time elapsed: 0.002 s
01:44:31 testFirePageAboutToBeClosedEvent(org.eclipse.papyrus.infra.core.sasheditor.internal.SashContainerEventsProviderTest)  Time elapsed: 0 s
01:44:31 testFirePageActivatedEvent(org.eclipse.papyrus.infra.core.sasheditor.internal.SashContainerEventsProviderTest)  Time elapsed: 0 s
01:44:31 testRemoveActiveEditorChangedListener(org.eclipse.papyrus.infra.core.sasheditor.internal.SashContainerEventsProviderTest)  Time elapsed: 0 s
01:44:31 testFirePageDeactivatedEvent(org.eclipse.papyrus.infra.core.sasheditor.internal.SashContainerEventsProviderTest)  Time elapsed: 0 s
01:44:31 testFirePageOpenedEvent(org.eclipse.papyrus.infra.core.sasheditor.internal.SashContainerEventsProviderTest)  Time elapsed: 0 s
01:44:31 testFirePageClosedEvent(org.eclipse.papyrus.infra.core.sasheditor.internal.SashContainerEventsProviderTest)  Time elapsed: 0 s
01:44:31 testAddActiveEditorChangedListener(org.eclipse.papyrus.infra.core.sasheditor.internal.SashContainerEventsProviderTest)  Time elapsed: 0 s
01:44:31 testFirePageAboutToBeOpenedEvent(org.eclipse.papyrus.infra.core.sasheditor.internal.PageLifeCycleEventsThrownFromContainerTest)  Time elapsed: 0.148 s
01:44:31 testFirePageAboutToBeClosedEvent(org.eclipse.papyrus.infra.core.sasheditor.internal.PageLifeCycleEventsThrownFromContainerTest)  Time elapsed: 0 s
01:44:31 testFirePageActivatedEvent(org.eclipse.papyrus.infra.core.sasheditor.internal.PageLifeCycleEventsThrownFromContainerTest)  Time elapsed: 0.06 s
01:44:31 testRemoveActiveEditorChangedListener(org.eclipse.papyrus.infra.core.sasheditor.internal.PageLifeCycleEventsThrownFromContainerTest) skipped
01:44:31 testFirePageDeactivatedEvent(org.eclipse.papyrus.infra.core.sasheditor.internal.PageLifeCycleEventsThrownFromContainerTest)  Time elapsed: 0 s
01:44:31 testFirePageOpenedEvent(org.eclipse.papyrus.infra.core.sasheditor.internal.PageLifeCycleEventsThrownFromContainerTest)  Time elapsed: 0.029 s
01:44:31 testFirePageClosedEvent(org.eclipse.papyrus.infra.core.sasheditor.internal.PageLifeCycleEventsThrownFromContainerTest)  Time elapsed: 0.031 s
01:44:31 testPageClosedEventLifeCycle(org.eclipse.papyrus.infra.core.sasheditor.internal.PageLifeCycleEventsThrownFromContainerTest)  Time elapsed: 0.023 s
01:44:31 testPageClosedEventLifeCycleWhenLastPageOfFolder(org.eclipse.papyrus.infra.core.sasheditor.internal.PageLifeCycleEventsThrownFromContainerTest)  Time elapsed: 0.019 s
01:44:31 testAddActiveEditorChangedListener(org.eclipse.papyrus.infra.core.sasheditor.internal.PageLifeCycleEventsThrownFromContainerTest) skipped
01:44:31 testRefreshTabs(org.eclipse.papyrus.infra.core.sasheditor.internal.SashWindowsContainerTest)  Time elapsed: 0.024 s
01:44:31 testGetActiveEditor(org.eclipse.papyrus.infra.core.sasheditor.internal.SashWindowsContainerTest)  Time elapsed: 0.011 s
01:44:31 testlookupModelPage(org.eclipse.papyrus.infra.core.sasheditor.internal.SashWindowsContainerTest)  Time elapsed: 0.012 s
01:44:31 testFolderList(org.eclipse.papyrus.infra.core.sasheditor.internal.SashWindowsContainerTest)  Time elapsed: 0.026 s
01:44:31 testGetVisiblePages2(org.eclipse.papyrus.infra.core.sasheditor.internal.SashWindowsContainerTest)  Time elapsed: 0.019 s
01:44:31 testVisit(org.eclipse.papyrus.infra.core.sasheditor.internal.SashWindowsContainerTest)  Time elapsed: 0.012 s
01:44:31 testGetActiveEditor2(org.eclipse.papyrus.infra.core.sasheditor.internal.SashWindowsContainerTest)  Time elapsed: 0.016 s
01:44:31 testGetActiveEditorNoPage(org.eclipse.papyrus.infra.core.sasheditor.internal.SashWindowsContainerTest)  Time elapsed: 0.005 s
01:44:31 testFolderList2(org.eclipse.papyrus.infra.core.sasheditor.internal.SashWindowsContainerTest)  Time elapsed: 0.025 s
01:44:31 testSelectPagePageId(org.eclipse.papyrus.infra.core.sasheditor.internal.SashWindowsContainerTest) skipped
01:44:31 testRefreshTabs2(org.eclipse.papyrus.infra.core.sasheditor.internal.SashWindowsContainerTest)  Time elapsed: 0.012 s
01:44:31 testGetVisiblePages(org.eclipse.papyrus.infra.core.sasheditor.internal.SashWindowsContainerTest)  Time elapsed: 0.017 s
01:44:31 testSetFolderTabMenuManager_MenuManager(org.eclipse.papyrus.infra.core.sasheditor.internal.SashWindowsContainerTest)  Time elapsed: 0.023 s
01:44:31 testGetVisiblePagesOneFoler(org.eclipse.papyrus.infra.core.sasheditor.internal.SashWindowsContainerTest)  Time elapsed: 0.011 s
01:44:31 testSelectPage(org.eclipse.papyrus.infra.core.sasheditor.internal.SashWindowsContainerTest)  Time elapsed: 0.02 s
01:44:31 testDisposeCallOnNestedEditorRemoval(org.eclipse.papyrus.infra.core.sasheditor.internal.SashWindowsContainerDisposeCalledTest)  Time elapsed: 4.16 s
01:44:31 testCallingDisposeTwice(org.eclipse.papyrus.infra.core.sasheditor.internal.SashWindowsContainerDisposeCalledTest) skipped
01:44:31 testDisposeCallOnMainEditorClose(org.eclipse.papyrus.infra.core.sasheditor.internal.SashWindowsContainerDisposeCalledTest)  Time elapsed: 0.207 s
01:44:31 org.eclipse.papyrus.infra.core.sasheditor.internal.SashWindowsContainerMemoryLeakTest skipped
01:44:31 testActivePageHistoryWhenPageIsClosed(org.eclipse.papyrus.infra.core.sasheditor.internal.ActiveHistoryTrackerBehaviorTest)  Time elapsed: 0.043 s
01:44:31 testEquals(org.eclipse.papyrus.infra.core.sasheditor.tests.texteditor.FakeEditorInputTest)  Time elapsed: 0 s
01:44:31 testStartMultipleFakeEditorsOneByOne(org.eclipse.papyrus.infra.core.sasheditor.tests.texteditor.FakeMultiSashPageEditorTest)  Time elapsed: 0.375 s
01:44:31 testStartMultipleFakeEditors(org.eclipse.papyrus.infra.core.sasheditor.tests.texteditor.FakeMultiSashPageEditorTest)  Time elapsed: 0.452 s
01:44:31 testCloseEditor(org.eclipse.papyrus.infra.core.sasheditor.tests.texteditor.FakeMultiSashPageEditorTest)  Time elapsed: 0.101 s
01:44:31 testOpenEditor(org.eclipse.papyrus.infra.core.sasheditor.tests.texteditor.FakeMultiSashPageEditorTest)  Time elapsed: 0.09 s
01:44:31 testOpenEditor_contentProvider(org.eclipse.papyrus.infra.core.sasheditor.tests.texteditor.FakeMultiSashPageEditorTest)  Time elapsed: 0.167 s
01:44:31 testGetSashContainer(org.eclipse.papyrus.infra.core.sasheditor.tests.texteditor.FakeMultiSashPageEditorTest)  Time elapsed: 0.094 s
01:44:31 testOpenEditor_nestedEditorCount(org.eclipse.papyrus.infra.core.sasheditor.tests.texteditor.FakeMultiSashPageEditorTest)  Time elapsed: 0.218 s
01:44:31 testStartMultipleFakeEditorsOneByOneAndDispose(org.eclipse.papyrus.infra.core.sasheditor.tests.texteditor.FakeMultiSashPageEditorTest)  Time elapsed: 0.268 s
01:44:31 testGetISashWindowsContentProvider(org.eclipse.papyrus.infra.core.sasheditor.di.contentprovider.DiSashModelMngrTest)  Time elapsed: 0.01 s
01:44:31 testDiSashModelMngrIPageModelFactory(org.eclipse.papyrus.infra.core.sasheditor.di.contentprovider.DiSashModelMngrTest)  Time elapsed: 0.003 s
01:44:31 testDiSashModelMngrIPageModelFactoryDiSashModel(org.eclipse.papyrus.infra.core.sasheditor.di.contentprovider.DiSashModelMngrTest)  Time elapsed: 0 s
01:44:31 testGetIPageMngr(org.eclipse.papyrus.infra.core.sasheditor.di.contentprovider.DiSashModelMngrTest)  Time elapsed: 0.001 s
01:44:31 testDiSashModelMngrIPageModelFactoryResource(org.eclipse.papyrus.infra.core.sasheditor.di.contentprovider.DiSashModelMngrTest)  Time elapsed: 0.001 s
01:44:31 testSetCurrentFolder(org.eclipse.papyrus.infra.core.sasheditor.di.contentprovider.internal.DiContentProviderTest) skipped
01:44:31 testCreateFolder(org.eclipse.papyrus.infra.core.sasheditor.di.contentprovider.internal.DiContentProviderTest)  Time elapsed: 0.012 s
01:44:31 testGetRootModel(org.eclipse.papyrus.infra.core.sasheditor.di.contentprovider.internal.DiContentProviderTest)  Time elapsed: 0.001 s
01:44:31 testLifeCycle(org.eclipse.papyrus.infra.core.sasheditor.di.contentprovider.internal.DiContentProviderTest)  Time elapsed: 0 s
01:44:31 testCreateFolder(org.eclipse.papyrus.infra.core.sasheditor.di.contentprovider.internal.DiContentProvider2Test)  Time elapsed: 0.005 s
01:44:31 testCloseLastTabFromLastFolder(org.eclipse.papyrus.infra.core.sasheditor.di.contentprovider.internal.DiContentProvider2Test)  Time elapsed: 0 s
01:44:31 testMoveFolderInsideFolder(org.eclipse.papyrus.infra.core.sasheditor.di.contentprovider.internal.DiContentProvider2Test)  Time elapsed: 0.001 s
01:44:31 testMoveFolderAroundFolder(org.eclipse.papyrus.infra.core.sasheditor.di.contentprovider.internal.DiContentProvider2Test)  Time elapsed: 0.001 s
01:44:31 testCloseLastTab(org.eclipse.papyrus.infra.core.sasheditor.di.contentprovider.internal.DiContentProvider2Test)  Time elapsed: 0 s
01:44:31 testMoveFolderInsideFolderAtSpecifiedIndex(org.eclipse.papyrus.infra.core.sasheditor.di.contentprovider.internal.DiContentProvider2Test)  Time elapsed: 0.001 s
01:44:31 testModelIsWritable(org.eclipse.papyrus.infra.core.sasheditor.di.contentprovider.internal.DiContentProvider2Test)  Time elapsed: 0.001 s
01:44:31 testClosePage(org.eclipse.papyrus.infra.core.sasheditor.di.contentprovider.internal.DiContentProvider2Test)  Time elapsed: 0 s
01:44:31 testMovePageInsideFolder(org.eclipse.papyrus.infra.core.sasheditor.di.contentprovider.internal.DiContentProvider2Test)  Time elapsed: 0 s
01:44:31 testMovePageBetweenFolder(org.eclipse.papyrus.infra.core.sasheditor.di.contentprovider.internal.DiContentProvider2Test)  Time elapsed: 0.001 s
01:44:31 testUndoRedoMovePageInsideFolder(org.eclipse.papyrus.infra.core.sasheditor.di.contentprovider.internal.TransactionalDiContentProvider2Test)  Time elapsed: 0.008 s
01:44:31 testCreateFolder(org.eclipse.papyrus.infra.core.sasheditor.di.contentprovider.internal.TransactionalDiContentProvider2Test)  Time elapsed: 0.003 s
01:44:31 testCloseLastTabFromLastFolder(org.eclipse.papyrus.infra.core.sasheditor.di.contentprovider.internal.TransactionalDiContentProvider2Test)  Time elapsed: 0.001 s
01:44:31 testMoveFolderInsideFolder(org.eclipse.papyrus.infra.core.sasheditor.di.contentprovider.internal.TransactionalDiContentProvider2Test)  Time elapsed: 0.003 s
01:44:31 testMoveFolderAroundFolder(org.eclipse.papyrus.infra.core.sasheditor.di.contentprovider.internal.TransactionalDiContentProvider2Test)  Time elapsed: 0.002 s
01:44:31 testCloseLastTab(org.eclipse.papyrus.infra.core.sasheditor.di.contentprovider.internal.TransactionalDiContentProvider2Test)  Time elapsed: 0.001 s
01:44:31 testMoveFolderInsideFolderAtSpecifiedIndex(org.eclipse.papyrus.infra.core.sasheditor.di.contentprovider.internal.TransactionalDiContentProvider2Test)  Time elapsed: 0.002 s
01:44:31 testModelIsWritable(org.eclipse.papyrus.infra.core.sasheditor.di.contentprovider.internal.TransactionalDiContentProvider2Test)  Time elapsed: 0.002 s
01:44:31 testClosePage(org.eclipse.papyrus.infra.core.sasheditor.di.contentprovider.internal.TransactionalDiContentProvider2Test)  Time elapsed: 0.001 s
01:44:31 testMovePageInsideFolder(org.eclipse.papyrus.infra.core.sasheditor.di.contentprovider.internal.TransactionalDiContentProvider2Test)  Time elapsed: 0.001 s
01:44:31 testMovePageBetweenFolder(org.eclipse.papyrus.infra.core.sasheditor.di.contentprovider.internal.TransactionalDiContentProvider2Test)  Time elapsed: 0.002 s
01:44:31 testCloseAllOpenedPages(org.eclipse.papyrus.infra.core.sasheditor.di.contentprovider.internal.PageManagerImplTest)  Time elapsed: 0.014 s
01:44:31 testAllPages(org.eclipse.papyrus.infra.core.sasheditor.di.contentprovider.internal.PageManagerImplTest)  Time elapsed: 0 s
01:44:31 testAddPage(org.eclipse.papyrus.infra.core.sasheditor.di.contentprovider.internal.PageManagerImplTest)  Time elapsed: 0 s
01:44:31 testCloseLastPageOfTabFolder(org.eclipse.papyrus.infra.core.sasheditor.di.contentprovider.internal.PageManagerImplTest)  Time elapsed: 0.001 s
01:44:31 testClosePage(org.eclipse.papyrus.infra.core.sasheditor.di.contentprovider.internal.PageManagerImplTest)  Time elapsed: 0 s
01:44:31 testCloseOtherOpenedPages(org.eclipse.papyrus.infra.core.sasheditor.di.contentprovider.internal.PageManagerImplTest)  Time elapsed: 0.001 s
01:44:31 testOpenPage(org.eclipse.papyrus.infra.core.sasheditor.di.contentprovider.internal.PageManagerImplTest)  Time elapsed: 0.001 s
01:44:31 testRemovePage(org.eclipse.papyrus.infra.core.sasheditor.di.contentprovider.internal.PageManagerImplTest)  Time elapsed: 0 s
01:44:31 testQuery(org.eclipse.papyrus.infra.core.sasheditor.di.sashmodel.query.SashModelQueryTest)  Time elapsed: 0 s
01:44:31 testToString(org.eclipse.papyrus.infra.core.sasheditor.di.sashmodel.query.SashModelQueryTest)  Time elapsed: 0.001 s
01:44:31 testCreateModelFPP(org.eclipse.papyrus.infra.core.sasheditor.di.sashmodel.query.SashModelQueryTest)  Time elapsed: 0 s
01:44:31 testStaticCreates(org.eclipse.papyrus.infra.core.sasheditor.di.sashmodel.query.SashModelQueryTest)  Time elapsed: 0 s
01:44:31 testQueriesWithResult(org.eclipse.papyrus.infra.core.sasheditor.di.sashmodel.query.SashModelQueryTest)  Time elapsed: 0 s
01:44:31 
01:44:31 Results:
01:44:31 
01:44:31 Tests run: 206, Failures: 0, Errors: 0, Skipped: 10
01:44:31 
01:44:33 [INFO] All tests passed!
01:44:33 [INFO] 
01:44:33 [INFO] --- jacoco-maven-plugin:0.8.2:report (default-report) @ org.eclipse.papyrus.infra.core.suite.tests ---
01:44:33 [INFO] Loading execution data file /jobs/genie.papyrus/Papyrus-Master-Tests-Release/workspace/source/tests/junit/plugins/infra/core/org.eclipse.papyrus.infra.core.suite.tests/target/jacoco.exec
01:44:33 [INFO] Analyzed bundle 'org.eclipse.papyrus.infra.core.suite.tests' with 0 classes
01:44:33 [INFO] 
01:44:33 [INFO] --< org.eclipse.papyrus.tests:org.eclipse.papyrus.infra.nattable.suite.tests >--
01:44:33 [INFO] Building org.eclipse.papyrus.infra.nattable.suite.tests 0.0.1-SNAPSHOT [137/166]
01:44:33 [INFO] ------------------------[ eclipse-test-plugin ]-------------------------
01:44:33 [INFO] 
01:44:33 [INFO] --- maven-clean-plugin:3.1.0:clean (default-clean) @ org.eclipse.papyrus.infra.nattable.suite.tests ---
01:44:33 [INFO] 
01:44:33 [INFO] --- tycho-packaging-plugin:1.3.0:build-qualifier (default-build-qualifier) @ org.eclipse.papyrus.infra.nattable.suite.tests ---
01:44:33 [INFO] The project's OSGi version is 0.0.1.201909270520
01:44:33 [INFO] 
01:44:33 [INFO] --- tycho-packaging-plugin:1.3.0:validate-id (default-validate-id) @ org.eclipse.papyrus.infra.nattable.suite.tests ---
01:44:33 [INFO] 
01:44:33 [INFO] --- tycho-packaging-plugin:1.3.0:validate-version (default-validate-version) @ org.eclipse.papyrus.infra.nattable.suite.tests ---
01:44:33 [INFO] 
01:44:33 [INFO] --- jacoco-maven-plugin:0.8.2:prepare-agent (default-prepare-agent) @ org.eclipse.papyrus.infra.nattable.suite.tests ---
01:44:33 [INFO] tycho.testArgLine set to -javaagent:/home/hudson/genie.papyrus/.jenkins/jobs/Papyrus-Master-Tests-Release/workspace/.repository/org/jacoco/org.jacoco.agent/0.8.2/org.jacoco.agent-0.8.2-runtime.jar=destfile=/jobs/genie.papyrus/Papyrus-Master-Tests-Release/workspace/source/tests/junit/plugins/infra/nattable/org.eclipse.papyrus.infra.nattable.suite.tests/target/jacoco.exec,includes=org.eclipse.papyrus.*,excludes=org.eclipse.uml2
01:44:33 [INFO] 
01:44:33 [INFO] --- maven-resources-plugin:3.1.0:resources (default-resources) @ org.eclipse.papyrus.infra.nattable.suite.tests ---
01:44:33 [INFO] Using 'UTF-8' encoding to copy filtered resources.
01:44:33 [INFO] skip non existing resourceDirectory /jobs/genie.papyrus/Papyrus-Master-Tests-Release/workspace/source/tests/junit/plugins/infra/nattable/org.eclipse.papyrus.infra.nattable.suite.tests/src/main/resources
01:44:33 [INFO] 
01:44:33 [INFO] --- tycho-compiler-plugin:1.3.0:compile (default-compile) @ org.eclipse.papyrus.infra.nattable.suite.tests ---
01:44:33 [INFO] Compiling 2 source files to /jobs/genie.papyrus/Papyrus-Master-Tests-Release/workspace/source/tests/junit/plugins/infra/nattable/org.eclipse.papyrus.infra.nattable.suite.tests/bin
01:44:34 [INFO] 
01:44:34 [INFO] --- maven-resources-plugin:3.1.0:testResources (default-testResources) @ org.eclipse.papyrus.infra.nattable.suite.tests ---
01:44:34 [INFO] Using 'UTF-8' encoding to copy filtered resources.
01:44:34 [INFO] skip non existing resourceDirectory /jobs/genie.papyrus/Papyrus-Master-Tests-Release/workspace/source/tests/junit/plugins/infra/nattable/org.eclipse.papyrus.infra.nattable.suite.tests/src/test/resources
01:44:34 [INFO] 
01:44:34 [INFO] --- target-platform-configuration:1.3.0:target-platform (default-target-platform) @ org.eclipse.papyrus.infra.nattable.suite.tests ---
01:44:34 [INFO] 
01:44:34 [INFO] --- tycho-packaging-plugin:1.3.0:package-plugin (default-package-plugin) @ org.eclipse.papyrus.infra.nattable.suite.tests ---
01:44:34 [INFO] Building jar: /jobs/genie.papyrus/Papyrus-Master-Tests-Release/workspace/source/tests/junit/plugins/infra/nattable/org.eclipse.papyrus.infra.nattable.suite.tests/target/org.eclipse.papyrus.infra.nattable.suite.tests-0.0.1-SNAPSHOT.jar
01:44:34 [INFO] 
01:44:34 [INFO] --- tycho-p2-plugin:1.3.0:p2-metadata-default (default-p2-metadata-default) @ org.eclipse.papyrus.infra.nattable.suite.tests ---
01:44:34 [INFO] 
01:44:34 [INFO] --- tycho-surefire-plugin:1.3.0:test (default-test) @ org.eclipse.papyrus.infra.nattable.suite.tests ---
01:44:43 [INFO] Expected eclipse log file: /jobs/genie.papyrus/Papyrus-Master-Tests-Release/workspace/source/tests/junit/plugins/infra/nattable/org.eclipse.papyrus.infra.nattable.suite.tests/target/work/data/.metadata/.log
01:44:43 [INFO] Command line:
01:44:43 	[/opt/public/common/java/oracle/jdk1.8.0_192_x64/jre/bin/java, -Dosgi.noShutdown=false, -Dosgi.os=linux, -Dosgi.ws=gtk, -Dosgi.arch=x86_64, -javaagent:/home/hudson/genie.papyrus/.jenkins/jobs/Papyrus-Master-Tests-Release/workspace/.repository/org/jacoco/org.jacoco.agent/0.8.2/org.jacoco.agent-0.8.2-runtime.jar=destfile=/jobs/genie.papyrus/Papyrus-Master-Tests-Release/workspace/source/tests/junit/plugins/infra/nattable/org.eclipse.papyrus.infra.nattable.suite.tests/target/jacoco.exec,includes=org.eclipse.papyrus.*,excludes=org.eclipse.uml2, -Xms512m, -Xmx2048m, -XX:SoftRefLRUPolicyMSPerMB=100, -Dosgi.clean=true, -jar, /jobs/genie.papyrus/Papyrus-Master-Tests-Release/workspace/.repository/p2/osgi/bundle/org.eclipse.equinox.launcher/1.5.500.v20190715-1310/org.eclipse.equinox.launcher-1.5.500.v20190715-1310.jar, -data, /jobs/genie.papyrus/Papyrus-Master-Tests-Release/workspace/source/tests/junit/plugins/infra/nattable/org.eclipse.papyrus.infra.nattable.suite.tests/target/work/data, -install, /jobs/genie.papyrus/Papyrus-Master-Tests-Release/workspace/source/tests/junit/plugins/infra/nattable/org.eclipse.papyrus.infra.nattable.suite.tests/target/work, -configuration, /jobs/genie.papyrus/Papyrus-Master-Tests-Release/workspace/source/tests/junit/plugins/infra/nattable/org.eclipse.papyrus.infra.nattable.suite.tests/target/work/configuration, -application, org.eclipse.tycho.surefire.osgibooter.uitest, -testproperties, /jobs/genie.papyrus/Papyrus-Master-Tests-Release/workspace/source/tests/junit/plugins/infra/nattable/org.eclipse.papyrus.infra.nattable.suite.tests/target/surefire.properties, -product, org.eclipse.sdk.ide, -testConfig=CI_TESTS_CONFIG]
01:44:43 Picked up JAVA_TOOL_OPTIONS: -Xmx2G -Djava.io.tmpdir=/tmp/genie.papyrus -DforkCount=1
01:44:53 Running org.eclipse.papyrus.infra.nattable.suite.tests.AllTests
01:44:56 Plugin org.eclipse.papyrus.uml.architecture, extension org.eclipse.papyrus.infra.nattable.common.tableReconciler
01:44:56 Error processing extension: ConfigurationElementHandle [name: tableReconciler, handle id: 16448, namespace: org.eclipse.papyrus.uml.architecture]
03:20:06 [INFO] ------------------------------------------------------------------------
03:20:06 [INFO] Reactor Summary:
03:20:06 [INFO] 
03:20:06 [INFO] org.eclipse.papyrus.tests.releng 0.0.1-SNAPSHOT .... SUCCESS [ 24.386 s]
03:20:06 [INFO] org.eclipse.papyrus.plugins.tests.releng 0.0.1-SNAPSHOT SUCCESS [  0.005 s]
03:20:06 [INFO] org.eclipse.papyrus.editor.tests.releng 0.0.1-SNAPSHOT SUCCESS [  0.005 s]
03:20:06 [INFO] org.eclipse.papyrus.editor.integration.tests 1.4.0-SNAPSHOT SUCCESS [ 10.089 s]
03:20:06 [INFO] org.eclipse.papyrus.infra.tests.releng 0.0.1-SNAPSHOT SUCCESS [  0.008 s]
03:20:06 [INFO] org.eclipse.papyrus.infra.core.tests.releng 0.0.1-SNAPSHOT SUCCESS [  0.005 s]
03:20:06 [INFO] org.eclipse.papyrus.infra.core.clipboard.tests 1.3.0-SNAPSHOT SUCCESS [  0.551 s]
03:20:06 [INFO] org.eclipse.papyrus.infra.core.sasheditor.tests 1.2.0-SNAPSHOT SUCCESS [  0.755 s]
03:20:06 [INFO] org.eclipse.papyrus.infra.core.sasheditor.di.tests 1.2.0-SNAPSHOT SUCCESS [  0.386 s]
03:20:06 [INFO] org.eclipse.papyrus.infra.core.tests 3.1.0-SNAPSHOT  SUCCESS [  0.840 s]
03:20:06 [INFO] org.eclipse.papyrus.infra.editor.tests.releng 0.0.1-SNAPSHOT SUCCESS [  0.010 s]
03:20:06 [INFO] org.eclipse.papyrus.infra.editor.welcome.tests 1.2.0-SNAPSHOT SUCCESS [  0.527 s]
03:20:06 [INFO] org.eclipse.papyrus.infra.emf.tests.releng 0.0.1-SNAPSHOT SUCCESS [  0.004 s]
03:20:06 [INFO] org.eclipse.papyrus.infra.emf.gmf.tests 1.2.100-SNAPSHOT SUCCESS [  0.332 s]
03:20:06 [INFO] org.eclipse.papyrus.infra.emf.readonly.tests 1.3.0-SNAPSHOT SUCCESS [  0.301 s]
03:20:06 [INFO] org.eclipse.papyrus.infra.emf.tests 1.5.0-SNAPSHOT . SUCCESS [  0.583 s]
03:20:06 [INFO] org.eclipse.papyrus.infra.filters.tests 1.2.0-SNAPSHOT SUCCESS [  0.118 s]
03:20:06 [INFO] org.eclipse.papyrus.infra.gmfdiag.tests.releng 0.0.1-SNAPSHOT SUCCESS [  0.004 s]
03:20:06 [INFO] org.eclipse.papyrus.infra.gmfdiag.assistant.tests.releng 0.0.1-SNAPSHOT SUCCESS [  0.004 s]
03:20:06 [INFO] org.eclipse.papyrus.infra.gmfdiag.assistant.tests 1.3.0-SNAPSHOT SUCCESS [  0.530 s]
03:20:06 [INFO] org.eclipse.papyrus.infra.gmfdiag.canonical.tests 1.3.0-SNAPSHOT SUCCESS [  0.528 s]
03:20:06 [INFO] org.eclipse.papyrus.infra.gmfdiag.commands.tests 1.3.0-SNAPSHOT SUCCESS [  0.456 s]
03:20:06 [INFO] org.eclipse.papyrus.infra.gmfdiag.common.tests 3.1.0-SNAPSHOT SUCCESS [  0.540 s]
03:20:06 [INFO] org.eclipse.papyrus.infra.gmfdiag.css.tests 1.2.0-SNAPSHOT SUCCESS [  0.615 s]
03:20:06 [INFO] org.eclipse.papyrus.infra.gmfdiag.menu.tests 1.2.100-SNAPSHOT SUCCESS [  0.323 s]
03:20:06 [INFO] org.eclipse.papyrus.infra.gmfdiag.paletteconfiguration.tests 1.3.0-SNAPSHOT SUCCESS [  0.355 s]
03:20:06 [INFO] org.eclipse.papyrus.infra.gmfdiag.welcome.tests 1.2.0-SNAPSHOT SUCCESS [  0.429 s]
03:20:06 [INFO] org.eclipse.papyrus.infra.nattable.main.test 1.2.0-SNAPSHOT SUCCESS [  0.003 s]
03:20:06 [INFO] org.eclipse.papyrus.infra.nattable.common.tests 1.2.200-SNAPSHOT SUCCESS [  0.299 s]
03:20:06 [INFO] org.eclipse.papyrus.infra.nattable.model.tests 1.2.100-SNAPSHOT SUCCESS [  0.413 s]
03:20:06 [INFO] org.eclipse.papyrus.infra.nattable.tests 1.2.200-SNAPSHOT SUCCESS [  0.462 s]
03:20:06 [INFO] org.eclipse.papyrus.infra.nattable.views.tests 1.2.100-SNAPSHOT SUCCESS [  0.492 s]
03:20:06 [INFO] org.eclipse.papyrus.infra.properties.tests.releng 0.0.1-SNAPSHOT SUCCESS [  0.003 s]
03:20:06 [INFO] org.eclipse.papyrus.infra.properties.ui.tests 2.0.0-SNAPSHOT SUCCESS [  0.437 s]
03:20:06 [INFO] org.eclipse.papyrus.infra.services.tests.releng 0.0.1-SNAPSHOT SUCCESS [  0.003 s]
03:20:06 [INFO] org.eclipse.papyrus.infra.services.controlmode.tests 1.5.0-SNAPSHOT SUCCESS [  0.474 s]
03:20:06 [INFO] org.eclipse.papyrus.infra.services.edit.tests 1.2.0-SNAPSHOT SUCCESS [  0.392 s]
03:20:06 [INFO] org.eclipse.papyrus.infra.services.edit.ui.tests 1.2.0-SNAPSHOT SUCCESS [  0.281 s]
03:20:06 [INFO] org.eclipse.papyrus.infra.services.resourceloading.tests 1.2.0-SNAPSHOT SUCCESS [  0.327 s]
03:20:06 [INFO] org.eclipse.papyrus.infra.services.semantic.tests 1.2.100-SNAPSHOT SUCCESS [  0.416 s]
03:20:06 [INFO] org.eclipse.papyrus.infra.tools.tests 1.3.0-SNAPSHOT SUCCESS [  0.602 s]
03:20:06 [INFO] org.eclipse.papyrus.infra.types.tests.releng 0.0.1-SNAPSHOT SUCCESS [  0.004 s]
03:20:06 [INFO] org.eclipse.papyrus.infra.types.tests 3.0.100-SNAPSHOT SUCCESS [  0.520 s]
03:20:06 [INFO] org.eclipse.papyrus.infra.types.ui.tests 3.0.100-SNAPSHOT SUCCESS [  0.308 s]
03:20:06 [INFO] org.eclipse.papyrus.infra.ui.emf.tests 1.3.0-SNAPSHOT SUCCESS [  0.340 s]
03:20:06 [INFO] org.eclipse.papyrus.infra.ui.tests 1.2.0-SNAPSHOT .. SUCCESS [  0.506 s]
03:20:06 [INFO] org.eclipse.papyrus.infra.viewpoints.tests.releng 1.2.0-SNAPSHOT SUCCESS [  0.005 s]
03:20:06 [INFO] org.eclipse.papyrus.infra.viewpoints.policy.tests 1.2.0-SNAPSHOT SUCCESS [  0.337 s]
03:20:06 [INFO] org.eclipse.papyrus.uml.tests.releng 0.0.1-SNAPSHOT  SUCCESS [  0.003 s]
03:20:06 [INFO] org.eclipse.papyrus.uml.diagram.tests.releng 1.2.0-SNAPSHOT SUCCESS [  0.003 s]
03:20:06 [INFO] org.eclipse.papyrus.uml.diagram.tests 1.3.100-SNAPSHOT SUCCESS [  0.743 s]
03:20:06 [INFO] org.eclipse.papyrus.uml.diagram.clazz.tests 1.3.100-SNAPSHOT SUCCESS [  0.607 s]
03:20:06 [INFO] org.eclipse.papyrus.uml.diagram.activity.tests 1.2.100-SNAPSHOT SUCCESS [  0.785 s]
03:20:06 [INFO] org.eclipse.papyrus.uml.diagram.usecase.tests 4.0.100-SNAPSHOT SUCCESS [  0.582 s]
03:20:06 [INFO] org.eclipse.papyrus.uml.diagram.deployment.tests 1.2.100-SNAPSHOT SUCCESS [  0.448 s]
03:20:06 [INFO] org.eclipse.papyrus.uml.diagram.component.tests 1.2.100-SNAPSHOT SUCCESS [  0.468 s]
03:20:06 [INFO] org.eclipse.papyrus.uml.diagram.timing.tests 1.2.100-SNAPSHOT SUCCESS [  0.511 s]
03:20:06 [INFO] org.eclipse.papyrus.uml.diagram.stereotypeproperty.tests 1.2.100-SNAPSHOT SUCCESS [  0.395 s]
03:20:06 [INFO] org.eclipse.papyrus.uml.diagram.sequence.tests 1.3.100-SNAPSHOT SUCCESS [  0.862 s]
03:20:06 [INFO] org.eclipse.papyrus.uml.diagram.composite.tests 1.2.100-SNAPSHOT SUCCESS [  0.552 s]
03:20:06 [INFO] org.eclipse.papyrus.uml.diagram.profile.tests 1.2.100-SNAPSHOT SUCCESS [  0.509 s]
03:20:06 [INFO] org.eclipse.papyrus.uml.dynamic.profile.tests 1.2.0-SNAPSHOT SUCCESS [  0.027 s]
03:20:06 [INFO] org.eclipse.papyrus.uml.diagram.common.tests 1.3.100-SNAPSHOT SUCCESS [  0.608 s]
03:20:06 [INFO] org.eclipse.papyrus.uml.diagram.wizards.tests 1.3.0-SNAPSHOT SUCCESS [  0.412 s]
03:20:06 [INFO] org.eclipse.papyrus.tests.uml.diagram.feature 1.2.0-SNAPSHOT SUCCESS [  0.272 s]
03:20:06 [INFO] org.eclipse.papyrus.tests.infra.services.feature 1.2.0-SNAPSHOT SUCCESS [  0.085 s]
03:20:06 [INFO] org.eclipse.papyrus.views.tests.releng 0.0.1-SNAPSHOT SUCCESS [  0.003 s]
03:20:06 [INFO] org.eclipse.papyrus.views.modelexplorer.tests 1.2.100-SNAPSHOT SUCCESS [  0.356 s]
03:20:06 [INFO] org.eclipse.papyrus.uml.modelexplorer.tests.releng 0.0.1-SNAPSHOT SUCCESS [  0.003 s]
03:20:06 [INFO] org.eclipse.papyrus.uml.modelexplorer.tests 1.3.100-SNAPSHOT SUCCESS [  0.389 s]
03:20:06 [INFO] org.eclipse.papyrus.uml.modelrepair.tests 1.3.0-SNAPSHOT SUCCESS [  0.703 s]
03:20:06 [INFO] org.eclipse.papyrus.uml.properties.tests 1.1.0-SNAPSHOT SUCCESS [  0.533 s]
03:20:06 [INFO] org.eclipse.papyrus.uml.service.types.tests 1.3.0-SNAPSHOT SUCCESS [  0.567 s]
03:20:06 [INFO] org.eclipse.papyrus.uml.service.types.ui.tests 1.2.100-SNAPSHOT SUCCESS [  0.487 s]
03:20:06 [INFO] org.eclipse.papyrus.uml.profile.tests.releng 0.0.1-SNAPSHOT SUCCESS [  0.003 s]
03:20:06 [INFO] org.eclipse.papyrus.uml.profile.drafter.tests 1.3.0-SNAPSHOT SUCCESS [  0.530 s]
03:20:06 [INFO] org.eclipse.papyrus.uml.filters.tests 1.2.0-SNAPSHOT SUCCESS [  0.328 s]
03:20:06 [INFO] org.eclipse.papyrus.uml.profile.tests 1.2.0-SNAPSHOT SUCCESS [  0.306 s]
03:20:06 [INFO] org.eclipse.papyrus.tests.uml.feature 1.2.0-SNAPSHOT SUCCESS [  0.159 s]
03:20:06 [INFO] org.eclipse.papyrus.views.documentation.tests 1.0.0-SNAPSHOT SUCCESS [  0.374 s]
03:20:06 [INFO] org.eclipse.papyrus.tests.views.feature 1.2.0-SNAPSHOT SUCCESS [  0.054 s]
03:20:06 [INFO] org.eclipse.papyrus.tests.infra.nattable.feature 1.4.0-SNAPSHOT SUCCESS [  0.070 s]
03:20:06 [INFO] org.eclipse.papyrus.uml.nattable.main.test 1.2.0-SNAPSHOT SUCCESS [  0.002 s]
03:20:06 [INFO] org.eclipse.papyrus.uml.nattable.tests 1.2.100-SNAPSHOT SUCCESS [  0.291 s]
03:20:06 [INFO] org.eclipse.papyrus.uml.nattable.generic.tests 1.2.200-SNAPSHOT SUCCESS [  0.640 s]
03:20:06 [INFO] org.eclipse.papyrus.uml.nattable.clazz.config.tests 1.2.200-SNAPSHOT SUCCESS [  0.906 s]
03:20:06 [INFO] org.eclipse.papyrus.uml.nattable.stereotyped.elements.tests 1.0.200-SNAPSHOT SUCCESS [  0.661 s]
03:20:06 [INFO] org.eclipse.papyrus.uml.nattable.matrix.tests 1.0.100-SNAPSHOT SUCCESS [  0.438 s]
03:20:06 [INFO] org.eclipse.papyrus.tests.uml.nattable.feature 1.3.0-SNAPSHOT SUCCESS [  0.119 s]
03:20:06 [INFO] org.eclipse.papyrus.tests.infra.feature 1.2.0-SNAPSHOT SUCCESS [  0.259 s]
03:20:06 [INFO] org.eclipse.papyrus.tests.infra.core.feature 1.2.0-SNAPSHOT SUCCESS [  0.059 s]
03:20:06 [INFO] org.eclipse.papyrus.uml.tools.tests.releng 0.0.1-SNAPSHOT SUCCESS [  0.003 s]
03:20:06 [INFO] org.eclipse.papyrus.uml.tools.tests 3.1.0-SNAPSHOT . SUCCESS [  0.524 s]
03:20:06 [INFO] org.eclipse.papyrus.uml.tools.utils.tests 1.3.0-SNAPSHOT SUCCESS [  0.339 s]
03:20:06 [INFO] org.eclipse.papyrus.tests.uml.tools.feature 1.2.0-SNAPSHOT SUCCESS [  0.053 s]
03:20:06 [INFO] org.eclipse.papyrus.uml.decoratormodel.tests.releng 0.0.1-SNAPSHOT SUCCESS [  0.003 s]
03:20:06 [INFO] org.eclipse.papyrus.uml.decoratormodel.controlmode.tests 1.3.0-SNAPSHOT SUCCESS [  0.489 s]
03:20:06 [INFO] org.eclipse.papyrus.uml.decoratormodel.tests 1.3.0-SNAPSHOT SUCCESS [  0.518 s]
03:20:06 [INFO] org.eclipse.papyrus.tests.uml.decoratormodel.feature 1.2.0-SNAPSHOT SUCCESS [  0.083 s]
03:20:06 [INFO] org.eclipse.papyrus.uml.textedit.tests.releng 0.0.1-SNAPSHOT SUCCESS [  0.003 s]
03:20:06 [INFO] org.eclipse.papyrus.uml.textedit.tests 1.3.100-SNAPSHOT SUCCESS [  0.472 s]
03:20:06 [INFO] org.eclipse.papyrus.uml.textedit.parameter.tests 1.2.0-SNAPSHOT SUCCESS [  0.430 s]
03:20:06 [INFO] org.eclipse.papyrus.uml.textedit.port.tests 1.2.0-SNAPSHOT SUCCESS [  0.573 s]
03:20:06 [INFO] org.eclipse.papyrus.uml.textedit.property.tests 1.2.100-SNAPSHOT SUCCESS [  0.485 s]
03:20:06 [INFO] org.eclipse.papyrus.uml.textedit.tests.feature 1.2.0-SNAPSHOT SUCCESS [  0.089 s]
03:20:06 [INFO] org.eclipse.papyrus.uml.assistants.tests.releng 0.0.1-SNAPSHOT SUCCESS [  0.004 s]
03:20:06 [INFO] org.eclipse.papyrus.uml.profile.types.generator.tests 1.2.100-SNAPSHOT SUCCESS [  0.546 s]
03:20:06 [INFO] org.eclipse.papyrus.uml.profile.assistants.generator.tests 1.2.100-SNAPSHOT SUCCESS [  0.521 s]
03:20:06 [INFO] org.eclipse.papyrus.tests.uml.assistants.feature 1.2.0-SNAPSHOT SUCCESS [  0.054 s]
03:20:06 [INFO] org.eclipse.papyrus.toolsmiths.tests.releng 0.0.1-SNAPSHOT SUCCESS [  0.003 s]
03:20:06 [INFO] org.eclipse.papyrus.toolsmiths.profilemigration.tests 0.7.0-SNAPSHOT SUCCESS [  0.520 s]
03:20:06 [INFO] org.eclipse.papyrus.toolsmiths.validation.profile.tests 1.0.0-SNAPSHOT SUCCESS [  0.351 s]
03:20:06 [INFO] org.eclipse.papyrus.toolsmiths.validation.elementtypes.tests 1.0.0-SNAPSHOT SUCCESS [  0.386 s]
03:20:06 [INFO] org.eclipse.papyrus.tests.toolsmiths.feature 1.0.0-SNAPSHOT SUCCESS [  0.066 s]
03:20:06 [INFO] org.eclipse.papyrus.tests.feature 2.0.0-SNAPSHOT ... SUCCESS [  0.849 s]
03:20:06 [INFO] org.eclipse.papyrus.infra.emf.expressions.main.tests 0.0.1-SNAPSHOT SUCCESS [  0.003 s]
03:20:06 [INFO] org.eclipse.papyrus.infra.emf.expressions.tests 1.0.0-SNAPSHOT SUCCESS [  0.111 s]
03:20:06 [INFO] org.eclipse.papyrus.tests.infra.emf.expressions.feature 1.0.0-SNAPSHOT SUCCESS [  0.027 s]
03:20:06 [INFO] org.eclipse.papyrus.infra.internationalization.main.test 1.0.0-SNAPSHOT SUCCESS [  0.003 s]
03:20:06 [INFO] org.eclipse.papyrus.infra.internationalization.tests 1.100.0-SNAPSHOT SUCCESS [  0.369 s]
03:20:06 [INFO] org.eclipse.papyrus.tests.infra.internationalization.feature 1.0.0-SNAPSHOT SUCCESS [  0.050 s]
03:20:06 [INFO] org.eclipse.papyrus.uml.expressions.tests.releng 0.0.1-SNAPSHOT SUCCESS [  0.003 s]
03:20:06 [INFO] org.eclipse.papyrus.uml.expressions.tests 1.1.0-SNAPSHOT SUCCESS [  0.397 s]
03:20:06 [INFO] org.eclipse.papyrus.tests.uml.expressions.feature 1.0.0-SNAPSHOT SUCCESS [  0.044 s]
03:20:06 [INFO] org.eclipse.papyrus.uml.internationalization.main.test 1.0.0-SNAPSHOT SUCCESS [  0.002 s]
03:20:06 [INFO] org.eclipse.papyrus.uml.internationalization.tests 1.100.0-SNAPSHOT SUCCESS [  0.307 s]
03:20:06 [INFO] org.eclipse.papyrus.uml.internationalization.controlmode.tests 1.1.0-SNAPSHOT SUCCESS [  0.308 s]
03:20:06 [INFO] org.eclipse.papyrus.tests.uml.internationalization.feature 1.0.0-SNAPSHOT SUCCESS [  0.046 s]
03:20:06 [INFO] org.eclipse.papyrus.uml.alf.tests 1.2.0-SNAPSHOT ... SUCCESS [01:01 min]
03:20:06 [INFO] org.eclipse.papyrus.uml.alf.tests.feature 1.2.0-SNAPSHOT SUCCESS [  0.116 s]
03:20:06 [INFO] Papyrus Tests Features 0.0.1-SNAPSHOT .............. SUCCESS [  0.002 s]
03:20:06 [INFO] org.eclipse.papyrus.developer.suite.tests 0.0.1-SNAPSHOT SUCCESS [ 23.222 s]
03:20:06 [INFO] org.eclipse.papyrus.bundles.tests 0.0.1-SNAPSHOT ... SUCCESS [  0.003 s]
03:20:06 [INFO] org.eclipse.papyrus.eclipse.project.editors.tests 2.1.0-SNAPSHOT SUCCESS [  0.550 s]
03:20:06 [INFO] org.eclipse.papyrus.editors.suite.tests 0.0.1-SNAPSHOT SUCCESS [04:56 min]
03:20:06 [INFO] org.eclipse.papyrus.infra.core.suite.tests 0.0.1-SNAPSHOT SUCCESS [ 54.194 s]
03:20:06 [INFO] org.eclipse.papyrus.infra.nattable.suite.tests 0.0.1-SNAPSHOT FAILURE [  01:35 h]
03:20:06 [INFO] org.eclipse.papyrus.infra.architecture.tests 1.0.0-SNAPSHOT SKIPPED
03:20:06 [INFO] org.eclipse.papyrus.infra.services.labelprovider.tests 1.2.200-SNAPSHOT SKIPPED
03:20:06 [INFO] org.eclipse.papyrus.infra.suite.tests 0.0.1-SNAPSHOT SKIPPED
03:20:06 [INFO] org.eclipse.papyrus.infra.newchild.tests 1.2.100-SNAPSHOT SKIPPED
03:20:06 [INFO] org.eclipse.papyrus.uml.diagram.communication.tests 1.2.100-SNAPSHOT SKIPPED
03:20:06 [INFO] org.eclipse.papyrus.uml.diagram.interactionoverview.tests 1.2.0-SNAPSHOT SKIPPED
03:20:06 [INFO] org.eclipse.papyrus.uml.diagram.statemachine.tests 1.2.100-SNAPSHOT SKIPPED
03:20:06 [INFO] org.eclipse.papyrus.uml.diagram.suite.tests 0.0.1-SNAPSHOT SKIPPED
03:20:06 [INFO] org.eclipse.papyrus.uml.diagram.dnd.tests 1.2.100-SNAPSHOT SKIPPED
03:20:06 [INFO] org.eclipse.papyrus.uml.diagram.properties.tests 1.0.0-SNAPSHOT SKIPPED
03:20:06 [INFO] org.eclipse.papyrus.uml.nattable.stereotype.display.tests 1.2.100-SNAPSHOT SKIPPED
03:20:06 [INFO] org.eclipse.papyrus.uml.nattable.suite.tests 0.0.1-SNAPSHOT SKIPPED
03:20:06 [INFO] org.eclipse.papyrus.uml.textedit.valuespecification.tests 1.2.0-SNAPSHOT SKIPPED
03:20:06 [INFO] org.eclipse.papyrus.uml.textedit.suite.tests 0.0.1-SNAPSHOT SKIPPED
03:20:06 [INFO] org.eclipse.papyrus.uml.architecture.tests 1.1.200-SNAPSHOT SKIPPED
03:20:06 [INFO] org.eclipse.papyrus.uml.validation.tests.releng 0.0.1-SNAPSHOT SKIPPED
03:20:06 [INFO] org.eclipse.papyrus.uml.validation.tests.staticprofile 1.2.0-SNAPSHOT SKIPPED
03:20:06 [INFO] org.eclipse.papyrus.uml.validation.tests.genvalidation 1.2.0-SNAPSHOT SKIPPED
03:20:06 [INFO] org.eclipse.papyrus.uml.validation.tests 1.2.100-SNAPSHOT SKIPPED
03:20:06 [INFO] org.eclipse.papyrus.uml.suite.tests 0.0.1-SNAPSHOT . SKIPPED
03:20:06 [INFO] org.eclipse.papyrus.uml.alf.tests.releng 0.0.1-SNAPSHOT SKIPPED
03:20:06 [INFO] org.eclipse.papyrus.uml.alf.backend.tests 1.1.0-SNAPSHOT SKIPPED
03:20:06 [INFO] org.eclipse.papyrus.views.properties.toolsmiths.tests 1.2.0-SNAPSHOT SKIPPED
03:20:06 [INFO] org.eclipse.papyrus.views.suite.tests 0.0.1-SNAPSHOT SKIPPED
03:20:06 [INFO] org.eclipse.papyrus.views.documentation.tests.releng 0.0.1-SNAPSHOT SKIPPED
03:20:06 [INFO] org.eclipse.papyrus.toolsmiths.suite.tests 0.0.1-SNAPSHOT SKIPPED
03:20:06 [INFO] org.eclipse.papyrus.tests.main.releng 1.2.0-SNAPSHOT SKIPPED
03:20:06 [INFO] org.eclipse.papyrus.main.tests.target.parent 0.0.1-SNAPSHOT SKIPPED
03:20:06 [INFO] org.eclipse.papyrus.main.tests.portable.target 0.0.1-SNAPSHOT SKIPPED
03:20:06 [INFO] ------------------------------------------------------------------------
03:20:06 [INFO] BUILD FAILURE
03:20:06 [INFO] ------------------------------------------------------------------------
03:20:06 [INFO] Total time:  01:59 h
03:20:06 [INFO] Finished at: 2019-09-27T03:20:06-04:00
03:20:06 [INFO] ------------------------------------------------------------------------
03:20:06 [ERROR] Failed to execute goal org.eclipse.tycho:tycho-surefire-plugin:1.3.0:test (default-test) on project org.eclipse.papyrus.infra.nattable.suite.tests: An unexpected error occured while launching the test runtime (return code 143). See log /jobs/genie.papyrus/Papyrus-Master-Tests-Release/workspace/source/tests/junit/plugins/infra/nattable/org.eclipse.papyrus.infra.nattable.suite.tests/target/work/data/.metadata/.log for details. -> [Help 1]
03:20:06 [ERROR] 
03:20:06 [ERROR] To see the full stack trace of the errors, re-run Maven with the -e switch.
03:20:06 [ERROR] Re-run Maven using the -X switch to enable full debug logging.
03:20:06 [ERROR] 
03:20:06 [ERROR] For more information about the errors and possible solutions, please read the following articles:
03:20:06 [ERROR] [Help 1] http://cwiki.apache.org/confluence/display/MAVEN/MojoFailureException
03:20:06 [ERROR] 
03:20:06 [ERROR] After correcting the problems, you can resume the build with the command
03:20:06 [ERROR]   mvn <goals> -rf :org.eclipse.papyrus.infra.nattable.suite.tests
03:20:10 Taking screenshot.
03:20:10 [workspace] $ echo $XAUTHORITY
03:20:10 /home/hudson/genie.papyrus/.jenkins/jobs/Papyrus-Master-Tests-Release/workspace/.Xauthority-4834264748388960953
03:20:10 [workspace] $ ls -l $XAUTHORITY
03:20:10 -rw-rw-r-- 1 genie.papyrus modeling.mdt.papyrus 0 Sep 27 01:20 /home/hudson/genie.papyrus/.jenkins/jobs/Papyrus-Master-Tests-Release/workspace/.Xauthority-4834264748388960953
03:20:10 [workspace] $ import -window root -display :726 screenshot.jpg
03:20:10 Terminating xvnc.
03:20:18 Build was aborted
03:20:18 Aborted by quentin.lemenez@cea.fr
03:20:18 No mail will be sent out, as 'Papyrus-Master-Tests-Release #60' does not have a result yet. Please make sure you set a proper result in case of pipeline/build scripts.
03:20:18 Recording test results
03:20:19 Started calculate disk usage of build
03:20:19 Finished Calculation of disk usage of build in 0 seconds
03:20:19 Started calculate disk usage of workspace
03:20:20 Finished Calculation of disk usage of workspace in  1 second
03:20:20 [WS-CLEANUP] Deleting project workspace...
03:20:20 [WS-CLEANUP] Deferred wipeout is used...
03:20:20 [WS-CLEANUP] done
03:20:20 Finished: ABORTED