FailedConsole Output

Skipping 10,816 KB.. Full Log
 kB | 81 kB   
Progress (4): 69 kB | 110 kB | 149/284 kB | 81 kB
Progress (4): 69 kB | 110 kB | 153/284 kB | 81 kB
Progress (4): 69 kB | 110 kB | 157/284 kB | 81 kB
Progress (4): 69 kB | 110 kB | 161/284 kB | 81 kB
Progress (4): 69 kB | 110 kB | 165/284 kB | 81 kB
Progress (4): 69 kB | 110 kB | 169/284 kB | 81 kB
Progress (4): 69 kB | 110 kB | 173/284 kB | 81 kB
Progress (4): 69 kB | 110 kB | 177/284 kB | 81 kB
Progress (4): 69 kB | 110 kB | 181/284 kB | 81 kB
Progress (4): 69 kB | 110 kB | 185/284 kB | 81 kB
Progress (4): 69 kB | 110 kB | 189/284 kB | 81 kB
Progress (4): 69 kB | 110 kB | 193/284 kB | 81 kB
Progress (4): 69 kB | 110 kB | 197/284 kB | 81 kB
Progress (4): 69 kB | 110 kB | 201/284 kB | 81 kB
Progress (4): 69 kB | 110 kB | 205/284 kB | 81 kB
Progress (4): 69 kB | 110 kB | 209/284 kB | 81 kB
Progress (4): 69 kB | 110 kB | 213/284 kB | 81 kB
Progress (4): 69 kB | 110 kB | 217/284 kB | 81 kB
                                                 
Downloaded from eclipse.maven.central.mirror: https://repo.eclipse.org/content/repositories/maven_central/org/apache/maven/scm/maven-scm-provider-svnexe/1.10.0/maven-scm-provider-svnexe-1.10.0.jar (81 kB at 211 kB/s)
03:46:20 Progress (3): 69 kB | 110 kB | 221/284 kB
                                         
Downloading from eclipse.maven.central.mirror: https://repo.eclipse.org/content/repositories/maven_central/org/apache/maven/scm/maven-scm-provider-cvs-commons/1.10.0/maven-scm-provider-cvs-commons-1.10.0.jar
03:46:20 Progress (3): 69 kB | 110 kB | 225/284 kB
Progress (3): 69 kB | 110 kB | 229/284 kB
Progress (3): 69 kB | 110 kB | 233/284 kB
Progress (3): 69 kB | 110 kB | 237/284 kB
Progress (3): 69 kB | 110 kB | 241/284 kB
Progress (3): 69 kB | 110 kB | 245/284 kB
Progress (3): 69 kB | 110 kB | 249/284 kB
Progress (3): 69 kB | 110 kB | 253/284 kB
Progress (3): 69 kB | 110 kB | 257/284 kB
Progress (3): 69 kB | 110 kB | 261/284 kB
Progress (3): 69 kB | 110 kB | 265/284 kB
Progress (3): 69 kB | 110 kB | 269/284 kB
Progress (3): 69 kB | 110 kB | 273/284 kB
Progress (3): 69 kB | 110 kB | 277/284 kB
Progress (3): 69 kB | 110 kB | 281/284 kB
Progress (3): 69 kB | 110 kB | 284 kB    
Progress (4): 69 kB | 110 kB | 284 kB | 4.1/38 kB
Progress (4): 69 kB | 110 kB | 284 kB | 7.7/38 kB
Progress (4): 69 kB | 110 kB | 284 kB | 12/38 kB 
Progress (4): 69 kB | 110 kB | 284 kB | 16/38 kB
Progress (4): 69 kB | 110 kB | 284 kB | 20/38 kB
Progress (4): 69 kB | 110 kB | 284 kB | 24/38 kB
Progress (4): 69 kB | 110 kB | 284 kB | 28/38 kB
Progress (4): 69 kB | 110 kB | 284 kB | 32/38 kB
Progress (4): 69 kB | 110 kB | 284 kB | 36/38 kB
Progress (4): 69 kB | 110 kB | 284 kB | 38 kB   
                                             
Downloaded from eclipse.maven.central.mirror: https://repo.eclipse.org/content/repositories/maven_central/org/apache/maven/scm/maven-scm-provider-hg/1.10.0/maven-scm-provider-hg-1.10.0.jar (69 kB at 152 kB/s)
03:46:20 Downloaded from eclipse.maven.central.mirror: https://repo.eclipse.org/content/repositories/maven_central/commons-lang/commons-lang/2.6/commons-lang-2.6.jar (284 kB at 627 kB/s)
03:46:20 Downloaded from eclipse.maven.central.mirror: https://repo.eclipse.org/content/repositories/maven_central/org/apache/maven/scm/maven-scm-api/1.10.0/maven-scm-api-1.10.0.jar (110 kB at 242 kB/s)
03:46:20 Downloading from eclipse.maven.central.mirror: https://repo.eclipse.org/content/repositories/maven_central/org/netbeans/lib/cvsclient/20060125/cvsclient-20060125.jar
03:46:20 Downloading from eclipse.maven.central.mirror: https://repo.eclipse.org/content/repositories/maven_central/org/apache/maven/scm/maven-scm-provider-cvsjava/1.10.0/maven-scm-provider-cvsjava-1.10.0.jar
03:46:20 Downloading from eclipse.maven.central.mirror: https://repo.eclipse.org/content/repositories/maven_central/org/apache/maven/scm/maven-scm-provider-cvsexe/1.10.0/maven-scm-provider-cvsexe-1.10.0.jar
03:46:20 Downloaded from eclipse.maven.central.mirror: https://repo.eclipse.org/content/repositories/maven_central/org/apache/maven/scm/maven-scm-provider-svn-commons/1.10.0/maven-scm-provider-svn-commons-1.10.0.jar (38 kB at 82 kB/s)
03:46:20 Downloading from eclipse.maven.central.mirror: https://repo.eclipse.org/content/repositories/maven_central/ch/ethz/ganymed/ganymed-ssh2/build210/ganymed-ssh2-build210.jar
03:46:20 Progress (1): 4.1/45 kB
Progress (1): 7.7/45 kB
Progress (1): 12/45 kB 
Progress (1): 16/45 kB
Progress (1): 20/45 kB
Progress (1): 24/45 kB
Progress (1): 28/45 kB
Progress (1): 32/45 kB
Progress (1): 36/45 kB
Progress (1): 40/45 kB
Progress (1): 44/45 kB
Progress (1): 45 kB   
                   
Downloaded from eclipse.maven.central.mirror: https://repo.eclipse.org/content/repositories/maven_central/org/apache/maven/scm/maven-scm-provider-cvsjava/1.10.0/maven-scm-provider-cvsjava-1.10.0.jar (45 kB at 90 kB/s)
03:46:20 Downloading from eclipse.maven.central.mirror: https://repo.eclipse.org/content/repositories/maven_central/org/apache/maven/scm/maven-scm-provider-git-commons/1.10.0/maven-scm-provider-git-commons-1.10.0.jar
03:46:20 Progress (1): 4.1/79 kB
Progress (1): 7.7/79 kB
Progress (2): 7.7/79 kB | 4.1/31 kB
Progress (2): 7.7/79 kB | 7.7/31 kB
Progress (2): 12/79 kB | 7.7/31 kB 
Progress (2): 16/79 kB | 7.7/31 kB
Progress (2): 16/79 kB | 12/31 kB 
Progress (2): 16/79 kB | 16/31 kB
Progress (2): 20/79 kB | 16/31 kB
Progress (2): 20/79 kB | 20/31 kB
Progress (2): 24/79 kB | 20/31 kB
Progress (2): 24/79 kB | 24/31 kB
Progress (3): 24/79 kB | 24/31 kB | 4.1/245 kB
Progress (3): 24/79 kB | 24/31 kB | 7.7/245 kB
Progress (3): 24/79 kB | 28/31 kB | 7.7/245 kB
Progress (3): 28/79 kB | 28/31 kB | 7.7/245 kB
Progress (3): 28/79 kB | 28/31 kB | 12/245 kB 
Progress (3): 28/79 kB | 31 kB | 12/245 kB   
Progress (3): 28/79 kB | 31 kB | 16/245 kB
Progress (3): 32/79 kB | 31 kB | 16/245 kB
Progress (3): 33/79 kB | 31 kB | 16/245 kB
Progress (3): 33/79 kB | 31 kB | 20/245 kB
Progress (3): 33/79 kB | 31 kB | 24/245 kB
Progress (3): 37/79 kB | 31 kB | 24/245 kB
Progress (3): 37/79 kB | 31 kB | 28/245 kB
Progress (3): 41/79 kB | 31 kB | 28/245 kB
Progress (3): 41/79 kB | 31 kB | 32/245 kB
Progress (3): 41/79 kB | 31 kB | 33/245 kB
Progress (3): 45/79 kB | 31 kB | 33/245 kB
Progress (3): 45/79 kB | 31 kB | 37/245 kB
Progress (3): 49/79 kB | 31 kB | 37/245 kB
Progress (3): 49/79 kB | 31 kB | 41/245 kB
Progress (3): 49/79 kB | 31 kB | 45/245 kB
Progress (3): 53/79 kB | 31 kB | 45/245 kB
Progress (3): 53/79 kB | 31 kB | 49/245 kB
Progress (3): 57/79 kB | 31 kB | 49/245 kB
Progress (3): 57/79 kB | 31 kB | 53/245 kB
Progress (3): 57/79 kB | 31 kB | 57/245 kB
Progress (3): 61/79 kB | 31 kB | 57/245 kB
Progress (3): 61/79 kB | 31 kB | 61/245 kB
Progress (3): 65/79 kB | 31 kB | 61/245 kB
Progress (3): 65/79 kB | 31 kB | 65/245 kB
Progress (3): 65/79 kB | 31 kB | 66/245 kB
Progress (3): 69/79 kB | 31 kB | 66/245 kB
Progress (3): 69/79 kB | 31 kB | 70/245 kB
Progress (3): 73/79 kB | 31 kB | 70/245 kB
Progress (3): 73/79 kB | 31 kB | 74/245 kB
Progress (3): 73/79 kB | 31 kB | 78/245 kB
Progress (3): 73/79 kB | 31 kB | 82/245 kB
Progress (3): 73/79 kB | 31 kB | 86/245 kB
Progress (3): 73/79 kB | 31 kB | 90/245 kB
Progress (3): 73/79 kB | 31 kB | 94/245 kB
Progress (3): 73/79 kB | 31 kB | 98/245 kB
Progress (3): 73/79 kB | 31 kB | 98/245 kB
Progress (3): 73/79 kB | 31 kB | 102/245 kB
Progress (3): 73/79 kB | 31 kB | 106/245 kB
Progress (3): 73/79 kB | 31 kB | 110/245 kB
Progress (3): 73/79 kB | 31 kB | 114/245 kB
Progress (3): 73/79 kB | 31 kB | 118/245 kB
Progress (3): 73/79 kB | 31 kB | 122/245 kB
Progress (3): 73/79 kB | 31 kB | 126/245 kB
Progress (3): 73/79 kB | 31 kB | 130/245 kB
Progress (3): 73/79 kB | 31 kB | 134/245 kB
Progress (3): 73/79 kB | 31 kB | 138/245 kB
Progress (3): 73/79 kB | 31 kB | 142/245 kB
Progress (3): 73/79 kB | 31 kB | 146/245 kB
Progress (3): 73/79 kB | 31 kB | 150/245 kB
Progress (3): 73/79 kB | 31 kB | 154/245 kB
Progress (3): 73/79 kB | 31 kB | 158/245 kB
Progress (3): 73/79 kB | 31 kB | 162/245 kB
Progress (3): 73/79 kB | 31 kB | 166/245 kB
Progress (3): 73/79 kB | 31 kB | 170/245 kB
Progress (3): 73/79 kB | 31 kB | 174/245 kB
Progress (3): 73/79 kB | 31 kB | 178/245 kB
Progress (3): 73/79 kB | 31 kB | 182/245 kB
Progress (3): 73/79 kB | 31 kB | 186/245 kB
Progress (3): 73/79 kB | 31 kB | 190/245 kB
Progress (3): 73/79 kB | 31 kB | 194/245 kB
Progress (3): 73/79 kB | 31 kB | 198/245 kB
Progress (3): 73/79 kB | 31 kB | 202/245 kB
Progress (3): 73/79 kB | 31 kB | 206/245 kB
Progress (3): 73/79 kB | 31 kB | 210/245 kB
Progress (3): 73/79 kB | 31 kB | 214/245 kB
Progress (3): 73/79 kB | 31 kB | 218/245 kB
Progress (3): 73/79 kB | 31 kB | 222/245 kB
Progress (3): 73/79 kB | 31 kB | 226/245 kB
Progress (3): 73/79 kB | 31 kB | 230/245 kB
Progress (3): 73/79 kB | 31 kB | 234/245 kB
Progress (3): 73/79 kB | 31 kB | 238/245 kB
Progress (3): 73/79 kB | 31 kB | 242/245 kB
Progress (3): 73/79 kB | 31 kB | 245 kB    
Progress (4): 73/79 kB | 31 kB | 245 kB | 4.1/619 kB
Progress (4): 73/79 kB | 31 kB | 245 kB | 7.7/619 kB
Progress (4): 73/79 kB | 31 kB | 245 kB | 12/619 kB 
Progress (4): 73/79 kB | 31 kB | 245 kB | 16/619 kB
Progress (4): 73/79 kB | 31 kB | 245 kB | 20/619 kB
Progress (4): 73/79 kB | 31 kB | 245 kB | 24/619 kB
Progress (4): 73/79 kB | 31 kB | 245 kB | 28/619 kB
Progress (4): 73/79 kB | 31 kB | 245 kB | 32/619 kB
Progress (4): 73/79 kB | 31 kB | 245 kB | 36/619 kB
Progress (4): 73/79 kB | 31 kB | 245 kB | 40/619 kB
Progress (4): 73/79 kB | 31 kB | 245 kB | 44/619 kB
Progress (4): 73/79 kB | 31 kB | 245 kB | 48/619 kB
Progress (4): 73/79 kB | 31 kB | 245 kB | 52/619 kB
Progress (4): 73/79 kB | 31 kB | 245 kB | 56/619 kB
Progress (4): 73/79 kB | 31 kB | 245 kB | 60/619 kB
Progress (4): 73/79 kB | 31 kB | 245 kB | 64/619 kB
Progress (4): 73/79 kB | 31 kB | 245 kB | 68/619 kB
Progress (4): 73/79 kB | 31 kB | 245 kB | 72/619 kB
Progress (4): 73/79 kB | 31 kB | 245 kB | 76/619 kB
Progress (4): 73/79 kB | 31 kB | 245 kB | 80/619 kB
Progress (4): 73/79 kB | 31 kB | 245 kB | 84/619 kB
Progress (4): 73/79 kB | 31 kB | 245 kB | 88/619 kB
Progress (4): 73/79 kB | 31 kB | 245 kB | 92/619 kB
Progress (4): 73/79 kB | 31 kB | 245 kB | 96/619 kB
Progress (4): 73/79 kB | 31 kB | 245 kB | 100/619 kB
Progress (4): 73/79 kB | 31 kB | 245 kB | 104/619 kB
Progress (4): 73/79 kB | 31 kB | 245 kB | 108/619 kB
Progress (4): 73/79 kB | 31 kB | 245 kB | 112/619 kB
Progress (4): 73/79 kB | 31 kB | 245 kB | 116/619 kB
Progress (4): 73/79 kB | 31 kB | 245 kB | 120/619 kB
Progress (4): 73/79 kB | 31 kB | 245 kB | 124/619 kB
                                                    
Downloaded from eclipse.maven.central.mirror: https://repo.eclipse.org/content/repositories/maven_central/org/apache/maven/scm/maven-scm-provider-cvsexe/1.10.0/maven-scm-provider-cvsexe-1.10.0.jar (31 kB at 58 kB/s)
03:46:20 Downloaded from eclipse.maven.central.mirror: https://repo.eclipse.org/content/repositories/maven_central/ch/ethz/ganymed/ganymed-ssh2/build210/ganymed-ssh2-build210.jar (245 kB at 460 kB/s)
03:46:20 Progress (2): 73/79 kB | 128/619 kB
                                   
Downloading from eclipse.maven.central.mirror: https://repo.eclipse.org/content/repositories/maven_central/org/apache/maven/doxia/doxia-logging-api/1.8/doxia-logging-api-1.8.jar
03:46:20 Downloading from eclipse.maven.central.mirror: https://repo.eclipse.org/content/repositories/maven_central/org/apache/maven/scm/maven-scm-provider-gitexe/1.10.0/maven-scm-provider-gitexe-1.10.0.jar
03:46:20 Progress (2): 73/79 kB | 132/619 kB
Progress (2): 73/79 kB | 136/619 kB
Progress (2): 73/79 kB | 140/619 kB
Progress (2): 73/79 kB | 144/619 kB
Progress (2): 73/79 kB | 148/619 kB
Progress (2): 73/79 kB | 152/619 kB
Progress (2): 73/79 kB | 156/619 kB
Progress (2): 73/79 kB | 160/619 kB
Progress (2): 73/79 kB | 164/619 kB
Progress (2): 73/79 kB | 168/619 kB
Progress (2): 73/79 kB | 172/619 kB
Progress (2): 73/79 kB | 176/619 kB
Progress (2): 73/79 kB | 180/619 kB
Progress (2): 73/79 kB | 184/619 kB
Progress (2): 73/79 kB | 188/619 kB
Progress (2): 73/79 kB | 192/619 kB
Progress (2): 73/79 kB | 196/619 kB
Progress (2): 73/79 kB | 200/619 kB
Progress (2): 73/79 kB | 204/619 kB
Progress (2): 73/79 kB | 208/619 kB
Progress (2): 73/79 kB | 212/619 kB
Progress (2): 73/79 kB | 216/619 kB
Progress (2): 73/79 kB | 220/619 kB
Progress (2): 73/79 kB | 224/619 kB
Progress (2): 73/79 kB | 228/619 kB
Progress (2): 73/79 kB | 232/619 kB
Progress (2): 73/79 kB | 236/619 kB
Progress (2): 73/79 kB | 240/619 kB
Progress (2): 73/79 kB | 244/619 kB
Progress (2): 73/79 kB | 248/619 kB
Progress (2): 73/79 kB | 252/619 kB
Progress (2): 73/79 kB | 256/619 kB
Progress (2): 73/79 kB | 260/619 kB
Progress (2): 73/79 kB | 264/619 kB
Progress (2): 73/79 kB | 268/619 kB
Progress (2): 73/79 kB | 272/619 kB
Progress (2): 73/79 kB | 276/619 kB
Progress (3): 73/79 kB | 276/619 kB | 4.1/35 kB
Progress (3): 73/79 kB | 280/619 kB | 4.1/35 kB
Progress (3): 73/79 kB | 280/619 kB | 7.7/35 kB
Progress (3): 73/79 kB | 284/619 kB | 7.7/35 kB
Progress (3): 73/79 kB | 288/619 kB | 7.7/35 kB
Progress (3): 73/79 kB | 288/619 kB | 12/35 kB 
Progress (3): 73/79 kB | 292/619 kB | 12/35 kB
Progress (3): 73/79 kB | 292/619 kB | 16/35 kB
Progress (3): 73/79 kB | 296/619 kB | 16/35 kB
Progress (3): 73/79 kB | 300/619 kB | 16/35 kB
Progress (3): 73/79 kB | 300/619 kB | 20/35 kB
Progress (3): 73/79 kB | 304/619 kB | 20/35 kB
Progress (3): 73/79 kB | 304/619 kB | 24/35 kB
Progress (3): 73/79 kB | 308/619 kB | 24/35 kB
Progress (3): 73/79 kB | 312/619 kB | 24/35 kB
Progress (3): 73/79 kB | 312/619 kB | 28/35 kB
Progress (3): 73/79 kB | 316/619 kB | 28/35 kB
Progress (3): 73/79 kB | 316/619 kB | 32/35 kB
Progress (3): 73/79 kB | 320/619 kB | 32/35 kB
Progress (3): 73/79 kB | 320/619 kB | 35 kB   
Progress (3): 73/79 kB | 324/619 kB | 35 kB
Progress (3): 73/79 kB | 328/619 kB | 35 kB
Progress (3): 73/79 kB | 332/619 kB | 35 kB
Progress (3): 73/79 kB | 336/619 kB | 35 kB
Progress (3): 73/79 kB | 340/619 kB | 35 kB
Progress (3): 73/79 kB | 344/619 kB | 35 kB
Progress (3): 73/79 kB | 348/619 kB | 35 kB
Progress (3): 73/79 kB | 352/619 kB | 35 kB
Progress (3): 73/79 kB | 356/619 kB | 35 kB
Progress (3): 73/79 kB | 360/619 kB | 35 kB
Progress (3): 73/79 kB | 364/619 kB | 35 kB
Progress (3): 73/79 kB | 368/619 kB | 35 kB
Progress (3): 73/79 kB | 372/619 kB | 35 kB
Progress (3): 73/79 kB | 376/619 kB | 35 kB
Progress (3): 73/79 kB | 380/619 kB | 35 kB
Progress (3): 73/79 kB | 384/619 kB | 35 kB
Progress (3): 73/79 kB | 388/619 kB | 35 kB
Progress (3): 73/79 kB | 392/619 kB | 35 kB
Progress (3): 73/79 kB | 396/619 kB | 35 kB
Progress (3): 73/79 kB | 400/619 kB | 35 kB
Progress (3): 73/79 kB | 404/619 kB | 35 kB
Progress (3): 73/79 kB | 408/619 kB | 35 kB
Progress (3): 73/79 kB | 412/619 kB | 35 kB
Progress (3): 73/79 kB | 416/619 kB | 35 kB
Progress (3): 73/79 kB | 420/619 kB | 35 kB
Progress (3): 73/79 kB | 424/619 kB | 35 kB
Progress (3): 73/79 kB | 428/619 kB | 35 kB
Progress (3): 73/79 kB | 432/619 kB | 35 kB
Progress (3): 73/79 kB | 436/619 kB | 35 kB
Progress (3): 73/79 kB | 440/619 kB | 35 kB
Progress (3): 73/79 kB | 444/619 kB | 35 kB
Progress (3): 73/79 kB | 448/619 kB | 35 kB
Progress (3): 73/79 kB | 452/619 kB | 35 kB
Progress (3): 73/79 kB | 456/619 kB | 35 kB
Progress (3): 73/79 kB | 460/619 kB | 35 kB
Progress (3): 73/79 kB | 464/619 kB | 35 kB
Progress (3): 73/79 kB | 468/619 kB | 35 kB
Progress (3): 73/79 kB | 472/619 kB | 35 kB
Progress (3): 73/79 kB | 476/619 kB | 35 kB
Progress (3): 73/79 kB | 480/619 kB | 35 kB
Progress (3): 73/79 kB | 484/619 kB | 35 kB
Progress (3): 73/79 kB | 488/619 kB | 35 kB
Progress (3): 73/79 kB | 492/619 kB | 35 kB
Progress (3): 73/79 kB | 496/619 kB | 35 kB
Progress (3): 73/79 kB | 500/619 kB | 35 kB
Progress (3): 73/79 kB | 504/619 kB | 35 kB
Progress (3): 73/79 kB | 508/619 kB | 35 kB
Progress (3): 73/79 kB | 512/619 kB | 35 kB
Progress (3): 73/79 kB | 516/619 kB | 35 kB
Progress (3): 73/79 kB | 520/619 kB | 35 kB
Progress (3): 73/79 kB | 524/619 kB | 35 kB
Progress (3): 73/79 kB | 528/619 kB | 35 kB
Progress (3): 73/79 kB | 532/619 kB | 35 kB
Progress (3): 73/79 kB | 536/619 kB | 35 kB
Progress (3): 73/79 kB | 540/619 kB | 35 kB
Progress (3): 73/79 kB | 544/619 kB | 35 kB
Progress (3): 73/79 kB | 548/619 kB | 35 kB
Progress (3): 73/79 kB | 552/619 kB | 35 kB
Progress (3): 73/79 kB | 556/619 kB | 35 kB
Progress (3): 73/79 kB | 560/619 kB | 35 kB
Progress (3): 73/79 kB | 564/619 kB | 35 kB
Progress (3): 73/79 kB | 568/619 kB | 35 kB
Progress (3): 73/79 kB | 572/619 kB | 35 kB
Progress (3): 73/79 kB | 576/619 kB | 35 kB
Progress (3): 73/79 kB | 580/619 kB | 35 kB
Progress (3): 73/79 kB | 584/619 kB | 35 kB
Progress (3): 73/79 kB | 588/619 kB | 35 kB
Progress (3): 73/79 kB | 592/619 kB | 35 kB
Progress (3): 73/79 kB | 596/619 kB | 35 kB
Progress (3): 73/79 kB | 600/619 kB | 35 kB
Progress (3): 73/79 kB | 604/619 kB | 35 kB
Progress (3): 73/79 kB | 608/619 kB | 35 kB
Progress (3): 73/79 kB | 612/619 kB | 35 kB
Progress (3): 73/79 kB | 616/619 kB | 35 kB
Progress (3): 73/79 kB | 619 kB | 35 kB    
                                       
Downloaded from eclipse.maven.central.mirror: https://repo.eclipse.org/content/repositories/maven_central/org/apache/maven/scm/maven-scm-provider-git-commons/1.10.0/maven-scm-provider-git-commons-1.10.0.jar (35 kB at 64 kB/s)
03:46:20 Downloading from eclipse.maven.central.mirror: https://repo.eclipse.org/content/repositories/maven_central/org/apache/maven/doxia/doxia-core/1.8/doxia-core-1.8.jar
03:46:20 Progress (3): 73/79 kB | 619 kB | 4.1/12 kB
Progress (3): 73/79 kB | 619 kB | 7.7/12 kB
Progress (3): 73/79 kB | 619 kB | 12/12 kB 
Progress (3): 73/79 kB | 619 kB | 12 kB   
Progress (4): 73/79 kB | 619 kB | 12 kB | 4.1/69 kB
Progress (4): 73/79 kB | 619 kB | 12 kB | 7.7/69 kB
Progress (4): 73/79 kB | 619 kB | 12 kB | 12/69 kB 
Progress (4): 73/79 kB | 619 kB | 12 kB | 16/69 kB
Progress (4): 73/79 kB | 619 kB | 12 kB | 20/69 kB
Progress (4): 73/79 kB | 619 kB | 12 kB | 24/69 kB
Progress (4): 73/79 kB | 619 kB | 12 kB | 28/69 kB
Progress (4): 73/79 kB | 619 kB | 12 kB | 32/69 kB
Progress (4): 73/79 kB | 619 kB | 12 kB | 33/69 kB
Progress (4): 73/79 kB | 619 kB | 12 kB | 37/69 kB
Progress (4): 73/79 kB | 619 kB | 12 kB | 41/69 kB
Progress (4): 73/79 kB | 619 kB | 12 kB | 45/69 kB
Progress (4): 73/79 kB | 619 kB | 12 kB | 49/69 kB
Progress (4): 73/79 kB | 619 kB | 12 kB | 53/69 kB
Progress (4): 73/79 kB | 619 kB | 12 kB | 57/69 kB
Progress (4): 73/79 kB | 619 kB | 12 kB | 61/69 kB
Progress (4): 73/79 kB | 619 kB | 12 kB | 65/69 kB
Progress (4): 73/79 kB | 619 kB | 12 kB | 69/69 kB
Progress (4): 73/79 kB | 619 kB | 12 kB | 69 kB   
                                               
Downloaded from eclipse.maven.central.mirror: https://repo.eclipse.org/content/repositories/maven_central/org/apache/maven/scm/maven-scm-provider-gitexe/1.10.0/maven-scm-provider-gitexe-1.10.0.jar (69 kB at 121 kB/s)
03:46:20 Downloading from eclipse.maven.central.mirror: https://repo.eclipse.org/content/repositories/maven_central/org/apache/commons/commons-lang3/3.5/commons-lang3-3.5.jar
03:46:20 Progress (4): 73/79 kB | 619 kB | 12 kB | 4.1/168 kB
Progress (4): 73/79 kB | 619 kB | 12 kB | 7.7/168 kB
Progress (4): 73/79 kB | 619 kB | 12 kB | 12/168 kB 
Progress (4): 73/79 kB | 619 kB | 12 kB | 16/168 kB
Progress (4): 73/79 kB | 619 kB | 12 kB | 20/168 kB
Progress (4): 73/79 kB | 619 kB | 12 kB | 24/168 kB
Progress (4): 73/79 kB | 619 kB | 12 kB | 28/168 kB
Progress (4): 73/79 kB | 619 kB | 12 kB | 32/168 kB
Progress (4): 73/79 kB | 619 kB | 12 kB | 33/168 kB
Progress (4): 73/79 kB | 619 kB | 12 kB | 37/168 kB
Progress (4): 73/79 kB | 619 kB | 12 kB | 41/168 kB
Progress (4): 73/79 kB | 619 kB | 12 kB | 45/168 kB
Progress (4): 73/79 kB | 619 kB | 12 kB | 49/168 kB
Progress (4): 73/79 kB | 619 kB | 12 kB | 53/168 kB
Progress (4): 73/79 kB | 619 kB | 12 kB | 57/168 kB
Progress (4): 73/79 kB | 619 kB | 12 kB | 61/168 kB
Progress (4): 73/79 kB | 619 kB | 12 kB | 65/168 kB
Progress (4): 73/79 kB | 619 kB | 12 kB | 66/168 kB
Progress (4): 73/79 kB | 619 kB | 12 kB | 70/168 kB
Progress (4): 73/79 kB | 619 kB | 12 kB | 74/168 kB
Progress (4): 73/79 kB | 619 kB | 12 kB | 78/168 kB
Progress (4): 73/79 kB | 619 kB | 12 kB | 82/168 kB
                                                   
Downloaded from eclipse.maven.central.mirror: https://repo.eclipse.org/content/repositories/maven_central/org/netbeans/lib/cvsclient/20060125/cvsclient-20060125.jar (619 kB at 1.1 MB/s)
03:46:20 Progress (3): 73/79 kB | 12 kB | 86/168 kB
                                          
Downloading from eclipse.maven.central.mirror: https://repo.eclipse.org/content/repositories/maven_central/org/apache/maven/doxia/doxia-decoration-model/1.8.1/doxia-decoration-model-1.8.1.jar
03:46:20 Progress (3): 73/79 kB | 12 kB | 90/168 kB
Progress (3): 73/79 kB | 12 kB | 94/168 kB
Progress (3): 73/79 kB | 12 kB | 98/168 kB
Progress (3): 73/79 kB | 12 kB | 102/168 kB
Progress (3): 73/79 kB | 12 kB | 106/168 kB
Progress (3): 73/79 kB | 12 kB | 110/168 kB
Progress (3): 73/79 kB | 12 kB | 114/168 kB
Progress (3): 73/79 kB | 12 kB | 118/168 kB
Progress (3): 73/79 kB | 12 kB | 122/168 kB
Progress (3): 73/79 kB | 12 kB | 126/168 kB
Progress (3): 73/79 kB | 12 kB | 130/168 kB
Progress (3): 73/79 kB | 12 kB | 134/168 kB
Progress (3): 73/79 kB | 12 kB | 138/168 kB
Progress (3): 73/79 kB | 12 kB | 142/168 kB
Progress (3): 73/79 kB | 12 kB | 146/168 kB
Progress (3): 73/79 kB | 12 kB | 150/168 kB
Progress (3): 73/79 kB | 12 kB | 154/168 kB
Progress (3): 73/79 kB | 12 kB | 158/168 kB
Progress (3): 73/79 kB | 12 kB | 162/168 kB
Progress (3): 73/79 kB | 12 kB | 166/168 kB
Progress (3): 73/79 kB | 12 kB | 168 kB    
                                       
Downloaded from eclipse.maven.central.mirror: https://repo.eclipse.org/content/repositories/maven_central/org/apache/maven/doxia/doxia-logging-api/1.8/doxia-logging-api-1.8.jar (12 kB at 20 kB/s)
03:46:20 Downloading from eclipse.maven.central.mirror: https://repo.eclipse.org/content/repositories/maven_central/org/apache/maven/doxia/doxia-skin-model/1.8.1/doxia-skin-model-1.8.1.jar
03:46:20 Downloaded from eclipse.maven.central.mirror: https://repo.eclipse.org/content/repositories/maven_central/org/apache/maven/doxia/doxia-core/1.8/doxia-core-1.8.jar (168 kB at 286 kB/s)
03:46:20 Downloading from eclipse.maven.central.mirror: https://repo.eclipse.org/content/repositories/maven_central/org/apache/maven/doxia/doxia-module-xhtml/1.8/doxia-module-xhtml-1.8.jar
03:46:20 Progress (2): 73/79 kB | 4.1/480 kB
Progress (2): 73/79 kB | 7.7/480 kB
Progress (2): 73/79 kB | 12/480 kB 
Progress (2): 73/79 kB | 16/480 kB
Progress (2): 73/79 kB | 20/480 kB
Progress (2): 73/79 kB | 24/480 kB
Progress (2): 73/79 kB | 28/480 kB
Progress (2): 73/79 kB | 32/480 kB
Progress (2): 73/79 kB | 36/480 kB
Progress (2): 73/79 kB | 40/480 kB
Progress (2): 73/79 kB | 44/480 kB
Progress (2): 73/79 kB | 48/480 kB
Progress (2): 73/79 kB | 52/480 kB
Progress (2): 73/79 kB | 56/480 kB
Progress (2): 73/79 kB | 60/480 kB
Progress (2): 73/79 kB | 64/480 kB
Progress (2): 73/79 kB | 68/480 kB
Progress (2): 73/79 kB | 72/480 kB
Progress (2): 73/79 kB | 76/480 kB
Progress (2): 73/79 kB | 80/480 kB
Progress (2): 73/79 kB | 84/480 kB
Progress (2): 73/79 kB | 88/480 kB
Progress (2): 73/79 kB | 92/480 kB
Progress (2): 73/79 kB | 96/480 kB
Progress (2): 73/79 kB | 98/480 kB
Progress (2): 73/79 kB | 102/480 kB
Progress (2): 73/79 kB | 106/480 kB
Progress (2): 73/79 kB | 110/480 kB
Progress (2): 73/79 kB | 114/480 kB
Progress (2): 73/79 kB | 118/480 kB
Progress (2): 73/79 kB | 122/480 kB
Progress (2): 73/79 kB | 126/480 kB
Progress (2): 73/79 kB | 130/480 kB
Progress (2): 73/79 kB | 134/480 kB
Progress (2): 73/79 kB | 138/480 kB
Progress (2): 73/79 kB | 142/480 kB
Progress (2): 73/79 kB | 146/480 kB
Progress (2): 73/79 kB | 150/480 kB
Progress (2): 73/79 kB | 154/480 kB
Progress (3): 73/79 kB | 154/480 kB | 4.1/61 kB
Progress (3): 73/79 kB | 154/480 kB | 7.7/61 kB
Progress (3): 73/79 kB | 158/480 kB | 7.7/61 kB
Progress (3): 73/79 kB | 162/480 kB | 7.7/61 kB
Progress (3): 73/79 kB | 164/480 kB | 7.7/61 kB
Progress (3): 73/79 kB | 164/480 kB | 12/61 kB 
Progress (3): 73/79 kB | 164/480 kB | 16/61 kB
Progress (3): 73/79 kB | 168/480 kB | 16/61 kB
Progress (3): 73/79 kB | 172/480 kB | 16/61 kB
Progress (3): 73/79 kB | 172/480 kB | 20/61 kB
Progress (4): 73/79 kB | 172/480 kB | 20/61 kB | 4.1/16 kB
Progress (4): 73/79 kB | 172/480 kB | 24/61 kB | 4.1/16 kB
Progress (4): 73/79 kB | 176/480 kB | 24/61 kB | 4.1/16 kB
Progress (4): 73/79 kB | 176/480 kB | 24/61 kB | 7.7/16 kB
Progress (4): 73/79 kB | 180/480 kB | 24/61 kB | 7.7/16 kB
Progress (4): 73/79 kB | 180/480 kB | 28/61 kB | 7.7/16 kB
Progress (4): 73/79 kB | 180/480 kB | 32/61 kB | 7.7/16 kB
Progress (4): 73/79 kB | 184/480 kB | 32/61 kB | 7.7/16 kB
Progress (4): 73/79 kB | 184/480 kB | 32/61 kB | 12/16 kB 
Progress (4): 73/79 kB | 188/480 kB | 32/61 kB | 12/16 kB
Progress (4): 73/79 kB | 188/480 kB | 32/61 kB | 16/16 kB
Progress (4): 73/79 kB | 188/480 kB | 36/61 kB | 16/16 kB
Progress (4): 73/79 kB | 188/480 kB | 36/61 kB | 16 kB   
Progress (4): 73/79 kB | 188/480 kB | 40/61 kB | 16 kB
Progress (4): 73/79 kB | 192/480 kB | 40/61 kB | 16 kB
Progress (4): 73/79 kB | 196/480 kB | 40/61 kB | 16 kB
Progress (4): 73/79 kB | 197/480 kB | 40/61 kB | 16 kB
Progress (4): 73/79 kB | 197/480 kB | 44/61 kB | 16 kB
Progress (4): 73/79 kB | 197/480 kB | 48/61 kB | 16 kB
Progress (4): 73/79 kB | 197/480 kB | 52/61 kB | 16 kB
Progress (4): 73/79 kB | 197/480 kB | 56/61 kB | 16 kB
Progress (4): 73/79 kB | 197/480 kB | 60/61 kB | 16 kB
Progress (4): 73/79 kB | 197/480 kB | 61 kB | 16 kB   
Progress (4): 73/79 kB | 201/480 kB | 61 kB | 16 kB
Progress (4): 73/79 kB | 205/480 kB | 61 kB | 16 kB
Progress (4): 73/79 kB | 209/480 kB | 61 kB | 16 kB
Progress (4): 73/79 kB | 213/480 kB | 61 kB | 16 kB
Progress (4): 73/79 kB | 217/480 kB | 61 kB | 16 kB
Progress (4): 73/79 kB | 221/480 kB | 61 kB | 16 kB
Progress (4): 73/79 kB | 225/480 kB | 61 kB | 16 kB
Progress (4): 73/79 kB | 229/480 kB | 61 kB | 16 kB
Progress (4): 73/79 kB | 229/480 kB | 61 kB | 16 kB
Progress (4): 73/79 kB | 233/480 kB | 61 kB | 16 kB
Progress (4): 73/79 kB | 237/480 kB | 61 kB | 16 kB
Progress (4): 73/79 kB | 241/480 kB | 61 kB | 16 kB
Progress (4): 73/79 kB | 245/480 kB | 61 kB | 16 kB
Progress (4): 73/79 kB | 249/480 kB | 61 kB | 16 kB
Progress (4): 73/79 kB | 253/480 kB | 61 kB | 16 kB
Progress (4): 73/79 kB | 257/480 kB | 61 kB | 16 kB
Progress (4): 73/79 kB | 261/480 kB | 61 kB | 16 kB
Progress (4): 73/79 kB | 262/480 kB | 61 kB | 16 kB
Progress (4): 73/79 kB | 266/480 kB | 61 kB | 16 kB
Progress (4): 73/79 kB | 270/480 kB | 61 kB | 16 kB
Progress (4): 73/79 kB | 274/480 kB | 61 kB | 16 kB
Progress (4): 73/79 kB | 278/480 kB | 61 kB | 16 kB
Progress (4): 73/79 kB | 282/480 kB | 61 kB | 16 kB
Progress (4): 73/79 kB | 286/480 kB | 61 kB | 16 kB
Progress (4): 73/79 kB | 290/480 kB | 61 kB | 16 kB
Progress (4): 73/79 kB | 294/480 kB | 61 kB | 16 kB
Progress (4): 73/79 kB | 295/480 kB | 61 kB | 16 kB
Progress (4): 73/79 kB | 299/480 kB | 61 kB | 16 kB
Progress (4): 73/79 kB | 303/480 kB | 61 kB | 16 kB
Progress (4): 73/79 kB | 307/480 kB | 61 kB | 16 kB
Progress (4): 73/79 kB | 311/480 kB | 61 kB | 16 kB
Progress (4): 73/79 kB | 315/480 kB | 61 kB | 16 kB
Progress (4): 73/79 kB | 319/480 kB | 61 kB | 16 kB
Progress (4): 73/79 kB | 323/480 kB | 61 kB | 16 kB
Progress (4): 73/79 kB | 327/480 kB | 61 kB | 16 kB
Progress (4): 73/79 kB | 328/480 kB | 61 kB | 16 kB
Progress (4): 73/79 kB | 332/480 kB | 61 kB | 16 kB
Progress (4): 73/79 kB | 336/480 kB | 61 kB | 16 kB
Progress (4): 73/79 kB | 340/480 kB | 61 kB | 16 kB
Progress (4): 73/79 kB | 344/480 kB | 61 kB | 16 kB
Progress (4): 73/79 kB | 348/480 kB | 61 kB | 16 kB
Progress (4): 73/79 kB | 352/480 kB | 61 kB | 16 kB
Progress (4): 73/79 kB | 356/480 kB | 61 kB | 16 kB
Progress (4): 73/79 kB | 360/480 kB | 61 kB | 16 kB
Progress (4): 73/79 kB | 360/480 kB | 61 kB | 16 kB
                                                   
Downloaded from eclipse.maven.central.mirror: https://repo.eclipse.org/content/repositories/maven_central/org/apache/maven/doxia/doxia-decoration-model/1.8.1/doxia-decoration-model-1.8.1.jar (61 kB at 98 kB/s)
03:46:20 Progress (3): 73/79 kB | 365/480 kB | 16 kB
                                           
Downloading from eclipse.maven.central.mirror: https://repo.eclipse.org/content/repositories/maven_central/org/codehaus/plexus/plexus-velocity/1.2/plexus-velocity-1.2.jar
03:46:20 Progress (3): 73/79 kB | 368/480 kB | 16 kB
Progress (3): 73/79 kB | 373/480 kB | 16 kB
                                           
Downloaded from eclipse.maven.central.mirror: https://repo.eclipse.org/content/repositories/maven_central/org/apache/maven/doxia/doxia-skin-model/1.8.1/doxia-skin-model-1.8.1.jar (16 kB at 26 kB/s)
03:46:20 Progress (2): 73/79 kB | 376/480 kB
                                   
Downloading from eclipse.maven.central.mirror: https://repo.eclipse.org/content/repositories/maven_central/org/apache/velocity/velocity/1.7/velocity-1.7.jar
03:46:20 Progress (2): 73/79 kB | 381/480 kB
Progress (2): 73/79 kB | 384/480 kB
Progress (2): 73/79 kB | 389/480 kB
Progress (2): 73/79 kB | 392/480 kB
Progress (2): 73/79 kB | 393/480 kB
Progress (2): 73/79 kB | 397/480 kB
Progress (2): 73/79 kB | 401/480 kB
Progress (2): 73/79 kB | 405/480 kB
Progress (2): 73/79 kB | 409/480 kB
Progress (2): 73/79 kB | 413/480 kB
Progress (2): 73/79 kB | 417/480 kB
Progress (2): 73/79 kB | 421/480 kB
Progress (2): 73/79 kB | 425/480 kB
Progress (2): 73/79 kB | 426/480 kB
Progress (2): 73/79 kB | 430/480 kB
Progress (2): 73/79 kB | 434/480 kB
Progress (2): 73/79 kB | 438/480 kB
Progress (2): 73/79 kB | 442/480 kB
Progress (2): 73/79 kB | 446/480 kB
Progress (2): 73/79 kB | 450/480 kB
Progress (2): 73/79 kB | 454/480 kB
Progress (2): 73/79 kB | 458/480 kB
Progress (2): 73/79 kB | 462/480 kB
Progress (2): 73/79 kB | 466/480 kB
Progress (2): 73/79 kB | 470/480 kB
Progress (2): 73/79 kB | 474/480 kB
Progress (2): 73/79 kB | 478/480 kB
Progress (2): 73/79 kB | 480 kB    
Progress (3): 73/79 kB | 480 kB | 4.1/18 kB
Progress (3): 73/79 kB | 480 kB | 7.7/18 kB
Progress (3): 73/79 kB | 480 kB | 12/18 kB 
Progress (3): 73/79 kB | 480 kB | 16/18 kB
Progress (3): 73/79 kB | 480 kB | 18 kB   
                                       
Downloaded from eclipse.maven.central.mirror: https://repo.eclipse.org/content/repositories/maven_central/org/apache/commons/commons-lang3/3.5/commons-lang3-3.5.jar (480 kB at 743 kB/s)
03:46:20 Downloading from eclipse.maven.central.mirror: https://repo.eclipse.org/content/repositories/maven_central/org/apache/maven/doxia/doxia-integration-tools/1.8.1/doxia-integration-tools-1.8.1.jar
03:46:20 Progress (3): 73/79 kB | 18 kB | 4.1/450 kB
Progress (3): 73/79 kB | 18 kB | 7.7/450 kB
Progress (3): 73/79 kB | 18 kB | 12/450 kB 
Progress (3): 73/79 kB | 18 kB | 16/450 kB
Progress (3): 73/79 kB | 18 kB | 20/450 kB
Progress (3): 73/79 kB | 18 kB | 24/450 kB
Progress (3): 73/79 kB | 18 kB | 28/450 kB
Progress (3): 73/79 kB | 18 kB | 32/450 kB
Progress (3): 73/79 kB | 18 kB | 36/450 kB
Progress (3): 73/79 kB | 18 kB | 40/450 kB
Progress (3): 73/79 kB | 18 kB | 44/450 kB
Progress (3): 73/79 kB | 18 kB | 48/450 kB
Progress (3): 73/79 kB | 18 kB | 52/450 kB
Progress (3): 73/79 kB | 18 kB | 56/450 kB
Progress (3): 73/79 kB | 18 kB | 60/450 kB
Progress (3): 73/79 kB | 18 kB | 64/450 kB
Progress (3): 73/79 kB | 18 kB | 68/450 kB
Progress (3): 73/79 kB | 18 kB | 72/450 kB
Progress (3): 73/79 kB | 18 kB | 76/450 kB
Progress (3): 73/79 kB | 18 kB | 80/450 kB
Progress (3): 73/79 kB | 18 kB | 84/450 kB
Progress (3): 73/79 kB | 18 kB | 88/450 kB
Progress (3): 73/79 kB | 18 kB | 92/450 kB
Progress (3): 73/79 kB | 18 kB | 96/450 kB
Progress (3): 73/79 kB | 18 kB | 100/450 kB
                                           
Downloaded from eclipse.maven.central.mirror: https://repo.eclipse.org/content/repositories/maven_central/org/apache/maven/doxia/doxia-module-xhtml/1.8/doxia-module-xhtml-1.8.jar (18 kB at 27 kB/s)
03:46:20 Progress (3): 73/79 kB | 100/450 kB | 4.1/8.1 kB
Progress (3): 73/79 kB | 104/450 kB | 4.1/8.1 kB
Progress (3): 73/79 kB | 104/450 kB | 7.7/8.1 kB
                                                
Downloading from eclipse.maven.central.mirror: https://repo.eclipse.org/content/repositories/maven_central/org/codehaus/plexus/plexus-i18n/1.0-beta-10/plexus-i18n-1.0-beta-10.jar
03:46:21 Progress (3): 73/79 kB | 108/450 kB | 7.7/8.1 kB
Progress (3): 73/79 kB | 112/450 kB | 7.7/8.1 kB
Progress (3): 73/79 kB | 116/450 kB | 7.7/8.1 kB
Progress (3): 73/79 kB | 120/450 kB | 7.7/8.1 kB
Progress (3): 73/79 kB | 124/450 kB | 7.7/8.1 kB
Progress (3): 73/79 kB | 128/450 kB | 7.7/8.1 kB
Progress (3): 73/79 kB | 132/450 kB | 7.7/8.1 kB
Progress (3): 73/79 kB | 136/450 kB | 7.7/8.1 kB
Progress (3): 73/79 kB | 140/450 kB | 7.7/8.1 kB
Progress (3): 73/79 kB | 144/450 kB | 7.7/8.1 kB
Progress (3): 73/79 kB | 148/450 kB | 7.7/8.1 kB
Progress (3): 73/79 kB | 152/450 kB | 7.7/8.1 kB
Progress (3): 73/79 kB | 156/450 kB | 7.7/8.1 kB
Progress (3): 73/79 kB | 160/450 kB | 7.7/8.1 kB
Progress (3): 73/79 kB | 164/450 kB | 7.7/8.1 kB
Progress (3): 73/79 kB | 168/450 kB | 7.7/8.1 kB
Progress (3): 73/79 kB | 172/450 kB | 7.7/8.1 kB
Progress (3): 73/79 kB | 176/450 kB | 7.7/8.1 kB
Progress (3): 73/79 kB | 180/450 kB | 7.7/8.1 kB
Progress (3): 73/79 kB | 184/450 kB | 7.7/8.1 kB
Progress (3): 73/79 kB | 184/450 kB | 8.1 kB    
Progress (3): 73/79 kB | 188/450 kB | 8.1 kB
Progress (3): 73/79 kB | 192/450 kB | 8.1 kB
Progress (3): 73/79 kB | 196/450 kB | 8.1 kB
Progress (3): 73/79 kB | 197/450 kB | 8.1 kB
Progress (3): 73/79 kB | 201/450 kB | 8.1 kB
Progress (3): 73/79 kB | 205/450 kB | 8.1 kB
Progress (3): 73/79 kB | 209/450 kB | 8.1 kB
Progress (3): 73/79 kB | 213/450 kB | 8.1 kB
Progress (3): 73/79 kB | 217/450 kB | 8.1 kB
Progress (3): 73/79 kB | 221/450 kB | 8.1 kB
Progress (3): 73/79 kB | 225/450 kB | 8.1 kB
Progress (3): 73/79 kB | 229/450 kB | 8.1 kB
Progress (3): 73/79 kB | 229/450 kB | 8.1 kB
Progress (3): 73/79 kB | 233/450 kB | 8.1 kB
Progress (3): 73/79 kB | 237/450 kB | 8.1 kB
Progress (3): 73/79 kB | 241/450 kB | 8.1 kB
Progress (3): 73/79 kB | 245/450 kB | 8.1 kB
Progress (3): 73/79 kB | 249/450 kB | 8.1 kB
Progress (3): 73/79 kB | 253/450 kB | 8.1 kB
Progress (3): 73/79 kB | 257/450 kB | 8.1 kB
Progress (3): 73/79 kB | 261/450 kB | 8.1 kB
Progress (3): 73/79 kB | 262/450 kB | 8.1 kB
Progress (3): 73/79 kB | 266/450 kB | 8.1 kB
Progress (3): 73/79 kB | 270/450 kB | 8.1 kB
Progress (3): 73/79 kB | 274/450 kB | 8.1 kB
Progress (3): 73/79 kB | 278/450 kB | 8.1 kB
Progress (3): 73/79 kB | 282/450 kB | 8.1 kB
Progress (3): 73/79 kB | 286/450 kB | 8.1 kB
Progress (3): 73/79 kB | 290/450 kB | 8.1 kB
Progress (3): 73/79 kB | 294/450 kB | 8.1 kB
Progress (3): 73/79 kB | 295/450 kB | 8.1 kB
Progress (3): 73/79 kB | 299/450 kB | 8.1 kB
Progress (3): 73/79 kB | 303/450 kB | 8.1 kB
Progress (3): 73/79 kB | 307/450 kB | 8.1 kB
Progress (3): 73/79 kB | 311/450 kB | 8.1 kB
Progress (3): 73/79 kB | 315/450 kB | 8.1 kB
Progress (3): 73/79 kB | 319/450 kB | 8.1 kB
Progress (3): 73/79 kB | 323/450 kB | 8.1 kB
Progress (3): 73/79 kB | 327/450 kB | 8.1 kB
Progress (3): 73/79 kB | 328/450 kB | 8.1 kB
Progress (3): 73/79 kB | 332/450 kB | 8.1 kB
Progress (3): 73/79 kB | 336/450 kB | 8.1 kB
Progress (3): 73/79 kB | 340/450 kB | 8.1 kB
Progress (3): 73/79 kB | 344/450 kB | 8.1 kB
Progress (3): 73/79 kB | 348/450 kB | 8.1 kB
Progress (3): 73/79 kB | 352/450 kB | 8.1 kB
Progress (3): 73/79 kB | 356/450 kB | 8.1 kB
Progress (3): 73/79 kB | 360/450 kB | 8.1 kB
Progress (3): 73/79 kB | 360/450 kB | 8.1 kB
Progress (3): 73/79 kB | 365/450 kB | 8.1 kB
Progress (3): 73/79 kB | 368/450 kB | 8.1 kB
Progress (3): 73/79 kB | 373/450 kB | 8.1 kB
Progress (3): 73/79 kB | 376/450 kB | 8.1 kB
Progress (3): 73/79 kB | 381/450 kB | 8.1 kB
Progress (3): 73/79 kB | 384/450 kB | 8.1 kB
Progress (3): 73/79 kB | 389/450 kB | 8.1 kB
Progress (3): 73/79 kB | 392/450 kB | 8.1 kB
Progress (3): 73/79 kB | 393/450 kB | 8.1 kB
Progress (3): 73/79 kB | 397/450 kB | 8.1 kB
Progress (3): 73/79 kB | 401/450 kB | 8.1 kB
Progress (3): 73/79 kB | 405/450 kB | 8.1 kB
Progress (3): 73/79 kB | 409/450 kB | 8.1 kB
Progress (3): 73/79 kB | 413/450 kB | 8.1 kB
Progress (3): 73/79 kB | 417/450 kB | 8.1 kB
Progress (3): 73/79 kB | 421/450 kB | 8.1 kB
Progress (3): 73/79 kB | 425/450 kB | 8.1 kB
Progress (3): 73/79 kB | 429/450 kB | 8.1 kB
Progress (3): 73/79 kB | 433/450 kB | 8.1 kB
Progress (3): 73/79 kB | 437/450 kB | 8.1 kB
Progress (3): 73/79 kB | 441/450 kB | 8.1 kB
Progress (3): 73/79 kB | 445/450 kB | 8.1 kB
Progress (3): 73/79 kB | 449/450 kB | 8.1 kB
Progress (3): 73/79 kB | 450 kB | 8.1 kB    
Progress (4): 73/79 kB | 450 kB | 8.1 kB | 4.1/47 kB
Progress (4): 73/79 kB | 450 kB | 8.1 kB | 7.7/47 kB
Progress (4): 73/79 kB | 450 kB | 8.1 kB | 12/47 kB 
Progress (4): 73/79 kB | 450 kB | 8.1 kB | 16/47 kB
Progress (4): 73/79 kB | 450 kB | 8.1 kB | 20/47 kB
Progress (4): 73/79 kB | 450 kB | 8.1 kB | 24/47 kB
Progress (4): 73/79 kB | 450 kB | 8.1 kB | 28/47 kB
Progress (4): 73/79 kB | 450 kB | 8.1 kB | 32/47 kB
Progress (4): 73/79 kB | 450 kB | 8.1 kB | 36/47 kB
Progress (4): 73/79 kB | 450 kB | 8.1 kB | 40/47 kB
Progress (4): 73/79 kB | 450 kB | 8.1 kB | 44/47 kB
Progress (4): 73/79 kB | 450 kB | 8.1 kB | 47 kB   
Progress (5): 73/79 kB | 450 kB | 8.1 kB | 47 kB | 4.1/12 kB
Progress (5): 73/79 kB | 450 kB | 8.1 kB | 47 kB | 7.7/12 kB
Progress (5): 73/79 kB | 450 kB | 8.1 kB | 47 kB | 12/12 kB 
Progress (5): 73/79 kB | 450 kB | 8.1 kB | 47 kB | 12 kB   
Progress (5): 77/79 kB | 450 kB | 8.1 kB | 47 kB | 12 kB
Progress (5): 79 kB | 450 kB | 8.1 kB | 47 kB | 12 kB   
                                                     
Downloaded from eclipse.maven.central.mirror: https://repo.eclipse.org/content/repositories/maven_central/org/apache/velocity/velocity/1.7/velocity-1.7.jar (450 kB at 486 kB/s)
03:46:21 Downloading from eclipse.maven.central.mirror: https://repo.eclipse.org/content/repositories/maven_central/org/codehaus/plexus/plexus-utils/3.1.0/plexus-utils-3.1.0.jar
03:46:21 Downloaded from eclipse.maven.central.mirror: https://repo.eclipse.org/content/repositories/maven_central/org/apache/maven/scm/maven-scm-provider-cvs-commons/1.10.0/maven-scm-provider-cvs-commons-1.10.0.jar (79 kB at 83 kB/s)
03:46:21 Downloading from eclipse.maven.central.mirror: https://repo.eclipse.org/content/repositories/maven_central/org/codehaus/plexus/plexus-interpolation/1.25/plexus-interpolation-1.25.jar
03:46:21 Progress (4): 8.1 kB | 47 kB | 12 kB | 4.1/85 kB
Progress (4): 8.1 kB | 47 kB | 12 kB | 7.7/85 kB
Progress (4): 8.1 kB | 47 kB | 12 kB | 12/85 kB 
Progress (4): 8.1 kB | 47 kB | 12 kB | 16/85 kB
Progress (4): 8.1 kB | 47 kB | 12 kB | 20/85 kB
Progress (4): 8.1 kB | 47 kB | 12 kB | 24/85 kB
Progress (4): 8.1 kB | 47 kB | 12 kB | 28/85 kB
Progress (4): 8.1 kB | 47 kB | 12 kB | 32/85 kB
Progress (4): 8.1 kB | 47 kB | 12 kB | 36/85 kB
Progress (4): 8.1 kB | 47 kB | 12 kB | 40/85 kB
Progress (4): 8.1 kB | 47 kB | 12 kB | 44/85 kB
Progress (4): 8.1 kB | 47 kB | 12 kB | 48/85 kB
Progress (4): 8.1 kB | 47 kB | 12 kB | 52/85 kB
Progress (4): 8.1 kB | 47 kB | 12 kB | 56/85 kB
Progress (4): 8.1 kB | 47 kB | 12 kB | 60/85 kB
Progress (4): 8.1 kB | 47 kB | 12 kB | 64/85 kB
Progress (4): 8.1 kB | 47 kB | 12 kB | 68/85 kB
Progress (4): 8.1 kB | 47 kB | 12 kB | 72/85 kB
Progress (4): 8.1 kB | 47 kB | 12 kB | 76/85 kB
Progress (4): 8.1 kB | 47 kB | 12 kB | 80/85 kB
Progress (4): 8.1 kB | 47 kB | 12 kB | 84/85 kB
Progress (4): 8.1 kB | 47 kB | 12 kB | 85 kB   
                                            
Downloaded from eclipse.maven.central.mirror: https://repo.eclipse.org/content/repositories/maven_central/org/codehaus/plexus/plexus-interpolation/1.25/plexus-interpolation-1.25.jar (85 kB at 86 kB/s)
03:46:21 Downloading from eclipse.maven.central.mirror: https://repo.eclipse.org/content/repositories/maven_central/org/apache/maven/wagon/wagon-http-lightweight/3.1.0/wagon-http-lightweight-3.1.0.jar
03:46:21 Progress (4): 8.1 kB | 47 kB | 12 kB | 4.1/262 kB
Progress (4): 8.1 kB | 47 kB | 12 kB | 7.7/262 kB
Progress (4): 8.1 kB | 47 kB | 12 kB | 12/262 kB 
Progress (4): 8.1 kB | 47 kB | 12 kB | 16/262 kB
Progress (4): 8.1 kB | 47 kB | 12 kB | 20/262 kB
Progress (4): 8.1 kB | 47 kB | 12 kB | 24/262 kB
Progress (4): 8.1 kB | 47 kB | 12 kB | 28/262 kB
Progress (4): 8.1 kB | 47 kB | 12 kB | 32/262 kB
Progress (4): 8.1 kB | 47 kB | 12 kB | 36/262 kB
Progress (4): 8.1 kB | 47 kB | 12 kB | 40/262 kB
Progress (4): 8.1 kB | 47 kB | 12 kB | 44/262 kB
Progress (4): 8.1 kB | 47 kB | 12 kB | 48/262 kB
Progress (4): 8.1 kB | 47 kB | 12 kB | 52/262 kB
Progress (4): 8.1 kB | 47 kB | 12 kB | 56/262 kB
Progress (4): 8.1 kB | 47 kB | 12 kB | 60/262 kB
Progress (4): 8.1 kB | 47 kB | 12 kB | 64/262 kB
Progress (4): 8.1 kB | 47 kB | 12 kB | 68/262 kB
Progress (4): 8.1 kB | 47 kB | 12 kB | 72/262 kB
Progress (4): 8.1 kB | 47 kB | 12 kB | 76/262 kB
Progress (4): 8.1 kB | 47 kB | 12 kB | 80/262 kB
Progress (4): 8.1 kB | 47 kB | 12 kB | 84/262 kB
Progress (4): 8.1 kB | 47 kB | 12 kB | 88/262 kB
Progress (4): 8.1 kB | 47 kB | 12 kB | 92/262 kB
Progress (4): 8.1 kB | 47 kB | 12 kB | 96/262 kB
Progress (4): 8.1 kB | 47 kB | 12 kB | 98/262 kB
Progress (4): 8.1 kB | 47 kB | 12 kB | 102/262 kB
Progress (4): 8.1 kB | 47 kB | 12 kB | 106/262 kB
Progress (4): 8.1 kB | 47 kB | 12 kB | 110/262 kB
Progress (4): 8.1 kB | 47 kB | 12 kB | 114/262 kB
Progress (4): 8.1 kB | 47 kB | 12 kB | 118/262 kB
Progress (4): 8.1 kB | 47 kB | 12 kB | 122/262 kB
Progress (4): 8.1 kB | 47 kB | 12 kB | 126/262 kB
Progress (4): 8.1 kB | 47 kB | 12 kB | 130/262 kB
Progress (4): 8.1 kB | 47 kB | 12 kB | 134/262 kB
Progress (4): 8.1 kB | 47 kB | 12 kB | 138/262 kB
Progress (4): 8.1 kB | 47 kB | 12 kB | 142/262 kB
Progress (4): 8.1 kB | 47 kB | 12 kB | 146/262 kB
Progress (4): 8.1 kB | 47 kB | 12 kB | 150/262 kB
Progress (4): 8.1 kB | 47 kB | 12 kB | 154/262 kB
Progress (4): 8.1 kB | 47 kB | 12 kB | 158/262 kB
Progress (4): 8.1 kB | 47 kB | 12 kB | 162/262 kB
Progress (4): 8.1 kB | 47 kB | 12 kB | 166/262 kB
Progress (4): 8.1 kB | 47 kB | 12 kB | 170/262 kB
Progress (4): 8.1 kB | 47 kB | 12 kB | 174/262 kB
Progress (4): 8.1 kB | 47 kB | 12 kB | 178/262 kB
Progress (4): 8.1 kB | 47 kB | 12 kB | 182/262 kB
Progress (4): 8.1 kB | 47 kB | 12 kB | 186/262 kB
Progress (4): 8.1 kB | 47 kB | 12 kB | 190/262 kB
Progress (4): 8.1 kB | 47 kB | 12 kB | 194/262 kB
Progress (4): 8.1 kB | 47 kB | 12 kB | 198/262 kB
Progress (4): 8.1 kB | 47 kB | 12 kB | 202/262 kB
Progress (4): 8.1 kB | 47 kB | 12 kB | 206/262 kB
Progress (4): 8.1 kB | 47 kB | 12 kB | 210/262 kB
Progress (4): 8.1 kB | 47 kB | 12 kB | 214/262 kB
Progress (4): 8.1 kB | 47 kB | 12 kB | 218/262 kB
Progress (4): 8.1 kB | 47 kB | 12 kB | 222/262 kB
Progress (4): 8.1 kB | 47 kB | 12 kB | 226/262 kB
Progress (4): 8.1 kB | 47 kB | 12 kB | 230/262 kB
Progress (4): 8.1 kB | 47 kB | 12 kB | 234/262 kB
Progress (4): 8.1 kB | 47 kB | 12 kB | 238/262 kB
Progress (4): 8.1 kB | 47 kB | 12 kB | 242/262 kB
Progress (4): 8.1 kB | 47 kB | 12 kB | 246/262 kB
Progress (4): 8.1 kB | 47 kB | 12 kB | 250/262 kB
Progress (4): 8.1 kB | 47 kB | 12 kB | 254/262 kB
Progress (4): 8.1 kB | 47 kB | 12 kB | 258/262 kB
Progress (4): 8.1 kB | 47 kB | 12 kB | 262 kB    
                                             
Downloaded from eclipse.maven.central.mirror: https://repo.eclipse.org/content/repositories/maven_central/org/codehaus/plexus/plexus-utils/3.1.0/plexus-utils-3.1.0.jar (262 kB at 220 kB/s)
03:46:21 Downloading from eclipse.maven.central.mirror: https://repo.eclipse.org/content/repositories/maven_central/org/apache/maven/wagon/wagon-http-shared/3.1.0/wagon-http-shared-3.1.0.jar
03:46:21 Downloaded from eclipse.maven.central.mirror: https://repo.eclipse.org/content/repositories/maven_central/org/apache/maven/doxia/doxia-integration-tools/1.8.1/doxia-integration-tools-1.8.1.jar (47 kB at 37 kB/s)
03:46:21 Downloading from eclipse.maven.central.mirror: https://repo.eclipse.org/content/repositories/maven_central/org/jsoup/jsoup/1.11.2/jsoup-1.11.2.jar
03:46:21 Downloaded from eclipse.maven.central.mirror: https://repo.eclipse.org/content/repositories/maven_central/org/codehaus/plexus/plexus-velocity/1.2/plexus-velocity-1.2.jar (8.1 kB at 6.3 kB/s)
03:46:21 Downloading from eclipse.maven.central.mirror: https://repo.eclipse.org/content/repositories/maven_central/org/apache/maven/wagon/wagon-provider-api/3.1.0/wagon-provider-api-3.1.0.jar
03:46:21 Downloaded from eclipse.maven.central.mirror: https://repo.eclipse.org/content/repositories/maven_central/org/codehaus/plexus/plexus-i18n/1.0-beta-10/plexus-i18n-1.0-beta-10.jar (12 kB at 9.2 kB/s)
03:46:21 Downloading from eclipse.maven.central.mirror: https://repo.eclipse.org/content/repositories/maven_central/commons-validator/commons-validator/1.6/commons-validator-1.6.jar
03:46:21 Progress (1): 4.1/392 kB
Progress (1): 7.7/392 kB
Progress (1): 12/392 kB 
Progress (1): 16/392 kB
Progress (1): 20/392 kB
Progress (1): 24/392 kB
Progress (1): 28/392 kB
Progress (1): 32/392 kB
Progress (1): 33/392 kB
Progress (1): 37/392 kB
Progress (1): 41/392 kB
Progress (1): 45/392 kB
Progress (1): 49/392 kB
Progress (1): 53/392 kB
Progress (2): 53/392 kB | 4.1/17 kB
Progress (2): 57/392 kB | 4.1/17 kB
Progress (2): 57/392 kB | 7.7/17 kB
Progress (2): 61/392 kB | 7.7/17 kB
Progress (2): 65/392 kB | 7.7/17 kB
Progress (2): 65/392 kB | 12/17 kB 
Progress (2): 66/392 kB | 12/17 kB
Progress (2): 66/392 kB | 16/17 kB
Progress (2): 66/392 kB | 17 kB   
Progress (2): 70/392 kB | 17 kB
Progress (2): 74/392 kB | 17 kB
Progress (2): 78/392 kB | 17 kB
Progress (2): 82/392 kB | 17 kB
Progress (2): 86/392 kB | 17 kB
Progress (2): 90/392 kB | 17 kB
Progress (2): 94/392 kB | 17 kB
Progress (2): 98/392 kB | 17 kB
Progress (2): 102/392 kB | 17 kB
Progress (2): 106/392 kB | 17 kB
Progress (2): 110/392 kB | 17 kB
Progress (2): 114/392 kB | 17 kB
Progress (2): 118/392 kB | 17 kB
Progress (2): 122/392 kB | 17 kB
Progress (2): 126/392 kB | 17 kB
Progress (2): 130/392 kB | 17 kB
Progress (2): 134/392 kB | 17 kB
Progress (2): 138/392 kB | 17 kB
Progress (2): 142/392 kB | 17 kB
Progress (2): 146/392 kB | 17 kB
Progress (2): 150/392 kB | 17 kB
Progress (2): 154/392 kB | 17 kB
Progress (2): 158/392 kB | 17 kB
Progress (2): 162/392 kB | 17 kB
Progress (2): 164/392 kB | 17 kB
Progress (2): 168/392 kB | 17 kB
Progress (2): 172/392 kB | 17 kB
Progress (2): 176/392 kB | 17 kB
Progress (2): 180/392 kB | 17 kB
Progress (2): 184/392 kB | 17 kB
Progress (2): 188/392 kB | 17 kB
Progress (2): 192/392 kB | 17 kB
Progress (2): 196/392 kB | 17 kB
Progress (2): 200/392 kB | 17 kB
Progress (2): 204/392 kB | 17 kB
Progress (2): 208/392 kB | 17 kB
Progress (2): 212/392 kB | 17 kB
Progress (2): 216/392 kB | 17 kB
Progress (2): 220/392 kB | 17 kB
Progress (2): 224/392 kB | 17 kB
Progress (2): 228/392 kB | 17 kB
Progress (2): 232/392 kB | 17 kB
Progress (2): 236/392 kB | 17 kB
Progress (2): 240/392 kB | 17 kB
Progress (2): 244/392 kB | 17 kB
Progress (2): 248/392 kB | 17 kB
Progress (2): 252/392 kB | 17 kB
Progress (2): 256/392 kB | 17 kB
Progress (2): 260/392 kB | 17 kB
Progress (2): 264/392 kB | 17 kB
Progress (2): 268/392 kB | 17 kB
Progress (2): 272/392 kB | 17 kB
Progress (2): 276/392 kB | 17 kB
Progress (2): 280/392 kB | 17 kB
Progress (2): 284/392 kB | 17 kB
Progress (2): 288/392 kB | 17 kB
Progress (2): 292/392 kB | 17 kB
Progress (2): 296/392 kB | 17 kB
Progress (2): 300/392 kB | 17 kB
Progress (2): 304/392 kB | 17 kB
Progress (2): 308/392 kB | 17 kB
Progress (2): 312/392 kB | 17 kB
Progress (2): 316/392 kB | 17 kB
Progress (2): 320/392 kB | 17 kB
Progress (2): 324/392 kB | 17 kB
Progress (2): 328/392 kB | 17 kB
Progress (2): 332/392 kB | 17 kB
Progress (2): 336/392 kB | 17 kB
Progress (2): 340/392 kB | 17 kB
Progress (2): 344/392 kB | 17 kB
Progress (2): 348/392 kB | 17 kB
Progress (2): 352/392 kB | 17 kB
Progress (2): 356/392 kB | 17 kB
Progress (2): 360/392 kB | 17 kB
Progress (2): 364/392 kB | 17 kB
Progress (2): 368/392 kB | 17 kB
Progress (2): 372/392 kB | 17 kB
Progress (2): 376/392 kB | 17 kB
Progress (2): 380/392 kB | 17 kB
Progress (2): 384/392 kB | 17 kB
Progress (2): 388/392 kB | 17 kB
Progress (2): 392/392 kB | 17 kB
Progress (2): 392 kB | 17 kB    
                            
Downloaded from eclipse.maven.central.mirror: https://repo.eclipse.org/content/repositories/maven_central/org/apache/maven/wagon/wagon-http-lightweight/3.1.0/wagon-http-lightweight-3.1.0.jar (17 kB at 13 kB/s)
03:46:21 Downloading from eclipse.maven.central.mirror: https://repo.eclipse.org/content/repositories/maven_central/commons-beanutils/commons-beanutils/1.9.2/commons-beanutils-1.9.2.jar
03:46:21 Downloaded from eclipse.maven.central.mirror: https://repo.eclipse.org/content/repositories/maven_central/org/jsoup/jsoup/1.11.2/jsoup-1.11.2.jar (392 kB at 293 kB/s)
03:46:21 Downloading from eclipse.maven.central.mirror: https://repo.eclipse.org/content/repositories/maven_central/commons-digester/commons-digester/1.8.1/commons-digester-1.8.1.jar
03:46:21 Progress (1): 4.1/186 kB
Progress (1): 7.7/186 kB
Progress (1): 12/186 kB 
Progress (1): 16/186 kB
Progress (1): 20/186 kB
Progress (1): 24/186 kB
Progress (1): 28/186 kB
Progress (1): 32/186 kB
Progress (1): 36/186 kB
Progress (1): 40/186 kB
Progress (2): 40/186 kB | 4.1/55 kB
Progress (2): 44/186 kB | 4.1/55 kB
Progress (2): 44/186 kB | 7.7/55 kB
Progress (2): 48/186 kB | 7.7/55 kB
Progress (2): 48/186 kB | 12/55 kB 
Progress (2): 48/186 kB | 16/55 kB
Progress (2): 52/186 kB | 16/55 kB
Progress (2): 56/186 kB | 16/55 kB
Progress (2): 56/186 kB | 20/55 kB
Progress (2): 56/186 kB | 24/55 kB
Progress (2): 60/186 kB | 24/55 kB
Progress (2): 60/186 kB | 28/55 kB
Progress (2): 64/186 kB | 28/55 kB
Progress (2): 64/186 kB | 32/55 kB
Progress (2): 68/186 kB | 32/55 kB
Progress (3): 68/186 kB | 32/55 kB | 4.1/36 kB
Progress (3): 72/186 kB | 32/55 kB | 4.1/36 kB
Progress (3): 72/186 kB | 36/55 kB | 4.1/36 kB
Progress (3): 72/186 kB | 36/55 kB | 7.7/36 kB
Progress (3): 72/186 kB | 40/55 kB | 7.7/36 kB
Progress (3): 76/186 kB | 40/55 kB | 7.7/36 kB
Progress (3): 80/186 kB | 40/55 kB | 7.7/36 kB
Progress (3): 80/186 kB | 40/55 kB | 12/36 kB 
Progress (3): 80/186 kB | 44/55 kB | 12/36 kB
Progress (3): 80/186 kB | 44/55 kB | 16/36 kB
Progress (3): 80/186 kB | 48/55 kB | 16/36 kB
Progress (3): 84/186 kB | 48/55 kB | 16/36 kB
Progress (3): 88/186 kB | 48/55 kB | 16/36 kB
Progress (3): 88/186 kB | 52/55 kB | 16/36 kB
Progress (3): 88/186 kB | 52/55 kB | 20/36 kB
Progress (3): 88/186 kB | 55 kB | 20/36 kB   
Progress (3): 88/186 kB | 55 kB | 24/36 kB
Progress (3): 92/186 kB | 55 kB | 24/36 kB
Progress (3): 96/186 kB | 55 kB | 24/36 kB
Progress (3): 96/186 kB | 55 kB | 28/36 kB
Progress (3): 98/186 kB | 55 kB | 28/36 kB
Progress (3): 98/186 kB | 55 kB | 32/36 kB
Progress (3): 98/186 kB | 55 kB | 36/36 kB
Progress (3): 98/186 kB | 55 kB | 36 kB   
Progress (3): 102/186 kB | 55 kB | 36 kB
Progress (3): 106/186 kB | 55 kB | 36 kB
Progress (3): 110/186 kB | 55 kB | 36 kB
Progress (3): 114/186 kB | 55 kB | 36 kB
Progress (3): 118/186 kB | 55 kB | 36 kB
Progress (3): 122/186 kB | 55 kB | 36 kB
Progress (3): 126/186 kB | 55 kB | 36 kB
Progress (3): 130/186 kB | 55 kB | 36 kB
Progress (3): 134/186 kB | 55 kB | 36 kB
Progress (3): 138/186 kB | 55 kB | 36 kB
Progress (3): 142/186 kB | 55 kB | 36 kB
Progress (3): 146/186 kB | 55 kB | 36 kB
Progress (3): 150/186 kB | 55 kB | 36 kB
Progress (3): 154/186 kB | 55 kB | 36 kB
Progress (3): 158/186 kB | 55 kB | 36 kB
Progress (3): 162/186 kB | 55 kB | 36 kB
                                        
Downloaded from eclipse.maven.central.mirror: https://repo.eclipse.org/content/repositories/maven_central/org/apache/maven/wagon/wagon-provider-api/3.1.0/wagon-provider-api-3.1.0.jar (55 kB at 41 kB/s)
03:46:21 Progress (2): 166/186 kB | 36 kB
                                
Downloading from eclipse.maven.central.mirror: https://repo.eclipse.org/content/repositories/maven_central/commons-logging/commons-logging/1.2/commons-logging-1.2.jar
03:46:21 Progress (2): 170/186 kB | 36 kB
Progress (2): 174/186 kB | 36 kB
Progress (2): 178/186 kB | 36 kB
Progress (2): 182/186 kB | 36 kB
Progress (2): 186 kB | 36 kB    
Progress (3): 186 kB | 36 kB | 4.1/62 kB
Progress (3): 186 kB | 36 kB | 7.7/62 kB
                                        
Downloaded from eclipse.maven.central.mirror: https://repo.eclipse.org/content/repositories/maven_central/org/apache/maven/wagon/wagon-http-shared/3.1.0/wagon-http-shared-3.1.0.jar (36 kB at 26 kB/s)
03:46:21 Progress (2): 186 kB | 12/62 kB
Progress (2): 186 kB | 16/62 kB
Progress (2): 186 kB | 20/62 kB
Progress (2): 186 kB | 24/62 kB
Progress (2): 186 kB | 28/62 kB
Progress (2): 186 kB | 32/62 kB
Progress (2): 186 kB | 36/62 kB
                               
Downloaded from eclipse.maven.central.mirror: https://repo.eclipse.org/content/repositories/maven_central/commons-validator/commons-validator/1.6/commons-validator-1.6.jar (186 kB at 136 kB/s)
03:46:21 Progress (1): 40/62 kB
Progress (1): 44/62 kB
Progress (1): 48/62 kB
Progress (1): 52/62 kB
Progress (1): 56/62 kB
Progress (1): 60/62 kB
Progress (1): 62 kB   
Progress (2): 62 kB | 4.1/234 kB
Progress (2): 62 kB | 7.7/234 kB
Progress (2): 62 kB | 12/234 kB 
Progress (2): 62 kB | 16/234 kB
Progress (2): 62 kB | 20/234 kB
Progress (2): 62 kB | 24/234 kB
Progress (2): 62 kB | 28/234 kB
Progress (2): 62 kB | 32/234 kB
Progress (2): 62 kB | 33/234 kB
Progress (2): 62 kB | 37/234 kB
Progress (2): 62 kB | 41/234 kB
Progress (2): 62 kB | 45/234 kB
Progress (2): 62 kB | 49/234 kB
Progress (2): 62 kB | 53/234 kB
Progress (2): 62 kB | 57/234 kB
Progress (2): 62 kB | 61/234 kB
Progress (2): 62 kB | 65/234 kB
Progress (2): 62 kB | 66/234 kB
Progress (2): 62 kB | 70/234 kB
Progress (2): 62 kB | 74/234 kB
Progress (2): 62 kB | 78/234 kB
Progress (2): 62 kB | 82/234 kB
Progress (2): 62 kB | 86/234 kB
Progress (2): 62 kB | 90/234 kB
Progress (2): 62 kB | 94/234 kB
Progress (2): 62 kB | 98/234 kB
Progress (3): 62 kB | 98/234 kB | 4.1/146 kB
Progress (3): 62 kB | 98/234 kB | 4.1/146 kB
Progress (3): 62 kB | 98/234 kB | 7.7/146 kB
Progress (3): 62 kB | 98/234 kB | 12/146 kB 
Progress (3): 62 kB | 102/234 kB | 12/146 kB
Progress (3): 62 kB | 102/234 kB | 16/146 kB
Progress (3): 62 kB | 106/234 kB | 16/146 kB
Progress (3): 62 kB | 106/234 kB | 20/146 kB
Progress (3): 62 kB | 106/234 kB | 24/146 kB
Progress (3): 62 kB | 110/234 kB | 24/146 kB
Progress (3): 62 kB | 114/234 kB | 24/146 kB
Progress (3): 62 kB | 114/234 kB | 28/146 kB
Progress (3): 62 kB | 114/234 kB | 32/146 kB
Progress (3): 62 kB | 118/234 kB | 32/146 kB
Progress (3): 62 kB | 118/234 kB | 36/146 kB
Progress (3): 62 kB | 122/234 kB | 36/146 kB
Progress (3): 62 kB | 122/234 kB | 40/146 kB
Progress (3): 62 kB | 122/234 kB | 44/146 kB
Progress (3): 62 kB | 126/234 kB | 44/146 kB
Progress (3): 62 kB | 126/234 kB | 48/146 kB
Progress (3): 62 kB | 130/234 kB | 48/146 kB
Progress (3): 62 kB | 131/234 kB | 48/146 kB
Progress (3): 62 kB | 131/234 kB | 52/146 kB
Progress (3): 62 kB | 131/234 kB | 56/146 kB
Progress (3): 62 kB | 135/234 kB | 56/146 kB
Progress (3): 62 kB | 135/234 kB | 60/146 kB
Progress (3): 62 kB | 139/234 kB | 60/146 kB
Progress (3): 62 kB | 139/234 kB | 64/146 kB
Progress (3): 62 kB | 139/234 kB | 66/146 kB
Progress (3): 62 kB | 143/234 kB | 66/146 kB
Progress (3): 62 kB | 143/234 kB | 70/146 kB
Progress (3): 62 kB | 147/234 kB | 70/146 kB
Progress (3): 62 kB | 147/234 kB | 74/146 kB
Progress (3): 62 kB | 147/234 kB | 78/146 kB
Progress (3): 62 kB | 151/234 kB | 78/146 kB
Progress (3): 62 kB | 151/234 kB | 82/146 kB
Progress (3): 62 kB | 155/234 kB | 82/146 kB
Progress (3): 62 kB | 155/234 kB | 86/146 kB
Progress (3): 62 kB | 155/234 kB | 90/146 kB
Progress (3): 62 kB | 159/234 kB | 90/146 kB
Progress (3): 62 kB | 163/234 kB | 90/146 kB
Progress (3): 62 kB | 163/234 kB | 94/146 kB
Progress (3): 62 kB | 164/234 kB | 94/146 kB
Progress (3): 62 kB | 164/234 kB | 98/146 kB
Progress (3): 62 kB | 164/234 kB | 102/146 kB
Progress (3): 62 kB | 168/234 kB | 102/146 kB
Progress (3): 62 kB | 168/234 kB | 106/146 kB
Progress (3): 62 kB | 172/234 kB | 106/146 kB
Progress (3): 62 kB | 172/234 kB | 110/146 kB
Progress (3): 62 kB | 172/234 kB | 114/146 kB
Progress (3): 62 kB | 176/234 kB | 114/146 kB
Progress (3): 62 kB | 180/234 kB | 114/146 kB
Progress (3): 62 kB | 180/234 kB | 118/146 kB
Progress (3): 62 kB | 180/234 kB | 122/146 kB
Progress (3): 62 kB | 184/234 kB | 122/146 kB
Progress (3): 62 kB | 184/234 kB | 126/146 kB
Progress (3): 62 kB | 188/234 kB | 126/146 kB
Progress (3): 62 kB | 188/234 kB | 130/146 kB
Progress (3): 62 kB | 188/234 kB | 134/146 kB
Progress (3): 62 kB | 192/234 kB | 134/146 kB
Progress (3): 62 kB | 192/234 kB | 138/146 kB
Progress (3): 62 kB | 196/234 kB | 138/146 kB
Progress (3): 62 kB | 196/234 kB | 142/146 kB
Progress (3): 62 kB | 196/234 kB | 146/146 kB
Progress (3): 62 kB | 200/234 kB | 146/146 kB
Progress (3): 62 kB | 200/234 kB | 146 kB    
Progress (3): 62 kB | 204/234 kB | 146 kB
Progress (3): 62 kB | 208/234 kB | 146 kB
Progress (3): 62 kB | 212/234 kB | 146 kB
Progress (3): 62 kB | 216/234 kB | 146 kB
Progress (3): 62 kB | 220/234 kB | 146 kB
Progress (3): 62 kB | 224/234 kB | 146 kB
Progress (3): 62 kB | 228/234 kB | 146 kB
Progress (3): 62 kB | 232/234 kB | 146 kB
Progress (3): 62 kB | 234 kB | 146 kB    
                                     
Downloaded from eclipse.maven.central.mirror: https://repo.eclipse.org/content/repositories/maven_central/commons-beanutils/commons-beanutils/1.9.2/commons-beanutils-1.9.2.jar (234 kB at 168 kB/s)
03:46:21 Downloaded from eclipse.maven.central.mirror: https://repo.eclipse.org/content/repositories/maven_central/commons-digester/commons-digester/1.8.1/commons-digester-1.8.1.jar (146 kB at 105 kB/s)
03:46:21 Downloaded from eclipse.maven.central.mirror: https://repo.eclipse.org/content/repositories/maven_central/commons-logging/commons-logging/1.2/commons-logging-1.2.jar (62 kB at 42 kB/s)
03:46:23 [WARNING] Error injecting: org.apache.maven.report.projectinfo.CiManagementReport
03:46:23 java.lang.NoClassDefFoundError: org/apache/maven/doxia/siterenderer/DocumentContent
03:46:23     at java.lang.Class.getDeclaredConstructors0 (Native Method)
03:46:23     at java.lang.Class.privateGetDeclaredConstructors (Class.java:2671)
03:46:23     at java.lang.Class.getDeclaredConstructors (Class.java:2020)
03:46:23     at com.google.inject.spi.InjectionPoint.forConstructorOf (InjectionPoint.java:245)
03:46:23     at com.google.inject.internal.ConstructorBindingImpl.create (ConstructorBindingImpl.java:99)
03:46:23     at com.google.inject.internal.InjectorImpl.createUninitializedBinding (InjectorImpl.java:658)
03:46:23     at com.google.inject.internal.InjectorImpl.createJustInTimeBinding (InjectorImpl.java:882)
03:46:23     at com.google.inject.internal.InjectorImpl.createJustInTimeBindingRecursive (InjectorImpl.java:805)
03:46:23     at com.google.inject.internal.InjectorImpl.getJustInTimeBinding (InjectorImpl.java:282)
03:46:23     at com.google.inject.internal.InjectorImpl.getBindingOrThrow (InjectorImpl.java:214)
03:46:23     at com.google.inject.internal.InjectorImpl.getProviderOrThrow (InjectorImpl.java:1006)
03:46:23     at com.google.inject.internal.InjectorImpl.getProvider (InjectorImpl.java:1038)
03:46:23     at com.google.inject.internal.InjectorImpl.getProvider (InjectorImpl.java:1001)
03:46:23     at com.google.inject.internal.InjectorImpl.getInstance (InjectorImpl.java:1051)
03:46:23     at org.eclipse.sisu.space.AbstractDeferredClass.get (AbstractDeferredClass.java:48)
03:46:23     at com.google.inject.internal.ProviderInternalFactory.provision (ProviderInternalFactory.java:81)
03:46:23     at com.google.inject.internal.InternalFactoryToInitializableAdapter.provision (InternalFactoryToInitializableAdapter.java:53)
03:46:23     at com.google.inject.internal.ProviderInternalFactory$1.call (ProviderInternalFactory.java:65)
03:46:23     at com.google.inject.internal.ProvisionListenerStackCallback$Provision.provision (ProvisionListenerStackCallback.java:115)
03:46:23     at com.google.inject.internal.ProvisionListenerStackCallback$Provision.provision (ProvisionListenerStackCallback.java:133)
03:46:23     at com.google.inject.internal.ProvisionListenerStackCallback.provision (ProvisionListenerStackCallback.java:68)
03:46:23     at com.google.inject.internal.ProviderInternalFactory.circularGet (ProviderInternalFactory.java:63)
03:46:23     at com.google.inject.internal.InternalFactoryToInitializableAdapter.get (InternalFactoryToInitializableAdapter.java:45)
03:46:23     at com.google.inject.internal.InjectorImpl$2$1.call (InjectorImpl.java:1016)
03:46:23     at com.google.inject.internal.InjectorImpl.callInContext (InjectorImpl.java:1092)
03:46:23     at com.google.inject.internal.InjectorImpl$2.get (InjectorImpl.java:1012)
03:46:23     at org.eclipse.sisu.inject.Guice4$1.get (Guice4.java:162)
03:46:23     at org.eclipse.sisu.inject.LazyBeanEntry.getValue (LazyBeanEntry.java:81)
03:46:23     at org.eclipse.sisu.plexus.LazyPlexusBean.getValue (LazyPlexusBean.java:51)
03:46:23     at org.codehaus.plexus.DefaultPlexusContainer.lookup (DefaultPlexusContainer.java:263)
03:46:23     at org.codehaus.plexus.DefaultPlexusContainer.lookup (DefaultPlexusContainer.java:255)
03:46:23     at org.apache.maven.plugin.internal.DefaultMavenPluginManager.getConfiguredMojo (DefaultMavenPluginManager.java:519)
03:46:23     at org.apache.maven.reporting.exec.DefaultMavenReportExecutor.getConfiguredMavenReport (DefaultMavenReportExecutor.java:306)
03:46:23     at org.apache.maven.reporting.exec.DefaultMavenReportExecutor.buildReportPlugin (DefaultMavenReportExecutor.java:263)
03:46:23     at org.apache.maven.reporting.exec.DefaultMavenReportExecutor.buildMavenReports (DefaultMavenReportExecutor.java:154)
03:46:23     at org.apache.maven.plugins.site.AbstractSiteRenderingMojo.getReports (AbstractSiteRenderingMojo.java:235)
03:46:23     at org.apache.maven.plugins.site.SiteMojo.execute (SiteMojo.java:121)
03:46:23     at org.apache.maven.plugin.DefaultBuildPluginManager.executeMojo (DefaultBuildPluginManager.java:137)
03:46:23     at org.apache.maven.lifecycle.internal.MojoExecutor.execute (MojoExecutor.java:208)
03:46:23     at org.apache.maven.lifecycle.internal.MojoExecutor.execute (MojoExecutor.java:154)
03:46:23     at org.apache.maven.lifecycle.internal.MojoExecutor.execute (MojoExecutor.java:146)
03:46:23     at org.apache.maven.lifecycle.internal.LifecycleModuleBuilder.buildProject (LifecycleModuleBuilder.java:117)
03:46:23     at org.apache.maven.lifecycle.internal.LifecycleModuleBuilder.buildProject (LifecycleModuleBuilder.java:81)
03:46:23     at org.apache.maven.lifecycle.internal.builder.singlethreaded.SingleThreadedBuilder.build (SingleThreadedBuilder.java:56)
03:46:23     at org.apache.maven.lifecycle.internal.LifecycleStarter.execute (LifecycleStarter.java:128)
03:46:23     at org.apache.maven.DefaultMaven.doExecute (DefaultMaven.java:305)
03:46:23     at org.apache.maven.DefaultMaven.doExecute (DefaultMaven.java:192)
03:46:23     at org.apache.maven.DefaultMaven.execute (DefaultMaven.java:105)
03:46:23     at org.apache.maven.cli.MavenCli.execute (MavenCli.java:956)
03:46:23     at org.apache.maven.cli.MavenCli.doMain (MavenCli.java:290)
03:46:23     at org.apache.maven.cli.MavenCli.main (MavenCli.java:194)
03:46:23     at sun.reflect.NativeMethodAccessorImpl.invoke0 (Native Method)
03:46:23     at sun.reflect.NativeMethodAccessorImpl.invoke (NativeMethodAccessorImpl.java:62)
03:46:23     at sun.reflect.DelegatingMethodAccessorImpl.invoke (DelegatingMethodAccessorImpl.java:43)
03:46:23     at java.lang.reflect.Method.invoke (Method.java:498)
03:46:23     at org.codehaus.plexus.classworlds.launcher.Launcher.launchEnhanced (Launcher.java:289)
03:46:23     at org.codehaus.plexus.classworlds.launcher.Launcher.launch (Launcher.java:229)
03:46:23     at org.codehaus.plexus.classworlds.launcher.Launcher.mainWithExitCode (Launcher.java:415)
03:46:23     at org.codehaus.plexus.classworlds.launcher.Launcher.main (Launcher.java:356)
03:46:23 Caused by: java.lang.ClassNotFoundException: org.apache.maven.doxia.siterenderer.DocumentContent
03:46:23     at org.codehaus.plexus.classworlds.strategy.SelfFirstStrategy.loadClass (SelfFirstStrategy.java:50)
03:46:23     at org.codehaus.plexus.classworlds.realm.ClassRealm.unsynchronizedLoadClass (ClassRealm.java:271)
03:46:23     at org.codehaus.plexus.classworlds.realm.ClassRealm.loadClass (ClassRealm.java:247)
03:46:23     at org.codehaus.plexus.classworlds.realm.ClassRealm.loadClass (ClassRealm.java:239)
03:46:23     at java.lang.Class.getDeclaredConstructors0 (Native Method)
03:46:23     at java.lang.Class.privateGetDeclaredConstructors (Class.java:2671)
03:46:23     at java.lang.Class.getDeclaredConstructors (Class.java:2020)
03:46:23     at com.google.inject.spi.InjectionPoint.forConstructorOf (InjectionPoint.java:245)
03:46:23     at com.google.inject.internal.ConstructorBindingImpl.create (ConstructorBindingImpl.java:99)
03:46:23     at com.google.inject.internal.InjectorImpl.createUninitializedBinding (InjectorImpl.java:658)
03:46:23     at com.google.inject.internal.InjectorImpl.createJustInTimeBinding (InjectorImpl.java:882)
03:46:23     at com.google.inject.internal.InjectorImpl.createJustInTimeBindingRecursive (InjectorImpl.java:805)
03:46:23     at com.google.inject.internal.InjectorImpl.getJustInTimeBinding (InjectorImpl.java:282)
03:46:23     at com.google.inject.internal.InjectorImpl.getBindingOrThrow (InjectorImpl.java:214)
03:46:23     at com.google.inject.internal.InjectorImpl.getProviderOrThrow (InjectorImpl.java:1006)
03:46:23     at com.google.inject.internal.InjectorImpl.getProvider (InjectorImpl.java:1038)
03:46:23     at com.google.inject.internal.InjectorImpl.getProvider (InjectorImpl.java:1001)
03:46:23     at com.google.inject.internal.InjectorImpl.getInstance (InjectorImpl.java:1051)
03:46:23     at org.eclipse.sisu.space.AbstractDeferredClass.get (AbstractDeferredClass.java:48)
03:46:23     at com.google.inject.internal.ProviderInternalFactory.provision (ProviderInternalFactory.java:81)
03:46:23     at com.google.inject.internal.InternalFactoryToInitializableAdapter.provision (InternalFactoryToInitializableAdapter.java:53)
03:46:23     at com.google.inject.internal.ProviderInternalFactory$1.call (ProviderInternalFactory.java:65)
03:46:23     at com.google.inject.internal.ProvisionListenerStackCallback$Provision.provision (ProvisionListenerStackCallback.java:115)
03:46:23     at com.google.inject.internal.ProvisionListenerStackCallback$Provision.provision (ProvisionListenerStackCallback.java:133)
03:46:23     at com.google.inject.internal.ProvisionListenerStackCallback.provision (ProvisionListenerStackCallback.java:68)
03:46:23     at com.google.inject.internal.ProviderInternalFactory.circularGet (ProviderInternalFactory.java:63)
03:46:23     at com.google.inject.internal.InternalFactoryToInitializableAdapter.get (InternalFactoryToInitializableAdapter.java:45)
03:46:23     at com.google.inject.internal.InjectorImpl$2$1.call (InjectorImpl.java:1016)
03:46:23     at com.google.inject.internal.InjectorImpl.callInContext (InjectorImpl.java:1092)
03:46:23     at com.google.inject.internal.InjectorImpl$2.get (InjectorImpl.java:1012)
03:46:23     at org.eclipse.sisu.inject.Guice4$1.get (Guice4.java:162)
03:46:23     at org.eclipse.sisu.inject.LazyBeanEntry.getValue (LazyBeanEntry.java:81)
03:46:23     at org.eclipse.sisu.plexus.LazyPlexusBean.getValue (LazyPlexusBean.java:51)
03:46:23     at org.codehaus.plexus.DefaultPlexusContainer.lookup (DefaultPlexusContainer.java:263)
03:46:23     at org.codehaus.plexus.DefaultPlexusContainer.lookup (DefaultPlexusContainer.java:255)
03:46:23     at org.apache.maven.plugin.internal.DefaultMavenPluginManager.getConfiguredMojo (DefaultMavenPluginManager.java:519)
03:46:23     at org.apache.maven.reporting.exec.DefaultMavenReportExecutor.getConfiguredMavenReport (DefaultMavenReportExecutor.java:306)
03:46:23     at org.apache.maven.reporting.exec.DefaultMavenReportExecutor.buildReportPlugin (DefaultMavenReportExecutor.java:263)
03:46:23     at org.apache.maven.reporting.exec.DefaultMavenReportExecutor.buildMavenReports (DefaultMavenReportExecutor.java:154)
03:46:23     at org.apache.maven.plugins.site.AbstractSiteRenderingMojo.getReports (AbstractSiteRenderingMojo.java:235)
03:46:23     at org.apache.maven.plugins.site.SiteMojo.execute (SiteMojo.java:121)
03:46:23     at org.apache.maven.plugin.DefaultBuildPluginManager.executeMojo (DefaultBuildPluginManager.java:137)
03:46:23     at org.apache.maven.lifecycle.internal.MojoExecutor.execute (MojoExecutor.java:208)
03:46:23     at org.apache.maven.lifecycle.internal.MojoExecutor.execute (MojoExecutor.java:154)
03:46:23     at org.apache.maven.lifecycle.internal.MojoExecutor.execute (MojoExecutor.java:146)
03:46:23     at org.apache.maven.lifecycle.internal.LifecycleModuleBuilder.buildProject (LifecycleModuleBuilder.java:117)
03:46:23     at org.apache.maven.lifecycle.internal.LifecycleModuleBuilder.buildProject (LifecycleModuleBuilder.java:81)
03:46:23     at org.apache.maven.lifecycle.internal.builder.singlethreaded.SingleThreadedBuilder.build (SingleThreadedBuilder.java:56)
03:46:23     at org.apache.maven.lifecycle.internal.LifecycleStarter.execute (LifecycleStarter.java:128)
03:46:23     at org.apache.maven.DefaultMaven.doExecute (DefaultMaven.java:305)
03:46:23     at org.apache.maven.DefaultMaven.doExecute (DefaultMaven.java:192)
03:46:23     at org.apache.maven.DefaultMaven.execute (DefaultMaven.java:105)
03:46:23     at org.apache.maven.cli.MavenCli.execute (MavenCli.java:956)
03:46:23     at org.apache.maven.cli.MavenCli.doMain (MavenCli.java:290)
03:46:23     at org.apache.maven.cli.MavenCli.main (MavenCli.java:194)
03:46:23     at sun.reflect.NativeMethodAccessorImpl.invoke0 (Native Method)
03:46:23     at sun.reflect.NativeMethodAccessorImpl.invoke (NativeMethodAccessorImpl.java:62)
03:46:23     at sun.reflect.DelegatingMethodAccessorImpl.invoke (DelegatingMethodAccessorImpl.java:43)
03:46:23     at java.lang.reflect.Method.invoke (Method.java:498)
03:46:23     at org.codehaus.plexus.classworlds.launcher.Launcher.launchEnhanced (Launcher.java:289)
03:46:23     at org.codehaus.plexus.classworlds.launcher.Launcher.launch (Launcher.java:229)
03:46:23     at org.codehaus.plexus.classworlds.launcher.Launcher.mainWithExitCode (Launcher.java:415)
03:46:23     at org.codehaus.plexus.classworlds.launcher.Launcher.main (Launcher.java:356)
03:46:23 [INFO] ------------------------------------------------------------------------
03:46:23 [INFO] Reactor Summary:
03:46:23 [INFO] 
03:46:23 [INFO] org.eclipse.papyrus.all.releng 0.0.1-SNAPSHOT ...... SUCCESS [  1.881 s]
03:46:23 [INFO] org.eclipse.papyrus.releng ......................... SUCCESS [  0.055 s]
03:46:23 [INFO] Papyrus Main Plugins ............................... SUCCESS [  0.008 s]
03:46:23 [INFO] EMF Facet, the Papyrus Edition ..................... SUCCESS [  0.006 s]
03:46:23 [INFO] Papyrus EMF Facet Editors .......................... SUCCESS [  0.009 s]
03:46:23 [INFO] org.eclipse.papyrus.emf.facet.custom.doc 1.2.0-SNAPSHOT SUCCESS [ 23.674 s]
03:46:23 [INFO] org.eclipse.papyrus.emf.facet.common.core 1.2.0-SNAPSHOT SUCCESS [  0.738 s]
03:46:23 [INFO] org.eclipse.papyrus.emf.facet.util.emf.catalog 1.2.0-SNAPSHOT SUCCESS [  0.274 s]
03:46:23 [INFO] org.eclipse.papyrus.emf.facet.util.core 1.2.0-SNAPSHOT SUCCESS [  0.239 s]
03:46:23 [INFO] org.eclipse.papyrus.emf.facet.common.sdk.core 1.2.0-SNAPSHOT SUCCESS [  0.326 s]
03:46:23 [INFO] org.eclipse.papyrus.emf.facet.common.ui 1.2.0-SNAPSHOT SUCCESS [  0.308 s]
03:46:23 [INFO] org.eclipse.papyrus.emf.facet.util.pde.core 1.2.0-SNAPSHOT SUCCESS [  0.223 s]
03:46:23 [INFO] org.eclipse.papyrus.emf.facet.util.emf.core 1.2.0-SNAPSHOT SUCCESS [  0.301 s]
03:46:23 [INFO] org.eclipse.papyrus.emf.facet.efacet.metamodel 1.2.0-SNAPSHOT SUCCESS [  0.560 s]
03:46:23 [INFO] org.eclipse.papyrus.emf.facet.custom.metamodel 1.3.100-SNAPSHOT SUCCESS [  0.293 s]
03:46:23 [INFO] org.eclipse.papyrus.emf.facet.efacet 1.2.0-SNAPSHOT  SUCCESS [  0.266 s]
03:46:23 [INFO] org.eclipse.papyrus.emf.facet.efacet.catalog 1.2.0-SNAPSHOT SUCCESS [  0.173 s]
03:46:23 [INFO] org.eclipse.papyrus.emf.facet.util.ui 2.0.0-SNAPSHOT SUCCESS [  0.401 s]
03:46:23 [INFO] org.eclipse.papyrus.emf.facet.util.swt 1.2.0-SNAPSHOT SUCCESS [  0.118 s]
03:46:23 [INFO] org.eclipse.papyrus.emf.facet.util.emf.ui 2.0.0-SNAPSHOT SUCCESS [  0.388 s]
03:46:23 [INFO] org.eclipse.papyrus.emf.facet.efacet.core 2.0.0-SNAPSHOT SUCCESS [  0.498 s]
03:46:23 [INFO] org.eclipse.papyrus.emf.facet.custom.core 3.0.0-SNAPSHOT SUCCESS [  0.282 s]
03:46:23 [INFO] org.eclipse.papyrus.emf.facet.efacet.metamodel.edit 1.2.0-SNAPSHOT SUCCESS [  0.330 s]
03:46:23 [INFO] org.eclipse.papyrus.emf.facet.custom.metamodel.edit 1.3.0-SNAPSHOT SUCCESS [  0.153 s]
03:46:23 [INFO] org.eclipse.papyrus.emf.facet.query.java 1.2.0-SNAPSHOT SUCCESS [  0.152 s]
03:46:23 [INFO] org.eclipse.papyrus.emf.facet.query.java.metamodel 1.2.0-SNAPSHOT SUCCESS [  0.496 s]
03:46:23 [INFO] org.eclipse.papyrus.emf.facet.query.java.core 2.0.0-SNAPSHOT SUCCESS [  0.916 s]
03:46:23 [INFO] org.eclipse.papyrus.emf.facet.util.jface.ui 2.0.0-SNAPSHOT SUCCESS [  0.215 s]
03:46:23 [INFO] org.eclipse.papyrus.emf.facet.custom.ui 3.1.0-SNAPSHOT SUCCESS [  0.680 s]
03:46:23 [INFO] org.eclipse.papyrus.emf.facet.efacet.sdk.ui 2.0.0-SNAPSHOT SUCCESS [  0.675 s]
03:46:23 [INFO] org.eclipse.papyrus.emf.facet.custom.sdk.core 1.2.0-SNAPSHOT SUCCESS [  0.263 s]
03:46:23 [INFO] org.eclipse.papyrus.emf.facet.widgets 1.2.0-SNAPSHOT SUCCESS [  0.192 s]
03:46:23 [INFO] org.eclipse.papyrus.emf.facet.widgets.celleditors 1.2.0-SNAPSHOT SUCCESS [  0.439 s]
03:46:23 [INFO] org.eclipse.papyrus.emf.facet.efacet.ui 3.0.0-SNAPSHOT SUCCESS [  0.546 s]
03:46:23 [INFO] org.eclipse.papyrus.emf.facet.custom.sdk.ui 1.2.0-SNAPSHOT SUCCESS [  0.359 s]
03:46:23 [INFO] org.eclipse.papyrus.emf.facet.query.ocl.metamodel 1.2.0-SNAPSHOT SUCCESS [  0.185 s]
03:46:23 [INFO] org.eclipse.papyrus.emf.facet.custom.metamodel.editor 1.3.0-SNAPSHOT SUCCESS [  0.542 s]
03:46:23 [INFO] org.eclipse.papyrus.emf.facet.custom.metamodel.editor.doc 1.2.0-SNAPSHOT SUCCESS [  0.071 s]
03:46:23 [INFO] org.eclipse.papyrus.emf.facet.doc 1.2.0-SNAPSHOT ... SUCCESS [  0.213 s]
03:46:23 [INFO] org.eclipse.papyrus.emf.facet.aggregate.doc 1.2.0-SNAPSHOT SUCCESS [  0.044 s]
03:46:23 [INFO] org.eclipse.papyrus.emf.facet.efacet.doc 1.2.0-SNAPSHOT SUCCESS [  0.064 s]
03:46:23 [INFO] org.eclipse.papyrus.emf.facet.efacet.edit 1.2.0-SNAPSHOT SUCCESS [  0.205 s]
03:46:23 [INFO] org.eclipse.papyrus.emf.facet.efacet.editor 1.2.0-SNAPSHOT SUCCESS [  0.304 s]
03:46:23 [INFO] org.eclipse.papyrus.emf.facet.query.java.sdk.ui 1.2.0-SNAPSHOT SUCCESS [  0.482 s]
03:46:23 [INFO] org.eclipse.papyrus.emf.facet.query.ocl.core 1.2.0-SNAPSHOT SUCCESS [  0.252 s]
03:46:23 [INFO] org.eclipse.papyrus.emf.facet.query.ocl.sdk.ui 2.0.0-SNAPSHOT SUCCESS [  0.222 s]
03:46:23 [INFO] org.eclipse.papyrus.emf.facet.util.emf.doc 1.2.0-SNAPSHOT SUCCESS [  0.037 s]
03:46:23 [INFO] org.eclipse.papyrus.emf.facet.widgets.celleditors.ecore 1.2.0-SNAPSHOT SUCCESS [  0.299 s]
03:46:23 [INFO] Papyrus Infra ...................................... SUCCESS [  0.004 s]
03:46:23 [INFO] Papyrus Infra Architecture ......................... SUCCESS [  0.003 s]
03:46:23 [INFO] Papyrus Infra Element Types Configurations ......... SUCCESS [  0.003 s]
03:46:23 [INFO] org.eclipse.papyrus.infra.types 3.0.0-SNAPSHOT ..... SUCCESS [  0.279 s]
03:46:23 [INFO] Papyrus Infra Core ................................. SUCCESS [  0.006 s]
03:46:23 [INFO] org.eclipse.papyrus.infra.core.architecture 1.0.0-SNAPSHOT SUCCESS [  0.237 s]
03:46:23 [INFO] org.eclipse.papyrus.infra.core.log 1.2.0-SNAPSHOT .. SUCCESS [  0.124 s]
03:46:23 [INFO] org.eclipse.papyrus.infra.tools 3.0.0-SNAPSHOT ..... SUCCESS [  0.434 s]
03:46:23 [INFO] org.eclipse.papyrus.infra.core.sashwindows.di 1.2.0-SNAPSHOT SUCCESS [  0.271 s]
03:46:23 [INFO] org.eclipse.papyrus.infra.core 3.0.1-SNAPSHOT ...... SUCCESS [  0.621 s]
03:46:23 [INFO] Papyrus EMF Infrastructure ......................... SUCCESS [  0.004 s]
03:46:23 [INFO] org.eclipse.papyrus.infra.emf 3.0.0-SNAPSHOT ....... SUCCESS [  0.687 s]
03:46:23 [INFO] Papyrus Infra Services ............................. SUCCESS [  0.004 s]
03:46:23 [INFO] org.eclipse.papyrus.infra.services.markerlistener 2.0.0-SNAPSHOT SUCCESS [  0.244 s]
03:46:23 [INFO] org.eclipse.papyrus.infra.services.edit 3.0.0-SNAPSHOT SUCCESS [  0.349 s]
03:46:23 [INFO] org.eclipse.papyrus.infra.architecture 1.0.0-SNAPSHOT SUCCESS [  0.299 s]
03:46:23 [INFO] Papyrus Infra Constraints .......................... SUCCESS [  0.007 s]
03:46:23 [INFO] org.eclipse.papyrus.infra.constraints 2.0.0-SNAPSHOT SUCCESS [  0.472 s]
03:46:23 [INFO] org.eclipse.papyrus.infra.architecture.representation 1.0.0-SNAPSHOT SUCCESS [  0.372 s]
03:46:23 [INFO] org.eclipse.papyrus.infra.types.edit 3.0.0-SNAPSHOT  SUCCESS [  0.211 s]
03:46:23 [INFO] org.eclipse.papyrus.infra.core.architecture.edit 1.0.0-SNAPSHOT SUCCESS [  0.250 s]
03:46:23 [INFO] org.eclipse.papyrus.infra.constraints.edit 2.0.0-SNAPSHOT SUCCESS [  0.301 s]
03:46:23 [INFO] org.eclipse.papyrus.infra.architecture.representation.edit 1.0.0-SNAPSHOT SUCCESS [  0.299 s]
03:46:23 [INFO] org.eclipse.papyrus.infra.core.pluginexplorer 1.2.0-SNAPSHOT SUCCESS [  0.217 s]
03:46:23 [INFO] org.eclipse.papyrus.infra.core.sasheditor 2.0.0-SNAPSHOT SUCCESS [  0.510 s]
03:46:23 [INFO] org.eclipse.papyrus.infra.core.sasheditor.di 2.0.0-SNAPSHOT SUCCESS [  0.281 s]
03:46:23 [INFO] Papyrus Infra One-file ............................. SUCCESS [  0.004 s]
03:46:23 [INFO] Papyrus EMF Expressions Infrastructure ............. SUCCESS [  0.005 s]
03:46:23 [INFO] org.eclipse.papyrus.infra.emf.expressions 1.0.0-SNAPSHOT SUCCESS [  0.220 s]
03:46:23 [INFO] org.eclipse.papyrus.infra.emf.gmf 1.2.100-SNAPSHOT . SUCCESS [  0.411 s]
03:46:23 [INFO] Papyrus Nattable ................................... SUCCESS [  0.003 s]
03:46:23 [INFO] org.eclipse.papyrus.infra.nattable.model 4.0.0-SNAPSHOT SUCCESS [  0.655 s]
03:46:23 [INFO] org.eclipse.papyrus.infra.services.labelprovider 2.0.0-SNAPSHOT SUCCESS [  0.189 s]
03:46:23 [INFO] Papyrus Infra UI ................................... SUCCESS [  0.004 s]
03:46:23 [INFO] org.eclipse.papyrus.infra.widgets 3.2.0-SNAPSHOT ... SUCCESS [  1.084 s]
03:46:23 [INFO] org.eclipse.papyrus.infra.widgets.toolbox 2.0.0-SNAPSHOT SUCCESS [  0.266 s]
03:46:23 [INFO] org.eclipse.papyrus.infra.ui 2.0.0-SNAPSHOT ........ SUCCESS [  0.903 s]
03:46:23 [INFO] Papyrus Internationalization ....................... SUCCESS [  0.005 s]
03:46:23 [INFO] org.eclipse.papyrus.infra.internationalization.common 1.1.0-SNAPSHOT SUCCESS [  0.360 s]
03:46:23 [INFO] org.eclipse.papyrus.infra.internationalization 1.0.100-SNAPSHOT SUCCESS [  0.513 s]
03:46:23 [INFO] org.eclipse.papyrus.infra.onefile 2.1.0-SNAPSHOT ... SUCCESS [  0.293 s]
03:46:23 [INFO] org.eclipse.papyrus.infra.constraints.editor 2.0.0-SNAPSHOT SUCCESS [  0.404 s]
03:46:23 [INFO] org.eclipse.papyrus.infra.constraints.ui 2.0.0-SNAPSHOT SUCCESS [  0.390 s]
03:46:23 [INFO] Papyrus Editor Welcome Page ........................ SUCCESS [  0.006 s]
03:46:23 [INFO] org.eclipse.papyrus.infra.emf.readonly 3.0.0-SNAPSHOT SUCCESS [  0.680 s]
03:46:23 [INFO] org.eclipse.papyrus.infra.internationalization.utils 1.0.100-SNAPSHOT SUCCESS [  0.464 s]
03:46:23 [INFO] Papyrus Infra Properties Framework ................. SUCCESS [  0.003 s]
03:46:23 [INFO] org.eclipse.papyrus.infra.properties 3.0.0-SNAPSHOT  SUCCESS [  0.566 s]
03:46:23 [INFO] org.eclipse.papyrus.infra.ui.emf 2.1.0-SNAPSHOT .... SUCCESS [  0.617 s]
03:46:23 [INFO] org.eclipse.papyrus.infra.properties.ui 3.3.0-SNAPSHOT SUCCESS [  0.844 s]
03:46:23 [INFO] org.eclipse.papyrus.infra.editor.welcome 2.0.0-SNAPSHOT SUCCESS [  0.601 s]
03:46:23 [INFO] org.eclipse.papyrus.infra.services.navigation 3.0.0-SNAPSHOT SUCCESS [  0.406 s]
03:46:23 [INFO] org.eclipse.papyrus.infra.editor.welcome.nattable 3.0.0-SNAPSHOT SUCCESS [  0.617 s]
03:46:23 [INFO] org.eclipse.papyrus.infra.emf.appearance 2.0.0-SNAPSHOT SUCCESS [  0.200 s]
03:46:23 [INFO] org.eclipse.papyrus.infra.emf.diagram.common 2.0.0-SNAPSHOT SUCCESS [  0.304 s]
03:46:23 [INFO] org.eclipse.papyrus.infra.types.core 3.1.0-SNAPSHOT  SUCCESS [  0.571 s]
03:46:23 [INFO] org.eclipse.papyrus.infra.types.rulebased 3.0.0-SNAPSHOT SUCCESS [  0.309 s]
03:46:23 [INFO] org.eclipse.papyrus.infra.properties.edit 3.0.0-SNAPSHOT SUCCESS [  0.303 s]
03:46:23 [INFO] org.eclipse.papyrus.infra.emf.types 4.0.0-SNAPSHOT . SUCCESS [  0.485 s]
03:46:23 [INFO] org.eclipse.papyrus.infra.emf.types.ui 4.0.0-SNAPSHOT SUCCESS [  0.610 s]
03:46:23 [INFO] Papyrus Views ...................................... SUCCESS [  0.003 s]
03:46:23 [INFO] Papyrus Properties View ............................ SUCCESS [  0.003 s]
03:46:23 [INFO] org.eclipse.papyrus.views.properties 4.0.0-SNAPSHOT  SUCCESS [  0.573 s]
03:46:23 [INFO] org.eclipse.papyrus.infra.properties.editor 3.0.0-SNAPSHOT SUCCESS [  0.576 s]
03:46:23 [INFO] org.eclipse.papyrus.infra.emf.types.ui.properties 3.0.0-SNAPSHOT SUCCESS [  0.579 s]
03:46:23 [INFO] org.eclipse.papyrus.infra.emf.expressions.edit 1.0.0-SNAPSHOT SUCCESS [  0.180 s]
03:46:23 [INFO] org.eclipse.papyrus.infra.emf.expressions.editor 1.0.0-SNAPSHOT SUCCESS [  0.267 s]
03:46:23 [INFO] org.eclipse.papyrus.infra.emf.expressions.properties 1.0.0-SNAPSHOT SUCCESS [  0.511 s]
03:46:23 [INFO] Papyrus Infra Filters Model ........................ SUCCESS [  0.004 s]
03:46:23 [INFO] org.eclipse.papyrus.infra.filters 1.3.0-SNAPSHOT ... SUCCESS [  0.178 s]
03:46:23 [INFO] org.eclipse.papyrus.infra.filters.edit 1.4.0-SNAPSHOT SUCCESS [  0.126 s]
03:46:23 [INFO] org.eclipse.papyrus.infra.services.architecture 1.0.0-SNAPSHOT SUCCESS [  0.292 s]
03:46:23 [INFO] org.eclipse.papyrus.infra.services.controlmode 2.0.0-SNAPSHOT SUCCESS [  0.673 s]
03:46:23 [INFO] org.eclipse.papyrus.infra.services.controlmode.history 2.0.0-SNAPSHOT SUCCESS [  0.190 s]
03:46:23 [INFO] org.eclipse.papyrus.infra.services.decoration 2.0.0-SNAPSHOT SUCCESS [  0.255 s]
03:46:23 [INFO] org.eclipse.papyrus.infra.services.edit.ui 3.0.0-SNAPSHOT SUCCESS [  0.455 s]
03:46:23 [INFO] org.eclipse.papyrus.infra.services.localizer 2.0.0-SNAPSHOT SUCCESS [  0.285 s]
03:46:23 [INFO] org.eclipse.papyrus.infra.services.openelement 3.0.0-SNAPSHOT SUCCESS [  0.284 s]
03:46:23 [INFO] org.eclipse.papyrus.infra.services.resourceloading 3.0.0-SNAPSHOT SUCCESS [  0.304 s]
03:46:23 [INFO] org.eclipse.papyrus.infra.services.resourceloading.ui 1.2.100-SNAPSHOT SUCCESS [  0.360 s]
03:46:23 [INFO] org.eclipse.papyrus.infra.services.semantic 2.0.0-SNAPSHOT SUCCESS [  0.174 s]
03:46:23 [INFO] org.eclipse.papyrus.infra.services.validation 3.0.0-SNAPSHOT SUCCESS [  0.374 s]
03:46:23 [INFO] org.eclipse.papyrus.infra.services.viewersearch 3.0.100-SNAPSHOT SUCCESS [  0.095 s]
03:46:23 [INFO] org.eclipse.papyrus.infra.services.viewlabelprovider 1.2.0-SNAPSHOT SUCCESS [  0.171 s]
03:46:23 [INFO] Papyrus Infra New-Child Model ...................... SUCCESS [  0.004 s]
03:46:23 [INFO] Papyrus Diagram Infrastructure ..................... SUCCESS [  0.003 s]
03:46:23 [INFO] Papyrus UML Diagram PaletteConfiguration ........... SUCCESS [  0.003 s]
03:46:23 [INFO] org.eclipse.papyrus.infra.gmfdiag.paletteconfiguration 3.1.0-SNAPSHOT SUCCESS [  0.684 s]
03:46:23 [INFO] org.eclipse.papyrus.infra.gmfdiag.representation 1.0.0-SNAPSHOT SUCCESS [  0.632 s]
03:46:23 [INFO] org.eclipse.papyrus.infra.nattable.representation 1.0.100-SNAPSHOT SUCCESS [  0.324 s]
03:46:23 [INFO] Papyrus Infra Viewpoints ........................... SUCCESS [  0.006 s]
03:46:23 [INFO] org.eclipse.papyrus.infra.viewpoints.policy 2.1.0-SNAPSHOT SUCCESS [  0.772 s]
03:46:23 [INFO] org.eclipse.papyrus.infra.gmfdiag.commands 3.0.0-SNAPSHOT SUCCESS [  0.791 s]
03:46:23 [INFO] org.eclipse.papyrus.infra.newchild 3.0.0-SNAPSHOT .. SUCCESS [  0.713 s]
03:46:23 [INFO] org.eclipse.papyrus.infra.newchild.edit 3.0.0-SNAPSHOT SUCCESS [  0.549 s]
03:46:23 [INFO] org.eclipse.papyrus.infra.newchild.editor 3.0.0-SNAPSHOT SUCCESS [  0.507 s]
03:46:23 [INFO] org.eclipse.papyrus.infra.types.editor 3.0.0-SNAPSHOT SUCCESS [  0.221 s]
03:46:23 [INFO] org.eclipse.papyrus.infra.types.ui 3.0.0-SNAPSHOT .. SUCCESS [  0.266 s]
03:46:23 [INFO] Papyrus Editor ..................................... SUCCESS [  0.004 s]
03:46:23 [INFO] org.eclipse.papyrus.editor 2.0.0-SNAPSHOT .......... SUCCESS [  0.324 s]
03:46:23 [INFO] org.eclipse.papyrus.infra.nattable 6.0.0-SNAPSHOT .. SUCCESS [  1.736 s]
03:46:23 [INFO] org.eclipse.papyrus.infra.emf.nattable 5.0.0-SNAPSHOT SUCCESS [  0.612 s]
03:46:23 [INFO] org.eclipse.papyrus.infra.nattable.common 5.0.0-SNAPSHOT SUCCESS [  0.764 s]
03:46:23 [INFO] org.eclipse.papyrus.infra.nattable.controlmode 2.0.100-SNAPSHOT SUCCESS [  0.527 s]
03:46:23 [INFO] org.eclipse.papyrus.infra.nattable.model.edit 4.0.0-SNAPSHOT SUCCESS [  0.622 s]
03:46:23 [INFO] org.eclipse.papyrus.infra.nattable.model.editor 4.0.0-SNAPSHOT SUCCESS [  1.058 s]
03:46:23 [INFO] org.eclipse.papyrus.extensionpoints.editors 2.0.0-SNAPSHOT SUCCESS [  0.504 s]
03:46:23 [INFO] org.eclipse.papyrus.infra.gmfdiag.tooling.runtime 3.0.0-SNAPSHOT SUCCESS [  0.939 s]
03:46:23 [INFO] Papyrus Infra Other Bundles ........................ SUCCESS [  0.006 s]
03:46:23 [INFO] org.eclipse.papyrus.infra.sync 2.0.0-SNAPSHOT ...... SUCCESS [  0.421 s]
03:46:23 [INFO] org.eclipse.papyrus.infra.gmfdiag.style 1.0.0-SNAPSHOT SUCCESS [  0.540 s]
03:46:23 [INFO] org.eclipse.papyrus.infra.gmfdiag.common 3.2.100-SNAPSHOT SUCCESS [  2.243 s]
03:46:23 [INFO] Papyrus Model Explorer View ........................ SUCCESS [  0.004 s]
03:46:23 [INFO] org.eclipse.papyrus.views.modelexplorer 3.0.0-SNAPSHOT SUCCESS [  1.038 s]
03:46:23 [INFO] org.eclipse.papyrus.infra.nattable.modelexplorer 4.0.0-SNAPSHOT SUCCESS [  0.711 s]
03:46:23 [INFO] org.eclipse.papyrus.customization.nattableconfiguration 2.0.100-SNAPSHOT SUCCESS [  0.691 s]
03:46:23 [INFO] org.eclipse.papyrus.infra.nattable.properties 2.2.100-SNAPSHOT SUCCESS [  0.653 s]
03:46:23 [INFO] org.eclipse.papyrus.infra.nattable.views.config 5.0.0-SNAPSHOT SUCCESS [  0.735 s]
03:46:23 [INFO] org.eclipse.papyrus.infra.nattable.views.editor 1.2.100-SNAPSHOT SUCCESS [  0.143 s]
03:46:23 [INFO] org.eclipse.papyrus.infra.nattable.representation.edit 1.0.100-SNAPSHOT SUCCESS [  0.420 s]
03:46:23 [INFO] org.eclipse.papyrus.infra.nattable.gmfdiag 1.2.100-SNAPSHOT SUCCESS [  0.655 s]
03:46:23 [INFO] org.eclipse.papyrus.infra.ui.fonts 1.0.0-SNAPSHOT .. SUCCESS [  0.188 s]
03:46:23 [INFO] org.eclipse.papyrus.infra.ui.architecture 1.0.100-SNAPSHOT SUCCESS [  0.853 s]
03:46:23 [INFO] org.eclipse.papyrus.infra.ui.resources 1.2.0-SNAPSHOT SUCCESS [  0.411 s]
03:46:23 [INFO] org.eclipse.papyrus.infra.onefile.ui 1.2.0-SNAPSHOT  SUCCESS [  0.666 s]
03:46:23 [INFO] org.eclipse.papyrus.infra.newchild.ui 2.0.0-SNAPSHOT SUCCESS [  0.533 s]
03:46:23 [INFO] org.eclipse.papyrus.infra.hyperlink 3.0.0-SNAPSHOT . SUCCESS [  0.870 s]
03:46:23 [INFO] org.eclipse.papyrus.infra.psf 1.2.0-SNAPSHOT ....... SUCCESS [  0.177 s]
03:46:23 [INFO] Papyrus Discovery UI ............................... SUCCESS [  0.003 s]
03:46:23 [INFO] org.eclipse.papyrus.infra.discovery 1.2.0-SNAPSHOT . SUCCESS [  0.125 s]
03:46:23 [INFO] org.eclipse.papyrus.infra.discovery.ui 3.0.0-SNAPSHOT SUCCESS [  0.255 s]
03:46:23 [INFO] org.eclipse.papyrus.infra.discovery.ui.menu 1.2.0-SNAPSHOT SUCCESS [  0.109 s]
03:46:23 [INFO] org.eclipse.papyrus.infra.internationalization.edit 1.0.0-SNAPSHOT SUCCESS [  0.451 s]
03:46:23 [INFO] org.eclipse.papyrus.infra.internationalization.ui 1.0.0-SNAPSHOT SUCCESS [  0.634 s]
03:46:23 [INFO] org.eclipse.papyrus.infra.internationalization.controlmode 1.0.100-SNAPSHOT SUCCESS [  9.630 s]
03:46:23 [INFO] org.eclipse.papyrus.infra.internationalization.readonly 1.0.0-SNAPSHOT SUCCESS [  0.370 s]
03:46:23 [INFO] org.eclipse.papyrus.infra.editor.welcome.internationalization 2.0.0-SNAPSHOT SUCCESS [  0.721 s]
03:46:23 [INFO] org.eclipse.papyrus.infra.gmfdiag.canonical 2.0.0-SNAPSHOT SUCCESS [  0.909 s]
03:46:23 [INFO] org.eclipse.papyrus.infra.gmfdiag.controlmode 1.2.0-SNAPSHOT SUCCESS [  0.381 s]
03:46:23 [INFO] org.eclipse.papyrus.infra.gmfdiag.css.model 1.3.0-SNAPSHOT SUCCESS [  0.152 s]
03:46:23 [INFO] org.eclipse.papyrus.infra.gmfdiag.css.model.edit 1.3.0-SNAPSHOT SUCCESS [  0.216 s]
03:46:23 [INFO] Papyrus Diagram Expansion .......................... SUCCESS [  0.004 s]
03:46:23 [INFO] org.eclipse.papyrus.infra.gmfdiag.expansion 2.0.0-SNAPSHOT SUCCESS [  1.493 s]
03:46:23 [INFO] org.eclipse.papyrus.infra.gmfdiag.dnd 1.3.0-SNAPSHOT SUCCESS [  0.750 s]
03:46:23 [INFO] Papyrus Diagram CSS Support ........................ SUCCESS [  0.004 s]
03:46:23 [INFO] org.eclipse.papyrus.infra.gmfdiag.css 2.2.1-SNAPSHOT SUCCESS [  1.003 s]
03:46:23 [INFO] org.eclipse.papyrus.infra.gmfdiag.export 2.1.100-SNAPSHOT SUCCESS [  0.648 s]
03:46:23 [INFO] org.eclipse.papyrus.infra.gmfdiag.gef 1.2.0-SNAPSHOT SUCCESS [  0.323 s]
03:46:23 [INFO] org.eclipse.papyrus.infra.gmfdiag.gmfmenu.filter 1.2.0-SNAPSHOT SUCCESS [  0.457 s]
03:46:23 [INFO] org.eclipse.papyrus.infra.gmfdiag.preferences 3.0.0-SNAPSHOT SUCCESS [  0.754 s]
03:46:23 [INFO] org.eclipse.papyrus.infra.gmfdiag.navigation 2.0.0-SNAPSHOT SUCCESS [  0.630 s]
03:46:23 [INFO] org.eclipse.papyrus.infra.gmfdiag.hyperlink 3.0.1-SNAPSHOT SUCCESS [  0.846 s]
03:46:23 [INFO] org.eclipse.papyrus.infra.gmfdiag.menu 1.2.0-SNAPSHOT SUCCESS [  0.542 s]
03:46:23 [INFO] org.eclipse.papyrus.infra.gmfdiag.modelexplorer 1.2.0-SNAPSHOT SUCCESS [  0.506 s]
03:46:23 [INFO] org.eclipse.papyrus.infra.gmfdiag.outline 2.0.0-SNAPSHOT SUCCESS [  0.414 s]
03:46:23 [INFO] org.eclipse.papyrus.infra.gmfdiag.properties 4.0.0-SNAPSHOT SUCCESS [  0.900 s]
03:46:23 [INFO] org.eclipse.papyrus.views.search 2.0.0-SNAPSHOT .... SUCCESS [  0.330 s]
03:46:23 [INFO] org.eclipse.papyrus.infra.gmfdiag.viewersearcher 1.2.0-SNAPSHOT SUCCESS [  0.434 s]
03:46:23 [INFO] org.eclipse.papyrus.infra.gmfdiag.welcome 1.2.100-SNAPSHOT SUCCESS [  0.560 s]
03:46:23 [INFO] org.eclipse.papyrus.infra.gmfdiag.widgets 1.2.0-SNAPSHOT SUCCESS [  0.370 s]
03:46:23 [INFO] org.eclipse.papyrus.infra.gmfdiag.paletteconfiguration.edit 3.1.0-SNAPSHOT SUCCESS [  0.570 s]
03:46:23 [INFO] org.eclipse.papyrus.infra.gmfdiag.representation.edit 1.0.0-SNAPSHOT SUCCESS [  0.394 s]
03:46:23 [INFO] org.eclipse.papyrus.infra.gmfdiag.style.edit 1.0.0-SNAPSHOT SUCCESS [  0.447 s]
03:46:23 [INFO] Papyrus Diagram Assistants ......................... SUCCESS [  0.002 s]
03:46:23 [INFO] org.eclipse.papyrus.infra.gmfdiag.assistant 1.3.1-SNAPSHOT SUCCESS [  0.734 s]
03:46:23 [INFO] org.eclipse.papyrus.infra.gmfdiag.assistant.edit 1.3.0-SNAPSHOT SUCCESS [  0.366 s]
03:46:23 [INFO] org.eclipse.papyrus.infra.gmfdiag.assistant.editor 1.3.0-SNAPSHOT SUCCESS [  0.680 s]
03:46:23 [INFO] org.eclipse.papyrus.infra.gmfdiag.assistant.ui 1.2.0-SNAPSHOT SUCCESS [  0.560 s]
03:46:23 [INFO] org.eclipse.papyrus.infra.gmfdiag.css.properties 3.0.0-SNAPSHOT SUCCESS [  0.668 s]
03:46:23 [INFO] org.eclipse.papyrus.infra.gmfdiag.css3.xtext 3.0.0-SNAPSHOT SUCCESS [02:10 min]
03:46:23 [INFO] org.eclipse.papyrus.infra.gmfdiag.css.configuration 2.0.0-SNAPSHOT SUCCESS [  0.509 s]
03:46:23 [INFO] org.eclipse.papyrus.infra.gmfdiag.css.theme 1.2.0-SNAPSHOT SUCCESS [  0.128 s]
03:46:23 [INFO] org.eclipse.papyrus.infra.gmfdiag.css3.xtext.ui 3.0.0-SNAPSHOT SUCCESS [  2.727 s]
03:46:23 [INFO] org.eclipse.papyrus.infra.gmfdiag.expansion.edit 2.0.0-SNAPSHOT SUCCESS [  0.453 s]
03:46:23 [INFO] org.eclipse.papyrus.infra.gmfdiag.expansion.editor 2.0.0-SNAPSHOT SUCCESS [  0.641 s]
03:46:23 [INFO] org.eclipse.papyrus.infra.gmfdiag.paletteconfiguration.editor 3.1.1-SNAPSHOT SUCCESS [  0.907 s]
03:46:23 [INFO] org.eclipse.papyrus.views.modelexplorer.newchild 1.2.0-SNAPSHOT SUCCESS [  0.484 s]
03:46:23 [INFO] org.eclipse.papyrus.views.modelexplorer.resourceloading 2.0.0-SNAPSHOT SUCCESS [  0.419 s]
03:46:23 [INFO] org.eclipse.papyrus.views.modelexplorer.widgets 2.0.0-SNAPSHOT SUCCESS [  0.312 s]
03:46:23 [INFO] org.eclipse.papyrus.views.properties.model.xwt 2.0.0-SNAPSHOT SUCCESS [  0.422 s]
03:46:23 [INFO] Papyrus UML ........................................ SUCCESS [  0.003 s]
03:46:23 [INFO] org.eclipse.papyrus.uml.appearance 2.0.0-SNAPSHOT .. SUCCESS [  0.158 s]
03:46:23 [INFO] Papyrus UML Internationalization ................... SUCCESS [  0.003 s]
03:46:23 [INFO] org.eclipse.papyrus.uml.internationalization.utils 1.0.0-SNAPSHOT SUCCESS [  0.329 s]
03:46:23 [INFO] Papyrus UML Tools .................................. SUCCESS [  0.002 s]
03:46:23 [INFO] org.eclipse.papyrus.uml.tools.utils 3.3.0-SNAPSHOT . SUCCESS [  0.626 s]
03:46:23 [INFO] org.eclipse.papyrus.uml.extensionpoints 1.3.0-SNAPSHOT SUCCESS [  0.293 s]
03:46:23 [INFO] org.eclipse.papyrus.uml.internationalization.edit 1.1.0-SNAPSHOT SUCCESS [  0.900 s]
03:46:23 [INFO] org.eclipse.papyrus.uml.tools 3.0.2-SNAPSHOT ....... SUCCESS [  1.247 s]
03:46:23 [INFO] Papyrus UML Diagrams ............................... SUCCESS [  0.007 s]
03:46:23 [INFO] org.eclipse.papyrus.uml.diagram.wizards 3.0.1-SNAPSHOT SUCCESS [  0.936 s]
03:46:23 [INFO] org.eclipse.papyrus.uml.diagram.navigation 2.0.0-SNAPSHOT SUCCESS [  0.470 s]
03:46:23 [INFO] org.eclipse.papyrus.uml.modelrepair 2.0.0-SNAPSHOT . SUCCESS [  0.772 s]
03:46:23 [INFO] org.eclipse.papyrus.uml.profile 3.1.0-SNAPSHOT ..... SUCCESS [  0.815 s]
03:46:23 [INFO] org.eclipse.papyrus.uml.diagram.common 3.1.0-SNAPSHOT SUCCESS [  3.163 s]
03:46:23 [INFO] org.eclipse.papyrus.views.properties.toolsmiths 2.0.2-SNAPSHOT SUCCESS [  0.951 s]
03:46:23 [INFO] Papyrus Validation View ............................ SUCCESS [  0.003 s]
03:46:23 [INFO] org.eclipse.papyrus.views.validation 2.0.0-SNAPSHOT  SUCCESS [  0.330 s]
03:46:23 [INFO] Papyrus References View ............................ SUCCESS [  0.004 s]
03:46:23 [INFO] org.eclipse.papyrus.views.references 2.0.0-SNAPSHOT  SUCCESS [  0.440 s]
03:46:23 [INFO] Papyrus Documentation View ......................... SUCCESS [  0.003 s]
03:46:23 [INFO] org.eclipse.papyrus.uml.diagram.stereotype.edition 2.0.0-SNAPSHOT SUCCESS [  0.950 s]
03:46:23 [INFO] org.eclipse.papyrus.uml.documentation.profile 1.3.0-SNAPSHOT SUCCESS [  0.410 s]
03:46:23 [INFO] Papyrus UML Nattable ............................... SUCCESS [  0.002 s]
03:46:23 [INFO] org.eclipse.papyrus.uml.nattable 5.0.0-SNAPSHOT .... SUCCESS [  0.688 s]
03:46:23 [INFO] org.eclipse.papyrus.uml.nattable.stereotype.display 3.0.100-SNAPSHOT SUCCESS [  0.704 s]
03:46:23 [INFO] org.eclipse.papyrus.uml.ui 1.3.0-SNAPSHOT .......... SUCCESS [  0.490 s]
03:46:23 [INFO] Papyrus UML Properties ............................. SUCCESS [  0.004 s]
03:46:23 [INFO] org.eclipse.papyrus.uml.properties 3.1.100-SNAPSHOT  SUCCESS [  6.503 s]
03:46:23 [INFO] org.eclipse.papyrus.uml.types.core 3.2.0-SNAPSHOT .. SUCCESS [  1.326 s]
03:46:23 [INFO] org.eclipse.papyrus.views.documentation 1.0.0-SNAPSHOT SUCCESS [  0.809 s]
03:46:23 [INFO] org.eclipse.papyrus.eclipse.project.editors 2.0.0-SNAPSHOT SUCCESS [  0.449 s]
03:46:23 [INFO] org.eclipse.papyrus.uml.commands 1.3.0-SNAPSHOT .... SUCCESS [  0.565 s]
03:46:23 [INFO] org.eclipse.papyrus.uml.controlmode.profile 2.0.0-SNAPSHOT SUCCESS [  0.477 s]
03:46:23 [INFO] org.eclipse.papyrus.uml.types.ui.properties 3.1.0-SNAPSHOT SUCCESS [  0.809 s]
03:46:23 [INFO] org.eclipse.papyrus.uml.filters 1.3.0-SNAPSHOT ..... SUCCESS [  0.221 s]
03:46:23 [INFO] org.eclipse.papyrus.uml.filters.edit 1.3.0-SNAPSHOT  SUCCESS [  0.115 s]
03:46:23 [INFO] org.eclipse.papyrus.uml.icons 1.2.0-SNAPSHOT ....... SUCCESS [  0.322 s]
03:46:23 [INFO] org.eclipse.papyrus.uml.import 1.2.0-SNAPSHOT ...... SUCCESS [  0.549 s]
03:46:23 [INFO] org.eclipse.papyrus.uml.export 1.0.0-SNAPSHOT ...... SUCCESS [  0.768 s]
03:46:23 [INFO] org.eclipse.papyrus.uml.navigation 1.2.0-SNAPSHOT .. SUCCESS [  0.716 s]
03:46:23 [INFO] org.eclipse.papyrus.uml.oclconstraintevaluation 1.2.0-SNAPSHOT SUCCESS [  0.617 s]
03:46:23 [INFO] org.eclipse.papyrus.uml.perspective 1.2.0-SNAPSHOT . SUCCESS [  0.452 s]
03:46:23 [INFO] org.eclipse.papyrus.uml.resourceloading.profile 1.2.0-SNAPSHOT SUCCESS [  0.430 s]
03:46:23 [INFO] org.eclipse.papyrus.uml.search.ui 2.0.0-SNAPSHOT ... SUCCESS [  0.780 s]
03:46:23 [INFO] org.eclipse.papyrus.uml.service.types 3.1.0-SNAPSHOT SUCCESS [  1.736 s]
03:46:23 [INFO] org.eclipse.papyrus.uml.service.types.ui 2.0.0-SNAPSHOT SUCCESS [  0.983 s]
03:46:23 [INFO] org.eclipse.papyrus.uml.service.validation 2.1.0-SNAPSHOT SUCCESS [  0.508 s]
03:46:23 [INFO] org.eclipse.papyrus.uml.services.decoration 1.2.0-SNAPSHOT SUCCESS [  0.309 s]
03:46:23 [INFO] org.eclipse.papyrus.uml.templaterepository 2.0.0-SNAPSHOT SUCCESS [  0.658 s]
03:46:23 [INFO] Papyrus UML ALF .................................... SUCCESS [  0.005 s]
03:46:23 [INFO] org.eclipse.papyrus.uml.alf.libraries 2.0.0-SNAPSHOT SUCCESS [  0.540 s]
03:46:23 [INFO] org.eclipse.papyrus.uml.alf 3.0.0-SNAPSHOT ......... SUCCESS [  7.172 s]
03:46:23 [INFO] org.eclipse.papyrus.uml.alf.common 2.0.0-SNAPSHOT .. SUCCESS [  0.516 s]
03:46:23 [INFO] org.eclipse.papyrus.uml.alf.common.ui 2.0.0-SNAPSHOT SUCCESS [  0.326 s]
03:46:23 [INFO] org.eclipse.papyrus.uml.alf.to.fuml 1.2.0-SNAPSHOT . SUCCESS [  0.378 s]
03:46:23 [INFO] Papyrus UML Xtext Integration ...................... SUCCESS [  0.004 s]
03:46:23 [INFO] org.eclipse.papyrus.uml.xtext.integration.core 2.0.0-SNAPSHOT SUCCESS [  0.113 s]
03:46:23 [INFO] org.eclipse.papyrus.uml.xtext.integration.ui 2.0.0-SNAPSHOT SUCCESS [  0.563 s]
03:46:23 [INFO] org.eclipse.papyrus.uml.alf.ui 3.0.0-SNAPSHOT ...... SUCCESS [  4.460 s]
03:46:23 [INFO] Papyrus UML Architecture ........................... SUCCESS [  0.003 s]
03:46:23 [INFO] org.eclipse.papyrus.uml.diagram.activity 3.0.0-SNAPSHOT SUCCESS [  9.872 s]
03:46:23 [INFO] org.eclipse.papyrus.uml.diagram.clazz 3.0.0-SNAPSHOT SUCCESS [  3.954 s]
03:46:23 [INFO] org.eclipse.papyrus.uml.diagram.communication 3.1.0-SNAPSHOT SUCCESS [  1.719 s]
03:46:23 [INFO] org.eclipse.papyrus.uml.diagram.menu 2.0.0-SNAPSHOT  SUCCESS [  1.448 s]
03:46:23 [INFO] org.eclipse.papyrus.uml.diagram.component 3.0.0-SNAPSHOT SUCCESS [  2.862 s]
03:46:23 [INFO] org.eclipse.papyrus.uml.diagram.composite 3.0.0-SNAPSHOT SUCCESS [  4.986 s]
03:46:23 [INFO] org.eclipse.papyrus.uml.diagram.deployment 3.1.0-SNAPSHOT SUCCESS [  5.353 s]
03:46:23 [INFO] org.eclipse.papyrus.uml.diagram.modelexplorer 1.2.0-SNAPSHOT SUCCESS [  0.748 s]
03:46:23 [INFO] org.eclipse.papyrus.uml.diagram.interactionoverview 3.0.0-SNAPSHOT SUCCESS [  1.306 s]
03:46:23 [INFO] org.eclipse.papyrus.uml.diagram.profile 3.0.0-SNAPSHOT SUCCESS [  2.449 s]
03:46:23 [INFO] org.eclipse.papyrus.uml.diagram.sequence 5.0.0-SNAPSHOT SUCCESS [  3.160 s]
03:46:23 [INFO] org.eclipse.papyrus.uml.diagram.statemachine 3.0.0-SNAPSHOT SUCCESS [  1.931 s]
03:46:23 [INFO] org.eclipse.papyrus.uml.diagram.timing 1.4.0-SNAPSHOT SUCCESS [  2.211 s]
03:46:23 [INFO] org.eclipse.papyrus.uml.diagram.usecase 3.1.0-SNAPSHOT SUCCESS [  2.001 s]
03:46:23 [INFO] org.eclipse.papyrus.uml.nattable.generic.config 1.2.100-SNAPSHOT SUCCESS [  0.564 s]
03:46:23 [INFO] org.eclipse.papyrus.uml.architecture 1.1.100-SNAPSHOT SUCCESS [  0.881 s]
03:46:23 [INFO] Papyrus UML Assistants ............................. SUCCESS [  0.011 s]
03:46:23 [INFO] org.eclipse.papyrus.uml.profile.types.generator 2.1.0-SNAPSHOT SUCCESS [  3.258 s]
03:46:23 [INFO] org.eclipse.papyrus.uml.profile.assistants.generator 3.0.0-SNAPSHOT SUCCESS [  1.848 s]
03:46:23 [INFO] org.eclipse.papyrus.uml.profile.types.generator.ui 1.2.0-SNAPSHOT SUCCESS [  0.611 s]
03:46:23 [INFO] org.eclipse.papyrus.uml.profile.assistants.generator.ui 1.2.0-SNAPSHOT SUCCESS [  0.622 s]
03:46:23 [INFO] Papyrus UML Decorator Models ....................... SUCCESS [  0.006 s]
03:46:23 [INFO] org.eclipse.papyrus.uml.decoratormodel 2.0.0-SNAPSHOT SUCCESS [  0.931 s]
03:46:23 [INFO] org.eclipse.papyrus.uml.decoratormodel.controlmode 1.2.100-SNAPSHOT SUCCESS [  0.760 s]
03:46:23 [INFO] org.eclipse.papyrus.uml.decoratormodel.ui 2.0.0-SNAPSHOT SUCCESS [  0.837 s]
03:46:23 [INFO] org.eclipse.papyrus.uml.decoratormodel.properties 4.0.0-SNAPSHOT SUCCESS [  0.816 s]
03:46:23 [INFO] org.eclipse.papyrus.uml.diagram.common.groups 2.0.0-SNAPSHOT SUCCESS [  0.793 s]
03:46:23 [INFO] org.eclipse.papyrus.uml.diagram.css 2.0.0-SNAPSHOT . SUCCESS [  0.756 s]
03:46:23 [INFO] org.eclipse.papyrus.uml.diagram.dnd 1.3.0-SNAPSHOT . SUCCESS [  0.925 s]
03:46:23 [INFO] org.eclipse.papyrus.uml.diagram.icons 1.2.0-SNAPSHOT SUCCESS [  0.181 s]
03:46:23 [INFO] org.eclipse.papyrus.uml.diagram.linklf 2.0.0-SNAPSHOT SUCCESS [  0.841 s]
03:46:23 [INFO] org.eclipse.papyrus.uml.diagram.symbols 1.2.0-SNAPSHOT SUCCESS [  0.619 s]
03:46:23 [INFO] org.eclipse.papyrus.uml.diagram.symbols.properties 1.2.0-SNAPSHOT SUCCESS [  0.245 s]
03:46:23 [INFO] Papyrus UML Expressions Infrastructure ............. SUCCESS [  0.003 s]
03:46:23 [INFO] org.eclipse.papyrus.uml.expressions 2.0.0-SNAPSHOT . SUCCESS [  0.141 s]
03:46:23 [INFO] org.eclipse.papyrus.uml.expressions.edit 2.0.0-SNAPSHOT SUCCESS [  0.092 s]
03:46:23 [INFO] org.eclipse.papyrus.uml.expressions.properties 1.0.0-SNAPSHOT SUCCESS [  0.397 s]
03:46:23 [INFO] Papyrus UML Model Explorer ......................... SUCCESS [  0.003 s]
03:46:23 [INFO] org.eclipse.papyrus.uml.modelexplorer 2.0.0-SNAPSHOT SUCCESS [  1.134 s]
03:46:23 [INFO] org.eclipse.papyrus.uml.modelexplorer.widgets 2.0.0-SNAPSHOT SUCCESS [  0.394 s]
03:46:23 [INFO] org.eclipse.papyrus.uml.nattable.clazz.config 5.0.0-SNAPSHOT SUCCESS [  0.463 s]
03:46:23 [INFO] org.eclipse.papyrus.uml.nattable.generic 1.2.100-SNAPSHOT SUCCESS [  0.274 s]
03:46:23 [INFO] org.eclipse.papyrus.uml.nattable.matrix 1.0.100-SNAPSHOT SUCCESS [  0.541 s]
03:46:23 [INFO] org.eclipse.papyrus.uml.nattable.menu 1.2.100-SNAPSHOT SUCCESS [  0.997 s]
03:46:23 [INFO] org.eclipse.papyrus.uml.nattable.properties 1.0.100-SNAPSHOT SUCCESS [  0.581 s]
03:46:23 [INFO] org.eclipse.papyrus.uml.nattable.richtext 2.1.100-SNAPSHOT SUCCESS [  0.399 s]
03:46:23 [INFO] org.eclipse.papyrus.uml.nattable.xtext.integration 2.0.100-SNAPSHOT SUCCESS [  0.430 s]
03:46:23 [INFO] Papyrus UML Textual Edit ........................... SUCCESS [  0.002 s]
03:46:23 [INFO] org.eclipse.papyrus.uml.textedit.valuespecification.xtext 1.3.0-SNAPSHOT SUCCESS [  1.032 s]
03:46:23 [INFO] org.eclipse.papyrus.uml.textedit.valuespecification.xtext.utils 1.3.0-SNAPSHOT SUCCESS [  0.460 s]
03:46:23 [INFO] org.eclipse.papyrus.uml.textedit.valuespecification.xtext.ui 2.0.0-SNAPSHOT SUCCESS [  0.531 s]
03:46:23 [INFO] org.eclipse.papyrus.uml.nattable.xtext.valuespecification 5.0.0-SNAPSHOT SUCCESS [  0.679 s]
03:46:23 [INFO] Papyrus UML New Child Menu ......................... SUCCESS [  0.003 s]
03:46:23 [INFO] org.eclipse.papyrus.uml.profile.newchildmenu.generator 1.2.0-SNAPSHOT SUCCESS [  1.173 s]
03:46:23 [INFO] org.eclipse.papyrus.uml.profile.newchildmenu.generator.ui 1.2.0-SNAPSHOT SUCCESS [  0.448 s]
03:46:23 [INFO] Papyrus UML Profile ................................ SUCCESS [  0.003 s]
03:46:23 [INFO] org.eclipse.papyrus.uml.profile.drafter 1.3.0-SNAPSHOT SUCCESS [  1.595 s]
03:46:23 [INFO] org.eclipse.papyrus.uml.profile.drafter.documentation 1.2.0-SNAPSHOT SUCCESS [  0.028 s]
03:46:23 [INFO] org.eclipse.papyrus.uml.properties.xtext 1.2.0-SNAPSHOT SUCCESS [  2.030 s]
03:46:23 [INFO] org.eclipse.papyrus.uml.properties.generation 2.1.0-SNAPSHOT SUCCESS [  0.781 s]
03:46:23 [INFO] org.eclipse.papyrus.uml.textedit.common.xtext 2.0.0-SNAPSHOT SUCCESS [  2.435 s]
03:46:23 [INFO] org.eclipse.papyrus.uml.textedit.collaborationuse.xtext 2.0.0-SNAPSHOT SUCCESS [  1.602 s]
03:46:23 [INFO] org.eclipse.papyrus.uml.textedit.common.xtext.ui 2.0.0-SNAPSHOT SUCCESS [  1.436 s]
03:46:23 [INFO] org.eclipse.papyrus.uml.textedit.collaborationuse.xtext.ui 2.0.100-SNAPSHOT SUCCESS [  0.933 s]
03:46:23 [INFO] org.eclipse.papyrus.uml.textedit.connectionpointreference.xtext 2.0.0-SNAPSHOT SUCCESS [  2.434 s]
03:46:23 [INFO] org.eclipse.papyrus.uml.textedit.connectionpointreference.xtext.ui 2.0.0-SNAPSHOT SUCCESS [  0.511 s]
03:46:23 [INFO] org.eclipse.papyrus.uml.textedit.constraintwithessentialocl.xtext 1.3.0-SNAPSHOT SUCCESS [  0.896 s]
03:46:23 [INFO] org.eclipse.papyrus.uml.textedit.javaconstraint 2.0.0-SNAPSHOT SUCCESS [  0.240 s]
03:46:23 [INFO] org.eclipse.papyrus.uml.textedit.message.xtext 2.0.0-SNAPSHOT SUCCESS [  1.590 s]
03:46:23 [INFO] org.eclipse.papyrus.uml.textedit.message.xtext.ui 2.0.0-SNAPSHOT SUCCESS [  5.265 s]
03:46:23 [INFO] org.eclipse.papyrus.uml.textedit.parameter.xtext 2.0.0-SNAPSHOT SUCCESS [  2.162 s]
03:46:23 [INFO] org.eclipse.papyrus.uml.textedit.parameter.xtext.ui 2.0.0-SNAPSHOT SUCCESS [  1.819 s]
03:46:23 [INFO] org.eclipse.papyrus.uml.textedit.port.xtext 1.3.0-SNAPSHOT SUCCESS [  2.064 s]
03:46:23 [INFO] org.eclipse.papyrus.uml.textedit.port.xtext.ui 2.0.0-SNAPSHOT SUCCESS [  1.341 s]
03:46:23 [INFO] org.eclipse.papyrus.uml.textedit.property.xtext 2.0.0-SNAPSHOT SUCCESS [  4.300 s]
03:46:23 [INFO] org.eclipse.papyrus.uml.textedit.property.xtext.ui 2.0.0-SNAPSHOT SUCCESS [  0.804 s]
03:46:23 [INFO] org.eclipse.papyrus.uml.textedit.state.xtext 2.0.0-SNAPSHOT SUCCESS [  2.611 s]
03:46:23 [INFO] org.eclipse.papyrus.uml.textedit.state.xtext.ui 2.0.0-SNAPSHOT SUCCESS [  0.640 s]
03:46:23 [INFO] org.eclipse.papyrus.uml.textedit.stereotypeproperty.xtext 3.0.0-SNAPSHOT SUCCESS [  4.586 s]
03:46:23 [INFO] org.eclipse.papyrus.uml.textedit.stereotypeproperty.xtext.ui 3.0.0-SNAPSHOT SUCCESS [  4.069 s]
03:46:23 [INFO] org.eclipse.papyrus.uml.textedit.transition.xtext 1.3.0-SNAPSHOT SUCCESS [  2.727 s]
03:46:23 [INFO] org.eclipse.papyrus.uml.textedit.transition.xtext.ui 2.0.0-SNAPSHOT SUCCESS [  0.630 s]
03:46:23 [INFO] org.eclipse.papyrus.uml.xtext.integration.validation 2.0.0-SNAPSHOT SUCCESS [  0.481 s]
03:46:23 [INFO] org.eclipse.papyrus.uml.internationalization 1.0.0-SNAPSHOT SUCCESS [  1.852 s]
03:46:23 [INFO] Papyrus M2M QvTo ................................... SUCCESS [  0.004 s]
03:46:23 [INFO] org.eclipse.papyrus.uml.m2m.qvto.common 1.0.0-SNAPSHOT SUCCESS [  2.944 s]
03:46:23 [INFO] org.eclipse.papyrus.uml.m2m.qvto.common.blackboxes 1.0.0-SNAPSHOT SUCCESS [  0.138 s]
03:46:23 [INFO] org.eclipse.papyrus.plugins-doc .................... SUCCESS [  0.003 s]
03:46:23 [INFO] Papyrus Infra doc 1.2.0-SNAPSHOT ................... SUCCESS [  0.020 s]
03:46:23 [INFO] Papyrus Copypaste UI doc 1.2.0-SNAPSHOT ............ SUCCESS [  7.761 s]
03:46:23 [INFO] Papyrus DSML Validation doc 1.2.0-SNAPSHOT ......... SUCCESS [  0.095 s]
03:46:23 [INFO] Papyrus Infra GmfDiag Common doc 1.2.0-SNAPSHOT .... SUCCESS [  0.389 s]
03:46:23 [INFO] Papyrus Infra GmfDiag Css doc 1.2.0-SNAPSHOT ....... SUCCESS [  0.156 s]
03:46:23 [INFO] Papyrus Infra Nattable doc 1.0.0-SNAPSHOT .......... SUCCESS [  0.080 s]
03:46:23 [INFO] Papyrus Internationalization doc 1.0.0-SNAPSHOT .... SUCCESS [  0.079 s]
03:46:23 [INFO] Papyrus Infra Nattable doc 1.3.0-SNAPSHOT .......... SUCCESS [  0.731 s]
03:46:23 [INFO] Papyrus Infra Newchild doc 1.2.0-SNAPSHOT .......... SUCCESS [  0.095 s]
03:46:23 [INFO] Papyrus Infra Services ControlMode doc 1.2.0-SNAPSHOT SUCCESS [  0.084 s]
03:46:23 [INFO] Papyrus Infra Architecture doc 1.0.0-SNAPSHOT ...... SUCCESS [  0.132 s]
03:46:23 [INFO] Papyrus Infra Types doc 3.0.0-SNAPSHOT ............. SUCCESS [  0.100 s]
03:46:23 [INFO] Papyrus Req Reqif doc 1.2.0-SNAPSHOT ............... SUCCESS [  0.217 s]
03:46:23 [INFO] Papyrus Uml DecoratorModel doc 1.2.0-SNAPSHOT ...... SUCCESS [  0.381 s]
03:46:23 [INFO] Papyrus Uml Diagram Common doc 1.2.0-SNAPSHOT ...... SUCCESS [  0.390 s]
03:46:23 [INFO] Papyrus Uml Diagram profile doc 1.2.0-SNAPSHOT ..... SUCCESS [  0.461 s]
03:46:23 [INFO] Papyrus Uml doc 1.2.0-SNAPSHOT ..................... SUCCESS [  1.509 s]
03:46:23 [INFO] Papyrus ModelRepair doc 1.2.0-SNAPSHOT ............. SUCCESS [  0.807 s]
03:46:23 [INFO] Papyrus Uml Profile Assistants doc 1.2.0-SNAPSHOT .. SUCCESS [  0.115 s]
03:46:23 [INFO] Papyrus Uml Search UI doc 1.2.0-SNAPSHOT ........... SUCCESS [  0.139 s]
03:46:23 [INFO] Papyrus Views Properties doc 1.2.0-SNAPSHOT ........ SUCCESS [  0.156 s]
03:46:23 [INFO] Papyrus Views References doc 1.2.0-SNAPSHOT ........ SUCCESS [  0.039 s]
03:46:23 [INFO] Papyrus Views References doc 1.0.0-SNAPSHOT ........ SUCCESS [  0.039 s]
03:46:23 [INFO] Papyrus Documentation template ..................... FAILURE [03:23 min]
03:46:23 [INFO] org.eclipse.papyrus.toolsmiths.profilemigration.doc 0.7.0-SNAPSHOT SKIPPED
03:46:23 [INFO] Papyrus Team Plugins ............................... SKIPPED
03:46:23 [INFO] org.eclipse.papyrus.team.svn 1.2.0-SNAPSHOT ........ SKIPPED
03:46:23 [INFO] Papyrus SDK ........................................ SKIPPED
03:46:23 [INFO] org.eclipse.papyrus.sdk 3.1.0-SNAPSHOT ............. SKIPPED
03:46:23 [INFO] Papyrus Toolsmiths Plugins ......................... SKIPPED
03:46:23 [INFO] org.eclipse.papyrus.toolsmiths 1.2.0-SNAPSHOT ...... SKIPPED
03:46:23 [INFO] org.eclipse.papyrus.toolsmiths.palette 3.0.0-SNAPSHOT SKIPPED
03:46:23 [INFO] org.eclipse.papyrus.toolsmiths.expressions 1.0.0-SNAPSHOT SKIPPED
03:46:23 [INFO] org.eclipse.papyrus.toolsmiths.profile-migration ... SKIPPED
03:46:23 [INFO] org.eclipse.papyrus.toolsmiths.profilemigration.ui 0.7.0-SNAPSHOT SKIPPED
03:46:23 [INFO] org.eclipse.papyrus.toolsmiths.profilemigration 0.7.0-SNAPSHOT SKIPPED
03:46:23 [INFO] Papyrus Examples Plugins 1.0.1-SNAPSHOT ............ SKIPPED
03:46:23 [INFO] org.eclipse.papyrus.examples.core 1.0.1-SNAPSHOT ... SKIPPED
03:46:23 [INFO] org.eclipse.papyrus.example.core.lifecycleevents 1.2.0-SNAPSHOT SKIPPED
03:46:23 [INFO] org.eclipse.papyrus.example.core.sashwindows.fulleditor 1.1.0-SNAPSHOT SKIPPED
03:46:23 [INFO] org.eclipse.papyrus.example.core.sashwindows.simpleeditor 1.1.0-SNAPSHOT SKIPPED
03:46:23 [INFO] org.eclipse.papyrus.examples.emf 1.0.1-SNAPSHOT .... SKIPPED
03:46:23 [INFO] org.eclipse.papyrus.outline.emftree 1.1.0-SNAPSHOT . SKIPPED
03:46:23 [INFO] org.eclipse.papyrus.examples.infra 1.0.1-SNAPSHOT .. SKIPPED
03:46:23 [INFO] org.eclipse.papyrus.example.infra.servicesregistry.retrieval 1.1.0-SNAPSHOT SKIPPED
03:46:23 [INFO] org.eclipse.papyrus.infra.gmfdiag.connectionpoint.preferences 1.1.0-SNAPSHOT SKIPPED
03:46:23 [INFO] org.eclipse.papyrus.examples.others 1.0.1-SNAPSHOT . SKIPPED
03:46:23 [INFO] org.eclipse.papyrus.example.diagram.simplediagram 1.1.0-SNAPSHOT SKIPPED
03:46:23 [INFO] org.eclipse.papyrus.example.text.instance 1.1.0-SNAPSHOT SKIPPED
03:46:23 [INFO] org.eclipse.papyrus.examples.uml 1.0.1-SNAPSHOT .... SKIPPED
03:46:23 [INFO] org.eclipse.papyrus.example.uml.comment.editor.newresource 1.1.0-SNAPSHOT SKIPPED
03:46:23 [INFO] org.eclipse.papyrus.example.uml.comment.editor.sharedresource 1.1.0-SNAPSHOT SKIPPED
03:46:23 [INFO] org.eclipse.papyrus.uml.diagram.emftree 1.2.0-SNAPSHOT SKIPPED
03:46:23 [INFO] org.eclipse.papyrus.uml.diagram.example.programmaticcreation 1.2.0-SNAPSHOT SKIPPED
03:46:23 [INFO] org.eclipse.papyrus.uml.textual.editors.example 1.1.100-SNAPSHOT SKIPPED
03:46:23 [INFO] org.eclipse.papyrus.examples-user 1.0.1-SNAPSHOT ... SKIPPED
03:46:23 [INFO] org.eclipse.papyrus.examples.user.qvto 1.0.0-SNAPSHOT SKIPPED
03:46:23 [INFO] org.eclipse.papyrus.examples.user-referencediagrams 1.0.1-SNAPSHOT SKIPPED
03:46:23 [INFO] Papyrus Main Features .............................. SKIPPED
03:46:23 [INFO] org.eclipse.papyrus.doc.feature 3.0.0-SNAPSHOT ..... SKIPPED
03:46:23 [INFO] org.eclipse.papyrus.editor.feature 2.0.0-SNAPSHOT .. SKIPPED
03:46:23 [INFO] org.eclipse.papyrus.emf.facet.feature 3.0.0-SNAPSHOT SKIPPED
03:46:23 [INFO] org.eclipse.papyrus.infra.architecture.feature 1.0.0-SNAPSHOT SKIPPED
03:46:23 [INFO] org.eclipse.papyrus.infra.core.feature 3.0.0-SNAPSHOT SKIPPED
03:46:23 [INFO] org.eclipse.papyrus.infra.discovery.feature 3.0.0-SNAPSHOT SKIPPED
03:46:23 [INFO] org.eclipse.papyrus.infra.emf.feature 3.0.0-SNAPSHOT SKIPPED
03:46:23 [INFO] org.eclipse.papyrus.infra.emf.expressions.feature 1.0.0-SNAPSHOT SKIPPED
03:46:23 [INFO] org.eclipse.papyrus.infra.feature 3.0.0-SNAPSHOT ... SKIPPED
03:46:23 [INFO] org.eclipse.papyrus.infra.gmfdiag.css.feature 3.0.0-SNAPSHOT SKIPPED
03:46:23 [INFO] org.eclipse.papyrus.infra.gmfdiag.feature 3.0.0-SNAPSHOT SKIPPED
03:46:23 [INFO] org.eclipse.papyrus.infra.internationalization.feature 1.0.0-SNAPSHOT SKIPPED
03:46:23 [INFO] org.eclipse.papyrus.infra.nattable.feature 4.0.0-SNAPSHOT SKIPPED
03:46:23 [INFO] org.eclipse.papyrus.infra.services.feature 3.0.0-SNAPSHOT SKIPPED
03:46:23 [INFO] org.eclipse.papyrus.infra.ui.feature 3.0.0-SNAPSHOT  SKIPPED
03:46:23 [INFO] org.eclipse.papyrus.infra.viewpoints.feature 3.0.0-SNAPSHOT SKIPPED
03:46:23 [INFO] org.eclipse.papyrus.infra.widget.feature 3.0.0-SNAPSHOT SKIPPED
03:46:23 [INFO] org.eclipse.papyrus.uml.feature 3.0.0-SNAPSHOT ..... SKIPPED
03:46:23 [INFO] org.eclipse.papyrus.uml.modelexplorer.feature 2.0.0-SNAPSHOT SKIPPED
03:46:23 [INFO] org.eclipse.papyrus.uml.properties.feature 3.0.0-SNAPSHOT SKIPPED
03:46:23 [INFO] org.eclipse.papyrus.uml.tools.feature 3.0.0-SNAPSHOT SKIPPED
03:46:23 [INFO] org.eclipse.papyrus.uml.ui.feature 1.2.0-SNAPSHOT .. SKIPPED
03:46:23 [INFO] org.eclipse.papyrus.views.modelexplorer.feature 3.0.0-SNAPSHOT SKIPPED
03:46:23 [INFO] org.eclipse.papyrus.views.properties.feature 3.0.0-SNAPSHOT SKIPPED
03:46:23 [INFO] org.eclipse.papyrus.views.references.feature 2.0.0-SNAPSHOT SKIPPED
03:46:23 [INFO] org.eclipse.papyrus.uml.diagram.feature 3.0.0-SNAPSHOT SKIPPED
03:46:23 [INFO] org.eclipse.papyrus.uml.textedit.feature 2.0.0-SNAPSHOT SKIPPED
03:46:23 [INFO] org.eclipse.papyrus.uml.alf.feature 3.0.0-SNAPSHOT . SKIPPED
03:46:23 [INFO] org.eclipse.papyrus.views.validation.feature 2.0.0-SNAPSHOT SKIPPED
03:46:23 [INFO] org.eclipse.papyrus.views.search.feature 2.0.0-SNAPSHOT SKIPPED
03:46:23 [INFO] org.eclipse.papyrus.uml.search.feature 2.0.0-SNAPSHOT SKIPPED
03:46:23 [INFO] org.eclipse.papyrus.uml.xtext.integration.feature 2.0.0-SNAPSHOT SKIPPED
03:46:23 [INFO] org.eclipse.papyrus.uml.internationalization.feature 1.0.0-SNAPSHOT SKIPPED
03:46:23 [INFO] org.eclipse.papyrus.uml.m2m.qvto.feature 1.0.0-SNAPSHOT SKIPPED
03:46:23 [INFO] org.eclipse.papyrus.uml.nattable.feature 4.0.0-SNAPSHOT SKIPPED
03:46:23 [INFO] org.eclipse.papyrus.uml.diagram.css.feature 2.0.0-SNAPSHOT SKIPPED
03:46:23 [INFO] org.eclipse.papyrus.uml.decoratormodel.feature 3.0.0-SNAPSHOT SKIPPED
03:46:23 [INFO] org.eclipse.papyrus.uml.assistants.feature 3.0.0-SNAPSHOT SKIPPED
03:46:23 [INFO] org.eclipse.papyrus.views.documentation.feature 1.0.0-SNAPSHOT SKIPPED
03:46:23 [INFO] org.eclipse.papyrus.uml.architecture.feature 1.0.0-SNAPSHOT SKIPPED
03:46:23 [INFO] org.eclipse.papyrus.uml.expressions.feature 1.0.0-SNAPSHOT SKIPPED
03:46:23 [INFO] org.eclipse.papyrus.sdk.feature 3.5.0-SNAPSHOT ..... SKIPPED
03:46:23 [INFO] Papyrus Toolsmiths Features ........................ SKIPPED
03:46:23 [INFO] org.eclipse.papyrus.toolsmiths.feature 1.2.0-SNAPSHOT SKIPPED
03:46:23 [INFO] Papyrus Examples Features .......................... SKIPPED
03:46:23 [INFO] org.eclipse.papyrus.user.examples.feature .......... SKIPPED
03:46:23 [INFO] org.eclipse.papyrus.main.target.parent ............. SKIPPED
03:46:23 [INFO] org.eclipse.papyrus.main.portable.target ........... SKIPPED
03:46:23 [INFO] org.eclipse.papyrus.p2 3.5.0-SNAPSHOT .............. SKIPPED
03:46:23 [INFO] org.eclipse.papyrus.dev.releng 3.0.0-SNAPSHOT ...... SKIPPED
03:46:23 [INFO] org.eclipse.papyrus.junit.framework 1.2.0-SNAPSHOT . SKIPPED
03:46:23 [INFO] org.eclipse.papyrus.junit.utils 2.2.0-SNAPSHOT ..... SKIPPED
03:46:23 [INFO] org.eclipse.papyrus.bundles.tests 1.2.0-SNAPSHOT ... SKIPPED
03:46:23 [INFO] Papyrus Developer Tools ............................ SKIPPED
03:46:23 [INFO] org.eclipse.papyrus.gmfgenextension 2.0.0-SNAPSHOT . SKIPPED
03:46:23 [INFO] org.eclipse.papyrus.def 1.3.0-SNAPSHOT ............. SKIPPED
03:46:23 [INFO] org.eclipse.papyrus.codegen 1.2.0-SNAPSHOT ......... SKIPPED
03:46:23 [INFO] org.eclipse.papyrus.dev.assistants.codegen 1.2.0-SNAPSHOT SKIPPED
03:46:23 [INFO] org.eclipse.papyrus.mwe2.utils 1.2.0-SNAPSHOT ...... SKIPPED
03:46:23 [INFO] org.eclipse.papyrus.tests.framework.annotations 1.2.0-SNAPSHOT SKIPPED
03:46:23 [INFO] org.eclipse.papyrus.tests.framework 1.2.0-SNAPSHOT . SKIPPED
03:46:23 [INFO] org.eclipse.papyrus.junit.feature 2.0.0-SNAPSHOT ... SKIPPED
03:46:23 [INFO] org.eclipse.papyrus.uml.m2m.qvto.tests.tools 1.0.0-SNAPSHOT SKIPPED
03:46:23 [INFO] org.eclipse.papyrus.uml.m2m.qvto.tests.tools.feature 1.0.0-SNAPSHOT SKIPPED
03:46:23 [INFO] org.eclipse.papyrus.dev.ui ......................... SKIPPED
03:46:23 [INFO] org.eclipse.papyrus.dev.view.services.edit.request 1.2.0-SNAPSHOT SKIPPED
03:46:23 [INFO] org.eclipse.papyrus.gmf.editpoliciesstates 1.2.0-SNAPSHOT SKIPPED
03:46:23 [INFO] org.eclipse.papyrus.gmf.editpartview 1.2.0-SNAPSHOT  SKIPPED
03:46:23 [INFO] org.eclipse.papyrus.gmf.figureview 1.2.0-SNAPSHOT .. SKIPPED
03:46:23 [INFO] org.eclipse.papyrus.infra.gmfdiag.css.debug 1.2.0-SNAPSHOT SKIPPED
03:46:23 [INFO] org.eclipse.papyrus.releng.tools 1.2.0-SNAPSHOT .... SKIPPED
03:46:23 [INFO] org.eclipse.papyrus.dev.project.management 1.3.0-SNAPSHOT SKIPPED
03:46:23 [INFO] org.eclipse.papyrus.infra.emf.commandstack 1.2.0-SNAPSHOT SKIPPED
03:46:23 [INFO] org.eclipse.papyrus.dev.tests.framework 2.0.0-SNAPSHOT SKIPPED
03:46:23 [INFO] org.eclipse.papyrus.dev.tests.framework.ui 1.2.0-SNAPSHOT SKIPPED
03:46:23 [INFO] org.eclipse.papyrus.tests.framework.edit 1.2.0-SNAPSHOT SKIPPED
03:46:23 [INFO] org.eclipse.papyrus.tests.framework.editor 1.2.0-SNAPSHOT SKIPPED
03:46:23 [INFO] org.eclipse.papyrus.dev.types 3.0.0-SNAPSHOT ....... SKIPPED
03:46:23 [INFO] org.eclipse.papyrus.dev.feature 3.0.0-SNAPSHOT ..... SKIPPED
03:46:23 [INFO] org.eclipse.papyrus.dev.examples.feature ........... SKIPPED
03:46:23 [INFO] org.eclipse.papyrus.p2.dev 3.0.0-SNAPSHOT .......... SKIPPED
03:46:23 [INFO] org.eclipse.papyrus.dev.target.parent .............. SKIPPED
03:46:23 [INFO] org.eclipse.papyrus.dev.portable.target ............ SKIPPED
03:46:23 [INFO] org.eclipse.papyrus.tests.releng 1.2.0-SNAPSHOT .... SKIPPED
03:46:23 [INFO] org.eclipse.papyrus.plugins.tests.releng ........... SKIPPED
03:46:23 [INFO] org.eclipse.papyrus.editor.tests.releng ............ SKIPPED
03:46:23 [INFO] org.eclipse.papyrus.editor.integration.tests 1.3.100-SNAPSHOT SKIPPED
03:46:23 [INFO] org.eclipse.papyrus.infra.tests.releng ............. SKIPPED
03:46:23 [INFO] org.eclipse.papyrus.infra.core.tests.releng ........ SKIPPED
03:46:23 [INFO] org.eclipse.papyrus.infra.core.clipboard.tests 1.3.0-SNAPSHOT SKIPPED
03:46:23 [INFO] org.eclipse.papyrus.infra.core.sasheditor.tests 1.2.0-SNAPSHOT SKIPPED
03:46:23 [INFO] org.eclipse.papyrus.infra.core.sasheditor.di.tests 1.2.0-SNAPSHOT SKIPPED
03:46:23 [INFO] org.eclipse.papyrus.infra.core.tests 3.0.1-SNAPSHOT  SKIPPED
03:46:23 [INFO] org.eclipse.papyrus.infra.editor.tests.releng ...... SKIPPED
03:46:23 [INFO] org.eclipse.papyrus.infra.editor.welcome.tests 1.2.0-SNAPSHOT SKIPPED
03:46:23 [INFO] org.eclipse.papyrus.infra.emf.tests.releng ......... SKIPPED
03:46:23 [INFO] org.eclipse.papyrus.infra.emf.gmf.tests 1.2.100-SNAPSHOT SKIPPED
03:46:23 [INFO] org.eclipse.papyrus.infra.emf.readonly.tests 1.2.0-SNAPSHOT SKIPPED
03:46:23 [INFO] org.eclipse.papyrus.infra.emf.tests 1.4.0-SNAPSHOT . SKIPPED
03:46:23 [INFO] org.eclipse.papyrus.infra.filters.tests 1.2.0-SNAPSHOT SKIPPED
03:46:23 [INFO] org.eclipse.papyrus.infra.gmfdiag.tests.releng ..... SKIPPED
03:46:23 [INFO] org.eclipse.papyrus.infra.gmfdiag.assistant.tests.releng SKIPPED
03:46:23 [INFO] org.eclipse.papyrus.infra.gmfdiag.assistant.tests 1.2.0-SNAPSHOT SKIPPED
03:46:23 [INFO] org.eclipse.papyrus.infra.gmfdiag.canonical.tests 1.2.0-SNAPSHOT SKIPPED
03:46:23 [INFO] org.eclipse.papyrus.infra.gmfdiag.commands.tests 1.2.0-SNAPSHOT SKIPPED
03:46:23 [INFO] org.eclipse.papyrus.infra.gmfdiag.common.tests 3.0.0-SNAPSHOT SKIPPED
03:46:23 [INFO] org.eclipse.papyrus.infra.gmfdiag.css.tests 1.2.0-SNAPSHOT SKIPPED
03:46:23 [INFO] org.eclipse.papyrus.infra.gmfdiag.menu.tests 1.2.0-SNAPSHOT SKIPPED
03:46:23 [INFO] org.eclipse.papyrus.infra.gmfdiag.paletteconfiguration.tests 1.2.0-SNAPSHOT SKIPPED
03:46:23 [INFO] org.eclipse.papyrus.infra.gmfdiag.welcome.tests 1.2.0-SNAPSHOT SKIPPED
03:46:23 [INFO] org.eclipse.papyrus.infra.nattable.main.test 1.2.0-SNAPSHOT SKIPPED
03:46:23 [INFO] org.eclipse.papyrus.infra.nattable.common.tests 1.2.100-SNAPSHOT SKIPPED
03:46:23 [INFO] org.eclipse.papyrus.infra.nattable.model.editor.tests 1.2.100-SNAPSHOT SKIPPED
03:46:23 [INFO] org.eclipse.papyrus.infra.nattable.model.tests 1.2.100-SNAPSHOT SKIPPED
03:46:23 [INFO] org.eclipse.papyrus.infra.nattable.tests 1.2.100-SNAPSHOT SKIPPED
03:46:23 [INFO] org.eclipse.papyrus.infra.nattable.views.tests 1.2.100-SNAPSHOT SKIPPED
03:46:23 [INFO] org.eclipse.papyrus.infra.properties.tests.releng .. SKIPPED
03:46:23 [INFO] org.eclipse.papyrus.infra.properties.ui.tests 2.0.0-SNAPSHOT SKIPPED
03:46:23 [INFO] org.eclipse.papyrus.infra.services.tests.releng .... SKIPPED
03:46:23 [INFO] org.eclipse.papyrus.infra.services.controlmode.tests 1.4.0-SNAPSHOT SKIPPED
03:46:23 [INFO] org.eclipse.papyrus.infra.services.edit.tests 1.2.0-SNAPSHOT SKIPPED
03:46:23 [INFO] org.eclipse.papyrus.infra.services.edit.ui.tests 1.2.0-SNAPSHOT SKIPPED
03:46:23 [INFO] org.eclipse.papyrus.infra.services.resourceloading.tests 1.2.0-SNAPSHOT SKIPPED
03:46:23 [INFO] org.eclipse.papyrus.infra.services.semantic.tests 1.2.100-SNAPSHOT SKIPPED
03:46:23 [INFO] org.eclipse.papyrus.infra.tools.tests 1.2.0-SNAPSHOT SKIPPED
03:46:23 [INFO] org.eclipse.papyrus.infra.types.tests.releng ....... SKIPPED
03:46:23 [INFO] org.eclipse.papyrus.infra.types.tests 3.0.0-SNAPSHOT SKIPPED
03:46:23 [INFO] org.eclipse.papyrus.infra.types.ui.tests 3.0.0-SNAPSHOT SKIPPED
03:46:23 [INFO] org.eclipse.papyrus.infra.ui.emf.tests 1.2.0-SNAPSHOT SKIPPED
03:46:23 [INFO] org.eclipse.papyrus.infra.ui.tests 1.2.0-SNAPSHOT .. SKIPPED
03:46:23 [INFO] org.eclipse.papyrus.infra.viewpoints.tests.releng 1.2.0-SNAPSHOT SKIPPED
03:46:23 [INFO] org.eclipse.papyrus.infra.viewpoints.policy.tests 1.2.0-SNAPSHOT SKIPPED
03:46:23 [INFO] org.eclipse.papyrus.uml.tests.releng ............... SKIPPED
03:46:23 [INFO] org.eclipse.papyrus.uml.diagram.tests.releng 1.2.0-SNAPSHOT SKIPPED
03:46:23 [INFO] org.eclipse.papyrus.uml.diagram.tests 1.3.0-SNAPSHOT SKIPPED
03:46:23 [INFO] org.eclipse.papyrus.uml.diagram.clazz.tests 1.3.0-SNAPSHOT SKIPPED
03:46:23 [INFO] org.eclipse.papyrus.uml.diagram.activity.tests 1.2.0-SNAPSHOT SKIPPED
03:46:23 [INFO] org.eclipse.papyrus.uml.diagram.usecase.tests 1.2.0-SNAPSHOT SKIPPED
03:46:23 [INFO] org.eclipse.papyrus.uml.diagram.deployment.tests 1.2.0-SNAPSHOT SKIPPED
03:46:23 [INFO] org.eclipse.papyrus.uml.diagram.component.tests 1.2.0-SNAPSHOT SKIPPED
03:46:23 [INFO] org.eclipse.papyrus.uml.diagram.timing.tests 1.2.0-SNAPSHOT SKIPPED
03:46:23 [INFO] org.eclipse.papyrus.uml.diagram.stereotypeproperty.tests 1.2.0-SNAPSHOT SKIPPED
03:46:23 [INFO] org.eclipse.papyrus.uml.diagram.sequence.tests 1.3.100-SNAPSHOT SKIPPED
03:46:23 [INFO] org.eclipse.papyrus.uml.diagram.composite.tests 1.2.0-SNAPSHOT SKIPPED
03:46:23 [INFO] org.eclipse.papyrus.uml.diagram.wizards.tests 1.2.0-SNAPSHOT SKIPPED
03:46:23 [INFO] org.eclipse.papyrus.uml.diagram.profile.tests 1.2.0-SNAPSHOT SKIPPED
03:46:23 [INFO] org.eclipse.papyrus.uml.dynamic.profile.tests 1.2.0-SNAPSHOT SKIPPED
03:46:23 [INFO] org.eclipse.papyrus.uml.diagram.common.tests 1.3.0-SNAPSHOT SKIPPED
03:46:23 [INFO] org.eclipse.papyrus.tests.uml.diagram.feature 1.2.0-SNAPSHOT SKIPPED
03:46:23 [INFO] org.eclipse.papyrus.tests.infra.services.feature 1.2.0-SNAPSHOT SKIPPED
03:46:23 [INFO] org.eclipse.papyrus.views.tests.releng ............. SKIPPED
03:46:23 [INFO] org.eclipse.papyrus.views.modelexplorer.tests 1.2.100-SNAPSHOT SKIPPED
03:46:23 [INFO] org.eclipse.papyrus.uml.modelexplorer.tests.releng . SKIPPED
03:46:23 [INFO] org.eclipse.papyrus.uml.modelexplorer.tests 1.3.100-SNAPSHOT SKIPPED
03:46:23 [INFO] org.eclipse.papyrus.uml.modelrepair.tests 1.2.100-SNAPSHOT SKIPPED
03:46:23 [INFO] org.eclipse.papyrus.uml.service.types.tests 1.2.0-SNAPSHOT SKIPPED
03:46:23 [INFO] org.eclipse.papyrus.uml.service.types.ui.tests 1.2.0-SNAPSHOT SKIPPED
03:46:23 [INFO] org.eclipse.papyrus.uml.profile.tests.releng ....... SKIPPED
03:46:23 [INFO] org.eclipse.papyrus.uml.profile.drafter.tests 1.2.0-SNAPSHOT SKIPPED
03:46:23 [INFO] org.eclipse.papyrus.uml.filters.tests 1.2.0-SNAPSHOT SKIPPED
03:46:23 [INFO] org.eclipse.papyrus.uml.profile.tests 1.2.0-SNAPSHOT SKIPPED
03:46:23 [INFO] org.eclipse.papyrus.tests.uml.feature 1.2.0-SNAPSHOT SKIPPED
03:46:23 [INFO] org.eclipse.papyrus.tests.views.feature 1.2.0-SNAPSHOT SKIPPED
03:46:23 [INFO] org.eclipse.papyrus.tests.infra.nattable.feature 1.3.0-SNAPSHOT SKIPPED
03:46:23 [INFO] org.eclipse.papyrus.uml.nattable.main.test 1.2.0-SNAPSHOT SKIPPED
03:46:23 [INFO] org.eclipse.papyrus.uml.nattable.tests 1.2.100-SNAPSHOT SKIPPED
03:46:23 [INFO] org.eclipse.papyrus.uml.nattable.generic.tests 1.2.100-SNAPSHOT SKIPPED
03:46:23 [INFO] org.eclipse.papyrus.uml.nattable.clazz.config.tests 1.2.100-SNAPSHOT SKIPPED
03:46:23 [INFO] org.eclipse.papyrus.uml.nattable.stereotyped.elements.tests 1.0.100-SNAPSHOT SKIPPED
03:46:23 [INFO] org.eclipse.papyrus.uml.nattable.matrix.tests 1.0.0-SNAPSHOT SKIPPED
03:46:23 [INFO] org.eclipse.papyrus.tests.uml.nattable.feature 1.3.0-SNAPSHOT SKIPPED
03:46:23 [INFO] org.eclipse.papyrus.tests.infra.feature 1.2.0-SNAPSHOT SKIPPED
03:46:23 [INFO] org.eclipse.papyrus.tests.infra.core.feature 1.2.0-SNAPSHOT SKIPPED
03:46:23 [INFO] org.eclipse.papyrus.uml.tools.tests.releng ......... SKIPPED
03:46:23 [INFO] org.eclipse.papyrus.uml.tools.tests 3.0.0-SNAPSHOT . SKIPPED
03:46:23 [INFO] org.eclipse.papyrus.uml.tools.utils.tests 1.3.0-SNAPSHOT SKIPPED
03:46:23 [INFO] org.eclipse.papyrus.tests.uml.tools.feature 1.2.0-SNAPSHOT SKIPPED
03:46:23 [INFO] org.eclipse.papyrus.uml.decoratormodel.tests.releng  SKIPPED
03:46:23 [INFO] org.eclipse.papyrus.uml.decoratormodel.tests 1.2.0-SNAPSHOT SKIPPED
03:46:23 [INFO] org.eclipse.papyrus.uml.decoratormodel.controlmode.tests 1.2.0-SNAPSHOT SKIPPED
03:46:23 [INFO] org.eclipse.papyrus.tests.uml.decoratormodel.feature 1.2.0-SNAPSHOT SKIPPED
03:46:23 [INFO] org.eclipse.papyrus.uml.textedit.tests.releng ...... SKIPPED
03:46:23 [INFO] org.eclipse.papyrus.uml.textedit.tests 1.2.0-SNAPSHOT SKIPPED
03:46:23 [INFO] org.eclipse.papyrus.uml.textedit.parameter.tests 1.2.0-SNAPSHOT SKIPPED
03:46:23 [INFO] org.eclipse.papyrus.uml.textedit.port.tests 1.2.0-SNAPSHOT SKIPPED
03:46:23 [INFO] org.eclipse.papyrus.uml.textedit.property.tests 1.2.0-SNAPSHOT SKIPPED
03:46:23 [INFO] org.eclipse.papyrus.uml.textedit.tests.feature 1.2.0-SNAPSHOT SKIPPED
03:46:23 [INFO] org.eclipse.papyrus.uml.assistants.tests.releng .... SKIPPED
03:46:23 [INFO] org.eclipse.papyrus.uml.profile.types.generator.tests 1.2.0-SNAPSHOT SKIPPED
03:46:23 [INFO] org.eclipse.papyrus.uml.profile.assistants.generator.tests 1.2.0-SNAPSHOT SKIPPED
03:46:23 [INFO] org.eclipse.papyrus.tests.uml.assistants.feature 1.2.0-SNAPSHOT SKIPPED
03:46:23 [INFO] org.eclipse.papyrus.toolsmiths.tests.releng ........ SKIPPED
03:46:23 [INFO] org.eclipse.papyrus.toolsmiths.profilemigration.tests 0.7.0-SNAPSHOT SKIPPED
03:46:23 [INFO] org.eclipse.papyrus.tests.toolsmiths.feature 1.0.0-SNAPSHOT SKIPPED
03:46:23 [INFO] org.eclipse.papyrus.tests.feature 1.3.0-SNAPSHOT ... SKIPPED
03:46:23 [INFO] org.eclipse.papyrus.infra.emf.expressions.main.tests SKIPPED
03:46:23 [INFO] org.eclipse.papyrus.infra.emf.expressions.tests 1.0.0-SNAPSHOT SKIPPED
03:46:23 [INFO] org.eclipse.papyrus.tests.infra.emf.expressions.feature 1.0.0-SNAPSHOT SKIPPED
03:46:23 [INFO] org.eclipse.papyrus.uml.expressions.tests.releng ... SKIPPED
03:46:23 [INFO] org.eclipse.papyrus.uml.expressions.tests 1.0.0-SNAPSHOT SKIPPED
03:46:23 [INFO] org.eclipse.papyrus.tests.uml.expressions.feature 1.0.0-SNAPSHOT SKIPPED
03:46:23 [INFO] org.eclipse.papyrus.uml.alf.tests 1.2.0-SNAPSHOT ... SKIPPED
03:46:23 [INFO] org.eclipse.papyrus.uml.alf.tests.feature 1.2.0-SNAPSHOT SKIPPED
03:46:23 [INFO] org.eclipse.papyrus.developer.suite.tests .......... SKIPPED
03:46:23 [INFO] org.eclipse.papyrus.developer.tests.releng ......... SKIPPED
03:46:23 [INFO] org.eclipse.papyrus.eclipse.project.editors.tests 2.0.0-SNAPSHOT SKIPPED
03:46:23 [INFO] org.eclipse.papyrus.editors.suite.tests ............ SKIPPED
03:46:23 [INFO] org.eclipse.papyrus.infra.core.suite.tests ......... SKIPPED
03:46:23 [INFO] org.eclipse.papyrus.infra.nattable.suite.tests ..... SKIPPED
03:46:23 [INFO] org.eclipse.papyrus.infra.internationalization.main.test 1.0.0-SNAPSHOT SKIPPED
03:46:23 [INFO] org.eclipse.papyrus.infra.internationalization.tests 1.1.0-SNAPSHOT SKIPPED
03:46:23 [INFO] org.eclipse.papyrus.infra.services.labelprovider.tests 1.2.1-SNAPSHOT SKIPPED
03:46:23 [INFO] org.eclipse.papyrus.infra.suite.tests .............. SKIPPED
03:46:23 [INFO] org.eclipse.papyrus.infra.newchild.tests 1.2.0-SNAPSHOT SKIPPED
03:46:23 [INFO] org.eclipse.papyrus.uml.diagram.communication.tests 1.2.0-SNAPSHOT SKIPPED
03:46:23 [INFO] org.eclipse.papyrus.uml.diagram.interactionoverview.tests 1.2.0-SNAPSHOT SKIPPED
03:46:23 [INFO] org.eclipse.papyrus.uml.diagram.statemachine.tests 1.2.0-SNAPSHOT SKIPPED
03:46:23 [INFO] org.eclipse.papyrus.uml.diagram.suite.tests ........ SKIPPED
03:46:23 [INFO] org.eclipse.papyrus.uml.diagram.dnd.tests 1.2.0-SNAPSHOT SKIPPED
03:46:23 [INFO] org.eclipse.papyrus.uml.nattable.stereotype.display.tests 1.2.100-SNAPSHOT SKIPPED
03:46:23 [INFO] org.eclipse.papyrus.uml.nattable.suite.tests ....... SKIPPED
03:46:23 [INFO] org.eclipse.papyrus.uml.textedit.valuespecification.tests 1.2.0-SNAPSHOT SKIPPED
03:46:23 [INFO] org.eclipse.papyrus.uml.textedit.suite.tests ....... SKIPPED
03:46:23 [INFO] org.eclipse.papyrus.uml.internationalization.main.test 1.0.0-SNAPSHOT SKIPPED
03:46:23 [INFO] org.eclipse.papyrus.uml.internationalization.tests 1.1.0-SNAPSHOT SKIPPED
03:46:23 [INFO] org.eclipse.papyrus.uml.validation.tests.releng .... SKIPPED
03:46:23 [INFO] org.eclipse.papyrus.uml.validation.tests.staticprofile 1.2.0-SNAPSHOT SKIPPED
03:46:23 [INFO] org.eclipse.papyrus.uml.validation.tests.genvalidation 1.2.0-SNAPSHOT SKIPPED
03:46:23 [INFO] org.eclipse.papyrus.uml.validation.tests 1.2.0-SNAPSHOT SKIPPED
03:46:23 [INFO] org.eclipse.papyrus.uml.suite.tests ................ SKIPPED
03:46:23 [INFO] org.eclipse.papyrus.uml.alf.tests.releng ........... SKIPPED
03:46:23 [INFO] org.eclipse.papyrus.uml.alf.backend.tests 1.1.0-SNAPSHOT SKIPPED
03:46:23 [INFO] org.eclipse.papyrus.uml.internationalization.controlmode.tests 1.0.0-SNAPSHOT SKIPPED
03:46:23 [INFO] org.eclipse.papyrus.views.properties.toolsmiths.tests 1.2.0-SNAPSHOT SKIPPED
03:46:23 [INFO] org.eclipse.papyrus.views.suite.tests .............. SKIPPED
03:46:23 [INFO] org.eclipse.papyrus.toolsmiths.suite.tests ......... SKIPPED
03:46:23 [INFO] org.eclipse.papyrus.main.tests.target.parent ....... SKIPPED
03:46:23 [INFO] org.eclipse.papyrus.main.tests.portable.target 0.0.1-SNAPSHOT SKIPPED
03:46:23 [INFO] ------------------------------------------------------------------------
03:46:23 [INFO] BUILD FAILURE
03:46:23 [INFO] ------------------------------------------------------------------------
03:46:23 [INFO] Total time: 28:46 min
03:46:23 [INFO] Finished at: 2018-07-02T03:46:23-04:00
03:46:23 [INFO] ------------------------------------------------------------------------
03:46:23 [ERROR] Failed to execute goal org.apache.maven.plugins:maven-site-plugin:3.3:site (siteauto) on project org.eclipse.papyrus.doctemplate.doc: Execution siteauto of goal org.apache.maven.plugins:maven-site-plugin:3.3:site failed: A required class was missing while executing org.apache.maven.plugins:maven-site-plugin:3.3:site: org/apache/maven/doxia/siterenderer/DocumentContent
03:46:23 [ERROR] -----------------------------------------------------
03:46:23 [ERROR] realm =    plugin>org.apache.maven.plugins:maven-site-plugin:3.3
03:46:23 [ERROR] strategy = org.codehaus.plexus.classworlds.strategy.SelfFirstStrategy
03:46:23 [ERROR] urls[0] = file:/home/hudson/genie.papyrus/.jenkins/jobs/Papyrus-Gerrit-Oxygen/workspace/.repository/org/apache/maven/plugins/maven-site-plugin/3.3/maven-site-plugin-3.3.jar
03:46:23 [ERROR] urls[1] = file:/home/hudson/genie.papyrus/.jenkins/jobs/Papyrus-Gerrit-Oxygen/workspace/.repository/org/apache/maven/skins/maven-fluido-skin/1.6/maven-fluido-skin-1.6.jar
03:46:23 [ERROR] urls[2] = file:/home/hudson/genie.papyrus/.jenkins/jobs/Papyrus-Gerrit-Oxygen/workspace/.repository/org/apache/maven/reporting/maven-reporting-exec/1.1/maven-reporting-exec-1.1.jar
03:46:23 [ERROR] urls[3] = file:/home/hudson/genie.papyrus/.jenkins/jobs/Papyrus-Gerrit-Oxygen/workspace/.repository/org/apache/maven/reporting/maven-reporting-api/3.0/maven-reporting-api-3.0.jar
03:46:23 [ERROR] urls[4] = file:/home/hudson/genie.papyrus/.jenkins/jobs/Papyrus-Gerrit-Oxygen/workspace/.repository/org/apache/maven/shared/maven-shared-utils/0.3/maven-shared-utils-0.3.jar
03:46:23 [ERROR] urls[5] = file:/home/hudson/genie.papyrus/.jenkins/jobs/Papyrus-Gerrit-Oxygen/workspace/.repository/com/google/code/findbugs/jsr305/2.0.1/jsr305-2.0.1.jar
03:46:23 [ERROR] urls[6] = file:/home/hudson/genie.papyrus/.jenkins/jobs/Papyrus-Gerrit-Oxygen/workspace/.repository/org/codehaus/plexus/plexus-component-annotations/1.5.5/plexus-component-annotations-1.5.5.jar
03:46:23 [ERROR] urls[7] = file:/home/hudson/genie.papyrus/.jenkins/jobs/Papyrus-Gerrit-Oxygen/workspace/.repository/org/sonatype/aether/aether-util/1.7/aether-util-1.7.jar
03:46:23 [ERROR] urls[8] = file:/home/hudson/genie.papyrus/.jenkins/jobs/Papyrus-Gerrit-Oxygen/workspace/.repository/org/eclipse/aether/aether-util/0.9.0.M2/aether-util-0.9.0.M2.jar
03:46:23 [ERROR] urls[9] = file:/home/hudson/genie.papyrus/.jenkins/jobs/Papyrus-Gerrit-Oxygen/workspace/.repository/org/sonatype/sisu/sisu-inject-bean/1.4.2/sisu-inject-bean-1.4.2.jar
03:46:23 [ERROR] urls[10] = file:/home/hudson/genie.papyrus/.jenkins/jobs/Papyrus-Gerrit-Oxygen/workspace/.repository/org/sonatype/sisu/sisu-guice/2.1.7/sisu-guice-2.1.7-noaop.jar
03:46:23 [ERROR] urls[11] = file:/home/hudson/genie.papyrus/.jenkins/jobs/Papyrus-Gerrit-Oxygen/workspace/.repository/org/codehaus/plexus/plexus-interpolation/1.14/plexus-interpolation-1.14.jar
03:46:23 [ERROR] urls[12] = file:/home/hudson/genie.papyrus/.jenkins/jobs/Papyrus-Gerrit-Oxygen/workspace/.repository/org/sonatype/plexus/plexus-sec-dispatcher/1.3/plexus-sec-dispatcher-1.3.jar
03:46:23 [ERROR] urls[13] = file:/home/hudson/genie.papyrus/.jenkins/jobs/Papyrus-Gerrit-Oxygen/workspace/.repository/org/sonatype/plexus/plexus-cipher/1.4/plexus-cipher-1.4.jar
03:46:23 [ERROR] urls[14] = file:/home/hudson/genie.papyrus/.jenkins/jobs/Papyrus-Gerrit-Oxygen/workspace/.repository/org/apache/maven/maven-archiver/2.4.2/maven-archiver-2.4.2.jar
03:46:23 [ERROR] urls[15] = file:/home/hudson/genie.papyrus/.jenkins/jobs/Papyrus-Gerrit-Oxygen/workspace/.repository/org/apache/maven/doxia/doxia-sink-api/1.4/doxia-sink-api-1.4.jar
03:46:23 [ERROR] urls[16] = file:/home/hudson/genie.papyrus/.jenkins/jobs/Papyrus-Gerrit-Oxygen/workspace/.repository/org/apache/maven/doxia/doxia-logging-api/1.4/doxia-logging-api-1.4.jar
03:46:23 [ERROR] urls[17] = file:/home/hudson/genie.papyrus/.jenkins/jobs/Papyrus-Gerrit-Oxygen/workspace/.repository/junit/junit/3.8.1/junit-3.8.1.jar
03:46:23 [ERROR] urls[18] = file:/home/hudson/genie.papyrus/.jenkins/jobs/Papyrus-Gerrit-Oxygen/workspace/.repository/org/apache/maven/doxia/doxia-core/1.4/doxia-core-1.4.jar
03:46:23 [ERROR] urls[19] = file:/home/hudson/genie.papyrus/.jenkins/jobs/Papyrus-Gerrit-Oxygen/workspace/.repository/xerces/xercesImpl/2.9.1/xercesImpl-2.9.1.jar
03:46:23 [ERROR] urls[20] = file:/home/hudson/genie.papyrus/.jenkins/jobs/Papyrus-Gerrit-Oxygen/workspace/.repository/xml-apis/xml-apis/1.3.04/xml-apis-1.3.04.jar
03:46:23 [ERROR] urls[21] = file:/home/hudson/genie.papyrus/.jenkins/jobs/Papyrus-Gerrit-Oxygen/workspace/.repository/org/apache/httpcomponents/httpclient/4.0.2/httpclient-4.0.2.jar
03:46:23 [ERROR] urls[22] = file:/home/hudson/genie.papyrus/.jenkins/jobs/Papyrus-Gerrit-Oxygen/workspace/.repository/commons-logging/commons-logging/1.1.1/commons-logging-1.1.1.jar
03:46:23 [ERROR] urls[23] = file:/home/hudson/genie.papyrus/.jenkins/jobs/Papyrus-Gerrit-Oxygen/workspace/.repository/commons-codec/commons-codec/1.3/commons-codec-1.3.jar
03:46:23 [ERROR] urls[24] = file:/home/hudson/genie.papyrus/.jenkins/jobs/Papyrus-Gerrit-Oxygen/workspace/.repository/org/apache/httpcomponents/httpcore/4.0.1/httpcore-4.0.1.jar
03:46:23 [ERROR] urls[25] = file:/home/hudson/genie.papyrus/.jenkins/jobs/Papyrus-Gerrit-Oxygen/workspace/.repository/org/apache/maven/doxia/doxia-module-xhtml/1.4/doxia-module-xhtml-1.4.jar
03:46:23 [ERROR] urls[26] = file:/home/hudson/genie.papyrus/.jenkins/jobs/Papyrus-Gerrit-Oxygen/workspace/.repository/org/apache/maven/doxia/doxia-module-apt/1.4/doxia-module-apt-1.4.jar
03:46:23 [ERROR] urls[27] = file:/home/hudson/genie.papyrus/.jenkins/jobs/Papyrus-Gerrit-Oxygen/workspace/.repository/org/apache/maven/doxia/doxia-module-xdoc/1.4/doxia-module-xdoc-1.4.jar
03:46:23 [ERROR] urls[28] = file:/home/hudson/genie.papyrus/.jenkins/jobs/Papyrus-Gerrit-Oxygen/workspace/.repository/org/apache/maven/doxia/doxia-module-fml/1.4/doxia-module-fml-1.4.jar
03:46:23 [ERROR] urls[29] = file:/home/hudson/genie.papyrus/.jenkins/jobs/Papyrus-Gerrit-Oxygen/workspace/.repository/org/apache/maven/doxia/doxia-module-markdown/1.4/doxia-module-markdown-1.4.jar
03:46:23 [ERROR] urls[30] = file:/home/hudson/genie.papyrus/.jenkins/jobs/Papyrus-Gerrit-Oxygen/workspace/.repository/org/pegdown/pegdown/1.2.1/pegdown-1.2.1.jar
03:46:23 [ERROR] urls[31] = file:/home/hudson/genie.papyrus/.jenkins/jobs/Papyrus-Gerrit-Oxygen/workspace/.repository/org/parboiled/parboiled-java/1.1.4/parboiled-java-1.1.4.jar
03:46:23 [ERROR] urls[32] = file:/home/hudson/genie.papyrus/.jenkins/jobs/Papyrus-Gerrit-Oxygen/workspace/.repository/org/parboiled/parboiled-core/1.1.4/parboiled-core-1.1.4.jar
03:46:23 [ERROR] urls[33] = file:/home/hudson/genie.papyrus/.jenkins/jobs/Papyrus-Gerrit-Oxygen/workspace/.repository/org/ow2/asm/asm/4.1/asm-4.1.jar
03:46:23 [ERROR] urls[34] = file:/home/hudson/genie.papyrus/.jenkins/jobs/Papyrus-Gerrit-Oxygen/workspace/.repository/org/ow2/asm/asm-tree/4.1/asm-tree-4.1.jar
03:46:23 [ERROR] urls[35] = file:/home/hudson/genie.papyrus/.jenkins/jobs/Papyrus-Gerrit-Oxygen/workspace/.repository/org/ow2/asm/asm-analysis/4.1/asm-analysis-4.1.jar
03:46:23 [ERROR] urls[36] = file:/home/hudson/genie.papyrus/.jenkins/jobs/Papyrus-Gerrit-Oxygen/workspace/.repository/org/ow2/asm/asm-util/4.1/asm-util-4.1.jar
03:46:23 [ERROR] urls[37] = file:/home/hudson/genie.papyrus/.jenkins/jobs/Papyrus-Gerrit-Oxygen/workspace/.repository/javax/servlet/servlet-api/2.5/servlet-api-2.5.jar
03:46:23 [ERROR] urls[38] = file:/home/hudson/genie.papyrus/.jenkins/jobs/Papyrus-Gerrit-Oxygen/workspace/.repository/org/apache/maven/doxia/doxia-decoration-model/1.4/doxia-decoration-model-1.4.jar
03:46:23 [ERROR] urls[39] = file:/home/hudson/genie.papyrus/.jenkins/jobs/Papyrus-Gerrit-Oxygen/workspace/.repository/org/apache/maven/doxia/doxia-site-renderer/1.4/doxia-site-renderer-1.4.jar
03:46:23 [ERROR] urls[40] = file:/home/hudson/genie.papyrus/.jenkins/jobs/Papyrus-Gerrit-Oxygen/workspace/.repository/org/apache/velocity/velocity-tools/2.0/velocity-tools-2.0.jar
03:46:23 [ERROR] urls[41] = file:/home/hudson/genie.papyrus/.jenkins/jobs/Papyrus-Gerrit-Oxygen/workspace/.repository/commons-beanutils/commons-beanutils/1.7.0/commons-beanutils-1.7.0.jar
03:46:23 [ERROR] urls[42] = file:/home/hudson/genie.papyrus/.jenkins/jobs/Papyrus-Gerrit-Oxygen/workspace/.repository/commons-digester/commons-digester/1.8/commons-digester-1.8.jar
03:46:23 [ERROR] urls[43] = file:/home/hudson/genie.papyrus/.jenkins/jobs/Papyrus-Gerrit-Oxygen/workspace/.repository/commons-chain/commons-chain/1.1/commons-chain-1.1.jar
03:46:23 [ERROR] urls[44] = file:/home/hudson/genie.papyrus/.jenkins/jobs/Papyrus-Gerrit-Oxygen/workspace/.repository/commons-validator/commons-validator/1.3.1/commons-validator-1.3.1.jar
03:46:23 [ERROR] urls[45] = file:/home/hudson/genie.papyrus/.jenkins/jobs/Papyrus-Gerrit-Oxygen/workspace/.repository/dom4j/dom4j/1.1/dom4j-1.1.jar
03:46:23 [ERROR] urls[46] = file:/home/hudson/genie.papyrus/.jenkins/jobs/Papyrus-Gerrit-Oxygen/workspace/.repository/sslext/sslext/1.2-0/sslext-1.2-0.jar
03:46:23 [ERROR] urls[47] = file:/home/hudson/genie.papyrus/.jenkins/jobs/Papyrus-Gerrit-Oxygen/workspace/.repository/org/apache/struts/struts-core/1.3.8/struts-core-1.3.8.jar
03:46:23 [ERROR] urls[48] = file:/home/hudson/genie.papyrus/.jenkins/jobs/Papyrus-Gerrit-Oxygen/workspace/.repository/antlr/antlr/2.7.2/antlr-2.7.2.jar
03:46:23 [ERROR] urls[49] = file:/home/hudson/genie.papyrus/.jenkins/jobs/Papyrus-Gerrit-Oxygen/workspace/.repository/org/apache/struts/struts-taglib/1.3.8/struts-taglib-1.3.8.jar
03:46:23 [ERROR] urls[50] = file:/home/hudson/genie.papyrus/.jenkins/jobs/Papyrus-Gerrit-Oxygen/workspace/.repository/org/apache/struts/struts-tiles/1.3.8/struts-tiles-1.3.8.jar
03:46:23 [ERROR] urls[51] = file:/home/hudson/genie.papyrus/.jenkins/jobs/Papyrus-Gerrit-Oxygen/workspace/.repository/commons-collections/commons-collections/3.2.1/commons-collections-3.2.1.jar
03:46:23 [ERROR] urls[52] = file:/home/hudson/genie.papyrus/.jenkins/jobs/Papyrus-Gerrit-Oxygen/workspace/.repository/org/apache/maven/doxia/doxia-integration-tools/1.5/doxia-integration-tools-1.5.jar
03:46:23 [ERROR] urls[53] = file:/home/hudson/genie.papyrus/.jenkins/jobs/Papyrus-Gerrit-Oxygen/workspace/.repository/org/codehaus/plexus/plexus-archiver/1.0/plexus-archiver-1.0.jar
03:46:23 [ERROR] urls[54] = file:/home/hudson/genie.papyrus/.jenkins/jobs/Papyrus-Gerrit-Oxygen/workspace/.repository/org/codehaus/plexus/plexus-io/1.0/plexus-io-1.0.jar
03:46:23 [ERROR] urls[55] = file:/home/hudson/genie.papyrus/.jenkins/jobs/Papyrus-Gerrit-Oxygen/workspace/.repository/org/codehaus/plexus/plexus-i18n/1.0-beta-7/plexus-i18n-1.0-beta-7.jar
03:46:23 [ERROR] urls[56] = file:/home/hudson/genie.papyrus/.jenkins/jobs/Papyrus-Gerrit-Oxygen/workspace/.repository/org/apache/velocity/velocity/1.5/velocity-1.5.jar
03:46:23 [ERROR] urls[57] = file:/home/hudson/genie.papyrus/.jenkins/jobs/Papyrus-Gerrit-Oxygen/workspace/.repository/oro/oro/2.0.8/oro-2.0.8.jar
03:46:23 [ERROR] urls[58] = file:/home/hudson/genie.papyrus/.jenkins/jobs/Papyrus-Gerrit-Oxygen/workspace/.repository/org/codehaus/plexus/plexus-velocity/1.1.8/plexus-velocity-1.1.8.jar
03:46:23 [ERROR] urls[59] = file:/home/hudson/genie.papyrus/.jenkins/jobs/Papyrus-Gerrit-Oxygen/workspace/.repository/org/codehaus/plexus/plexus-utils/1.5.10/plexus-utils-1.5.10.jar
03:46:23 [ERROR] urls[60] = file:/home/hudson/genie.papyrus/.jenkins/jobs/Papyrus-Gerrit-Oxygen/workspace/.repository/org/mortbay/jetty/jetty/6.1.25/jetty-6.1.25.jar
03:46:23 [ERROR] urls[61] = file:/home/hudson/genie.papyrus/.jenkins/jobs/Papyrus-Gerrit-Oxygen/workspace/.repository/org/mortbay/jetty/servlet-api/2.5-20081211/servlet-api-2.5-20081211.jar
03:46:23 [ERROR] urls[62] = file:/home/hudson/genie.papyrus/.jenkins/jobs/Papyrus-Gerrit-Oxygen/workspace/.repository/org/mortbay/jetty/jetty-util/6.1.25/jetty-util-6.1.25.jar
03:46:23 [ERROR] urls[63] = file:/home/hudson/genie.papyrus/.jenkins/jobs/Papyrus-Gerrit-Oxygen/workspace/.repository/commons-lang/commons-lang/2.5/commons-lang-2.5.jar
03:46:23 [ERROR] urls[64] = file:/home/hudson/genie.papyrus/.jenkins/jobs/Papyrus-Gerrit-Oxygen/workspace/.repository/commons-io/commons-io/1.4/commons-io-1.4.jar
03:46:23 [ERROR] Number of foreign imports: 1
03:46:23 [ERROR] import: Entry[import  from realm ClassRealm[project>org.eclipse.papyrus:org.eclipse.papyrus.releng:0.0.1-SNAPSHOT, parent: ClassRealm[maven.api, parent: null]]]
03:46:23 [ERROR] 
03:46:23 [ERROR] -----------------------------------------------------
03:46:23 [ERROR] : org.apache.maven.doxia.siterenderer.DocumentContent
03:46:23 [ERROR] -> [Help 1]
03:46:23 [ERROR] 
03:46:23 [ERROR] To see the full stack trace of the errors, re-run Maven with the -e switch.
03:46:23 [ERROR] Re-run Maven using the -X switch to enable full debug logging.
03:46:23 [ERROR] 
03:46:23 [ERROR] For more information about the errors and possible solutions, please read the following articles:
03:46:23 [ERROR] [Help 1] http://cwiki.apache.org/confluence/display/MAVEN/PluginContainerException
03:46:23 [ERROR] 
03:46:23 [ERROR] After correcting the problems, you can resume the build with the command
03:46:23 [ERROR]   mvn <goals> -rf :org.eclipse.papyrus.doctemplate.doc
03:46:27 Build step 'Invoke top-level Maven targets' marked build as failure
03:46:28 Sending e-mails to: quentin.lemenez@cea.fr
03:46:28 Started calculate disk usage of build
03:46:28 Finished Calculation of disk usage of build in 0 seconds
03:46:28 Started calculate disk usage of workspace
03:46:30 Finished Calculation of disk usage of workspace in  1 second
03:46:30 Finished: FAILURE