AbortedConsole Output

Skipping 14,219 KB.. Full Log
l.textedit.valuespecification.tests ---
16:02:28 [INFO] Building jar: /jobs/genie.papyrus/Papyrus-Gerrit-Master-With-Tests/workspace/source/tests/junit/plugins/uml/textedit/org.eclipse.papyrus.uml.textedit.valuespecification.tests/target/org.eclipse.papyrus.uml.textedit.valuespecification.tests-1.2.200-SNAPSHOT.jar
16:02:29 [INFO] 
16:02:29 [INFO] --- tycho-p2-plugin:1.3.0:p2-metadata-default (default-p2-metadata-default) @ org.eclipse.papyrus.uml.textedit.valuespecification.tests ---
16:02:29 [INFO] 
16:02:29 [INFO] --- tycho-p2-plugin:1.3.0:p2-metadata (attach-p2-metadata) @ org.eclipse.papyrus.uml.textedit.valuespecification.tests ---
16:02:29 [INFO] 
16:02:29 [INFO] --- tycho-surefire-plugin:1.3.0:test (default-test) @ org.eclipse.papyrus.uml.textedit.valuespecification.tests ---
16:02:29 [INFO] Skipping tests
16:02:29 [INFO] 
16:02:29 [INFO] --- jacoco-maven-plugin:0.8.2:report (default-report) @ org.eclipse.papyrus.uml.textedit.valuespecification.tests ---
16:02:29 [INFO] Skipping JaCoCo execution due to missing execution data file.
16:02:29 [INFO] 
16:02:29 [INFO] --< org.eclipse.papyrus.tests:org.eclipse.papyrus.uml.textedit.suite.tests >--
16:02:29 [INFO] Building org.eclipse.papyrus.uml.textedit.suite.tests 0.0.1-SNAPSHOT [685/700]
16:02:29 [INFO] ------------------------[ eclipse-test-plugin ]-------------------------
16:02:31 [INFO] 
16:02:31 [INFO] --- maven-clean-plugin:3.1.0:clean (default-clean) @ org.eclipse.papyrus.uml.textedit.suite.tests ---
16:02:31 [INFO] 
16:02:31 [INFO] --- tycho-packaging-plugin:1.3.0:build-qualifier (default-build-qualifier) @ org.eclipse.papyrus.uml.textedit.suite.tests ---
16:02:31 [INFO] The project's OSGi version is 0.0.1.202007031807
16:02:31 [INFO] 
16:02:31 [INFO] --- tycho-packaging-plugin:1.3.0:validate-id (default-validate-id) @ org.eclipse.papyrus.uml.textedit.suite.tests ---
16:02:31 [INFO] 
16:02:31 [INFO] --- tycho-packaging-plugin:1.3.0:validate-version (default-validate-version) @ org.eclipse.papyrus.uml.textedit.suite.tests ---
16:02:31 [INFO] 
16:02:31 [INFO] --- jacoco-maven-plugin:0.8.2:prepare-agent (default-prepare-agent) @ org.eclipse.papyrus.uml.textedit.suite.tests ---
16:02:31 [INFO] tycho.testArgLine set to -javaagent:/home/hudson/genie.papyrus/.jenkins/jobs/Papyrus-Gerrit-Master-With-Tests/workspace/.repository/org/jacoco/org.jacoco.agent/0.8.2/org.jacoco.agent-0.8.2-runtime.jar=destfile=/jobs/genie.papyrus/Papyrus-Gerrit-Master-With-Tests/workspace/source/tests/junit/plugins/uml/textedit/org.eclipse.papyrus.uml.textedit.suite.tests/target/jacoco.exec,includes=org.eclipse.papyrus.*,excludes=org.eclipse.uml2
16:02:31 [INFO] 
16:02:31 [INFO] --- maven-resources-plugin:3.1.0:resources (default-resources) @ org.eclipse.papyrus.uml.textedit.suite.tests ---
16:02:31 [INFO] Using 'UTF-8' encoding to copy filtered resources.
16:02:31 [INFO] skip non existing resourceDirectory /jobs/genie.papyrus/Papyrus-Gerrit-Master-With-Tests/workspace/source/tests/junit/plugins/uml/textedit/org.eclipse.papyrus.uml.textedit.suite.tests/src/main/resources
16:02:31 [INFO] 
16:02:31 [INFO] --- tycho-compiler-plugin:1.3.0:compile (default-compile) @ org.eclipse.papyrus.uml.textedit.suite.tests ---
16:02:31 [INFO] Compiling 2 source files to /jobs/genie.papyrus/Papyrus-Gerrit-Master-With-Tests/workspace/source/tests/junit/plugins/uml/textedit/org.eclipse.papyrus.uml.textedit.suite.tests/bin
16:02:34 [INFO] 
16:02:34 [INFO] --- maven-resources-plugin:3.1.0:testResources (default-testResources) @ org.eclipse.papyrus.uml.textedit.suite.tests ---
16:02:34 [INFO] Using 'UTF-8' encoding to copy filtered resources.
16:02:34 [INFO] skip non existing resourceDirectory /jobs/genie.papyrus/Papyrus-Gerrit-Master-With-Tests/workspace/source/tests/junit/plugins/uml/textedit/org.eclipse.papyrus.uml.textedit.suite.tests/src/test/resources
16:02:34 [INFO] 
16:02:34 [INFO] --- target-platform-configuration:1.3.0:target-platform (default-target-platform) @ org.eclipse.papyrus.uml.textedit.suite.tests ---
16:02:34 [INFO] 
16:02:34 [INFO] --- tycho-packaging-plugin:1.3.0:package-plugin (default-package-plugin) @ org.eclipse.papyrus.uml.textedit.suite.tests ---
16:02:34 [INFO] Building jar: /jobs/genie.papyrus/Papyrus-Gerrit-Master-With-Tests/workspace/source/tests/junit/plugins/uml/textedit/org.eclipse.papyrus.uml.textedit.suite.tests/target/org.eclipse.papyrus.uml.textedit.suite.tests-0.0.1-SNAPSHOT.jar
16:02:34 [INFO] 
16:02:34 [INFO] --- tycho-p2-plugin:1.3.0:p2-metadata-default (default-p2-metadata-default) @ org.eclipse.papyrus.uml.textedit.suite.tests ---
16:02:34 [INFO] 
16:02:34 [INFO] --- tycho-p2-plugin:1.3.0:p2-metadata (attach-p2-metadata) @ org.eclipse.papyrus.uml.textedit.suite.tests ---
16:02:34 [INFO] 
16:02:34 [INFO] --- tycho-surefire-plugin:1.3.0:test (default-test) @ org.eclipse.papyrus.uml.textedit.suite.tests ---
16:02:48 [INFO] Expected eclipse log file: /jobs/genie.papyrus/Papyrus-Gerrit-Master-With-Tests/workspace/source/tests/junit/plugins/uml/textedit/org.eclipse.papyrus.uml.textedit.suite.tests/target/work/data/.metadata/.log
16:02:48 [INFO] Command line:
16:02:48 	[/opt/public/common/java/oracle/jdk1.8.0_202_x64/jre/bin/java, -Dosgi.noShutdown=false, -Dosgi.os=linux, -Dosgi.ws=gtk, -Dosgi.arch=x86_64, -javaagent:/home/hudson/genie.papyrus/.jenkins/jobs/Papyrus-Gerrit-Master-With-Tests/workspace/.repository/org/jacoco/org.jacoco.agent/0.8.2/org.jacoco.agent-0.8.2-runtime.jar=destfile=/jobs/genie.papyrus/Papyrus-Gerrit-Master-With-Tests/workspace/source/tests/junit/plugins/uml/textedit/org.eclipse.papyrus.uml.textedit.suite.tests/target/jacoco.exec,includes=org.eclipse.papyrus.*,excludes=org.eclipse.uml2, -Xms512m, -Xmx2048m, -XX:SoftRefLRUPolicyMSPerMB=100, -Dosgi.clean=true, -jar, /jobs/genie.papyrus/Papyrus-Gerrit-Master-With-Tests/workspace/.repository/p2/osgi/bundle/org.eclipse.equinox.launcher/1.5.700.v20200207-2156/org.eclipse.equinox.launcher-1.5.700.v20200207-2156.jar, -data, /jobs/genie.papyrus/Papyrus-Gerrit-Master-With-Tests/workspace/source/tests/junit/plugins/uml/textedit/org.eclipse.papyrus.uml.textedit.suite.tests/target/work/data, -install, /jobs/genie.papyrus/Papyrus-Gerrit-Master-With-Tests/workspace/source/tests/junit/plugins/uml/textedit/org.eclipse.papyrus.uml.textedit.suite.tests/target/work, -configuration, /jobs/genie.papyrus/Papyrus-Gerrit-Master-With-Tests/workspace/source/tests/junit/plugins/uml/textedit/org.eclipse.papyrus.uml.textedit.suite.tests/target/work/configuration, -application, org.eclipse.tycho.surefire.osgibooter.uitest, -testproperties, /jobs/genie.papyrus/Papyrus-Gerrit-Master-With-Tests/workspace/source/tests/junit/plugins/uml/textedit/org.eclipse.papyrus.uml.textedit.suite.tests/target/surefire.properties, -product, org.eclipse.sdk.ide, -testConfig=CI_TESTS_CONFIG]
16:02:48 Picked up JAVA_TOOL_OPTIONS: -Xmx2G -Djava.io.tmpdir=/tmp/genie.papyrus -DforkCount=1
16:02:51 ***WARNING: GTK+ version too old (micro mismatch)
16:02:51 ***WARNING: SWT requires GTK 3.20.0
16:02:51 ***WARNING: Detected: 3.10.9
16:02:51 
16:02:51 (Eclipse:11293): Gtk-WARNING **: Theme parsing error: <data>:31:11: 'min-height' is not a valid property name
16:02:57 SWT Webkit: Warning, You are using an old version of webkitgtk. (pre 2.4) BrowserFunction functionality will not be avaliable
16:02:57 SWT WebKit: error initializing DBus server, dBusServer == 0
16:02:58 Running org.eclipse.papyrus.uml.textedit.suite.tests.AllTests
16:02:59 log4j:WARN No appenders could be found for logger (org.eclipse.xtext.ui.internal.Activator).
16:02:59 log4j:WARN Please initialize the log4j system properly.
16:03:06 Tests run: 16, Failures: 0, Errors: 0, Skipped: 0, Time elapsed: 8.245 s - in org.eclipse.papyrus.uml.textedit.suite.tests.AllTests
16:03:06 testDefaultValues(org.eclipse.papyrus.uml.textedit.port.tests.suites.PortGrammarTests)  Time elapsed: 2.072 s
16:03:06 testInitialText(org.eclipse.papyrus.uml.textedit.port.tests.suites.PortGrammarTests)  Time elapsed: 0.108 s
16:03:06 testMultiplicity(org.eclipse.papyrus.uml.textedit.port.tests.suites.PortGrammarTests)  Time elapsed: 0.111 s
16:03:06 testParser(org.eclipse.papyrus.uml.textedit.port.tests.suites.PortGrammarTests)  Time elapsed: 0.286 s
16:03:06 testDefaultValues(org.eclipse.papyrus.uml.textedit.property.tests.suites.PropertyGrammarTests)  Time elapsed: 0.178 s
16:03:06 testInitialText(org.eclipse.papyrus.uml.textedit.property.tests.suites.PropertyGrammarTests)  Time elapsed: 0.033 s
16:03:06 testMultiplicity(org.eclipse.papyrus.uml.textedit.property.tests.suites.PropertyGrammarTests)  Time elapsed: 0.052 s
16:03:06 testParser(org.eclipse.papyrus.uml.textedit.property.tests.suites.PropertyGrammarTests)  Time elapsed: 0.057 s
16:03:06 testDefaultValues(org.eclipse.papyrus.uml.textedit.parameter.tests.suites.ParameterGrammarTests)  Time elapsed: 2.295 s
16:03:06 testInitialText(org.eclipse.papyrus.uml.textedit.parameter.tests.suites.ParameterGrammarTests)  Time elapsed: 0.358 s
16:03:06 testParser(org.eclipse.papyrus.uml.textedit.parameter.tests.suites.ParameterGrammarTests)  Time elapsed: 0.148 s
16:03:06 testDefaultValues(org.eclipse.papyrus.uml.textedit.valuespecification.tests.suites.ValueSpecificationGrammarTests)  Time elapsed: 1.086 s
16:03:06 testInitialText(org.eclipse.papyrus.uml.textedit.valuespecification.tests.suites.ValueSpecificationGrammarTests)  Time elapsed: 0.179 s
16:03:06 testParser(org.eclipse.papyrus.uml.textedit.valuespecification.tests.suites.ValueSpecificationGrammarTests)  Time elapsed: 0.465 s
16:03:06 testParser(org.eclipse.papyrus.uml.textedit.valuespecification.tests.suites.MultiplicityLowerValueSpecificationGrammarTests)  Time elapsed: 0.114 s
16:03:06 testParser(org.eclipse.papyrus.uml.textedit.valuespecification.tests.suites.MultiplicityUpperValueSpecificationGrammarTests)  Time elapsed: 0.155 s
16:03:06 
16:03:06 Results:
16:03:06 
16:03:06 Tests run: 16, Failures: 0, Errors: 0, Skipped: 0
16:03:06 
16:03:08 [INFO] All tests passed!
16:03:08 [INFO] 
16:03:08 [INFO] --- jacoco-maven-plugin:0.8.2:report (default-report) @ org.eclipse.papyrus.uml.textedit.suite.tests ---
16:03:08 [INFO] Loading execution data file /jobs/genie.papyrus/Papyrus-Gerrit-Master-With-Tests/workspace/source/tests/junit/plugins/uml/textedit/org.eclipse.papyrus.uml.textedit.suite.tests/target/jacoco.exec
16:03:08 [INFO] Analyzed bundle 'org.eclipse.papyrus.uml.textedit.suite.tests' with 0 classes
16:03:08 [INFO] 
16:03:08 [INFO] --< org.eclipse.papyrus.tests:org.eclipse.papyrus.uml.architecture.tests >--
16:03:08 [INFO] Building org.eclipse.papyrus.uml.architecture.tests 1.1.200-SNAPSHOT [686/700]
16:03:08 [INFO] ---------------------------[ eclipse-plugin ]---------------------------
16:03:08 [INFO] 
16:03:08 [INFO] --- maven-clean-plugin:3.1.0:clean (default-clean) @ org.eclipse.papyrus.uml.architecture.tests ---
16:03:08 [INFO] 
16:03:08 [INFO] --- tycho-packaging-plugin:1.3.0:build-qualifier (default-build-qualifier) @ org.eclipse.papyrus.uml.architecture.tests ---
16:03:08 [INFO] The project's OSGi version is 1.1.200.202007031807
16:03:08 [INFO] 
16:03:08 [INFO] --- tycho-packaging-plugin:1.3.0:validate-id (default-validate-id) @ org.eclipse.papyrus.uml.architecture.tests ---
16:03:08 [INFO] 
16:03:08 [INFO] --- tycho-packaging-plugin:1.3.0:validate-version (default-validate-version) @ org.eclipse.papyrus.uml.architecture.tests ---
16:03:08 [INFO] 
16:03:08 [INFO] --- jacoco-maven-plugin:0.8.2:prepare-agent (default-prepare-agent) @ org.eclipse.papyrus.uml.architecture.tests ---
16:03:08 [INFO] argLine set to -javaagent:/home/hudson/genie.papyrus/.jenkins/jobs/Papyrus-Gerrit-Master-With-Tests/workspace/.repository/org/jacoco/org.jacoco.agent/0.8.2/org.jacoco.agent-0.8.2-runtime.jar=destfile=/jobs/genie.papyrus/Papyrus-Gerrit-Master-With-Tests/workspace/source/tests/junit/plugins/uml/org.eclipse.papyrus.uml.architecture.tests/target/jacoco.exec,includes=org.eclipse.papyrus.*,excludes=org.eclipse.uml2
16:03:08 [INFO] 
16:03:08 [INFO] --- maven-resources-plugin:3.1.0:resources (default-resources) @ org.eclipse.papyrus.uml.architecture.tests ---
16:03:08 [INFO] Using 'UTF-8' encoding to copy filtered resources.
16:03:08 [INFO] skip non existing resourceDirectory /jobs/genie.papyrus/Papyrus-Gerrit-Master-With-Tests/workspace/source/tests/junit/plugins/uml/org.eclipse.papyrus.uml.architecture.tests/src/main/resources
16:03:08 [INFO] 
16:03:08 [INFO] --- tycho-compiler-plugin:1.3.0:compile (default-compile) @ org.eclipse.papyrus.uml.architecture.tests ---
16:03:08 [INFO] Compiling 2 source files to /jobs/genie.papyrus/Papyrus-Gerrit-Master-With-Tests/workspace/source/tests/junit/plugins/uml/org.eclipse.papyrus.uml.architecture.tests/bin
16:03:08 [INFO] 
16:03:08 [INFO] --- maven-resources-plugin:3.1.0:testResources (default-testResources) @ org.eclipse.papyrus.uml.architecture.tests ---
16:03:08 [INFO] Using 'UTF-8' encoding to copy filtered resources.
16:03:08 [INFO] skip non existing resourceDirectory /jobs/genie.papyrus/Papyrus-Gerrit-Master-With-Tests/workspace/source/tests/junit/plugins/uml/org.eclipse.papyrus.uml.architecture.tests/src/test/resources
16:03:08 [INFO] 
16:03:08 [INFO] --- target-platform-configuration:1.3.0:target-platform (default-target-platform) @ org.eclipse.papyrus.uml.architecture.tests ---
16:03:08 [INFO] 
16:03:08 [INFO] --- tycho-packaging-plugin:1.3.0:package-plugin (default-package-plugin) @ org.eclipse.papyrus.uml.architecture.tests ---
16:03:08 [INFO] Building jar: /jobs/genie.papyrus/Papyrus-Gerrit-Master-With-Tests/workspace/source/tests/junit/plugins/uml/org.eclipse.papyrus.uml.architecture.tests/target/org.eclipse.papyrus.uml.architecture.tests-1.1.200-SNAPSHOT.jar
16:03:08 [INFO] 
16:03:08 [INFO] --- tycho-p2-plugin:1.3.0:p2-metadata-default (default-p2-metadata-default) @ org.eclipse.papyrus.uml.architecture.tests ---
16:03:08 [INFO] 
16:03:08 [INFO] --- tycho-p2-plugin:1.3.0:p2-metadata (attach-p2-metadata) @ org.eclipse.papyrus.uml.architecture.tests ---
16:03:08 [INFO] 
16:03:08 [INFO] --- jacoco-maven-plugin:0.8.2:report (default-report) @ org.eclipse.papyrus.uml.architecture.tests ---
16:03:08 [INFO] Skipping JaCoCo execution due to missing execution data file.
16:03:08 [INFO] 
16:03:08 [INFO] --< org.eclipse.papyrus.tests:org.eclipse.papyrus.uml.validation.tests.releng >--
16:03:08 [INFO] Building org.eclipse.papyrus.uml.validation.tests.releng 0.0.1-SNAPSHOT [687/700]
16:03:08 [INFO] --------------------------------[ pom ]---------------------------------
16:03:08 [INFO] 
16:03:08 [INFO] --- maven-clean-plugin:3.1.0:clean (default-clean) @ org.eclipse.papyrus.uml.validation.tests.releng ---
16:03:08 [INFO] 
16:03:08 [INFO] --- jacoco-maven-plugin:0.8.2:prepare-agent (default-prepare-agent) @ org.eclipse.papyrus.uml.validation.tests.releng ---
16:03:08 [INFO] argLine set to -javaagent:/home/hudson/genie.papyrus/.jenkins/jobs/Papyrus-Gerrit-Master-With-Tests/workspace/.repository/org/jacoco/org.jacoco.agent/0.8.2/org.jacoco.agent-0.8.2-runtime.jar=destfile=/jobs/genie.papyrus/Papyrus-Gerrit-Master-With-Tests/workspace/source/tests/junit/plugins/uml/validation/target/jacoco.exec,includes=org.eclipse.papyrus.*,excludes=org.eclipse.uml2
16:03:08 [INFO] 
16:03:08 [INFO] --- tycho-p2-plugin:1.3.0:p2-metadata (attach-p2-metadata) @ org.eclipse.papyrus.uml.validation.tests.releng ---
16:03:08 [INFO] 
16:03:08 [INFO] --- jacoco-maven-plugin:0.8.2:report (default-report) @ org.eclipse.papyrus.uml.validation.tests.releng ---
16:03:08 [INFO] Skipping JaCoCo execution due to missing execution data file.
16:03:08 [INFO] 
16:03:08 [INFO] --< org.eclipse.papyrus.tests:org.eclipse.papyrus.uml.validation.tests.staticprofile >--
16:03:08 [INFO] Building org.eclipse.papyrus.uml.validation.tests.staticprofile 1.2.100-SNAPSHOT [688/700]
16:03:08 [INFO] ------------------------[ eclipse-test-plugin ]-------------------------
16:03:08 [INFO] 
16:03:08 [INFO] --- maven-clean-plugin:3.1.0:clean (default-clean) @ org.eclipse.papyrus.uml.validation.tests.staticprofile ---
16:03:08 [INFO] 
16:03:08 [INFO] --- tycho-packaging-plugin:1.3.0:build-qualifier (default-build-qualifier) @ org.eclipse.papyrus.uml.validation.tests.staticprofile ---
16:03:08 [INFO] The project's OSGi version is 1.2.100.202007031807
16:03:08 [INFO] 
16:03:08 [INFO] --- tycho-packaging-plugin:1.3.0:validate-id (default-validate-id) @ org.eclipse.papyrus.uml.validation.tests.staticprofile ---
16:03:08 [INFO] 
16:03:08 [INFO] --- tycho-packaging-plugin:1.3.0:validate-version (default-validate-version) @ org.eclipse.papyrus.uml.validation.tests.staticprofile ---
16:03:08 [INFO] 
16:03:08 [INFO] --- jacoco-maven-plugin:0.8.2:prepare-agent (default-prepare-agent) @ org.eclipse.papyrus.uml.validation.tests.staticprofile ---
16:03:08 [INFO] tycho.testArgLine set to -javaagent:/home/hudson/genie.papyrus/.jenkins/jobs/Papyrus-Gerrit-Master-With-Tests/workspace/.repository/org/jacoco/org.jacoco.agent/0.8.2/org.jacoco.agent-0.8.2-runtime.jar=destfile=/jobs/genie.papyrus/Papyrus-Gerrit-Master-With-Tests/workspace/source/tests/junit/plugins/uml/validation/org.eclipse.papyrus.uml.validation.tests.staticprofile/target/jacoco.exec,includes=org.eclipse.papyrus.*,excludes=org.eclipse.uml2
16:03:08 [INFO] 
16:03:08 [INFO] --- maven-resources-plugin:3.1.0:resources (default-resources) @ org.eclipse.papyrus.uml.validation.tests.staticprofile ---
16:03:08 [INFO] Using 'UTF-8' encoding to copy filtered resources.
16:03:08 [INFO] skip non existing resourceDirectory /jobs/genie.papyrus/Papyrus-Gerrit-Master-With-Tests/workspace/source/tests/junit/plugins/uml/validation/org.eclipse.papyrus.uml.validation.tests.staticprofile/src/main/resources
16:03:08 [INFO] 
16:03:08 [INFO] --- tycho-compiler-plugin:1.3.0:compile (default-compile) @ org.eclipse.papyrus.uml.validation.tests.staticprofile ---
16:03:08 [INFO] Compiling 16 source files to /jobs/genie.papyrus/Papyrus-Gerrit-Master-With-Tests/workspace/source/tests/junit/plugins/uml/validation/org.eclipse.papyrus.uml.validation.tests.staticprofile/bin
16:03:08 [WARNING] /jobs/genie.papyrus/Papyrus-Gerrit-Master-With-Tests/workspace/source/tests/junit/plugins/uml/validation/org.eclipse.papyrus.uml.validation.tests.staticprofile/src-gen/profile/impl/AlwaysPassiveJavaImpl.java:[122] 
16:03:08 	if (false) {
16:03:08 			if (diagnostics != null) {
16:03:08 				diagnostics.add
16:03:08 					(new BasicDiagnostic
16:03:08 						(Diagnostic.ERROR,
16:03:08 						 ProfileValidator.DIAGNOSTIC_SOURCE,
16:03:08 						 ProfileValidator.ALWAYS_PASSIVE_JAVA__ALWAYS_PASSIVE,
16:03:08 						 EcorePlugin.INSTANCE.getString("_UI_GenericInvariant_diagnostic", new Object[] { "AlwaysPassive", EObjectValidator.getObjectLabel(this, context) }),
16:03:08 						 new Object [] { this }));
16:03:08 			}
16:03:08 			return false;
16:03:08 		}
16:03:08 	           ^^^^^^^^^^^^^^^^^^^^^^^^^^^^^^^^^^^^^^^^^^^^^^^^^^^^^^^^^^^^^^^^^^^^^^^^^^^^^^^^^^^^^^^^^^^^^^^^^^^^^^^^^^^^^^^^^^^^^^^^^^^^^^^^^^^^^^^^^^^^^^^^^^^^^^^^^^^^^^^^^^^^^^^^^^^^^^^^^^^^^^^^^^^^^^^^^^^^^^^^^^^^^^^^^^^^^^^^^^^^^^^^^^^^^^^^^^^^^^^^^^^^^^^^^^^^^^^^^^^^^^^^^^^^^^^^^^^^^^^^^^^^^^^^^^^^^^^^^^^^^^^^^^^^^^^^^^^^^^^^^^^^^^^^^^^^^^^^^^^^^^^^^^^^^^^^^^^^^^^^^^^^^^^^^^^^^^^^^^^^^^^^^^^^^^^^^^^^^^^^^^^^^^^^^^^^^^^^^^^^^
16:03:08 Dead code
16:03:08 [WARNING] /jobs/genie.papyrus/Papyrus-Gerrit-Master-With-Tests/workspace/source/tests/junit/plugins/uml/validation/org.eclipse.papyrus.uml.validation.tests.staticprofile/src-gen/profile/impl/AlwaysActiveMalformedImpl.java:[122] 
16:03:08 	if (false) {
16:03:08 			if (diagnostics != null) {
16:03:08 				diagnostics.add
16:03:08 					(new BasicDiagnostic
16:03:08 						(Diagnostic.ERROR,
16:03:08 						 ProfileValidator.DIAGNOSTIC_SOURCE,
16:03:08 						 ProfileValidator.ALWAYS_ACTIVE_MALFORMED__CONSTRAINT_ALWAYS_ACTIVE_MF,
16:03:08 						 EcorePlugin.INSTANCE.getString("_UI_GenericInvariant_diagnostic", new Object[] { "ConstraintAlwaysActiveMF", EObjectValidator.getObjectLabel(this, context) }),
16:03:08 						 new Object [] { this }));
16:03:08 			}
16:03:08 			return false;
16:03:08 		}
16:03:08 	           ^^^^^^^^^^^^^^^^^^^^^^^^^^^^^^^^^^^^^^^^^^^^^^^^^^^^^^^^^^^^^^^^^^^^^^^^^^^^^^^^^^^^^^^^^^^^^^^^^^^^^^^^^^^^^^^^^^^^^^^^^^^^^^^^^^^^^^^^^^^^^^^^^^^^^^^^^^^^^^^^^^^^^^^^^^^^^^^^^^^^^^^^^^^^^^^^^^^^^^^^^^^^^^^^^^^^^^^^^^^^^^^^^^^^^^^^^^^^^^^^^^^^^^^^^^^^^^^^^^^^^^^^^^^^^^^^^^^^^^^^^^^^^^^^^^^^^^^^^^^^^^^^^^^^^^^^^^^^^^^^^^^^^^^^^^^^^^^^^^^^^^^^^^^^^^^^^^^^^^^^^^^^^^^^^^^^^^^^^^^^^^^^^^^^^^^^^^^^^^^^^^^^^^^^^^^^^^^^^^^^^^^^^^^^^^^^^^^^^^^^^^^^^^^^^
16:03:08 Dead code
16:03:08 [WARNING] /jobs/genie.papyrus/Papyrus-Gerrit-Master-With-Tests/workspace/source/tests/junit/plugins/uml/validation/org.eclipse.papyrus.uml.validation.tests.staticprofile/src-gen/profile/impl/AlwaysActiveImpl.java:[122] 
16:03:08 	if (false) {
16:03:08 			if (diagnostics != null) {
16:03:08 				diagnostics.add
16:03:08 					(new BasicDiagnostic
16:03:08 						(Diagnostic.ERROR,
16:03:08 						 ProfileValidator.DIAGNOSTIC_SOURCE,
16:03:08 						 ProfileValidator.ALWAYS_ACTIVE__CONSTRAINT_ALWAYS_ACTIVE,
16:03:08 						 EcorePlugin.INSTANCE.getString("_UI_GenericInvariant_diagnostic", new Object[] { "ConstraintAlwaysActive", EObjectValidator.getObjectLabel(this, context) }),
16:03:08 						 new Object [] { this }));
16:03:08 			}
16:03:08 			return false;
16:03:08 		}
16:03:08 	           ^^^^^^^^^^^^^^^^^^^^^^^^^^^^^^^^^^^^^^^^^^^^^^^^^^^^^^^^^^^^^^^^^^^^^^^^^^^^^^^^^^^^^^^^^^^^^^^^^^^^^^^^^^^^^^^^^^^^^^^^^^^^^^^^^^^^^^^^^^^^^^^^^^^^^^^^^^^^^^^^^^^^^^^^^^^^^^^^^^^^^^^^^^^^^^^^^^^^^^^^^^^^^^^^^^^^^^^^^^^^^^^^^^^^^^^^^^^^^^^^^^^^^^^^^^^^^^^^^^^^^^^^^^^^^^^^^^^^^^^^^^^^^^^^^^^^^^^^^^^^^^^^^^^^^^^^^^^^^^^^^^^^^^^^^^^^^^^^^^^^^^^^^^^^^^^^^^^^^^^^^^^^^^^^^^^^^^^^^^^^^^^^^^^^^^^^^^^^^^^^^^^^^^^^^^^^^^^^^^^^^^^^^^^^^^^^^^
16:03:08 Dead code
16:03:08 3 problems (3 warnings)
16:03:08 [INFO] 
16:03:08 [INFO] --- maven-resources-plugin:3.1.0:testResources (default-testResources) @ org.eclipse.papyrus.uml.validation.tests.staticprofile ---
16:03:08 [INFO] Using 'UTF-8' encoding to copy filtered resources.
16:03:08 [INFO] skip non existing resourceDirectory /jobs/genie.papyrus/Papyrus-Gerrit-Master-With-Tests/workspace/source/tests/junit/plugins/uml/validation/org.eclipse.papyrus.uml.validation.tests.staticprofile/src/test/resources
16:03:08 [INFO] 
16:03:08 [INFO] --- target-platform-configuration:1.3.0:target-platform (default-target-platform) @ org.eclipse.papyrus.uml.validation.tests.staticprofile ---
16:03:08 [INFO] 
16:03:08 [INFO] --- tycho-packaging-plugin:1.3.0:package-plugin (default-package-plugin) @ org.eclipse.papyrus.uml.validation.tests.staticprofile ---
16:03:08 [INFO] Building jar: /jobs/genie.papyrus/Papyrus-Gerrit-Master-With-Tests/workspace/source/tests/junit/plugins/uml/validation/org.eclipse.papyrus.uml.validation.tests.staticprofile/target/org.eclipse.papyrus.uml.validation.tests.staticprofile-1.2.100-SNAPSHOT.jar
16:03:08 [INFO] 
16:03:08 [INFO] --- tycho-p2-plugin:1.3.0:p2-metadata-default (default-p2-metadata-default) @ org.eclipse.papyrus.uml.validation.tests.staticprofile ---
16:03:08 [INFO] 
16:03:08 [INFO] --- tycho-p2-plugin:1.3.0:p2-metadata (attach-p2-metadata) @ org.eclipse.papyrus.uml.validation.tests.staticprofile ---
16:03:08 [INFO] 
16:03:08 [INFO] --- tycho-surefire-plugin:1.3.0:test (default-test) @ org.eclipse.papyrus.uml.validation.tests.staticprofile ---
16:03:08 [INFO] Skipping tests
16:03:08 [INFO] 
16:03:08 [INFO] --- jacoco-maven-plugin:0.8.2:report (default-report) @ org.eclipse.papyrus.uml.validation.tests.staticprofile ---
16:03:08 [INFO] Skipping JaCoCo execution due to missing execution data file.
16:03:08 [INFO] 
16:03:08 [INFO] --< org.eclipse.papyrus.tests:org.eclipse.papyrus.uml.validation.tests.genvalidation >--
16:03:08 [INFO] Building org.eclipse.papyrus.uml.validation.tests.genvalidation 1.2.0-SNAPSHOT [689/700]
16:03:08 [INFO] ------------------------[ eclipse-test-plugin ]-------------------------
16:03:08 [INFO] 
16:03:08 [INFO] --- maven-clean-plugin:3.1.0:clean (default-clean) @ org.eclipse.papyrus.uml.validation.tests.genvalidation ---
16:03:08 [INFO] 
16:03:08 [INFO] --- tycho-packaging-plugin:1.3.0:build-qualifier (default-build-qualifier) @ org.eclipse.papyrus.uml.validation.tests.genvalidation ---
16:03:08 [INFO] The project's OSGi version is 1.2.0.202007031807
16:03:08 [INFO] 
16:03:08 [INFO] --- tycho-packaging-plugin:1.3.0:validate-id (default-validate-id) @ org.eclipse.papyrus.uml.validation.tests.genvalidation ---
16:03:08 [INFO] 
16:03:08 [INFO] --- tycho-packaging-plugin:1.3.0:validate-version (default-validate-version) @ org.eclipse.papyrus.uml.validation.tests.genvalidation ---
16:03:08 [INFO] 
16:03:08 [INFO] --- jacoco-maven-plugin:0.8.2:prepare-agent (default-prepare-agent) @ org.eclipse.papyrus.uml.validation.tests.genvalidation ---
16:03:08 [INFO] tycho.testArgLine set to -javaagent:/home/hudson/genie.papyrus/.jenkins/jobs/Papyrus-Gerrit-Master-With-Tests/workspace/.repository/org/jacoco/org.jacoco.agent/0.8.2/org.jacoco.agent-0.8.2-runtime.jar=destfile=/jobs/genie.papyrus/Papyrus-Gerrit-Master-With-Tests/workspace/source/tests/junit/plugins/uml/validation/org.eclipse.papyrus.uml.validation.tests.genvalidation/target/jacoco.exec,includes=org.eclipse.papyrus.*,excludes=org.eclipse.uml2
16:03:08 [INFO] 
16:03:08 [INFO] --- maven-resources-plugin:3.1.0:resources (default-resources) @ org.eclipse.papyrus.uml.validation.tests.genvalidation ---
16:03:08 [INFO] Using 'UTF-8' encoding to copy filtered resources.
16:03:08 [INFO] skip non existing resourceDirectory /jobs/genie.papyrus/Papyrus-Gerrit-Master-With-Tests/workspace/source/tests/junit/plugins/uml/validation/org.eclipse.papyrus.uml.validation.tests.genvalidation/src/main/resources
16:03:08 [INFO] 
16:03:08 [INFO] --- tycho-compiler-plugin:1.3.0:compile (default-compile) @ org.eclipse.papyrus.uml.validation.tests.genvalidation ---
16:03:09 [INFO] Compiling 6 source files to /jobs/genie.papyrus/Papyrus-Gerrit-Master-With-Tests/workspace/source/tests/junit/plugins/uml/validation/org.eclipse.papyrus.uml.validation.tests.genvalidation/bin
16:03:11 [INFO] 
16:03:11 [INFO] --- maven-resources-plugin:3.1.0:testResources (default-testResources) @ org.eclipse.papyrus.uml.validation.tests.genvalidation ---
16:03:11 [INFO] Using 'UTF-8' encoding to copy filtered resources.
16:03:11 [INFO] skip non existing resourceDirectory /jobs/genie.papyrus/Papyrus-Gerrit-Master-With-Tests/workspace/source/tests/junit/plugins/uml/validation/org.eclipse.papyrus.uml.validation.tests.genvalidation/src/test/resources
16:03:11 [INFO] 
16:03:11 [INFO] --- target-platform-configuration:1.3.0:target-platform (default-target-platform) @ org.eclipse.papyrus.uml.validation.tests.genvalidation ---
16:03:11 [INFO] 
16:03:11 [INFO] --- tycho-packaging-plugin:1.3.0:package-plugin (default-package-plugin) @ org.eclipse.papyrus.uml.validation.tests.genvalidation ---
16:03:11 [INFO] Building jar: /jobs/genie.papyrus/Papyrus-Gerrit-Master-With-Tests/workspace/source/tests/junit/plugins/uml/validation/org.eclipse.papyrus.uml.validation.tests.genvalidation/target/org.eclipse.papyrus.uml.validation.tests.genvalidation-1.2.0-SNAPSHOT.jar
16:03:11 [INFO] 
16:03:11 [INFO] --- tycho-p2-plugin:1.3.0:p2-metadata-default (default-p2-metadata-default) @ org.eclipse.papyrus.uml.validation.tests.genvalidation ---
16:03:11 [INFO] 
16:03:11 [INFO] --- tycho-p2-plugin:1.3.0:p2-metadata (attach-p2-metadata) @ org.eclipse.papyrus.uml.validation.tests.genvalidation ---
16:03:11 [INFO] 
16:03:11 [INFO] --- tycho-surefire-plugin:1.3.0:test (default-test) @ org.eclipse.papyrus.uml.validation.tests.genvalidation ---
16:03:11 [INFO] Skipping tests
16:03:11 [INFO] 
16:03:11 [INFO] --- jacoco-maven-plugin:0.8.2:report (default-report) @ org.eclipse.papyrus.uml.validation.tests.genvalidation ---
16:03:11 [INFO] Skipping JaCoCo execution due to missing execution data file.
16:03:11 [INFO] 
16:03:11 [INFO] --< org.eclipse.papyrus.tests:org.eclipse.papyrus.uml.validation.tests >--
16:03:11 [INFO] Building org.eclipse.papyrus.uml.validation.tests 1.2.200-SNAPSHOT [690/700]
16:03:11 [INFO] ------------------------[ eclipse-test-plugin ]-------------------------
16:03:12 [INFO] 
16:03:12 [INFO] --- maven-clean-plugin:3.1.0:clean (default-clean) @ org.eclipse.papyrus.uml.validation.tests ---
16:03:12 [INFO] 
16:03:12 [INFO] --- tycho-packaging-plugin:1.3.0:build-qualifier (default-build-qualifier) @ org.eclipse.papyrus.uml.validation.tests ---
16:03:12 [INFO] The project's OSGi version is 1.2.200.202007031807
16:03:12 [INFO] 
16:03:12 [INFO] --- tycho-packaging-plugin:1.3.0:validate-id (default-validate-id) @ org.eclipse.papyrus.uml.validation.tests ---
16:03:12 [INFO] 
16:03:12 [INFO] --- tycho-packaging-plugin:1.3.0:validate-version (default-validate-version) @ org.eclipse.papyrus.uml.validation.tests ---
16:03:12 [INFO] 
16:03:12 [INFO] --- jacoco-maven-plugin:0.8.2:prepare-agent (default-prepare-agent) @ org.eclipse.papyrus.uml.validation.tests ---
16:03:12 [INFO] tycho.testArgLine set to -javaagent:/home/hudson/genie.papyrus/.jenkins/jobs/Papyrus-Gerrit-Master-With-Tests/workspace/.repository/org/jacoco/org.jacoco.agent/0.8.2/org.jacoco.agent-0.8.2-runtime.jar=destfile=/jobs/genie.papyrus/Papyrus-Gerrit-Master-With-Tests/workspace/source/tests/junit/plugins/uml/validation/org.eclipse.papyrus.uml.validation.tests/target/jacoco.exec,includes=org.eclipse.papyrus.*,excludes=org.eclipse.uml2
16:03:12 [INFO] 
16:03:12 [INFO] --- maven-resources-plugin:3.1.0:resources (default-resources) @ org.eclipse.papyrus.uml.validation.tests ---
16:03:12 [INFO] Using 'UTF-8' encoding to copy filtered resources.
16:03:12 [INFO] skip non existing resourceDirectory /jobs/genie.papyrus/Papyrus-Gerrit-Master-With-Tests/workspace/source/tests/junit/plugins/uml/validation/org.eclipse.papyrus.uml.validation.tests/src/main/resources
16:03:12 [INFO] 
16:03:12 [INFO] --- tycho-compiler-plugin:1.3.0:compile (default-compile) @ org.eclipse.papyrus.uml.validation.tests ---
16:03:12 [WARNING] The effective compiler target level 1.8 is incompatible with the following OSGi execution environments: [JavaSE-1.6 (assumes 1.6)] @ MavenProject: org.eclipse.papyrus.tests:org.eclipse.papyrus.uml.validation.tests:1.2.200-SNAPSHOT @ /jobs/genie.papyrus/Papyrus-Gerrit-Master-With-Tests/workspace/source/tests/junit/plugins/uml/validation/org.eclipse.papyrus.uml.validation.tests/pom.xml
16:03:12 [INFO] Compiling 10 source files to /jobs/genie.papyrus/Papyrus-Gerrit-Master-With-Tests/workspace/source/tests/junit/plugins/uml/validation/org.eclipse.papyrus.uml.validation.tests/bin
16:03:12 [INFO] 
16:03:12 [INFO] --- maven-resources-plugin:3.1.0:testResources (default-testResources) @ org.eclipse.papyrus.uml.validation.tests ---
16:03:12 [INFO] Using 'UTF-8' encoding to copy filtered resources.
16:03:12 [INFO] skip non existing resourceDirectory /jobs/genie.papyrus/Papyrus-Gerrit-Master-With-Tests/workspace/source/tests/junit/plugins/uml/validation/org.eclipse.papyrus.uml.validation.tests/src/test/resources
16:03:12 [INFO] 
16:03:12 [INFO] --- target-platform-configuration:1.3.0:target-platform (default-target-platform) @ org.eclipse.papyrus.uml.validation.tests ---
16:03:12 [INFO] 
16:03:12 [INFO] --- tycho-packaging-plugin:1.3.0:package-plugin (default-package-plugin) @ org.eclipse.papyrus.uml.validation.tests ---
16:03:12 [INFO] Building jar: /jobs/genie.papyrus/Papyrus-Gerrit-Master-With-Tests/workspace/source/tests/junit/plugins/uml/validation/org.eclipse.papyrus.uml.validation.tests/target/org.eclipse.papyrus.uml.validation.tests-1.2.200-SNAPSHOT.jar
16:03:12 [INFO] 
16:03:12 [INFO] --- tycho-p2-plugin:1.3.0:p2-metadata-default (default-p2-metadata-default) @ org.eclipse.papyrus.uml.validation.tests ---
16:03:12 [INFO] 
16:03:12 [INFO] --- tycho-p2-plugin:1.3.0:p2-metadata (attach-p2-metadata) @ org.eclipse.papyrus.uml.validation.tests ---
16:03:12 [INFO] 
16:03:12 [INFO] --- tycho-surefire-plugin:1.3.0:test (default-test) @ org.eclipse.papyrus.uml.validation.tests ---
16:03:12 [INFO] Skipping tests
16:03:12 [INFO] 
16:03:12 [INFO] --- jacoco-maven-plugin:0.8.2:report (default-report) @ org.eclipse.papyrus.uml.validation.tests ---
16:03:12 [INFO] Skipping JaCoCo execution due to missing execution data file.
16:03:12 [INFO] 
16:03:12 [INFO] ---< org.eclipse.papyrus.tests:org.eclipse.papyrus.uml.suite.tests >----
16:03:12 [INFO] Building org.eclipse.papyrus.uml.suite.tests 0.0.1-SNAPSHOT    [691/700]
16:03:12 [INFO] ------------------------[ eclipse-test-plugin ]-------------------------
16:03:17 [INFO] 
16:03:17 [INFO] --- maven-clean-plugin:3.1.0:clean (default-clean) @ org.eclipse.papyrus.uml.suite.tests ---
16:03:17 [INFO] 
16:03:17 [INFO] --- tycho-packaging-plugin:1.3.0:build-qualifier (default-build-qualifier) @ org.eclipse.papyrus.uml.suite.tests ---
16:03:17 [INFO] The project's OSGi version is 0.0.1.202007031807
16:03:17 [INFO] 
16:03:17 [INFO] --- tycho-packaging-plugin:1.3.0:validate-id (default-validate-id) @ org.eclipse.papyrus.uml.suite.tests ---
16:03:17 [INFO] 
16:03:17 [INFO] --- tycho-packaging-plugin:1.3.0:validate-version (default-validate-version) @ org.eclipse.papyrus.uml.suite.tests ---
16:03:17 [INFO] 
16:03:17 [INFO] --- jacoco-maven-plugin:0.8.2:prepare-agent (default-prepare-agent) @ org.eclipse.papyrus.uml.suite.tests ---
16:03:17 [INFO] tycho.testArgLine set to -javaagent:/home/hudson/genie.papyrus/.jenkins/jobs/Papyrus-Gerrit-Master-With-Tests/workspace/.repository/org/jacoco/org.jacoco.agent/0.8.2/org.jacoco.agent-0.8.2-runtime.jar=destfile=/jobs/genie.papyrus/Papyrus-Gerrit-Master-With-Tests/workspace/source/tests/junit/plugins/uml/org.eclipse.papyrus.uml.suite.tests/target/jacoco.exec,includes=org.eclipse.papyrus.*,excludes=org.eclipse.uml2
16:03:17 [INFO] 
16:03:17 [INFO] --- maven-resources-plugin:3.1.0:resources (default-resources) @ org.eclipse.papyrus.uml.suite.tests ---
16:03:17 [INFO] Using 'UTF-8' encoding to copy filtered resources.
16:03:17 [INFO] skip non existing resourceDirectory /jobs/genie.papyrus/Papyrus-Gerrit-Master-With-Tests/workspace/source/tests/junit/plugins/uml/org.eclipse.papyrus.uml.suite.tests/src/main/resources
16:03:17 [INFO] 
16:03:17 [INFO] --- tycho-compiler-plugin:1.3.0:compile (default-compile) @ org.eclipse.papyrus.uml.suite.tests ---
16:03:17 [INFO] Compiling 2 source files to /jobs/genie.papyrus/Papyrus-Gerrit-Master-With-Tests/workspace/source/tests/junit/plugins/uml/org.eclipse.papyrus.uml.suite.tests/bin
16:03:18 [INFO] 
16:03:18 [INFO] --- maven-resources-plugin:3.1.0:testResources (default-testResources) @ org.eclipse.papyrus.uml.suite.tests ---
16:03:18 [INFO] Using 'UTF-8' encoding to copy filtered resources.
16:03:18 [INFO] skip non existing resourceDirectory /jobs/genie.papyrus/Papyrus-Gerrit-Master-With-Tests/workspace/source/tests/junit/plugins/uml/org.eclipse.papyrus.uml.suite.tests/src/test/resources
16:03:18 [INFO] 
16:03:18 [INFO] --- target-platform-configuration:1.3.0:target-platform (default-target-platform) @ org.eclipse.papyrus.uml.suite.tests ---
16:03:18 [INFO] 
16:03:18 [INFO] --- tycho-packaging-plugin:1.3.0:package-plugin (default-package-plugin) @ org.eclipse.papyrus.uml.suite.tests ---
16:03:18 [INFO] Building jar: /jobs/genie.papyrus/Papyrus-Gerrit-Master-With-Tests/workspace/source/tests/junit/plugins/uml/org.eclipse.papyrus.uml.suite.tests/target/org.eclipse.papyrus.uml.suite.tests-0.0.1-SNAPSHOT.jar
16:03:18 [INFO] 
16:03:18 [INFO] --- tycho-p2-plugin:1.3.0:p2-metadata-default (default-p2-metadata-default) @ org.eclipse.papyrus.uml.suite.tests ---
16:03:18 [INFO] 
16:03:18 [INFO] --- tycho-p2-plugin:1.3.0:p2-metadata (attach-p2-metadata) @ org.eclipse.papyrus.uml.suite.tests ---
16:03:18 [INFO] 
16:03:18 [INFO] --- tycho-surefire-plugin:1.3.0:test (default-test) @ org.eclipse.papyrus.uml.suite.tests ---
16:03:35 [INFO] Expected eclipse log file: /jobs/genie.papyrus/Papyrus-Gerrit-Master-With-Tests/workspace/source/tests/junit/plugins/uml/org.eclipse.papyrus.uml.suite.tests/target/work/data/.metadata/.log
16:03:35 [INFO] Command line:
16:03:35 	[/opt/public/common/java/oracle/jdk1.8.0_202_x64/jre/bin/java, -Dosgi.noShutdown=false, -Dosgi.os=linux, -Dosgi.ws=gtk, -Dosgi.arch=x86_64, -javaagent:/home/hudson/genie.papyrus/.jenkins/jobs/Papyrus-Gerrit-Master-With-Tests/workspace/.repository/org/jacoco/org.jacoco.agent/0.8.2/org.jacoco.agent-0.8.2-runtime.jar=destfile=/jobs/genie.papyrus/Papyrus-Gerrit-Master-With-Tests/workspace/source/tests/junit/plugins/uml/org.eclipse.papyrus.uml.suite.tests/target/jacoco.exec,includes=org.eclipse.papyrus.*,excludes=org.eclipse.uml2, -Xms512m, -Xmx2048m, -XX:SoftRefLRUPolicyMSPerMB=100, -Dosgi.clean=true, -jar, /jobs/genie.papyrus/Papyrus-Gerrit-Master-With-Tests/workspace/.repository/p2/osgi/bundle/org.eclipse.equinox.launcher/1.5.700.v20200207-2156/org.eclipse.equinox.launcher-1.5.700.v20200207-2156.jar, -data, /jobs/genie.papyrus/Papyrus-Gerrit-Master-With-Tests/workspace/source/tests/junit/plugins/uml/org.eclipse.papyrus.uml.suite.tests/target/work/data, -install, /jobs/genie.papyrus/Papyrus-Gerrit-Master-With-Tests/workspace/source/tests/junit/plugins/uml/org.eclipse.papyrus.uml.suite.tests/target/work, -configuration, /jobs/genie.papyrus/Papyrus-Gerrit-Master-With-Tests/workspace/source/tests/junit/plugins/uml/org.eclipse.papyrus.uml.suite.tests/target/work/configuration, -application, org.eclipse.tycho.surefire.osgibooter.uitest, -testproperties, /jobs/genie.papyrus/Papyrus-Gerrit-Master-With-Tests/workspace/source/tests/junit/plugins/uml/org.eclipse.papyrus.uml.suite.tests/target/surefire.properties, -product, org.eclipse.sdk.ide, -testConfig=CI_TESTS_CONFIG]
16:03:35 Picked up JAVA_TOOL_OPTIONS: -Xmx2G -Djava.io.tmpdir=/tmp/genie.papyrus -DforkCount=1
16:03:39 ***WARNING: GTK+ version too old (micro mismatch)
16:03:39 ***WARNING: SWT requires GTK 3.20.0
16:03:39 ***WARNING: Detected: 3.10.9
16:03:39 
16:03:39 (Eclipse:12066): Gtk-WARNING **: Theme parsing error: <data>:31:11: 'min-height' is not a valid property name
16:03:45 SWT Webkit: Warning, You are using an old version of webkitgtk. (pre 2.4) BrowserFunction functionality will not be avaliable
16:03:45 SWT WebKit: error initializing DBus server, dBusServer == 0
16:03:46 Running org.eclipse.papyrus.uml.suite.tests.AllTests
16:03:56 No JFaces support for org.eclipse.jface.viewers.TableTreeViewer
16:03:58 Warning: NLS unused message: "Select in: messages
16:04:31 org.eclipse.e4.core.di.InjectionException: org.eclipse.emf.ecore.resource.impl.ResourceSetImpl$1DiagnosticWrappedException: org.eclipse.core.internal.resources.ResourceException: Resource '/copyPasteofClass1Test/ProfileWithStrereotype.profile.uml' does not exist.
16:04:31 	at org.eclipse.e4.core.internal.di.MethodRequestor.execute(MethodRequestor.java:68)
16:04:31 	at org.eclipse.e4.core.internal.di.InjectorImpl.invokeUsingClass(InjectorImpl.java:319)
16:04:31 	at org.eclipse.e4.core.internal.di.InjectorImpl.invoke(InjectorImpl.java:253)
16:04:31 	at org.eclipse.e4.core.contexts.ContextInjectionFactory.invoke(ContextInjectionFactory.java:173)
16:04:31 	at org.eclipse.e4.core.commands.internal.HandlerServiceHandler.setEnabled(HandlerServiceHandler.java:84)
16:04:31 	at org.eclipse.core.commands.Command.setEnabled(Command.java:856)
16:04:31 	at org.eclipse.ui.menus.CommandContributionItem.isEnabled(CommandContributionItem.java:916)
16:04:31 	at org.eclipse.ui.menus.CommandContributionItem.updateMenuItem(CommandContributionItem.java:531)
16:04:31 	at org.eclipse.ui.menus.CommandContributionItem.update(CommandContributionItem.java:484)
16:04:31 	at org.eclipse.jface.action.MenuManager.update(MenuManager.java:860)
16:04:31 	at org.eclipse.jface.action.MenuManager.update(MenuManager.java:860)
16:04:31 	at org.eclipse.ui.internal.Workbench.updateActiveWorkbenchWindowMenuManager(Workbench.java:3186)
16:04:31 	at org.eclipse.ui.internal.Workbench.lambda$0(Workbench.java:3168)
16:04:31 	at org.eclipse.jface.bindings.BindingManager.fireBindingManagerChanged(BindingManager.java:903)
16:04:31 	at org.eclipse.jface.bindings.BindingManager.setActiveBindings(BindingManager.java:2183)
16:04:31 	at org.eclipse.jface.bindings.BindingManager.recomputeBindings(BindingManager.java:1744)
16:04:31 	at org.eclipse.jface.bindings.BindingManager.contextManagerChanged(BindingManager.java:693)
16:04:31 	at org.eclipse.core.commands.contexts.ContextManager.fireContextManagerChanged(ContextManager.java:164)
16:04:31 	at org.eclipse.core.commands.contexts.ContextManager.setEventCaching(ContextManager.java:323)
16:04:31 	at org.eclipse.core.commands.contexts.ContextManager.deferUpdates(ContextManager.java:85)
16:04:31 	at org.eclipse.e4.ui.internal.workbench.PartServiceImpl.activate(PartServiceImpl.java:781)
16:04:31 	at org.eclipse.e4.ui.internal.workbench.PartServiceImpl.activate(PartServiceImpl.java:683)
16:04:31 	at org.eclipse.e4.ui.internal.workbench.PartServiceImpl.activate(PartServiceImpl.java:678)
16:04:31 	at org.eclipse.ui.internal.WorkbenchPage.busyOpenEditor(WorkbenchPage.java:3203)
16:04:31 	at org.eclipse.ui.internal.WorkbenchPage.lambda$9(WorkbenchPage.java:3100)
16:04:31 	at org.eclipse.swt.custom.BusyIndicator.showWhile(BusyIndicator.java:72)
16:04:31 	at org.eclipse.ui.internal.WorkbenchPage.openEditor(WorkbenchPage.java:3098)
16:04:31 	at org.eclipse.ui.internal.WorkbenchPage.openEditor(WorkbenchPage.java:3068)
16:04:31 	at org.eclipse.ui.internal.WorkbenchPage.openEditor(WorkbenchPage.java:3051)
16:04:31 	at org.eclipse.ui.ide.IDE.openEditor(IDE.java:636)
16:04:31 	at org.eclipse.papyrus.junit.utils.EditorUtils.lambda$1(EditorUtils.java:71)
16:04:31 	at org.eclipse.papyrus.junit.utils.EditorUtils.withoutLayoutStoragePopup(EditorUtils.java:90)
16:04:31 	at org.eclipse.papyrus.junit.utils.EditorUtils.openPapyrusEditor(EditorUtils.java:67)
16:04:31 	at org.eclipse.papyrus.junit.utils.rules.PapyrusEditorFixture$2.run(PapyrusEditorFixture.java:443)
16:04:31 	at org.eclipse.swt.widgets.Synchronizer.syncExec(Synchronizer.java:236)
16:04:31 	at org.eclipse.ui.internal.UISynchronizer.syncExec(UISynchronizer.java:133)
16:04:31 	at org.eclipse.swt.widgets.Display.syncExec(Display.java:5795)
16:04:31 	at org.eclipse.papyrus.junit.utils.rules.PapyrusEditorFixture.open(PapyrusEditorFixture.java:438)
16:04:31 	at org.eclipse.papyrus.junit.utils.rules.PapyrusEditorFixture.openAll(PapyrusEditorFixture.java:512)
16:04:31 	at org.eclipse.papyrus.junit.utils.rules.PapyrusEditorFixture.starting(PapyrusEditorFixture.java:299)
16:04:31 	at org.junit.rules.TestWatcher.startingQuietly(TestWatcher.java:113)
16:04:31 	at org.junit.rules.TestWatcher.access$000(TestWatcher.java:52)
16:04:31 	at org.junit.rules.TestWatcher$1.evaluate(TestWatcher.java:59)
16:04:31 	at org.eclipse.papyrus.junit.utils.rules.ProjectFixture$1.evaluate(ProjectFixture.java:238)
16:04:31 	at org.junit.runners.ParentRunner$3.evaluate(ParentRunner.java:306)
16:04:31 	at org.junit.runners.BlockJUnit4ClassRunner$1.evaluate(BlockJUnit4ClassRunner.java:100)
16:04:31 	at org.junit.runners.ParentRunner.runLeaf(ParentRunner.java:366)
16:04:31 	at org.junit.runners.BlockJUnit4ClassRunner.runChild(BlockJUnit4ClassRunner.java:103)
16:04:31 	at org.eclipse.papyrus.junit.framework.classification.ClassificationRunner.access$0(ClassificationRunner.java:1)
16:04:31 	at org.eclipse.papyrus.junit.framework.classification.ClassificationRunner$1.runChild(ClassificationRunner.java:58)
16:04:31 	at org.eclipse.papyrus.junit.framework.classification.ClassificationRunnerImpl.runChild(ClassificationRunnerImpl.java:87)
16:04:31 	at org.eclipse.papyrus.junit.framework.classification.ClassificationRunner.runChild(ClassificationRunner.java:86)
16:04:31 	at org.junit.runners.BlockJUnit4ClassRunner.runChild(BlockJUnit4ClassRunner.java:63)
16:04:31 	at org.junit.runners.ParentRunner$4.run(ParentRunner.java:331)
16:04:31 	at org.junit.runners.ParentRunner$1.schedule(ParentRunner.java:79)
16:04:31 	at org.junit.runners.ParentRunner.runChildren(ParentRunner.java:329)
16:04:31 	at org.junit.runners.ParentRunner.access$100(ParentRunner.java:66)
16:04:31 	at org.junit.runners.ParentRunner$2.evaluate(ParentRunner.java:293)
16:04:31 	at org.junit.runners.ParentRunner$3.evaluate(ParentRunner.java:306)
16:04:31 	at org.junit.rules.TestWatcher$1.evaluate(TestWatcher.java:61)
16:04:31 	at org.junit.runners.ParentRunner.run(ParentRunner.java:413)
16:04:31 	at org.junit.runners.Suite.runChild(Suite.java:128)
16:04:31 	at org.junit.runners.Suite.runChild(Suite.java:27)
16:04:31 	at org.junit.runners.ParentRunner$4.run(ParentRunner.java:331)
16:04:31 	at org.junit.runners.ParentRunner$1.schedule(ParentRunner.java:79)
16:04:31 	at org.junit.runners.ParentRunner.runChildren(ParentRunner.java:329)
16:04:31 	at org.junit.runners.ParentRunner.access$100(ParentRunner.java:66)
16:04:31 	at org.junit.runners.ParentRunner$2.evaluate(ParentRunner.java:293)
16:04:31 	at org.junit.runners.ParentRunner$3.evaluate(ParentRunner.java:306)
16:04:31 	at org.junit.runners.ParentRunner.run(ParentRunner.java:413)
16:04:31 	at org.eclipse.papyrus.junit.framework.classification.ClassificationSuite.run(ClassificationSuite.java:130)
16:04:31 	at org.junit.runners.Suite.runChild(Suite.java:128)
16:04:31 	at org.junit.runners.Suite.runChild(Suite.java:27)
16:04:31 	at org.junit.runners.ParentRunner$4.run(ParentRunner.java:331)
16:04:31 	at org.junit.runners.ParentRunner$1.schedule(ParentRunner.java:79)
16:04:31 	at org.junit.runners.ParentRunner.runChildren(ParentRunner.java:329)
16:04:31 	at org.junit.runners.ParentRunner.access$100(ParentRunner.java:66)
16:04:31 	at org.junit.runners.ParentRunner$2.evaluate(ParentRunner.java:293)
16:04:31 	at org.junit.runners.ParentRunner$3.evaluate(ParentRunner.java:306)
16:04:31 	at org.junit.runners.ParentRunner.run(ParentRunner.java:413)
16:04:31 	at org.apache.maven.surefire.junit4.JUnit4Provider.execute(JUnit4Provider.java:365)
16:04:31 	at org.apache.maven.surefire.junit4.JUnit4Provider.executeWithRerun(JUnit4Provider.java:273)
16:04:31 	at org.apache.maven.surefire.junit4.JUnit4Provider.executeTestSet(JUnit4Provider.java:238)
16:04:31 	at org.apache.maven.surefire.junit4.JUnit4Provider.invoke(JUnit4Provider.java:159)
16:04:31 	at sun.reflect.NativeMethodAccessorImpl.invoke0(Native Method)
16:04:31 	at sun.reflect.NativeMethodAccessorImpl.invoke(NativeMethodAccessorImpl.java:62)
16:04:31 	at sun.reflect.DelegatingMethodAccessorImpl.invoke(DelegatingMethodAccessorImpl.java:43)
16:04:31 	at java.lang.reflect.Method.invoke(Method.java:498)
16:04:31 	at org.apache.maven.surefire.util.ReflectionUtils.invokeMethodWithArray2(ReflectionUtils.java:206)
16:04:31 	at org.apache.maven.surefire.booter.ProviderFactory$ProviderProxy.invoke(ProviderFactory.java:161)
16:04:31 	at org.apache.maven.surefire.booter.ProviderFactory.invokeProvider(ProviderFactory.java:84)
16:04:31 	at org.eclipse.tycho.surefire.osgibooter.OsgiSurefireBooter.run(OsgiSurefireBooter.java:110)
16:04:31 	at org.eclipse.tycho.surefire.osgibooter.AbstractUITestApplication$1.run(AbstractUITestApplication.java:35)
16:04:31 	at org.eclipse.swt.widgets.RunnableLock.run(RunnableLock.java:40)
16:04:31 	at org.eclipse.swt.widgets.Synchronizer.runAsyncMessages(Synchronizer.java:185)
16:04:31 	at org.eclipse.swt.widgets.Display.runAsyncMessages(Display.java:4928)
16:04:31 	at org.eclipse.swt.widgets.Display.readAndDispatch(Display.java:4449)
16:04:31 	at org.eclipse.e4.ui.internal.workbench.swt.PartRenderingEngine$5.run(PartRenderingEngine.java:1158)
16:04:31 	at org.eclipse.core.databinding.observable.Realm.runWithDefault(Realm.java:338)
16:04:31 	at org.eclipse.e4.ui.internal.workbench.swt.PartRenderingEngine.run(PartRenderingEngine.java:1047)
16:04:31 	at org.eclipse.e4.ui.internal.workbench.E4Workbench.createAndRunUI(E4Workbench.java:155)
16:04:31 	at org.eclipse.ui.internal.Workbench.lambda$3(Workbench.java:658)
16:04:31 	at org.eclipse.core.databinding.observable.Realm.runWithDefault(Realm.java:338)
16:04:31 	at org.eclipse.ui.internal.Workbench.createAndRunWorkbench(Workbench.java:557)
16:04:31 	at org.eclipse.ui.PlatformUI.createAndRunWorkbench(PlatformUI.java:154)
16:04:31 	at org.eclipse.ui.internal.ide.application.IDEApplication.start(IDEApplication.java:150)
16:04:31 	at org.eclipse.tycho.surefire.osgibooter.UITestApplication.runApplication(UITestApplication.java:31)
16:04:31 	at org.eclipse.tycho.surefire.osgibooter.AbstractUITestApplication.run(AbstractUITestApplication.java:120)
16:04:31 	at org.eclipse.tycho.surefire.osgibooter.UITestApplication.start(UITestApplication.java:37)
16:04:31 	at org.eclipse.equinox.internal.app.EclipseAppHandle.run(EclipseAppHandle.java:203)
16:04:31 	at org.eclipse.core.runtime.internal.adaptor.EclipseAppLauncher.runApplication(EclipseAppLauncher.java:137)
16:04:31 	at org.eclipse.core.runtime.internal.adaptor.EclipseAppLauncher.start(EclipseAppLauncher.java:107)
16:04:31 	at org.eclipse.core.runtime.adaptor.EclipseStarter.run(EclipseStarter.java:401)
16:04:31 	at org.eclipse.core.runtime.adaptor.EclipseStarter.run(EclipseStarter.java:255)
16:04:31 	at sun.reflect.NativeMethodAccessorImpl.invoke0(Native Method)
16:04:31 	at sun.reflect.NativeMethodAccessorImpl.invoke(NativeMethodAccessorImpl.java:62)
16:04:31 	at sun.reflect.DelegatingMethodAccessorImpl.invoke(DelegatingMethodAccessorImpl.java:43)
16:04:31 	at java.lang.reflect.Method.invoke(Method.java:498)
16:04:31 	at org.eclipse.equinox.launcher.Main.invokeFramework(Main.java:657)
16:04:31 	at org.eclipse.equinox.launcher.Main.basicRun(Main.java:594)
16:04:31 	at org.eclipse.equinox.launcher.Main.run(Main.java:1447)
16:04:31 	at org.eclipse.equinox.launcher.Main.main(Main.java:1420)
16:04:31 Caused by: org.eclipse.emf.ecore.resource.impl.ResourceSetImpl$1DiagnosticWrappedException: org.eclipse.core.internal.resources.ResourceException: Resource '/copyPasteofClass1Test/ProfileWithStrereotype.profile.uml' does not exist.
16:04:31 	at org.eclipse.emf.ecore.resource.impl.ResourceSetImpl.handleDemandLoadException(ResourceSetImpl.java:319)
16:04:31 	at org.eclipse.papyrus.infra.core.resource.ModelSet.handleDemandLoadException(ModelSet.java:240)
16:04:31 	at org.eclipse.emf.ecore.resource.impl.ResourceSetImpl.demandLoadHelper(ResourceSetImpl.java:278)
16:04:31 	at org.eclipse.emf.ecore.resource.impl.ResourceSetImpl.getResource(ResourceSetImpl.java:406)
16:04:31 	at org.eclipse.papyrus.infra.core.resource.ModelSet.getResource(ModelSet.java:220)
16:04:31 	at org.eclipse.emf.ecore.resource.impl.ResourceSetImpl$ResourceLocator.basicGetResource(ResourceSetImpl.java:751)
16:04:31 	at org.eclipse.papyrus.infra.emf.resource.ShardResourceLocator.getResource(ShardResourceLocator.java:109)
16:04:31 	at org.eclipse.emf.ecore.resource.impl.ResourceSetImpl$ResourceLocator.basicGetResource(ResourceSetImpl.java:743)
16:04:31 	at org.eclipse.papyrus.infra.editor.welcome.internal.WelcomeModelManager$WelcomeLocator.getResource(WelcomeModelManager.java:233)
16:04:31 	at org.eclipse.emf.ecore.resource.impl.ResourceSetImpl.getResource(ResourceSetImpl.java:352)
16:04:31 	at org.eclipse.papyrus.infra.core.resource.ModelSet.getResource(ModelSet.java:220)
16:04:31 	at org.eclipse.papyrus.infra.services.resourceloading.impl.ProxyManager.getEObjectFromStrategy(ProxyManager.java:134)
16:04:31 	at org.eclipse.papyrus.infra.services.resourceloading.OnDemandLoadingModelSet.getEObject(OnDemandLoadingModelSet.java:94)
16:04:31 	at org.eclipse.papyrus.infra.emf.utils.EMFHelper.reloadIntoContext(EMFHelper.java:1049)
16:04:31 	at org.eclipse.papyrus.uml.tools.commands.DuplicateStereotypeCommand.<init>(DuplicateStereotypeCommand.java:84)
16:04:31 	at org.eclipse.papyrus.uml.diagram.common.strategy.paste.StereotypePasteStrategy.getSemanticCommand(StereotypePasteStrategy.java:136)
16:04:31 	at org.eclipse.papyrus.uml.diagram.common.strategy.paste.StereotypePasteStrategy.getGraphicalCommand(StereotypePasteStrategy.java:199)
16:04:31 	at org.eclipse.papyrus.infra.gmfdiag.menu.handlers.PasteInDiagramHandler.getCommand(PasteInDiagramHandler.java:59)
16:04:31 	at org.eclipse.papyrus.infra.gmfdiag.menu.handlers.AbstractGraphicalCommandHandler.getCommand(AbstractGraphicalCommandHandler.java:55)
16:04:31 	at org.eclipse.papyrus.infra.gmfdiag.menu.handlers.AbstractGraphicalCommandHandler.computeEnabled(AbstractGraphicalCommandHandler.java:142)
16:04:31 	at org.eclipse.papyrus.infra.gmfdiag.menu.handlers.AbstractGraphicalCommandHandler.setEnabled(AbstractGraphicalCommandHandler.java:131)
16:04:31 	at org.eclipse.papyrus.infra.gmfdiag.menu.handlers.PasteInDiagramHandler.setEnabled(PasteInDiagramHandler.java:93)
16:04:31 	at org.eclipse.ui.internal.handlers.HandlerProxy.setEnabled(HandlerProxy.java:229)
16:04:31 	at org.eclipse.ui.internal.handlers.E4HandlerProxy.setEnabled(E4HandlerProxy.java:133)
16:04:31 	at sun.reflect.GeneratedMethodAccessor20.invoke(Unknown Source)
16:04:31 	at sun.reflect.DelegatingMethodAccessorImpl.invoke(DelegatingMethodAccessorImpl.java:43)
16:04:31 	at java.lang.reflect.Method.invoke(Method.java:498)
16:04:31 	at org.eclipse.e4.core.internal.di.MethodRequestor.execute(MethodRequestor.java:58)
16:04:31 	... 121 more
16:04:31 Caused by: org.eclipse.core.internal.resources.ResourceException: Resource '/copyPasteofClass1Test/ProfileWithStrereotype.profile.uml' does not exist.
16:04:31 	at org.eclipse.core.internal.resources.Resource.checkExists(Resource.java:330)
16:04:31 	at org.eclipse.core.internal.resources.Resource.checkAccessible(Resource.java:204)
16:04:31 	at org.eclipse.core.internal.resources.File.getContents(File.java:273)
16:04:31 	at org.eclipse.core.internal.resources.File.getContents(File.java:266)
16:04:31 	at org.eclipse.emf.ecore.resource.impl.PlatformResourceURIHandlerImpl$WorkbenchHelper.createPlatformResourceInputStream(PlatformResourceURIHandlerImpl.java:208)
16:04:31 	at org.eclipse.emf.ecore.resource.impl.PlatformResourceURIHandlerImpl.createInputStream(PlatformResourceURIHandlerImpl.java:568)
16:04:31 	at org.eclipse.emf.ecore.resource.impl.ExtensibleURIConverterImpl.createInputStream(ExtensibleURIConverterImpl.java:358)
16:04:31 	at org.eclipse.emf.ecore.resource.impl.ResourceImpl.load(ResourceImpl.java:1314)
16:04:31 	at org.eclipse.emf.ecore.resource.impl.ResourceSetImpl.demandLoad(ResourceSetImpl.java:259)
16:04:31 	at org.eclipse.papyrus.infra.core.resource.ModelSet.demandLoad(ModelSet.java:380)
16:04:31 	at org.eclipse.emf.ecore.resource.impl.ResourceSetImpl.demandLoadHelper(ResourceSetImpl.java:274)
16:04:31 	... 146 more
16:04:31 Caused by: java.lang.Exception: Resource '/copyPasteofClass1Test/ProfileWithStrereotype.profile.uml' does not exist.
16:04:31 	at org.eclipse.core.internal.resources.ResourceException.provideStackTrace(ResourceException.java:42)
16:04:31 	at org.eclipse.core.internal.resources.ResourceException.<init>(ResourceException.java:38)
16:04:31 	... 157 more
16:04:34 org.eclipse.e4.core.di.InjectionException: org.eclipse.emf.ecore.resource.impl.ResourceSetImpl$1DiagnosticWrappedException: org.eclipse.core.internal.resources.ResourceException: Resource '/copyPasteofClass1Test/ProfileWithStrereotype.profile.uml' does not exist.
16:04:34 	at org.eclipse.e4.core.internal.di.MethodRequestor.execute(MethodRequestor.java:68)
16:04:34 	at org.eclipse.e4.core.internal.di.InjectorImpl.invokeUsingClass(InjectorImpl.java:319)
16:04:34 	at org.eclipse.e4.core.internal.di.InjectorImpl.invoke(InjectorImpl.java:253)
16:04:34 	at org.eclipse.e4.core.contexts.ContextInjectionFactory.invoke(ContextInjectionFactory.java:173)
16:04:34 	at org.eclipse.e4.core.commands.internal.HandlerServiceHandler.setEnabled(HandlerServiceHandler.java:84)
16:04:34 	at org.eclipse.core.commands.Command.setEnabled(Command.java:856)
16:04:34 	at org.eclipse.ui.menus.CommandContributionItem.isEnabled(CommandContributionItem.java:916)
16:04:34 	at org.eclipse.ui.menus.CommandContributionItem.updateMenuItem(CommandContributionItem.java:531)
16:04:34 	at org.eclipse.ui.menus.CommandContributionItem.update(CommandContributionItem.java:484)
16:04:34 	at org.eclipse.jface.action.MenuManager.update(MenuManager.java:860)
16:04:34 	at org.eclipse.jface.action.MenuManager.update(MenuManager.java:860)
16:04:34 	at org.eclipse.ui.internal.Workbench.updateActiveWorkbenchWindowMenuManager(Workbench.java:3186)
16:04:34 	at org.eclipse.ui.internal.Workbench.lambda$0(Workbench.java:3168)
16:04:34 	at org.eclipse.jface.bindings.BindingManager.fireBindingManagerChanged(BindingManager.java:903)
16:04:34 	at org.eclipse.jface.bindings.BindingManager.setActiveBindings(BindingManager.java:2183)
16:04:34 	at org.eclipse.jface.bindings.BindingManager.recomputeBindings(BindingManager.java:1744)
16:04:34 	at org.eclipse.jface.bindings.BindingManager.contextManagerChanged(BindingManager.java:693)
16:04:34 	at org.eclipse.core.commands.contexts.ContextManager.fireContextManagerChanged(ContextManager.java:164)
16:04:34 	at org.eclipse.core.commands.contexts.ContextManager.setEventCaching(ContextManager.java:323)
16:04:34 	at org.eclipse.core.commands.contexts.ContextManager.deferUpdates(ContextManager.java:85)
16:04:34 	at org.eclipse.e4.ui.internal.workbench.PartServiceImpl.activate(PartServiceImpl.java:781)
16:04:34 	at org.eclipse.e4.ui.internal.workbench.PartServiceImpl.activate(PartServiceImpl.java:683)
16:04:34 	at org.eclipse.e4.ui.internal.workbench.PartServiceImpl.activate(PartServiceImpl.java:678)
16:04:34 	at org.eclipse.ui.internal.WorkbenchPage.busyOpenEditor(WorkbenchPage.java:3203)
16:04:34 	at org.eclipse.ui.internal.WorkbenchPage.lambda$9(WorkbenchPage.java:3100)
16:04:34 	at org.eclipse.swt.custom.BusyIndicator.showWhile(BusyIndicator.java:72)
16:04:34 	at org.eclipse.ui.internal.WorkbenchPage.openEditor(WorkbenchPage.java:3098)
16:04:34 	at org.eclipse.ui.internal.WorkbenchPage.openEditor(WorkbenchPage.java:3068)
16:04:34 	at org.eclipse.ui.internal.WorkbenchPage.openEditor(WorkbenchPage.java:3051)
16:04:34 	at org.eclipse.ui.ide.IDE.openEditor(IDE.java:636)
16:04:34 	at org.eclipse.papyrus.junit.utils.EditorUtils.lambda$1(EditorUtils.java:71)
16:04:34 	at org.eclipse.papyrus.junit.utils.EditorUtils.withoutLayoutStoragePopup(EditorUtils.java:90)
16:04:34 	at org.eclipse.papyrus.junit.utils.EditorUtils.openPapyrusEditor(EditorUtils.java:67)
16:04:34 	at org.eclipse.papyrus.junit.utils.rules.AbstractHouseKeeperRule$3.run(AbstractHouseKeeperRule.java:305)
16:04:34 	at org.eclipse.swt.widgets.Synchronizer.syncExec(Synchronizer.java:236)
16:04:34 	at org.eclipse.ui.internal.UISynchronizer.syncExec(UISynchronizer.java:133)
16:04:34 	at org.eclipse.swt.widgets.Display.syncExec(Display.java:5795)
16:04:34 	at org.eclipse.papyrus.junit.utils.rules.AbstractHouseKeeperRule.openPapyrusEditor(AbstractHouseKeeperRule.java:300)
16:04:34 	at org.eclipse.papyrus.uml.diagram.dnd.tests.tests.InstanceSpecificationTest$1.run(InstanceSpecificationTest.java:123)
16:04:34 	at org.eclipse.swt.widgets.Synchronizer.syncExec(Synchronizer.java:236)
16:04:34 	at org.eclipse.ui.internal.UISynchronizer.syncExec(UISynchronizer.java:133)
16:04:34 	at org.eclipse.swt.widgets.Display.syncExec(Display.java:5795)
16:04:34 	at org.eclipse.papyrus.uml.diagram.dnd.tests.tests.InstanceSpecificationTest.initModel(InstanceSpecificationTest.java:119)
16:04:34 	at org.eclipse.papyrus.uml.diagram.dnd.tests.tests.InstanceSpecificationTest.init(InstanceSpecificationTest.java:91)
16:04:34 	at sun.reflect.NativeMethodAccessorImpl.invoke0(Native Method)
16:04:34 	at sun.reflect.NativeMethodAccessorImpl.invoke(NativeMethodAccessorImpl.java:62)
16:04:34 	at sun.reflect.DelegatingMethodAccessorImpl.invoke(DelegatingMethodAccessorImpl.java:43)
16:04:34 	at java.lang.reflect.Method.invoke(Method.java:498)
16:04:34 	at org.junit.runners.model.FrameworkMethod$1.runReflectiveCall(FrameworkMethod.java:59)
16:04:34 	at org.junit.internal.runners.model.ReflectiveCallable.run(ReflectiveCallable.java:12)
16:04:34 	at org.junit.runners.model.FrameworkMethod.invokeExplosively(FrameworkMethod.java:56)
16:04:34 	at org.junit.internal.runners.statements.RunBefores.invokeMethod(RunBefores.java:33)
16:04:34 	at org.junit.internal.runners.statements.RunBefores.evaluate(RunBefores.java:24)
16:04:34 	at org.eclipse.papyrus.junit.utils.rules.HouseKeeper$Static$1.evaluate(HouseKeeper.java:124)
16:04:34 	at org.junit.rules.RunRules.evaluate(RunRules.java:20)
16:04:34 	at org.junit.runners.ParentRunner$3.evaluate(ParentRunner.java:306)
16:04:34 	at org.junit.rules.TestWatcher$1.evaluate(TestWatcher.java:61)
16:04:34 	at org.junit.runners.ParentRunner.run(ParentRunner.java:413)
16:04:34 	at org.junit.runners.Suite.runChild(Suite.java:128)
16:04:34 	at org.junit.runners.Suite.runChild(Suite.java:27)
16:04:34 	at org.junit.runners.ParentRunner$4.run(ParentRunner.java:331)
16:04:34 	at org.junit.runners.ParentRunner$1.schedule(ParentRunner.java:79)
16:04:34 	at org.junit.runners.ParentRunner.runChildren(ParentRunner.java:329)
16:04:34 	at org.junit.runners.ParentRunner.access$100(ParentRunner.java:66)
16:04:34 	at org.junit.runners.ParentRunner$2.evaluate(ParentRunner.java:293)
16:04:34 	at org.junit.runners.ParentRunner$3.evaluate(ParentRunner.java:306)
16:04:34 	at org.junit.runners.ParentRunner.run(ParentRunner.java:413)
16:04:34 	at org.eclipse.papyrus.junit.framework.classification.ClassificationSuite.run(ClassificationSuite.java:130)
16:04:34 	at org.junit.runners.Suite.runChild(Suite.java:128)
16:04:34 	at org.junit.runners.Suite.runChild(Suite.java:27)
16:04:34 	at org.junit.runners.ParentRunner$4.run(ParentRunner.java:331)
16:04:34 	at org.junit.runners.ParentRunner$1.schedule(ParentRunner.java:79)
16:04:34 	at org.junit.runners.ParentRunner.runChildren(ParentRunner.java:329)
16:04:34 	at org.junit.runners.ParentRunner.access$100(ParentRunner.java:66)
16:04:34 	at org.junit.runners.ParentRunner$2.evaluate(ParentRunner.java:293)
16:04:34 	at org.junit.runners.ParentRunner$3.evaluate(ParentRunner.java:306)
16:04:34 	at org.junit.runners.ParentRunner.run(ParentRunner.java:413)
16:04:34 	at org.apache.maven.surefire.junit4.JUnit4Provider.execute(JUnit4Provider.java:365)
16:04:34 	at org.apache.maven.surefire.junit4.JUnit4Provider.executeWithRerun(JUnit4Provider.java:273)
16:04:34 	at org.apache.maven.surefire.junit4.JUnit4Provider.executeTestSet(JUnit4Provider.java:238)
16:04:34 	at org.apache.maven.surefire.junit4.JUnit4Provider.invoke(JUnit4Provider.java:159)
16:04:34 	at sun.reflect.NativeMethodAccessorImpl.invoke0(Native Method)
16:04:34 	at sun.reflect.NativeMethodAccessorImpl.invoke(NativeMethodAccessorImpl.java:62)
16:04:34 	at sun.reflect.DelegatingMethodAccessorImpl.invoke(DelegatingMethodAccessorImpl.java:43)
16:04:34 	at java.lang.reflect.Method.invoke(Method.java:498)
16:04:34 	at org.apache.maven.surefire.util.ReflectionUtils.invokeMethodWithArray2(ReflectionUtils.java:206)
16:04:34 	at org.apache.maven.surefire.booter.ProviderFactory$ProviderProxy.invoke(ProviderFactory.java:161)
16:04:34 	at org.apache.maven.surefire.booter.ProviderFactory.invokeProvider(ProviderFactory.java:84)
16:04:34 	at org.eclipse.tycho.surefire.osgibooter.OsgiSurefireBooter.run(OsgiSurefireBooter.java:110)
16:04:34 	at org.eclipse.tycho.surefire.osgibooter.AbstractUITestApplication$1.run(AbstractUITestApplication.java:35)
16:04:34 	at org.eclipse.swt.widgets.RunnableLock.run(RunnableLock.java:40)
16:04:34 	at org.eclipse.swt.widgets.Synchronizer.runAsyncMessages(Synchronizer.java:185)
16:04:34 	at org.eclipse.swt.widgets.Display.runAsyncMessages(Display.java:4928)
16:04:34 	at org.eclipse.swt.widgets.Display.readAndDispatch(Display.java:4449)
16:04:34 	at org.eclipse.e4.ui.internal.workbench.swt.PartRenderingEngine$5.run(PartRenderingEngine.java:1158)
16:04:34 	at org.eclipse.core.databinding.observable.Realm.runWithDefault(Realm.java:338)
16:04:34 	at org.eclipse.e4.ui.internal.workbench.swt.PartRenderingEngine.run(PartRenderingEngine.java:1047)
16:04:34 	at org.eclipse.e4.ui.internal.workbench.E4Workbench.createAndRunUI(E4Workbench.java:155)
16:04:34 	at org.eclipse.ui.internal.Workbench.lambda$3(Workbench.java:658)
16:04:34 	at org.eclipse.core.databinding.observable.Realm.runWithDefault(Realm.java:338)
16:04:34 	at org.eclipse.ui.internal.Workbench.createAndRunWorkbench(Workbench.java:557)
16:04:34 	at org.eclipse.ui.PlatformUI.createAndRunWorkbench(PlatformUI.java:154)
16:04:34 	at org.eclipse.ui.internal.ide.application.IDEApplication.start(IDEApplication.java:150)
16:04:34 	at org.eclipse.tycho.surefire.osgibooter.UITestApplication.runApplication(UITestApplication.java:31)
16:04:34 	at org.eclipse.tycho.surefire.osgibooter.AbstractUITestApplication.run(AbstractUITestApplication.java:120)
16:04:34 	at org.eclipse.tycho.surefire.osgibooter.UITestApplication.start(UITestApplication.java:37)
16:04:34 	at org.eclipse.equinox.internal.app.EclipseAppHandle.run(EclipseAppHandle.java:203)
16:04:34 	at org.eclipse.core.runtime.internal.adaptor.EclipseAppLauncher.runApplication(EclipseAppLauncher.java:137)
16:04:34 	at org.eclipse.core.runtime.internal.adaptor.EclipseAppLauncher.start(EclipseAppLauncher.java:107)
16:04:34 	at org.eclipse.core.runtime.adaptor.EclipseStarter.run(EclipseStarter.java:401)
16:04:34 	at org.eclipse.core.runtime.adaptor.EclipseStarter.run(EclipseStarter.java:255)
16:04:34 	at sun.reflect.NativeMethodAccessorImpl.invoke0(Native Method)
16:04:34 	at sun.reflect.NativeMethodAccessorImpl.invoke(NativeMethodAccessorImpl.java:62)
16:04:34 	at sun.reflect.DelegatingMethodAccessorImpl.invoke(DelegatingMethodAccessorImpl.java:43)
16:04:34 	at java.lang.reflect.Method.invoke(Method.java:498)
16:04:34 	at org.eclipse.equinox.launcher.Main.invokeFramework(Main.java:657)
16:04:34 	at org.eclipse.equinox.launcher.Main.basicRun(Main.java:594)
16:04:34 	at org.eclipse.equinox.launcher.Main.run(Main.java:1447)
16:04:34 	at org.eclipse.equinox.launcher.Main.main(Main.java:1420)
16:04:34 Caused by: org.eclipse.emf.ecore.resource.impl.ResourceSetImpl$1DiagnosticWrappedException: org.eclipse.core.internal.resources.ResourceException: Resource '/copyPasteofClass1Test/ProfileWithStrereotype.profile.uml' does not exist.
16:04:34 	at org.eclipse.emf.ecore.resource.impl.ResourceSetImpl.handleDemandLoadException(ResourceSetImpl.java:319)
16:04:34 	at org.eclipse.papyrus.infra.core.resource.ModelSet.handleDemandLoadException(ModelSet.java:240)
16:04:34 	at org.eclipse.emf.ecore.resource.impl.ResourceSetImpl.demandLoadHelper(ResourceSetImpl.java:278)
16:04:34 	at org.eclipse.emf.ecore.resource.impl.ResourceSetImpl.getResource(ResourceSetImpl.java:406)
16:04:34 	at org.eclipse.papyrus.infra.core.resource.ModelSet.getResource(ModelSet.java:220)
16:04:34 	at org.eclipse.emf.ecore.resource.impl.ResourceSetImpl$ResourceLocator.basicGetResource(ResourceSetImpl.java:751)
16:04:34 	at org.eclipse.papyrus.infra.emf.resource.ShardResourceLocator.getResource(ShardResourceLocator.java:109)
16:04:34 	at org.eclipse.emf.ecore.resource.impl.ResourceSetImpl$ResourceLocator.basicGetResource(ResourceSetImpl.java:743)
16:04:34 	at org.eclipse.papyrus.infra.editor.welcome.internal.WelcomeModelManager$WelcomeLocator.getResource(WelcomeModelManager.java:233)
16:04:34 	at org.eclipse.emf.ecore.resource.impl.ResourceSetImpl.getResource(ResourceSetImpl.java:352)
16:04:34 	at org.eclipse.papyrus.infra.core.resource.ModelSet.getResource(ModelSet.java:220)
16:04:34 	at org.eclipse.papyrus.infra.services.resourceloading.impl.ProxyManager.getEObjectFromStrategy(ProxyManager.java:134)
16:04:34 	at org.eclipse.papyrus.infra.services.resourceloading.OnDemandLoadingModelSet.getEObject(OnDemandLoadingModelSet.java:94)
16:04:34 	at org.eclipse.papyrus.infra.emf.utils.EMFHelper.reloadIntoContext(EMFHelper.java:1049)
16:04:34 	at org.eclipse.papyrus.uml.tools.commands.DuplicateStereotypeCommand.<init>(DuplicateStereotypeCommand.java:84)
16:04:34 	at org.eclipse.papyrus.uml.diagram.common.strategy.paste.StereotypePasteStrategy.getSemanticCommand(StereotypePasteStrategy.java:136)
16:04:34 	at org.eclipse.papyrus.uml.diagram.common.strategy.paste.StereotypePasteStrategy.getGraphicalCommand(StereotypePasteStrategy.java:199)
16:04:34 	at org.eclipse.papyrus.infra.gmfdiag.menu.handlers.PasteInDiagramHandler.getCommand(PasteInDiagramHandler.java:59)
16:04:34 	at org.eclipse.papyrus.infra.gmfdiag.menu.handlers.AbstractGraphicalCommandHandler.getCommand(AbstractGraphicalCommandHandler.java:55)
16:04:34 	at org.eclipse.papyrus.infra.gmfdiag.menu.handlers.AbstractGraphicalCommandHandler.computeEnabled(AbstractGraphicalCommandHandler.java:142)
16:04:34 	at org.eclipse.papyrus.infra.gmfdiag.menu.handlers.AbstractGraphicalCommandHandler.setEnabled(AbstractGraphicalCommandHandler.java:131)
16:04:34 	at org.eclipse.papyrus.infra.gmfdiag.menu.handlers.PasteInDiagramHandler.setEnabled(PasteInDiagramHandler.java:93)
16:04:34 	at org.eclipse.ui.internal.handlers.HandlerProxy.setEnabled(HandlerProxy.java:229)
16:04:34 	at org.eclipse.ui.internal.handlers.E4HandlerProxy.setEnabled(E4HandlerProxy.java:133)
16:04:34 	at sun.reflect.GeneratedMethodAccessor20.invoke(Unknown Source)
16:04:34 	at sun.reflect.DelegatingMethodAccessorImpl.invoke(DelegatingMethodAccessorImpl.java:43)
16:04:34 	at java.lang.reflect.Method.invoke(Method.java:498)
16:04:34 	at org.eclipse.e4.core.internal.di.MethodRequestor.execute(MethodRequestor.java:58)
16:04:34 	... 118 more
16:04:34 Caused by: org.eclipse.core.internal.resources.ResourceException: Resource '/copyPasteofClass1Test/ProfileWithStrereotype.profile.uml' does not exist.
16:04:34 	at org.eclipse.core.internal.resources.Resource.checkExists(Resource.java:330)
16:04:34 	at org.eclipse.core.internal.resources.Resource.checkAccessible(Resource.java:204)
16:04:34 	at org.eclipse.core.internal.resources.File.getContents(File.java:273)
16:04:34 	at org.eclipse.core.internal.resources.File.getContents(File.java:266)
16:04:34 	at org.eclipse.emf.ecore.resource.impl.PlatformResourceURIHandlerImpl$WorkbenchHelper.createPlatformResourceInputStream(PlatformResourceURIHandlerImpl.java:208)
16:04:34 	at org.eclipse.emf.ecore.resource.impl.PlatformResourceURIHandlerImpl.createInputStream(PlatformResourceURIHandlerImpl.java:568)
16:04:34 	at org.eclipse.emf.ecore.resource.impl.ExtensibleURIConverterImpl.createInputStream(ExtensibleURIConverterImpl.java:358)
16:04:34 	at org.eclipse.emf.ecore.resource.impl.ResourceImpl.load(ResourceImpl.java:1314)
16:04:34 	at org.eclipse.emf.ecore.resource.impl.ResourceSetImpl.demandLoad(ResourceSetImpl.java:259)
16:04:34 	at org.eclipse.papyrus.infra.core.resource.ModelSet.demandLoad(ModelSet.java:380)
16:04:34 	at org.eclipse.emf.ecore.resource.impl.ResourceSetImpl.demandLoadHelper(ResourceSetImpl.java:274)
16:04:34 	... 143 more
16:04:34 Caused by: java.lang.Exception: Resource '/copyPasteofClass1Test/ProfileWithStrereotype.profile.uml' does not exist.
16:04:34 	at org.eclipse.core.internal.resources.ResourceException.provideStackTrace(ResourceException.java:42)
16:04:34 	at org.eclipse.core.internal.resources.ResourceException.<init>(ResourceException.java:38)
16:04:34 	... 154 more
16:05:09 org.eclipse.core.internal.resources.ResourceException(/copyingInterfaceRealizationDoesNotCorruptTheModel)[368]: java.lang.Exception: Resource '/copyingInterfaceRealizationDoesNotCorruptTheModel' does not exist.
16:05:09 	at org.eclipse.core.internal.resources.ResourceException.provideStackTrace(ResourceException.java:42)
16:05:09 	at org.eclipse.core.internal.resources.ResourceException.<init>(ResourceException.java:38)
16:05:09 	at org.eclipse.core.internal.resources.Resource.checkExists(Resource.java:330)
16:05:09 	at org.eclipse.core.internal.resources.Resource.checkAccessible(Resource.java:204)
16:05:09 	at org.eclipse.core.internal.resources.Project.checkAccessible(Project.java:145)
16:05:09 	at org.eclipse.core.internal.resources.Resource.accept(Resource.java:63)
16:05:09 	at org.eclipse.core.internal.resources.Resource.accept(Resource.java:55)
16:05:09 	at org.eclipse.core.internal.resources.Resource.accept(Resource.java:117)
16:05:09 	at org.eclipse.core.internal.resources.Resource.accept(Resource.java:105)
16:05:09 	at org.eclipse.papyrus.junit.utils.rules.ProjectFixture.deleteProject(ProjectFixture.java:270)
16:05:09 	at org.eclipse.papyrus.junit.utils.rules.ProjectFixture$1.evaluate(ProjectFixture.java:240)
16:05:09 	at org.junit.runners.ParentRunner$3.evaluate(ParentRunner.java:306)
16:05:09 	at org.junit.runners.BlockJUnit4ClassRunner$1.evaluate(BlockJUnit4ClassRunner.java:100)
16:05:09 	at org.junit.runners.ParentRunner.runLeaf(ParentRunner.java:366)
16:05:09 	at org.junit.runners.BlockJUnit4ClassRunner.runChild(BlockJUnit4ClassRunner.java:103)
16:05:09 	at org.eclipse.papyrus.junit.framework.classification.ClassificationRunner.access$0(ClassificationRunner.java:1)
16:05:09 	at org.eclipse.papyrus.junit.framework.classification.ClassificationRunner$1.runChild(ClassificationRunner.java:58)
16:05:09 	at org.eclipse.papyrus.junit.framework.classification.ClassificationRunnerImpl.runChild(ClassificationRunnerImpl.java:87)
16:05:09 	at org.eclipse.papyrus.junit.framework.classification.ClassificationRunner.runChild(ClassificationRunner.java:86)
16:05:09 	at org.junit.runners.BlockJUnit4ClassRunner.runChild(BlockJUnit4ClassRunner.java:63)
16:05:09 	at org.junit.runners.ParentRunner$4.run(ParentRunner.java:331)
16:05:09 	at org.junit.runners.ParentRunner$1.schedule(ParentRunner.java:79)
16:05:09 	at org.junit.runners.ParentRunner.runChildren(ParentRunner.java:329)
16:05:09 	at org.junit.runners.ParentRunner.access$100(ParentRunner.java:66)
16:05:09 	at org.junit.runners.ParentRunner$2.evaluate(ParentRunner.java:293)
16:05:09 	at org.junit.runners.ParentRunner$3.evaluate(ParentRunner.java:306)
16:05:09 	at org.junit.rules.TestWatcher$1.evaluate(TestWatcher.java:61)
16:05:09 	at org.junit.runners.ParentRunner.run(ParentRunner.java:413)
16:05:09 	at org.junit.runners.Suite.runChild(Suite.java:128)
16:05:09 	at org.junit.runners.Suite.runChild(Suite.java:27)
16:05:09 	at org.junit.runners.ParentRunner$4.run(ParentRunner.java:331)
16:05:09 	at org.junit.runners.ParentRunner$1.schedule(ParentRunner.java:79)
16:05:09 	at org.junit.runners.ParentRunner.runChildren(ParentRunner.java:329)
16:05:09 	at org.junit.runners.ParentRunner.access$100(ParentRunner.java:66)
16:05:09 	at org.junit.runners.ParentRunner$2.evaluate(ParentRunner.java:293)
16:05:09 	at org.junit.runners.ParentRunner$3.evaluate(ParentRunner.java:306)
16:05:09 	at org.junit.runners.ParentRunner.run(ParentRunner.java:413)
16:05:09 	at org.eclipse.papyrus.junit.framework.classification.ClassificationSuite.run(ClassificationSuite.java:130)
16:05:09 	at org.junit.runners.Suite.runChild(Suite.java:128)
16:05:09 	at org.junit.runners.Suite.runChild(Suite.java:27)
16:05:09 	at org.junit.runners.ParentRunner$4.run(ParentRunner.java:331)
16:05:09 	at org.junit.runners.ParentRunner$1.schedule(ParentRunner.java:79)
16:05:09 	at org.junit.runners.ParentRunner.runChildren(ParentRunner.java:329)
16:05:09 	at org.junit.runners.ParentRunner.access$100(ParentRunner.java:66)
16:05:09 	at org.junit.runners.ParentRunner$2.evaluate(ParentRunner.java:293)
16:05:09 	at org.junit.runners.ParentRunner$3.evaluate(ParentRunner.java:306)
16:05:09 	at org.junit.runners.ParentRunner.run(ParentRunner.java:413)
16:05:09 	at org.apache.maven.surefire.junit4.JUnit4Provider.execute(JUnit4Provider.java:365)
16:05:09 	at org.apache.maven.surefire.junit4.JUnit4Provider.executeWithRerun(JUnit4Provider.java:273)
16:05:09 	at org.apache.maven.surefire.junit4.JUnit4Provider.executeTestSet(JUnit4Provider.java:238)
16:05:09 	at org.apache.maven.surefire.junit4.JUnit4Provider.invoke(JUnit4Provider.java:159)
16:05:09 	at sun.reflect.NativeMethodAccessorImpl.invoke0(Native Method)
16:05:09 	at sun.reflect.NativeMethodAccessorImpl.invoke(NativeMethodAccessorImpl.java:62)
16:05:09 	at sun.reflect.DelegatingMethodAccessorImpl.invoke(DelegatingMethodAccessorImpl.java:43)
16:05:09 	at java.lang.reflect.Method.invoke(Method.java:498)
16:05:09 	at org.apache.maven.surefire.util.ReflectionUtils.invokeMethodWithArray2(ReflectionUtils.java:206)
16:05:09 	at org.apache.maven.surefire.booter.ProviderFactory$ProviderProxy.invoke(ProviderFactory.java:161)
16:05:09 	at org.apache.maven.surefire.booter.ProviderFactory.invokeProvider(ProviderFactory.java:84)
16:05:09 	at org.eclipse.tycho.surefire.osgibooter.OsgiSurefireBooter.run(OsgiSurefireBooter.java:110)
16:05:09 	at org.eclipse.tycho.surefire.osgibooter.AbstractUITestApplication$1.run(AbstractUITestApplication.java:35)
16:05:09 	at org.eclipse.swt.widgets.RunnableLock.run(RunnableLock.java:40)
16:05:09 	at org.eclipse.swt.widgets.Synchronizer.runAsyncMessages(Synchronizer.java:185)
16:05:09 	at org.eclipse.swt.widgets.Display.runAsyncMessages(Display.java:4928)
16:05:09 	at org.eclipse.swt.widgets.Display.readAndDispatch(Display.java:4449)
16:05:09 	at org.eclipse.e4.ui.internal.workbench.swt.PartRenderingEngine$5.run(PartRenderingEngine.java:1158)
16:05:09 	at org.eclipse.core.databinding.observable.Realm.runWithDefault(Realm.java:338)
16:05:09 	at org.eclipse.e4.ui.internal.workbench.swt.PartRenderingEngine.run(PartRenderingEngine.java:1047)
16:05:09 	at org.eclipse.e4.ui.internal.workbench.E4Workbench.createAndRunUI(E4Workbench.java:155)
16:05:09 	at org.eclipse.ui.internal.Workbench.lambda$3(Workbench.java:658)
16:05:09 	at org.eclipse.core.databinding.observable.Realm.runWithDefault(Realm.java:338)
16:05:09 	at org.eclipse.ui.internal.Workbench.createAndRunWorkbench(Workbench.java:557)
16:05:09 	at org.eclipse.ui.PlatformUI.createAndRunWorkbench(PlatformUI.java:154)
16:05:09 	at org.eclipse.ui.internal.ide.application.IDEApplication.start(IDEApplication.java:150)
16:05:09 	at org.eclipse.tycho.surefire.osgibooter.UITestApplication.runApplication(UITestApplication.java:31)
16:05:09 	at org.eclipse.tycho.surefire.osgibooter.AbstractUITestApplication.run(AbstractUITestApplication.java:120)
16:05:09 	at org.eclipse.tycho.surefire.osgibooter.UITestApplication.start(UITestApplication.java:37)
16:05:09 	at org.eclipse.equinox.internal.app.EclipseAppHandle.run(EclipseAppHandle.java:203)
16:05:09 	at org.eclipse.core.runtime.internal.adaptor.EclipseAppLauncher.runApplication(EclipseAppLauncher.java:137)
16:05:09 	at org.eclipse.core.runtime.internal.adaptor.EclipseAppLauncher.start(EclipseAppLauncher.java:107)
16:05:09 	at org.eclipse.core.runtime.adaptor.EclipseStarter.run(EclipseStarter.java:401)
16:05:09 	at org.eclipse.core.runtime.adaptor.EclipseStarter.run(EclipseStarter.java:255)
16:05:09 	at sun.reflect.NativeMethodAccessorImpl.invoke0(Native Method)
16:05:09 	at sun.reflect.NativeMethodAccessorImpl.invoke(NativeMethodAccessorImpl.java:62)
16:05:09 	at sun.reflect.DelegatingMethodAccessorImpl.invoke(DelegatingMethodAccessorImpl.java:43)
16:05:09 	at java.lang.reflect.Method.invoke(Method.java:498)
16:05:09 	at org.eclipse.equinox.launcher.Main.invokeFramework(Main.java:657)
16:05:09 	at org.eclipse.equinox.launcher.Main.basicRun(Main.java:594)
16:05:09 	at org.eclipse.equinox.launcher.Main.run(Main.java:1447)
16:05:09 	at org.eclipse.equinox.launcher.Main.main(Main.java:1420)
16:07:03 Build timed out (after 120 minutes). Marking the build as aborted.
16:07:04 [INFO] ------------------------------------------------------------------------
16:07:04 [INFO] Reactor Summary:
16:07:04 [INFO] 
16:07:04 [INFO] org.eclipse.papyrus.all.releng 0.0.1-SNAPSHOT ...... SUCCESS [  1.577 s]
16:07:04 [INFO] org.eclipse.papyrus.releng 0.0.1-SNAPSHOT .......... SUCCESS [  0.046 s]
16:07:04 [INFO] Papyrus Main Plugins 0.0.1-SNAPSHOT ................ SUCCESS [  0.006 s]
16:07:04 [INFO] Papyrus EMF 0.0.1-SNAPSHOT ......................... SUCCESS [  0.013 s]
16:07:04 [INFO] org.eclipse.papyrus.emf 1.0.0-SNAPSHOT ............. SUCCESS [ 13.389 s]
16:07:04 [INFO] org.eclipse.papyrus.emf.ui 1.0.0-SNAPSHOT .......... SUCCESS [  0.367 s]
16:07:04 [INFO] EMF Facet, the Papyrus Edition 0.0.1-SNAPSHOT ...... SUCCESS [  0.005 s]
16:07:04 [INFO] Papyrus EMF Facet Editors 0.0.1-SNAPSHOT ........... SUCCESS [  0.003 s]
16:07:04 [INFO] org.eclipse.papyrus.emf.facet.custom.doc 1.2.0-SNAPSHOT SUCCESS [  0.043 s]
16:07:04 [INFO] org.eclipse.papyrus.emf.facet.common.core 1.2.0-SNAPSHOT SUCCESS [  0.178 s]
16:07:04 [INFO] org.eclipse.papyrus.emf.facet.util.emf.catalog 1.2.0-SNAPSHOT SUCCESS [  0.168 s]
16:07:04 [INFO] org.eclipse.papyrus.emf.facet.util.core 1.2.0-SNAPSHOT SUCCESS [  0.168 s]
16:07:04 [INFO] org.eclipse.papyrus.emf.facet.common.sdk.core 1.2.0-SNAPSHOT SUCCESS [  0.210 s]
16:07:04 [INFO] org.eclipse.papyrus.emf.facet.common.ui 1.2.0-SNAPSHOT SUCCESS [  0.258 s]
16:07:04 [INFO] org.eclipse.papyrus.emf.facet.util.pde.core 1.2.0-SNAPSHOT SUCCESS [  0.185 s]
16:07:04 [INFO] org.eclipse.papyrus.emf.facet.util.emf.core 1.2.0-SNAPSHOT SUCCESS [  0.255 s]
16:07:04 [INFO] org.eclipse.papyrus.emf.facet.efacet.metamodel 1.3.100-SNAPSHOT SUCCESS [  0.466 s]
16:07:04 [INFO] org.eclipse.papyrus.emf.facet.custom.metamodel 1.4.100-SNAPSHOT SUCCESS [  0.337 s]
16:07:04 [INFO] org.eclipse.papyrus.emf.facet.efacet 1.2.100-SNAPSHOT SUCCESS [  0.223 s]
16:07:04 [INFO] org.eclipse.papyrus.emf.facet.efacet.catalog 1.2.0-SNAPSHOT SUCCESS [  0.175 s]
16:07:04 [INFO] org.eclipse.papyrus.emf.facet.util.ui 2.0.0-SNAPSHOT SUCCESS [  0.323 s]
16:07:04 [INFO] org.eclipse.papyrus.emf.facet.util.swt 1.2.0-SNAPSHOT SUCCESS [  0.167 s]
16:07:04 [INFO] org.eclipse.papyrus.emf.facet.util.emf.ui 2.0.0-SNAPSHOT SUCCESS [  0.401 s]
16:07:04 [INFO] org.eclipse.papyrus.emf.facet.efacet.core 2.0.0-SNAPSHOT SUCCESS [  0.454 s]
16:07:04 [INFO] org.eclipse.papyrus.emf.facet.custom.core 3.0.0-SNAPSHOT SUCCESS [  0.246 s]
16:07:04 [INFO] org.eclipse.papyrus.emf.facet.efacet.metamodel.edit 1.2.0-SNAPSHOT SUCCESS [  0.336 s]
16:07:04 [INFO] org.eclipse.papyrus.emf.facet.custom.metamodel.edit 1.3.0-SNAPSHOT SUCCESS [  0.152 s]
16:07:04 [INFO] org.eclipse.papyrus.emf.facet.query.java 1.2.0-SNAPSHOT SUCCESS [  0.126 s]
16:07:04 [INFO] Papyrus Infra 0.0.1-SNAPSHOT ....................... SUCCESS [  0.003 s]
16:07:04 [INFO] Papyrus Infra Core 0.0.1-SNAPSHOT .................. SUCCESS [  0.002 s]
16:07:04 [INFO] org.eclipse.papyrus.infra.core.log 1.2.0-SNAPSHOT .. SUCCESS [  0.077 s]
16:07:04 [INFO] org.eclipse.papyrus.infra.tools 3.2.100-SNAPSHOT ... SUCCESS [  0.400 s]
16:07:04 [INFO] org.eclipse.papyrus.emf.facet.query.java.metamodel 1.3.0-SNAPSHOT SUCCESS [  0.171 s]
16:07:04 [INFO] org.eclipse.papyrus.emf.facet.query.java.core 2.0.0-SNAPSHOT SUCCESS [  0.239 s]
16:07:04 [INFO] org.eclipse.papyrus.emf.facet.util.jface.ui 2.0.0-SNAPSHOT SUCCESS [  0.126 s]
16:07:04 [INFO] org.eclipse.papyrus.emf.facet.custom.ui 3.1.0-SNAPSHOT SUCCESS [  0.411 s]
16:07:04 [INFO] org.eclipse.papyrus.emf.facet.efacet.sdk.ui 2.0.0-SNAPSHOT SUCCESS [  0.522 s]
16:07:04 [INFO] org.eclipse.papyrus.emf.facet.custom.sdk.core 1.2.0-SNAPSHOT SUCCESS [  0.217 s]
16:07:04 [INFO] org.eclipse.papyrus.emf.facet.widgets 1.2.0-SNAPSHOT SUCCESS [  0.167 s]
16:07:04 [INFO] org.eclipse.papyrus.emf.facet.widgets.celleditors 1.2.0-SNAPSHOT SUCCESS [  0.384 s]
16:07:04 [INFO] org.eclipse.papyrus.emf.facet.efacet.ui 3.0.0-SNAPSHOT SUCCESS [  0.389 s]
16:07:04 [INFO] org.eclipse.papyrus.emf.facet.custom.sdk.ui 1.2.0-SNAPSHOT SUCCESS [  0.305 s]
16:07:04 [INFO] org.eclipse.papyrus.emf.facet.query.ocl.metamodel 1.2.0-SNAPSHOT SUCCESS [  0.145 s]
16:07:04 [INFO] org.eclipse.papyrus.emf.facet.custom.metamodel.editor 1.3.0-SNAPSHOT SUCCESS [  0.336 s]
16:07:04 [INFO] org.eclipse.papyrus.emf.facet.custom.metamodel.editor.doc 1.2.0-SNAPSHOT SUCCESS [  0.049 s]
16:07:04 [INFO] org.eclipse.papyrus.emf.facet.doc 1.2.0-SNAPSHOT ... SUCCESS [  0.122 s]
16:07:04 [INFO] org.eclipse.papyrus.emf.facet.aggregate.doc 1.2.0-SNAPSHOT SUCCESS [  0.029 s]
16:07:04 [INFO] org.eclipse.papyrus.emf.facet.efacet.doc 1.2.0-SNAPSHOT SUCCESS [  0.044 s]
16:07:04 [INFO] org.eclipse.papyrus.emf.facet.efacet.edit 1.2.0-SNAPSHOT SUCCESS [  0.187 s]
16:07:04 [INFO] org.eclipse.papyrus.emf.facet.efacet.editor 1.2.0-SNAPSHOT SUCCESS [  0.180 s]
16:07:04 [INFO] org.eclipse.papyrus.emf.facet.query.java.sdk.ui 1.2.0-SNAPSHOT SUCCESS [  0.301 s]
16:07:04 [INFO] org.eclipse.papyrus.emf.facet.query.ocl.core 1.2.0-SNAPSHOT SUCCESS [  0.155 s]
16:07:04 [INFO] org.eclipse.papyrus.emf.facet.query.ocl.sdk.ui 2.0.0-SNAPSHOT SUCCESS [  0.183 s]
16:07:04 [INFO] org.eclipse.papyrus.emf.facet.util.emf.doc 1.2.0-SNAPSHOT SUCCESS [  0.033 s]
16:07:04 [INFO] org.eclipse.papyrus.emf.facet.widgets.celleditors.ecore 1.2.0-SNAPSHOT SUCCESS [  0.207 s]
16:07:04 [INFO] Papyrus Infra Architecture 0.0.1-SNAPSHOT .......... SUCCESS [  0.002 s]
16:07:04 [INFO] Papyrus Infra Element Types Configurations 0.0.1-SNAPSHOT SUCCESS [  0.002 s]
16:07:04 [INFO] org.eclipse.papyrus.infra.types 4.0.100-SNAPSHOT ... SUCCESS [  0.233 s]
16:07:04 [INFO] org.eclipse.papyrus.infra.core.architecture 2.1.100-SNAPSHOT SUCCESS [  0.170 s]
16:07:04 [INFO] org.eclipse.papyrus.infra.core.sashwindows.di 1.4.100-SNAPSHOT SUCCESS [  0.181 s]
16:07:04 [INFO] org.eclipse.papyrus.infra.core 3.1.100-SNAPSHOT .... SUCCESS [  0.531 s]
16:07:04 [INFO] Papyrus EMF Infrastructure 0.0.1-SNAPSHOT .......... SUCCESS [  0.005 s]
16:07:04 [INFO] org.eclipse.papyrus.infra.emf 3.1.0-SNAPSHOT ....... SUCCESS [  0.716 s]
16:07:04 [INFO] Papyrus Infra Services 0.0.1-SNAPSHOT .............. SUCCESS [  0.002 s]
16:07:04 [INFO] org.eclipse.papyrus.infra.services.markerlistener 2.0.0-SNAPSHOT SUCCESS [  0.212 s]
16:07:04 [INFO] org.eclipse.papyrus.infra.services.edit 3.2.0-SNAPSHOT SUCCESS [  0.230 s]
16:07:04 [INFO] org.eclipse.papyrus.infra.architecture 2.1.0-SNAPSHOT SUCCESS [  0.289 s]
16:07:04 [INFO] Papyrus Infra Constraints 0.0.1-SNAPSHOT ........... SUCCESS [  0.002 s]
16:07:04 [INFO] org.eclipse.papyrus.infra.constraints 2.0.0-SNAPSHOT SUCCESS [  0.301 s]
16:07:04 [INFO] org.eclipse.papyrus.infra.architecture.representation 2.1.100-SNAPSHOT SUCCESS [  0.216 s]
16:07:04 [INFO] org.eclipse.papyrus.infra.types.edit 4.0.0-SNAPSHOT  SUCCESS [  0.134 s]
16:07:04 [INFO] org.eclipse.papyrus.infra.core.architecture.edit 2.1.0-SNAPSHOT SUCCESS [  0.139 s]
16:07:04 [INFO] org.eclipse.papyrus.infra.constraints.edit 2.0.0-SNAPSHOT SUCCESS [  0.210 s]
16:07:04 [INFO] org.eclipse.papyrus.infra.architecture.representation.edit 1.2.0-SNAPSHOT SUCCESS [  0.189 s]
16:07:04 [INFO] org.eclipse.papyrus.infra.core.sasheditor 2.2.0-SNAPSHOT SUCCESS [  7.310 s]
16:07:04 [INFO] org.eclipse.papyrus.infra.core.sasheditor.di 2.1.0-SNAPSHOT SUCCESS [  0.535 s]
16:07:04 [INFO] Papyrus Infra One-file 0.0.1-SNAPSHOT .............. SUCCESS [  0.004 s]
16:07:04 [INFO] Papyrus EMF Expressions Infrastructure 0.0.1-SNAPSHOT SUCCESS [  0.003 s]
16:07:04 [INFO] org.eclipse.papyrus.infra.emf.expressions 1.1.100-SNAPSHOT SUCCESS [  0.241 s]
16:07:04 [INFO] org.eclipse.papyrus.infra.emf.gmf 1.3.0-SNAPSHOT ... SUCCESS [  0.303 s]
16:07:04 [INFO] Papyrus Nattable 0.0.1-SNAPSHOT .................... SUCCESS [  0.003 s]
16:07:04 [INFO] org.eclipse.papyrus.infra.nattable.model 4.2.100-SNAPSHOT SUCCESS [  0.534 s]
16:07:04 [INFO] org.eclipse.papyrus.infra.services.labelprovider 2.0.0-SNAPSHOT SUCCESS [  0.147 s]
16:07:04 [INFO] Papyrus Infra UI 0.0.1-SNAPSHOT .................... SUCCESS [  0.003 s]
16:07:04 [INFO] org.eclipse.papyrus.infra.widgets 3.6.0-SNAPSHOT ... SUCCESS [  0.874 s]
16:07:04 [INFO] org.eclipse.papyrus.infra.widgets.toolbox 2.0.0-SNAPSHOT SUCCESS [  0.216 s]
16:07:04 [INFO] org.eclipse.papyrus.infra.ui 2.1.0-SNAPSHOT ........ SUCCESS [  0.689 s]
16:07:04 [INFO] Papyrus Internationalization 0.0.1-SNAPSHOT ........ SUCCESS [  0.002 s]
16:07:04 [INFO] org.eclipse.papyrus.infra.internationalization.common 1.100.0-SNAPSHOT SUCCESS [  0.224 s]
16:07:04 [INFO] org.eclipse.papyrus.infra.internationalization 1.2.100-SNAPSHOT SUCCESS [  0.310 s]
16:07:04 [INFO] org.eclipse.papyrus.infra.onefile 2.2.0-SNAPSHOT ... SUCCESS [  0.187 s]
16:07:04 [INFO] org.eclipse.papyrus.infra.constraints.editor 2.0.0-SNAPSHOT SUCCESS [  0.356 s]
16:07:04 [INFO] org.eclipse.papyrus.infra.constraints.ui 2.0.0-SNAPSHOT SUCCESS [  0.157 s]
16:07:04 [INFO] Papyrus Editor Welcome Page 0.0.1-SNAPSHOT ......... SUCCESS [  0.002 s]
16:07:04 [INFO] org.eclipse.papyrus.infra.emf.readonly 3.1.0-SNAPSHOT SUCCESS [  0.265 s]
16:07:04 [INFO] org.eclipse.papyrus.infra.internationalization.utils 1.0.100-SNAPSHOT SUCCESS [  0.201 s]
16:07:04 [INFO] Papyrus Infra Properties Framework 0.0.1-SNAPSHOT .. SUCCESS [  0.003 s]
16:07:04 [INFO] org.eclipse.papyrus.infra.properties 3.0.0-SNAPSHOT  SUCCESS [  0.353 s]
16:07:04 [INFO] org.eclipse.papyrus.infra.ui.emf 2.2.100-SNAPSHOT .. SUCCESS [  0.407 s]
16:07:04 [INFO] org.eclipse.papyrus.infra.properties.ui 3.4.0-SNAPSHOT SUCCESS [  0.540 s]
16:07:04 [INFO] org.eclipse.papyrus.infra.editor.welcome 2.0.200-SNAPSHOT SUCCESS [  0.513 s]
16:07:04 [INFO] org.eclipse.papyrus.infra.services.navigation 3.0.0-SNAPSHOT SUCCESS [  0.203 s]
16:07:04 [INFO] org.eclipse.papyrus.infra.editor.welcome.nattable 3.0.0-SNAPSHOT SUCCESS [  0.274 s]
16:07:04 [INFO] org.eclipse.papyrus.infra.emf.appearance 2.0.0-SNAPSHOT SUCCESS [  0.144 s]
16:07:04 [INFO] org.eclipse.papyrus.infra.emf.diagram.common 2.0.100-SNAPSHOT SUCCESS [  0.144 s]
16:07:04 [INFO] org.eclipse.papyrus.infra.types.core 4.1.0-SNAPSHOT  SUCCESS [  0.256 s]
16:07:04 [INFO] org.eclipse.papyrus.infra.types.rulebased 4.0.0-SNAPSHOT SUCCESS [  0.238 s]
16:07:04 [INFO] org.eclipse.papyrus.infra.properties.edit 3.0.0-SNAPSHOT SUCCESS [  0.234 s]
16:07:04 [INFO] org.eclipse.papyrus.infra.emf.types 4.1.0-SNAPSHOT . SUCCESS [  0.322 s]
16:07:04 [INFO] org.eclipse.papyrus.infra.emf.types.ui 4.1.0-SNAPSHOT SUCCESS [  0.242 s]
16:07:04 [INFO] org.eclipse.papyrus.infra.emf.expressions.edit 1.1.0-SNAPSHOT SUCCESS [  0.133 s]
16:07:04 [INFO] org.eclipse.papyrus.infra.emf.expressions.editor 1.1.0-SNAPSHOT SUCCESS [  0.258 s]
16:07:04 [INFO] org.eclipse.papyrus.infra.emf.expressions.properties 1.0.100-SNAPSHOT SUCCESS [  0.307 s]
16:07:04 [INFO] Papyrus Infra Filters Model 0.0.1-SNAPSHOT ......... SUCCESS [  0.003 s]
16:07:04 [INFO] org.eclipse.papyrus.infra.filters 1.3.100-SNAPSHOT . SUCCESS [  0.164 s]
16:07:04 [INFO] org.eclipse.papyrus.infra.filters.edit 1.4.0-SNAPSHOT SUCCESS [  0.100 s]
16:07:04 [INFO] org.eclipse.papyrus.infra.properties.editor 3.0.0-SNAPSHOT SUCCESS [  0.309 s]
16:07:04 [INFO] org.eclipse.papyrus.infra.services.architecture 1.0.100-SNAPSHOT SUCCESS [  0.153 s]
16:07:04 [INFO] org.eclipse.papyrus.infra.services.controlmode 2.1.0-SNAPSHOT SUCCESS [  0.377 s]
16:07:04 [INFO] org.eclipse.papyrus.infra.services.controlmode.history 2.0.0-SNAPSHOT SUCCESS [  0.134 s]
16:07:04 [INFO] org.eclipse.papyrus.infra.services.decoration 2.0.0-SNAPSHOT SUCCESS [  0.170 s]
16:07:04 [INFO] org.eclipse.papyrus.infra.services.edit.ui 3.0.0-SNAPSHOT SUCCESS [  0.193 s]
16:07:04 [INFO] org.eclipse.papyrus.infra.services.localizer 2.1.0-SNAPSHOT SUCCESS [  0.164 s]
16:07:04 [INFO] org.eclipse.papyrus.infra.services.openelement 3.0.0-SNAPSHOT SUCCESS [  0.186 s]
16:07:04 [INFO] org.eclipse.papyrus.infra.services.resourceloading 3.0.0-SNAPSHOT SUCCESS [  0.228 s]
16:07:04 [INFO] org.eclipse.papyrus.infra.services.resourceloading.ui 1.2.200-SNAPSHOT SUCCESS [  0.256 s]
16:07:04 [INFO] org.eclipse.papyrus.infra.services.semantic 2.0.0-SNAPSHOT SUCCESS [  0.131 s]
16:07:04 [INFO] org.eclipse.papyrus.infra.services.validation 3.1.100-SNAPSHOT SUCCESS [  0.238 s]
16:07:04 [INFO] org.eclipse.papyrus.infra.services.viewersearch 3.0.0-SNAPSHOT SUCCESS [  0.087 s]
16:07:04 [INFO] org.eclipse.papyrus.infra.services.viewlabelprovider 1.2.200-SNAPSHOT SUCCESS [  0.124 s]
16:07:04 [INFO] Papyrus Infra New-Child Model 0.0.1-SNAPSHOT ....... SUCCESS [  0.003 s]
16:07:04 [INFO] Papyrus Views 0.0.1-SNAPSHOT ....................... SUCCESS [  0.003 s]
16:07:04 [INFO] Papyrus Properties View 0.0.1-SNAPSHOT ............. SUCCESS [  0.002 s]
16:07:04 [INFO] org.eclipse.papyrus.views.properties 4.0.0-SNAPSHOT  SUCCESS [  0.295 s]
16:07:04 [INFO] Papyrus Diagram Infrastructure 0.0.1-SNAPSHOT ...... SUCCESS [  0.001 s]
16:07:04 [INFO] Papyrus UML Diagram PaletteConfiguration 0.0.1-SNAPSHOT SUCCESS [  0.002 s]
16:07:04 [INFO] org.eclipse.papyrus.infra.gmfdiag.paletteconfiguration 4.0.100-SNAPSHOT SUCCESS [  0.304 s]
16:07:04 [INFO] org.eclipse.papyrus.infra.gmfdiag.representation 2.1.0-SNAPSHOT SUCCESS [  0.267 s]
16:07:04 [INFO] org.eclipse.papyrus.infra.nattable.representation 2.2.0-SNAPSHOT SUCCESS [  0.160 s]
16:07:04 [INFO] Papyrus Infra Viewpoints 0.0.1-SNAPSHOT ............ SUCCESS [  0.003 s]
16:07:04 [INFO] org.eclipse.papyrus.infra.viewpoints.policy 3.2.100-SNAPSHOT SUCCESS [  0.405 s]
16:07:04 [INFO] org.eclipse.papyrus.infra.gmfdiag.commands 3.0.0-SNAPSHOT SUCCESS [  0.329 s]
16:07:04 [INFO] org.eclipse.papyrus.infra.newchild 4.1.100-SNAPSHOT  SUCCESS [  0.312 s]
16:07:04 [INFO] org.eclipse.papyrus.infra.newchild.edit 4.1.0-SNAPSHOT SUCCESS [  0.228 s]
16:07:04 [INFO] org.eclipse.papyrus.infra.newchild.editor 3.1.0-SNAPSHOT SUCCESS [  0.339 s]
16:07:04 [INFO] org.eclipse.papyrus.infra.types.editor 3.1.0-SNAPSHOT SUCCESS [  0.158 s]
16:07:04 [INFO] org.eclipse.papyrus.infra.types.ui 3.0.100-SNAPSHOT  SUCCESS [  0.194 s]
16:07:04 [INFO] Papyrus Editor 0.0.1-SNAPSHOT ...................... SUCCESS [  0.003 s]
16:07:04 [INFO] org.eclipse.papyrus.editor 2.0.0-SNAPSHOT .......... SUCCESS [  0.198 s]
16:07:04 [INFO] org.eclipse.papyrus.infra.nattable 6.7.0-SNAPSHOT .. SUCCESS [  1.517 s]
16:07:04 [INFO] org.eclipse.papyrus.infra.emf.nattable 5.2.0-SNAPSHOT SUCCESS [  0.450 s]
16:07:04 [INFO] org.eclipse.papyrus.infra.nattable.common 5.5.100-SNAPSHOT SUCCESS [  0.465 s]
16:07:04 [INFO] org.eclipse.papyrus.infra.nattable.controlmode 2.1.0-SNAPSHOT SUCCESS [  0.287 s]
16:07:04 [INFO] org.eclipse.papyrus.infra.nattable.model.edit 4.1.0-SNAPSHOT SUCCESS [  0.346 s]
16:07:04 [INFO] org.eclipse.papyrus.infra.nattable.model.editor 5.0.0-SNAPSHOT SUCCESS [  0.554 s]
16:07:04 [INFO] org.eclipse.papyrus.infra.gmfdiag.tooling.runtime 3.1.0-SNAPSHOT SUCCESS [  0.575 s]
16:07:04 [INFO] Papyrus Infra Other Bundles 0.0.1-SNAPSHOT ......... SUCCESS [  0.003 s]
16:07:04 [INFO] org.eclipse.papyrus.infra.sync 2.1.100-SNAPSHOT .... SUCCESS [  0.355 s]
16:07:04 [INFO] org.eclipse.papyrus.infra.gmfdiag.style 2.0.0-SNAPSHOT SUCCESS [  0.263 s]
16:07:04 [INFO] org.eclipse.papyrus.infra.gmfdiag.common 3.104.200-SNAPSHOT SUCCESS [  1.602 s]
16:07:04 [INFO] org.eclipse.papyrus.infra.gmfdiag.extensionpoints.editors 1.0.0-SNAPSHOT SUCCESS [  0.272 s]
16:07:04 [INFO] Papyrus Model Explorer View 0.0.1-SNAPSHOT ......... SUCCESS [  0.003 s]
16:07:04 [INFO] org.eclipse.papyrus.views.modelexplorer 3.1.0-SNAPSHOT SUCCESS [ 11.987 s]
16:07:04 [INFO] org.eclipse.papyrus.infra.nattable.modelexplorer 4.1.0-SNAPSHOT SUCCESS [  0.794 s]
16:07:04 [INFO] org.eclipse.papyrus.infra.nattable.properties 2.5.0-SNAPSHOT SUCCESS [  0.574 s]
16:07:04 [INFO] org.eclipse.papyrus.infra.nattable.views.config 5.0.0-SNAPSHOT SUCCESS [  0.290 s]
16:07:04 [INFO] org.eclipse.papyrus.infra.nattable.views.editor 1.2.100-SNAPSHOT SUCCESS [  0.066 s]
16:07:04 [INFO] org.eclipse.papyrus.infra.nattable.representation.edit 2.2.0-SNAPSHOT SUCCESS [  0.175 s]
16:07:04 [INFO] org.eclipse.papyrus.infra.nattable.gmfdiag 1.2.100-SNAPSHOT SUCCESS [  0.276 s]
16:07:04 [INFO] org.eclipse.papyrus.infra.ui.fonts 1.0.0-SNAPSHOT .. SUCCESS [  0.144 s]
16:07:04 [INFO] org.eclipse.papyrus.infra.ui.architecture 2.1.0-SNAPSHOT SUCCESS [  0.651 s]
16:07:04 [INFO] org.eclipse.papyrus.infra.ui.resources 1.3.0-SNAPSHOT SUCCESS [  0.294 s]
16:07:04 [INFO] org.eclipse.papyrus.infra.onefile.ui 1.2.0-SNAPSHOT  SUCCESS [  0.353 s]
16:07:04 [INFO] org.eclipse.papyrus.infra.newchild.ui 2.0.100-SNAPSHOT SUCCESS [  0.321 s]
16:07:04 [INFO] org.eclipse.papyrus.infra.hyperlink 3.0.0-SNAPSHOT . SUCCESS [  0.370 s]
16:07:04 [INFO] org.eclipse.papyrus.infra.psf 1.2.0-SNAPSHOT ....... SUCCESS [  0.187 s]
16:07:04 [INFO] org.eclipse.papyrus.infra.internationalization.edit 1.0.0-SNAPSHOT SUCCESS [  0.227 s]
16:07:04 [INFO] org.eclipse.papyrus.infra.internationalization.ui 1.0.0-SNAPSHOT SUCCESS [  0.461 s]
16:07:04 [INFO] org.eclipse.papyrus.infra.internationalization.controlmode 1.0.100-SNAPSHOT SUCCESS [  0.345 s]
16:07:04 [INFO] org.eclipse.papyrus.infra.internationalization.readonly 1.1.0-SNAPSHOT SUCCESS [  0.245 s]
16:07:04 [INFO] org.eclipse.papyrus.infra.editor.welcome.internationalization 2.0.0-SNAPSHOT SUCCESS [  0.481 s]
16:07:04 [INFO] org.eclipse.papyrus.extensionpoints.editors 3.1.0-SNAPSHOT SUCCESS [  0.278 s]
16:07:04 [INFO] org.eclipse.papyrus.infra.gmfdiag.canonical 2.1.100-SNAPSHOT SUCCESS [  0.458 s]
16:07:04 [INFO] org.eclipse.papyrus.infra.gmfdiag.controlmode 1.2.0-SNAPSHOT SUCCESS [  0.294 s]
16:07:04 [INFO] org.eclipse.papyrus.infra.gmfdiag.css.model 1.3.100-SNAPSHOT SUCCESS [  0.161 s]
16:07:04 [INFO] org.eclipse.papyrus.infra.gmfdiag.css.model.edit 1.3.0-SNAPSHOT SUCCESS [  0.136 s]
16:07:04 [INFO] Papyrus Diagram Expansion 0.0.1-SNAPSHOT ........... SUCCESS [  0.002 s]
16:07:04 [INFO] org.eclipse.papyrus.infra.gmfdiag.expansion 3.0.100-SNAPSHOT SUCCESS [  0.436 s]
16:07:04 [INFO] org.eclipse.papyrus.infra.gmfdiag.dnd 1.4.0-SNAPSHOT SUCCESS [  0.432 s]
16:07:04 [INFO] Papyrus Diagram CSS Support 0.0.1-SNAPSHOT ......... SUCCESS [  0.003 s]
16:07:04 [INFO] org.eclipse.papyrus.infra.gmfdiag.css 2.4.0-SNAPSHOT SUCCESS [  0.677 s]
16:07:04 [INFO] org.eclipse.papyrus.infra.gmfdiag.export 2.1.0-SNAPSHOT SUCCESS [  0.397 s]
16:07:04 [INFO] org.eclipse.papyrus.infra.gmfdiag.gef 1.2.0-SNAPSHOT SUCCESS [  0.212 s]
16:07:04 [INFO] org.eclipse.papyrus.infra.gmfdiag.gmfmenu.filter 1.2.0-SNAPSHOT SUCCESS [  0.268 s]
16:07:04 [INFO] org.eclipse.papyrus.infra.gmfdiag.preferences 3.0.0-SNAPSHOT SUCCESS [  0.503 s]
16:07:04 [INFO] org.eclipse.papyrus.infra.gmfdiag.navigation 2.0.0-SNAPSHOT SUCCESS [  0.383 s]
16:07:04 [INFO] org.eclipse.papyrus.infra.gmfdiag.hyperlink 3.0.100-SNAPSHOT SUCCESS [  0.433 s]
16:07:04 [INFO] org.eclipse.papyrus.infra.gmfdiag.menu 1.3.0-SNAPSHOT SUCCESS [  0.417 s]
16:07:04 [INFO] org.eclipse.papyrus.infra.gmfdiag.modelexplorer 1.3.100-SNAPSHOT SUCCESS [  0.375 s]
16:07:04 [INFO] org.eclipse.papyrus.infra.gmfdiag.outline 2.0.0-SNAPSHOT SUCCESS [  0.295 s]
16:07:04 [INFO] org.eclipse.papyrus.infra.gmfdiag.properties 4.1.200-SNAPSHOT SUCCESS [  0.462 s]
16:07:04 [INFO] org.eclipse.papyrus.views.search 2.0.0-SNAPSHOT .... SUCCESS [  0.187 s]
16:07:04 [INFO] org.eclipse.papyrus.infra.gmfdiag.viewersearcher 1.2.0-SNAPSHOT SUCCESS [  0.240 s]
16:07:04 [INFO] org.eclipse.papyrus.infra.gmfdiag.welcome 1.2.100-SNAPSHOT SUCCESS [  0.351 s]
16:07:04 [INFO] org.eclipse.papyrus.infra.gmfdiag.widgets 1.2.0-SNAPSHOT SUCCESS [  0.263 s]
16:07:04 [INFO] org.eclipse.papyrus.infra.gmfdiag.paletteconfiguration.edit 4.0.0-SNAPSHOT SUCCESS [  0.392 s]
16:07:04 [INFO] org.eclipse.papyrus.infra.gmfdiag.representation.edit 2.1.0-SNAPSHOT SUCCESS [  0.343 s]
16:07:04 [INFO] org.eclipse.papyrus.infra.gmfdiag.style.edit 2.0.0-SNAPSHOT SUCCESS [  0.296 s]
16:07:04 [INFO] Papyrus Diagram Assistants 0.0.1-SNAPSHOT .......... SUCCESS [  0.002 s]
16:07:04 [INFO] org.eclipse.papyrus.infra.gmfdiag.assistant 1.5.100-SNAPSHOT SUCCESS [  0.601 s]
16:07:04 [INFO] org.eclipse.papyrus.infra.gmfdiag.assistant.edit 1.3.0-SNAPSHOT SUCCESS [  0.370 s]
16:07:04 [INFO] org.eclipse.papyrus.infra.gmfdiag.assistant.editor 1.3.0-SNAPSHOT SUCCESS [  0.347 s]
16:07:04 [INFO] org.eclipse.papyrus.infra.gmfdiag.assistant.ui 1.3.0-SNAPSHOT SUCCESS [  0.273 s]
16:07:04 [INFO] org.eclipse.papyrus.infra.gmfdiag.css.properties 3.1.100-SNAPSHOT SUCCESS [  0.483 s]
16:07:04 [INFO] org.eclipse.papyrus.infra.gmfdiag.css3.xtext 3.0.0-SNAPSHOT SUCCESS [01:37 min]
16:07:04 [INFO] org.eclipse.papyrus.infra.gmfdiag.css.configuration 2.0.0-SNAPSHOT SUCCESS [  0.472 s]
16:07:04 [INFO] org.eclipse.papyrus.infra.gmfdiag.css.theme 1.2.0-SNAPSHOT SUCCESS [  0.089 s]
16:07:04 [INFO] org.eclipse.papyrus.infra.gmfdiag.css3.xtext.ui 3.0.0-SNAPSHOT SUCCESS [  2.230 s]
16:07:04 [INFO] org.eclipse.papyrus.views.modelexplorer.newchild 1.2.100-SNAPSHOT SUCCESS [  0.371 s]
16:07:04 [INFO] org.eclipse.papyrus.views.modelexplorer.resourceloading 2.0.0-SNAPSHOT SUCCESS [  0.284 s]
16:07:04 [INFO] org.eclipse.papyrus.views.modelexplorer.widgets 2.0.100-SNAPSHOT SUCCESS [  0.303 s]
16:07:04 [INFO] org.eclipse.papyrus.views.properties.model.xwt 2.0.0-SNAPSHOT SUCCESS [  0.280 s]
16:07:04 [INFO] Papyrus Validation View 0.0.1-SNAPSHOT ............. SUCCESS [  0.003 s]
16:07:04 [INFO] org.eclipse.papyrus.views.validation 2.1.0-SNAPSHOT  SUCCESS [  0.323 s]
16:07:04 [INFO] Papyrus References View 0.0.1-SNAPSHOT ............. SUCCESS [  0.003 s]
16:07:04 [INFO] org.eclipse.papyrus.views.references 2.0.0-SNAPSHOT  SUCCESS [  0.225 s]
16:07:04 [INFO] Papyrus Documentation View 0.0.1-SNAPSHOT .......... SUCCESS [  0.004 s]
16:07:04 [INFO] Papyrus UML 0.0.1-SNAPSHOT ......................... SUCCESS [  0.001 s]
16:07:04 [INFO] org.eclipse.papyrus.uml.appearance 2.0.0-SNAPSHOT .. SUCCESS [  0.145 s]
16:07:04 [INFO] Papyrus UML Internationalization 0.0.1-SNAPSHOT .... SUCCESS [  0.002 s]
16:07:04 [INFO] org.eclipse.papyrus.uml.internationalization.utils 1.0.0-SNAPSHOT SUCCESS [  0.187 s]
16:07:04 [INFO] Papyrus UML Tools 0.0.1-SNAPSHOT ................... SUCCESS [  0.002 s]
16:07:04 [INFO] org.eclipse.papyrus.uml.tools.utils 3.5.100-SNAPSHOT SUCCESS [  0.405 s]
16:07:04 [INFO] org.eclipse.papyrus.uml.extensionpoints 1.3.0-SNAPSHOT SUCCESS [  0.237 s]
16:07:04 [INFO] org.eclipse.papyrus.uml.internationalization.edit 1.100.100-SNAPSHOT SUCCESS [  0.471 s]
16:07:04 [INFO] org.eclipse.papyrus.uml.tools 4.3.0-SNAPSHOT ....... SUCCESS [  0.826 s]
16:07:04 [INFO] Papyrus UML Diagrams 0.0.1-SNAPSHOT ................ SUCCESS [  0.003 s]
16:07:04 [INFO] org.eclipse.papyrus.uml.diagram.wizards 3.2.100-SNAPSHOT SUCCESS [  0.672 s]
16:07:04 [INFO] org.eclipse.papyrus.uml.diagram.navigation 2.0.0-SNAPSHOT SUCCESS [  0.505 s]
16:07:04 [INFO] org.eclipse.papyrus.uml.modelrepair 2.1.0-SNAPSHOT . SUCCESS [  0.637 s]
16:07:04 [INFO] org.eclipse.papyrus.uml.profile 3.2.0-SNAPSHOT ..... SUCCESS [  0.631 s]
16:07:04 [INFO] org.eclipse.papyrus.uml.diagram.common 3.4.200-SNAPSHOT SUCCESS [  2.690 s]
16:07:04 [INFO] org.eclipse.papyrus.uml.documentation.profile 1.3.0-SNAPSHOT SUCCESS [  0.343 s]
16:07:04 [INFO] org.eclipse.papyrus.uml.types.core 4.1.0-SNAPSHOT .. SUCCESS [  0.868 s]
16:07:04 [INFO] org.eclipse.papyrus.uml.ui 1.3.100-SNAPSHOT ........ SUCCESS [  0.454 s]
16:07:04 [INFO] org.eclipse.papyrus.views.documentation 1.0.100-SNAPSHOT SUCCESS [  0.729 s]
16:07:04 [INFO] org.eclipse.papyrus.eclipse.project.editors 2.1.0-SNAPSHOT SUCCESS [  0.325 s]
16:07:04 [INFO] org.eclipse.papyrus.editor.perspectiveconfiguration 1.2.0-SNAPSHOT SUCCESS [  0.152 s]
16:07:04 [INFO] org.eclipse.papyrus.uml.commands 1.3.100-SNAPSHOT .. SUCCESS [  0.407 s]
16:07:04 [INFO] org.eclipse.papyrus.uml.controlmode.profile 2.1.0-SNAPSHOT SUCCESS [  0.471 s]
16:07:04 [INFO] org.eclipse.papyrus.uml.filters 1.4.100-SNAPSHOT ... SUCCESS [  0.207 s]
16:07:04 [INFO] org.eclipse.papyrus.uml.filters.edit 1.3.0-SNAPSHOT  SUCCESS [  0.133 s]
16:07:04 [INFO] org.eclipse.papyrus.uml.icons 1.2.0-SNAPSHOT ....... SUCCESS [  0.134 s]
16:07:04 [INFO] org.eclipse.papyrus.uml.import 1.2.0-SNAPSHOT ...... SUCCESS [  0.355 s]
16:07:04 [INFO] org.eclipse.papyrus.uml.export 1.0.0-SNAPSHOT ...... SUCCESS [  0.584 s]
16:07:04 [INFO] org.eclipse.papyrus.uml.navigation 1.2.0-SNAPSHOT .. SUCCESS [  0.318 s]
16:07:04 [INFO] org.eclipse.papyrus.uml.oclconstraintevaluation 1.2.0-SNAPSHOT SUCCESS [  0.259 s]
16:07:04 [INFO] org.eclipse.papyrus.uml.perspective 1.2.0-SNAPSHOT . SUCCESS [  0.244 s]
16:07:04 [INFO] org.eclipse.papyrus.uml.resourceloading.profile 1.2.100-SNAPSHOT SUCCESS [  0.397 s]
16:07:04 [INFO] org.eclipse.papyrus.uml.search.ui 2.0.200-SNAPSHOT . SUCCESS [  0.690 s]
16:07:04 [INFO] org.eclipse.papyrus.uml.service.types 4.3.100-SNAPSHOT SUCCESS [  0.946 s]
16:07:04 [INFO] org.eclipse.papyrus.uml.service.types.ui 2.1.0-SNAPSHOT SUCCESS [  0.573 s]
16:07:04 [INFO] org.eclipse.papyrus.uml.service.validation 2.1.1-SNAPSHOT SUCCESS [  0.314 s]
16:07:04 [INFO] org.eclipse.papyrus.uml.services.decoration 1.2.0-SNAPSHOT SUCCESS [  0.200 s]
16:07:04 [INFO] org.eclipse.papyrus.uml.templaterepository 2.0.100-SNAPSHOT SUCCESS [  0.360 s]
16:07:04 [INFO] Papyrus UML ALF 0.0.1-SNAPSHOT ..................... SUCCESS [  0.002 s]
16:07:04 [INFO] org.eclipse.papyrus.uml.alf.libraries 2.0.100-SNAPSHOT SUCCESS [  0.365 s]
16:07:04 [INFO] org.eclipse.papyrus.uml.alf 3.0.0-SNAPSHOT ......... SUCCESS [ 12.852 s]
16:07:04 [INFO] org.eclipse.papyrus.uml.alf.common 2.0.0-SNAPSHOT .. SUCCESS [  0.406 s]
16:07:04 [INFO] org.eclipse.papyrus.uml.alf.common.ui 2.0.0-SNAPSHOT SUCCESS [  0.319 s]
16:07:04 [INFO] org.eclipse.papyrus.uml.alf.to.fuml 1.2.0-SNAPSHOT . SUCCESS [  0.358 s]
16:07:04 [INFO] Papyrus UML Xtext Integration 0.0.1-SNAPSHOT ....... SUCCESS [  0.003 s]
16:07:04 [INFO] org.eclipse.papyrus.uml.xtext.integration.core 2.1.0-SNAPSHOT SUCCESS [  0.090 s]
16:07:04 [INFO] org.eclipse.papyrus.uml.xtext.integration.ui 2.2.0-SNAPSHOT SUCCESS [  0.722 s]
16:07:04 [INFO] org.eclipse.papyrus.uml.alf.ui 3.0.100-SNAPSHOT .... SUCCESS [  4.479 s]
16:07:04 [INFO] Papyrus UML Architecture 0.0.1-SNAPSHOT ............ SUCCESS [  0.004 s]
16:07:04 [INFO] org.eclipse.papyrus.uml.diagram.activity 3.5.100-SNAPSHOT SUCCESS [  9.880 s]
16:07:04 [INFO] org.eclipse.papyrus.uml.diagram.clazz 3.2.0-SNAPSHOT SUCCESS [  7.317 s]
16:07:04 [INFO] org.eclipse.papyrus.uml.diagram.communication 4.1.0-SNAPSHOT SUCCESS [  1.358 s]
16:07:04 [INFO] org.eclipse.papyrus.uml.diagram.menu 2.0.100-SNAPSHOT SUCCESS [  0.862 s]
16:07:04 [INFO] org.eclipse.papyrus.uml.diagram.component 3.2.0-SNAPSHOT SUCCESS [  1.377 s]
16:07:04 [INFO] org.eclipse.papyrus.uml.diagram.composite 3.2.0-SNAPSHOT SUCCESS [  3.065 s]
16:07:04 [INFO] org.eclipse.papyrus.uml.diagram.deployment 3.2.0-SNAPSHOT SUCCESS [  1.380 s]
16:07:04 [INFO] org.eclipse.papyrus.uml.diagram.stereotype.edition 2.0.200-SNAPSHOT SUCCESS [  0.792 s]
16:07:04 [INFO] org.eclipse.papyrus.uml.diagram.modelexplorer 1.2.100-SNAPSHOT SUCCESS [  0.442 s]
16:07:04 [INFO] org.eclipse.papyrus.uml.diagram.interactionoverview 3.1.0-SNAPSHOT SUCCESS [  0.730 s]
16:07:04 [INFO] org.eclipse.papyrus.uml.diagram.profile 3.2.0-SNAPSHOT SUCCESS [  2.211 s]
16:07:04 [INFO] org.eclipse.papyrus.uml.diagram.sequence 5.3.100-SNAPSHOT SUCCESS [  2.885 s]
16:07:04 [INFO] org.eclipse.papyrus.uml.diagram.statemachine 3.2.200-SNAPSHOT SUCCESS [  1.732 s]
16:07:04 [INFO] org.eclipse.papyrus.uml.diagram.timing 1.4.200-SNAPSHOT SUCCESS [  1.621 s]
16:07:04 [INFO] org.eclipse.papyrus.uml.diagram.usecase 4.0.300-SNAPSHOT SUCCESS [  1.891 s]
16:07:04 [INFO] Papyrus UML Nattable 0.0.1-SNAPSHOT ................ SUCCESS [  0.004 s]
16:07:04 [INFO] org.eclipse.papyrus.uml.nattable 5.4.0-SNAPSHOT .... SUCCESS [  0.661 s]
16:07:04 [INFO] org.eclipse.papyrus.uml.nattable.clazz.config 5.0.0-SNAPSHOT SUCCESS [  0.392 s]
16:07:04 [INFO] org.eclipse.papyrus.uml.nattable.generic.config 1.2.100-SNAPSHOT SUCCESS [  0.448 s]
16:07:04 [INFO] org.eclipse.papyrus.uml.architecture 1.1.400-SNAPSHOT SUCCESS [  0.993 s]
16:07:04 [INFO] Papyrus UML Decorator Models 0.0.1-SNAPSHOT ........ SUCCESS [  0.004 s]
16:07:04 [INFO] org.eclipse.papyrus.uml.decoratormodel 2.3.100-SNAPSHOT SUCCESS [  0.835 s]
16:07:04 [INFO] org.eclipse.papyrus.uml.decoratormodel.controlmode 1.3.0-SNAPSHOT SUCCESS [  0.540 s]
16:07:04 [INFO] org.eclipse.papyrus.uml.nattable.stereotype.display 3.0.200-SNAPSHOT SUCCESS [  0.652 s]
16:07:04 [INFO] Papyrus UML Properties 0.0.1-SNAPSHOT .............. SUCCESS [  0.002 s]
16:07:04 [INFO] org.eclipse.papyrus.uml.properties 3.5.100-SNAPSHOT  SUCCESS [  5.913 s]
16:07:04 [INFO] org.eclipse.papyrus.uml.decoratormodel.ui 2.1.0-SNAPSHOT SUCCESS [  0.578 s]
16:07:04 [INFO] org.eclipse.papyrus.uml.decoratormodel.properties 4.1.0-SNAPSHOT SUCCESS [  0.613 s]
16:07:04 [INFO] org.eclipse.papyrus.uml.diagram.common.groups 2.0.0-SNAPSHOT SUCCESS [  0.482 s]
16:07:04 [INFO] org.eclipse.papyrus.uml.diagram.css 2.0.100-SNAPSHOT SUCCESS [  0.427 s]
16:07:04 [INFO] org.eclipse.papyrus.uml.diagram.dnd 1.3.100-SNAPSHOT SUCCESS [  0.610 s]
16:07:04 [INFO] org.eclipse.papyrus.uml.diagram.icons 1.2.0-SNAPSHOT SUCCESS [  0.144 s]
16:07:04 [INFO] org.eclipse.papyrus.uml.diagram.linklf 2.0.100-SNAPSHOT SUCCESS [  0.633 s]
16:07:04 [INFO] org.eclipse.papyrus.uml.diagram.symbols 1.2.100-SNAPSHOT SUCCESS [  0.517 s]
16:07:04 [INFO] org.eclipse.papyrus.uml.diagram.sequence.restrictions 1.0.0-SNAPSHOT SUCCESS [  0.441 s]
16:07:04 [INFO] org.eclipse.papyrus.uml.diagram.symbols.properties 1.2.0-SNAPSHOT SUCCESS [  0.186 s]
16:07:04 [INFO] Papyrus UML Expressions Infrastructure 0.0.1-SNAPSHOT SUCCESS [  0.004 s]
16:07:04 [INFO] org.eclipse.papyrus.uml.expressions 2.1.100-SNAPSHOT SUCCESS [  0.163 s]
16:07:04 [INFO] org.eclipse.papyrus.uml.expressions.edit 2.1.0-SNAPSHOT SUCCESS [  0.201 s]
16:07:04 [INFO] org.eclipse.papyrus.uml.expressions.properties 1.0.100-SNAPSHOT SUCCESS [  0.412 s]
16:07:04 [INFO] Papyrus UML Model Explorer 0.0.1-SNAPSHOT .......... SUCCESS [  0.002 s]
16:07:04 [INFO] org.eclipse.papyrus.uml.modelexplorer 2.1.0-SNAPSHOT SUCCESS [  0.842 s]
16:07:04 [INFO] org.eclipse.papyrus.uml.modelexplorer.widgets 2.0.100-SNAPSHOT SUCCESS [  0.274 s]
16:07:04 [INFO] org.eclipse.papyrus.uml.nattable.generic 1.2.100-SNAPSHOT SUCCESS [  0.268 s]
16:07:04 [INFO] org.eclipse.papyrus.uml.nattable.matrix 1.0.200-SNAPSHOT SUCCESS [  0.530 s]
16:07:04 [INFO] org.eclipse.papyrus.uml.nattable.menu 1.2.200-SNAPSHOT SUCCESS [  0.744 s]
16:07:04 [INFO] org.eclipse.papyrus.uml.nattable.properties 1.0.200-SNAPSHOT SUCCESS [  0.459 s]
16:07:04 [INFO] org.eclipse.papyrus.uml.nattable.richtext 2.1.100-SNAPSHOT SUCCESS [  0.430 s]
16:07:04 [INFO] org.eclipse.papyrus.uml.nattable.xtext.integration 2.0.100-SNAPSHOT SUCCESS [  0.524 s]
16:07:04 [INFO] Papyrus UML Textual Edit 0.0.1-SNAPSHOT ............ SUCCESS [  0.004 s]
16:07:04 [INFO] org.eclipse.papyrus.uml.textedit.valuespecification.xtext 1.4.0-SNAPSHOT SUCCESS [  1.108 s]
16:07:04 [INFO] org.eclipse.papyrus.uml.textedit.valuespecification.xtext.utils 1.4.0-SNAPSHOT SUCCESS [  0.294 s]
16:07:04 [INFO] org.eclipse.papyrus.uml.textedit.valuespecification.xtext.ui 2.1.0-SNAPSHOT SUCCESS [  0.599 s]
16:07:04 [INFO] org.eclipse.papyrus.uml.nattable.xtext.valuespecification 5.0.0-SNAPSHOT SUCCESS [  0.597 s]
16:07:04 [INFO] Papyrus UML Profile 0.0.1-SNAPSHOT ................. SUCCESS [  0.002 s]
16:07:04 [INFO] org.eclipse.papyrus.uml.profile.drafter 1.4.0-SNAPSHOT SUCCESS [  0.747 s]
16:07:04 [INFO] org.eclipse.papyrus.uml.profile.drafter.documentation 1.2.100-SNAPSHOT SUCCESS [  0.038 s]
16:07:04 [INFO] org.eclipse.papyrus.uml.properties.xtext 1.3.100-SNAPSHOT SUCCESS [  0.680 s]
16:07:04 [INFO] org.eclipse.papyrus.uml.textedit.common.xtext 2.1.0-SNAPSHOT SUCCESS [  1.267 s]
16:07:04 [INFO] org.eclipse.papyrus.uml.textedit.collaborationuse.xtext 2.1.0-SNAPSHOT SUCCESS [  1.398 s]
16:07:04 [INFO] org.eclipse.papyrus.uml.textedit.common.xtext.ui 2.1.100-SNAPSHOT SUCCESS [  0.554 s]
16:07:04 [INFO] org.eclipse.papyrus.uml.textedit.collaborationuse.xtext.ui 2.1.0-SNAPSHOT SUCCESS [  0.748 s]
16:07:04 [INFO] org.eclipse.papyrus.uml.textedit.connectionpointreference.xtext 2.1.0-SNAPSHOT SUCCESS [  1.130 s]
16:07:04 [INFO] org.eclipse.papyrus.uml.textedit.connectionpointreference.xtext.ui 2.1.0-SNAPSHOT SUCCESS [  0.643 s]
16:07:04 [INFO] org.eclipse.papyrus.uml.textedit.constraintwithessentialocl.xtext 1.3.0-SNAPSHOT SUCCESS [  0.533 s]
16:07:04 [INFO] org.eclipse.papyrus.uml.textedit.javaconstraint 2.0.100-SNAPSHOT SUCCESS [  0.253 s]
16:07:04 [INFO] org.eclipse.papyrus.uml.textedit.message.xtext 2.1.0-SNAPSHOT SUCCESS [  1.251 s]
16:07:04 [INFO] org.eclipse.papyrus.uml.textedit.message.xtext.ui 2.1.0-SNAPSHOT SUCCESS [  0.772 s]
16:07:04 [INFO] org.eclipse.papyrus.uml.textedit.parameter.xtext 2.1.0-SNAPSHOT SUCCESS [  2.258 s]
16:07:04 [INFO] org.eclipse.papyrus.uml.textedit.parameter.xtext.ui 2.1.0-SNAPSHOT SUCCESS [  4.481 s]
16:07:04 [INFO] org.eclipse.papyrus.uml.textedit.port.xtext 1.4.0-SNAPSHOT SUCCESS [  1.473 s]
16:07:04 [INFO] org.eclipse.papyrus.uml.textedit.port.xtext.ui 2.1.0-SNAPSHOT SUCCESS [  0.610 s]
16:07:04 [INFO] org.eclipse.papyrus.uml.textedit.property.xtext 2.1.0-SNAPSHOT SUCCESS [  1.388 s]
16:07:04 [INFO] org.eclipse.papyrus.uml.textedit.property.xtext.ui 2.1.0-SNAPSHOT SUCCESS [  0.583 s]
16:07:04 [INFO] org.eclipse.papyrus.uml.textedit.state.xtext 2.1.0-SNAPSHOT SUCCESS [  1.141 s]
16:07:04 [INFO] org.eclipse.papyrus.uml.textedit.state.xtext.ui 2.1.0-SNAPSHOT SUCCESS [  0.628 s]
16:07:04 [INFO] org.eclipse.papyrus.uml.textedit.stereotypeproperty.xtext 3.0.0-SNAPSHOT SUCCESS [  2.087 s]
16:07:04 [INFO] org.eclipse.papyrus.uml.textedit.stereotypeproperty.xtext.ui 3.0.0-SNAPSHOT SUCCESS [  1.156 s]
16:07:04 [INFO] org.eclipse.papyrus.uml.textedit.transition.xtext 1.4.0-SNAPSHOT SUCCESS [  0.416 s]
16:07:04 [INFO] org.eclipse.papyrus.uml.textedit.transition.xtext.ui 2.1.0-SNAPSHOT SUCCESS [  0.624 s]
16:07:04 [INFO] org.eclipse.papyrus.uml.xtext.integration.validation 2.1.0-SNAPSHOT SUCCESS [  0.303 s]
16:07:04 [INFO] org.eclipse.papyrus.uml.internationalization 1.0.0-SNAPSHOT SUCCESS [  0.341 s]
16:07:04 [INFO] Papyrus M2M QvTo 0.0.1-SNAPSHOT .................... SUCCESS [  0.004 s]
16:07:04 [INFO] org.eclipse.papyrus.uml.m2m.qvto.common 1.1.100-SNAPSHOT SUCCESS [  0.735 s]
16:07:04 [INFO] org.eclipse.papyrus.uml.m2m.qvto.common.blackboxes 1.0.100-SNAPSHOT SUCCESS [  0.150 s]
16:07:04 [INFO] org.eclipse.papyrus.plugins-doc 0.0.1-SNAPSHOT ..... SUCCESS [  0.004 s]
16:07:04 [INFO] Papyrus Infra doc 1.2.0-SNAPSHOT ................... SUCCESS [  0.029 s]
16:07:04 [INFO] Papyrus - API migration documentation 1.0.0-SNAPSHOT SUCCESS [  1.976 s]
16:07:04 [INFO] Papyrus Copypaste UI doc 1.2.0-SNAPSHOT ............ SUCCESS [  0.107 s]
16:07:04 [INFO] Papyrus Developer doc 1.0.0-SNAPSHOT ............... SUCCESS [  0.584 s]
16:07:04 [INFO] Papyrus DSML Validation doc 1.2.0-SNAPSHOT ......... SUCCESS [  0.089 s]
16:07:04 [INFO] Papyrus Infra GmfDiag Common doc 1.2.0-SNAPSHOT .... SUCCESS [  0.232 s]
16:07:04 [INFO] Papyrus Infra GmfDiag Css doc 1.2.0-SNAPSHOT ....... SUCCESS [  0.169 s]
16:07:04 [INFO] Papyrus Infra Expression doc 1.0.0-SNAPSHOT ........ SUCCESS [  0.106 s]
16:07:04 [INFO] Papyrus Internationalization doc 1.0.0-SNAPSHOT .... SUCCESS [  0.064 s]
16:07:04 [INFO] Papyrus Infra Nattable doc 1.3.100-SNAPSHOT ........ SUCCESS [  0.429 s]
16:07:04 [INFO] Papyrus Infra Newchild doc 1.2.0-SNAPSHOT .......... SUCCESS [  0.054 s]
16:07:04 [INFO] Papyrus Infra Services ControlMode doc 1.2.0-SNAPSHOT SUCCESS [  0.106 s]
16:07:04 [INFO] Papyrus Infra Service decoration doc 1.0.0-SNAPSHOT  SUCCESS [  0.082 s]
16:07:04 [INFO] Papyrus Infra Service decoration doc 1.0.0-SNAPSHOT  SUCCESS [  0.043 s]
16:07:04 [INFO] Papyrus Infra Architecture doc 1.0.0-SNAPSHOT ...... SUCCESS [  0.072 s]
16:07:04 [INFO] Papyrus Infra Types doc 3.0.100-SNAPSHOT ........... SUCCESS [  0.047 s]
16:07:04 [INFO] Papyrus Req Reqif doc 1.2.0-SNAPSHOT ............... SUCCESS [  0.088 s]
16:07:04 [INFO] Papyrus Uml DecoratorModel doc 1.2.0-SNAPSHOT ...... SUCCESS [  0.117 s]
16:07:04 [INFO] Papyrus Uml Diagram Common doc 1.2.0-SNAPSHOT ...... SUCCESS [  0.119 s]
16:07:04 [INFO] Papyrus Uml Diagram profile doc 1.2.0-SNAPSHOT ..... SUCCESS [  0.190 s]
16:07:04 [INFO] Papyrus Uml doc 1.2.0-SNAPSHOT ..................... SUCCESS [  0.450 s]
16:07:04 [INFO] Papyrus Uml Search UI doc 1.0.0-SNAPSHOT ........... SUCCESS [  0.115 s]
16:07:04 [INFO] Papyrus ModelRepair doc 1.2.0-SNAPSHOT ............. SUCCESS [  0.053 s]
16:07:04 [INFO] Papyrus Uml Profile Assistants doc 1.2.0-SNAPSHOT .. SUCCESS [  0.090 s]
16:07:04 [INFO] Papyrus Uml Search UI doc 1.2.0-SNAPSHOT ........... SUCCESS [  0.096 s]
16:07:04 [INFO] Papyrus Views Properties doc 1.3.0-SNAPSHOT ........ SUCCESS [  0.123 s]
16:07:04 [INFO] Papyrus Views References doc 1.2.0-SNAPSHOT ........ SUCCESS [  0.044 s]
16:07:04 [INFO] Papyrus Views References doc 1.0.0-SNAPSHOT ........ SUCCESS [  0.040 s]
16:07:04 [INFO] Papyrus Views References doc 1.0.0-SNAPSHOT ........ SUCCESS [  0.058 s]
16:07:04 [INFO] org.eclipse.papyrus.toolsmiths.profilemigration.doc 0.7.0-SNAPSHOT SUCCESS [  0.070 s]
16:07:04 [INFO] org.eclipse.papyrus.toolsmiths.architecture.doc 1.0.0-SNAPSHOT SUCCESS [  0.035 s]
16:07:04 [INFO] org.eclipse.papyrus.toolsmiths.validation.doc 1.0.0-SNAPSHOT SUCCESS [  0.065 s]
16:07:04 [INFO] Papyrus SDK 0.0.1-SNAPSHOT ......................... SUCCESS [  0.001 s]
16:07:04 [INFO] org.eclipse.papyrus.sdk 5.0.0-SNAPSHOT ............. SUCCESS [  0.022 s]
16:07:04 [INFO] Papyrus Examples Plugins 1.0.1-SNAPSHOT ............ SUCCESS [  0.002 s]
16:07:04 [INFO] org.eclipse.papyrus.examples.core 1.0.1-SNAPSHOT ... SUCCESS [  0.001 s]
16:07:04 [INFO] org.eclipse.papyrus.example.core.lifecycleevents 1.2.0-SNAPSHOT SUCCESS [  0.163 s]
16:07:04 [INFO] org.eclipse.papyrus.example.core.sashwindows.fulleditor 1.1.0-SNAPSHOT SUCCESS [  0.199 s]
16:07:04 [INFO] org.eclipse.papyrus.example.core.sashwindows.simpleeditor 1.1.0-SNAPSHOT SUCCESS [  0.161 s]
16:07:04 [INFO] org.eclipse.papyrus.examples.emf 1.0.1-SNAPSHOT .... SUCCESS [  0.003 s]
16:07:04 [INFO] org.eclipse.papyrus.outline.emftree 1.1.0-SNAPSHOT . SUCCESS [  0.224 s]
16:07:04 [INFO] org.eclipse.papyrus.examples.infra 1.0.1-SNAPSHOT .. SUCCESS [  0.002 s]
16:07:04 [INFO] org.eclipse.papyrus.example.infra.servicesregistry.retrieval 1.1.0-SNAPSHOT SUCCESS [  0.197 s]
16:07:04 [INFO] org.eclipse.papyrus.infra.gmfdiag.connectionpoint.preferences 1.1.0-SNAPSHOT SUCCESS [  0.256 s]
16:07:04 [INFO] org.eclipse.papyrus.examples.others 1.0.1-SNAPSHOT . SUCCESS [  0.004 s]
16:07:04 [INFO] org.eclipse.papyrus.example.diagram.simplediagram 1.1.100-SNAPSHOT SUCCESS [  0.626 s]
16:07:04 [INFO] org.eclipse.papyrus.example.text.instance 1.1.0-SNAPSHOT SUCCESS [  0.130 s]
16:07:04 [INFO] org.eclipse.papyrus.examples.uml 1.0.1-SNAPSHOT .... SUCCESS [  0.003 s]
16:07:04 [INFO] org.eclipse.papyrus.example.uml.comment.editor.newresource 1.1.0-SNAPSHOT SUCCESS [  0.261 s]
16:07:04 [INFO] org.eclipse.papyrus.example.uml.comment.editor.sharedresource 1.1.0-SNAPSHOT SUCCESS [  0.240 s]
16:07:04 [INFO] org.eclipse.papyrus.uml.diagram.emftree 1.3.0-SNAPSHOT SUCCESS [  0.170 s]
16:07:04 [INFO] org.eclipse.papyrus.uml.textual.editors.example 1.1.100-SNAPSHOT SUCCESS [  0.504 s]
16:07:04 [INFO] org.eclipse.papyrus.uml.disable.helper.advices.example 1.0.0-SNAPSHOT SUCCESS [  0.150 s]
16:07:04 [INFO] org.eclipse.papyrus.examples.uml.diagrams 1.0.100-SNAPSHOT SUCCESS [  0.118 s]
16:07:04 [INFO] org.eclipse.papyrus.example.uml.nattable.actions 1.0.0-SNAPSHOT SUCCESS [  0.272 s]
16:07:04 [INFO] org.eclipse.papyrus.example.uml.nattable.empty.line 1.0.0-SNAPSHOT SUCCESS [  0.564 s]
16:07:04 [INFO] org.eclipse.papyrus.example.uml.services.decorator 1.0.0-SNAPSHOT SUCCESS [  0.117 s]
16:07:04 [INFO] org.eclipse.papyrus.examples-user 1.0.1-SNAPSHOT ... SUCCESS [  0.004 s]
16:07:04 [INFO] org.eclipse.papyrus.examples.user.qvto 1.0.100-SNAPSHOT SUCCESS [  0.156 s]
16:07:04 [INFO] Papyrus Main Features 0.0.1-SNAPSHOT ............... SUCCESS [  0.002 s]
16:07:04 [INFO] org.eclipse.papyrus.doc.feature 3.1.0-SNAPSHOT ..... SUCCESS [  1.072 s]
16:07:04 [INFO] org.eclipse.papyrus.editor.feature 2.0.0-SNAPSHOT .. SUCCESS [  0.102 s]
16:07:04 [INFO] org.eclipse.papyrus.emf.facet.feature 3.0.0-SNAPSHOT SUCCESS [  0.875 s]
16:07:04 [INFO] org.eclipse.papyrus.emf.feature 1.1.0-SNAPSHOT ..... SUCCESS [  0.090 s]
16:07:04 [INFO] org.eclipse.papyrus.infra.architecture.feature 1.0.0-SNAPSHOT SUCCESS [  0.146 s]
16:07:04 [INFO] org.eclipse.papyrus.infra.core.feature 3.0.0-SNAPSHOT SUCCESS [  0.173 s]
16:07:04 [INFO] org.eclipse.papyrus.infra.emf.expressions.feature 1.0.0-SNAPSHOT SUCCESS [  0.175 s]
16:07:04 [INFO] org.eclipse.papyrus.infra.emf.feature 3.0.0-SNAPSHOT SUCCESS [  0.279 s]
16:07:04 [INFO] org.eclipse.papyrus.infra.gmfdiag.feature 3.0.0-SNAPSHOT SUCCESS [  1.268 s]
16:07:04 [INFO] org.eclipse.papyrus.infra.services.feature 3.0.0-SNAPSHOT SUCCESS [  5.581 s]
16:07:04 [INFO] org.eclipse.papyrus.infra.ui.feature 3.0.0-SNAPSHOT  SUCCESS [  0.683 s]
16:07:04 [INFO] org.eclipse.papyrus.infra.widget.feature 3.0.0-SNAPSHOT SUCCESS [  0.325 s]
16:07:04 [INFO] org.eclipse.papyrus.infra.internationalization.feature 1.0.0-SNAPSHOT SUCCESS [  0.211 s]
16:07:04 [INFO] org.eclipse.papyrus.infra.nattable.feature 4.0.0-SNAPSHOT SUCCESS [  1.201 s]
16:07:04 [INFO] org.eclipse.papyrus.infra.gmfdiag.css.feature 3.0.0-SNAPSHOT SUCCESS [  0.359 s]
16:07:04 [INFO] org.eclipse.papyrus.infra.viewpoints.feature 3.0.0-SNAPSHOT SUCCESS [  0.102 s]
16:07:04 [INFO] org.eclipse.papyrus.infra.feature 3.0.0-SNAPSHOT ... SUCCESS [  0.896 s]
16:07:04 [INFO] org.eclipse.papyrus.uml.alf.feature 3.0.0-SNAPSHOT . SUCCESS [  0.207 s]
16:07:04 [INFO] org.eclipse.papyrus.uml.architecture.feature 1.0.0-SNAPSHOT SUCCESS [  0.253 s]
16:07:04 [INFO] org.eclipse.papyrus.uml.decoratormodel.feature 3.0.0-SNAPSHOT SUCCESS [  0.234 s]
16:07:04 [INFO] org.eclipse.papyrus.uml.diagram.css.feature 2.0.0-SNAPSHOT SUCCESS [  0.201 s]
16:07:04 [INFO] org.eclipse.papyrus.uml.diagram.feature 3.0.0-SNAPSHOT SUCCESS [  0.883 s]
16:07:04 [INFO] org.eclipse.papyrus.uml.expressions.feature 1.0.0-SNAPSHOT SUCCESS [  0.319 s]
16:07:04 [INFO] org.eclipse.papyrus.uml.internationalization.feature 1.0.0-SNAPSHOT SUCCESS [  0.096 s]
16:07:04 [INFO] org.eclipse.papyrus.uml.modelexplorer.feature 2.0.0-SNAPSHOT SUCCESS [  0.324 s]
16:07:04 [INFO] org.eclipse.papyrus.uml.properties.feature 3.0.0-SNAPSHOT SUCCESS [  0.244 s]
16:07:04 [INFO] org.eclipse.papyrus.uml.tools.feature 3.0.0-SNAPSHOT SUCCESS [  0.168 s]
16:07:04 [INFO] org.eclipse.papyrus.uml.ui.feature 1.2.0-SNAPSHOT .. SUCCESS [  0.152 s]
16:07:04 [INFO] org.eclipse.papyrus.uml.textedit.feature 2.0.0-SNAPSHOT SUCCESS [  0.530 s]
16:07:04 [INFO] org.eclipse.papyrus.uml.search.feature 2.0.0-SNAPSHOT SUCCESS [  0.122 s]
16:07:04 [INFO] org.eclipse.papyrus.uml.xtext.integration.feature 2.0.0-SNAPSHOT SUCCESS [  0.184 s]
16:07:04 [INFO] org.eclipse.papyrus.uml.m2m.qvto.feature 1.0.0-SNAPSHOT SUCCESS [  0.128 s]
16:07:04 [INFO] org.eclipse.papyrus.uml.nattable.feature 4.0.0-SNAPSHOT SUCCESS [  0.528 s]
16:07:04 [INFO] org.eclipse.papyrus.uml.feature 4.0.0-SNAPSHOT ..... SUCCESS [  1.578 s]
16:07:04 [INFO] org.eclipse.papyrus.views.documentation.feature 1.0.0-SNAPSHOT SUCCESS [  0.267 s]
16:07:04 [INFO] org.eclipse.papyrus.views.search.feature 2.0.0-SNAPSHOT SUCCESS [  0.146 s]
16:07:04 [INFO] org.eclipse.papyrus.views.modelexplorer.feature 3.0.0-SNAPSHOT SUCCESS [  0.352 s]
16:07:04 [INFO] org.eclipse.papyrus.views.properties.feature 3.0.0-SNAPSHOT SUCCESS [  0.106 s]
16:07:04 [INFO] org.eclipse.papyrus.views.references.feature 2.0.0-SNAPSHOT SUCCESS [  0.070 s]
16:07:04 [INFO] org.eclipse.papyrus.views.validation.feature 2.0.0-SNAPSHOT SUCCESS [  0.069 s]
16:07:04 [INFO] org.eclipse.papyrus.views.feature 1.0.0-SNAPSHOT ... SUCCESS [  0.309 s]
16:07:04 [INFO] org.eclipse.papyrus.sdk.feature 5.0.0-SNAPSHOT ..... SUCCESS [  1.675 s]
16:07:04 [INFO] Papyrus Examples Features 0.0.1-SNAPSHOT ........... SUCCESS [  0.004 s]
16:07:04 [INFO] org.eclipse.papyrus.user.examples.feature 0.0.3-SNAPSHOT SUCCESS [  0.566 s]
16:07:04 [INFO] org.eclipse.papyrus.main.target.parent 0.0.1-SNAPSHOT SUCCESS [  0.003 s]
16:07:04 [INFO] org.eclipse.papyrus.main.portable.target 0.0.1-SNAPSHOT SUCCESS [  0.005 s]
16:07:04 [INFO] org.eclipse.papyrus.p2 5.0.0-SNAPSHOT .............. SUCCESS [01:21 min]
16:07:04 [INFO] org.eclipse.papyrus.toolsmiths.releng 1.0.0-SNAPSHOT SUCCESS [  1.054 s]
16:07:04 [INFO] Papyrus Toolsmiths Features 0.0.1-SNAPSHOT ......... SUCCESS [  0.005 s]
16:07:04 [INFO] Papyrus Toolsmiths Plugins 0.0.1-SNAPSHOT .......... SUCCESS [  0.004 s]
16:07:04 [INFO] org.eclipse.papyrus.architectureview 1.0.0-SNAPSHOT  SUCCESS [  1.308 s]
16:07:04 [INFO] org.eclipse.papyrus.dev.ui 0.0.1-SNAPSHOT .......... SUCCESS [  0.124 s]
16:07:04 [INFO] org.eclipse.papyrus.dev.view.services.edit.request 1.2.0-SNAPSHOT SUCCESS [  0.138 s]
16:07:04 [INFO] org.eclipse.papyrus.gmf.editpoliciesstates 1.2.0-SNAPSHOT SUCCESS [  0.280 s]
16:07:04 [INFO] org.eclipse.papyrus.gmf.editpartview 1.2.0-SNAPSHOT  SUCCESS [  0.399 s]
16:07:04 [INFO] org.eclipse.papyrus.gmf.figureview 1.2.0-SNAPSHOT .. SUCCESS [  0.317 s]
16:07:04 [INFO] org.eclipse.papyrus.infra.gmfdiag.css.debug 1.2.0-SNAPSHOT SUCCESS [  0.431 s]
16:07:04 [INFO] org.eclipse.papyrus.infra.emf.commandstack 1.2.0-SNAPSHOT SUCCESS [  0.223 s]
16:07:04 [INFO] org.eclipse.papyrus.dev.types 3.0.100-SNAPSHOT ..... SUCCESS [  1.311 s]
16:07:04 [INFO] org.eclipse.papyrus.dev.pluginexplorer 1.2.0-SNAPSHOT SUCCESS [  0.186 s]
16:07:04 [INFO] org.eclipse.papyrus.debug.feature 1.0.0-SNAPSHOT ... SUCCESS [  0.342 s]
16:07:04 [INFO] org.eclipse.papyrus.gmfgenextension 2.0.0-SNAPSHOT . SUCCESS [  0.510 s]
16:07:04 [INFO] org.eclipse.papyrus.def 1.4.0-SNAPSHOT ............. SUCCESS [  7.653 s]
16:07:04 [INFO] org.eclipse.papyrus.codegen 1.2.0-SNAPSHOT ......... SUCCESS [  0.607 s]
16:07:04 [INFO] Papyrus UML Assistants 0.0.1-SNAPSHOT .............. SUCCESS [  0.007 s]
16:07:04 [INFO] org.eclipse.papyrus.uml.profile.types.generator 2.2.0-SNAPSHOT SUCCESS [  2.714 s]
16:07:04 [INFO] org.eclipse.papyrus.uml.profile.assistants.generator 4.0.0-SNAPSHOT SUCCESS [  3.982 s]
16:07:04 [INFO] org.eclipse.papyrus.dev.assistants.codegen 1.2.100-SNAPSHOT SUCCESS [  2.965 s]
16:07:04 [INFO] org.eclipse.papyrus.mwe2.utils 1.2.0-SNAPSHOT ...... SUCCESS [  0.279 s]
16:07:04 [INFO] org.eclipse.papyrus.diagramgen.feature 1.0.0-SNAPSHOT SUCCESS [  0.397 s]
16:07:04 [INFO] org.eclipse.papyrus.tests.junit-framework 0.0.1-SNAPSHOT SUCCESS [  0.003 s]
16:07:04 [INFO] org.eclipse.papyrus.junit.framework 1.3.0-SNAPSHOT . SUCCESS [  0.240 s]
16:07:04 [INFO] org.eclipse.papyrus.junit.utils 2.4.0-SNAPSHOT ..... SUCCESS [  1.022 s]
16:07:04 [INFO] org.eclipse.papyrus.bundles.tests 1.3.0-SNAPSHOT ... SUCCESS [  0.788 s]
16:07:04 [INFO] org.eclipse.papyrus.junit.feature 1.0.0-SNAPSHOT ... SUCCESS [  0.256 s]
16:07:04 [INFO] org.eclipse.papyrus.dev.project.management 1.3.0-SNAPSHOT SUCCESS [  0.495 s]
16:07:04 [INFO] org.eclipse.papyrus.releng.tools 2.1.0-SNAPSHOT .... SUCCESS [  0.467 s]
16:07:04 [INFO] org.eclipse.papyrus.releng.feature 1.0.0-SNAPSHOT .. SUCCESS [  0.831 s]
16:07:04 [INFO] org.eclipse.papyrus.customization.nattableconfiguration 2.0.100-SNAPSHOT SUCCESS [  0.614 s]
16:07:04 [INFO] org.eclipse.papyrus.infra.emf.types.ui.properties 3.0.0-SNAPSHOT SUCCESS [  0.359 s]
16:07:04 [INFO] org.eclipse.papyrus.infra.gmfdiag.expansion.edit 2.1.0-SNAPSHOT SUCCESS [  0.282 s]
16:07:04 [INFO] org.eclipse.papyrus.infra.gmfdiag.expansion.editor 2.1.0-SNAPSHOT SUCCESS [  0.366 s]
16:07:04 [INFO] org.eclipse.papyrus.infra.gmfdiag.paletteconfiguration.editor 3.2.0-SNAPSHOT SUCCESS [  0.504 s]
16:07:04 [INFO] org.eclipse.papyrus.toolsmiths 1.2.100-SNAPSHOT .... SUCCESS [  0.360 s]
16:07:04 [INFO] org.eclipse.papyrus.toolsmiths.ecore 1.0.0-SNAPSHOT  SUCCESS [  0.187 s]
16:07:04 [INFO] org.eclipse.papyrus.toolsmiths.expressions 1.0.0-SNAPSHOT SUCCESS [  0.192 s]
16:07:04 [INFO] org.eclipse.papyrus.uml.m2m.qvto.tests.tools 1.1.100-SNAPSHOT SUCCESS [  0.471 s]
16:07:04 [INFO] org.eclipse.papyrus.uml.m2m.qvto.tests.tools.feature 1.0.0-SNAPSHOT SUCCESS [  0.150 s]
16:07:04 [INFO] org.eclipse.papyrus.toolsmiths.palette 3.0.100-SNAPSHOT SUCCESS [  0.902 s]
16:07:04 [INFO] org.eclipse.papyrus.views.properties.toolsmiths 2.1.0-SNAPSHOT SUCCESS [  0.809 s]
16:07:04 [INFO] org.eclipse.papyrus.uml.properties.generation 2.1.200-SNAPSHOT SUCCESS [  0.805 s]
16:07:04 [INFO] org.eclipse.papyrus.toolsmiths.nattable 1.0.0-SNAPSHOT SUCCESS [  0.646 s]
16:07:04 [INFO] org.eclipse.papyrus.uml.types.ui.properties 3.1.100-SNAPSHOT SUCCESS [  0.485 s]
16:07:04 [INFO] org.eclipse.papyrus.toolsmiths.profile-migration 0.0.1-SNAPSHOT SUCCESS [  0.002 s]
16:07:04 [INFO] org.eclipse.papyrus.toolsmiths.profilemigration.ui 0.8.100-SNAPSHOT SUCCESS [  0.542 s]
16:07:04 [INFO] org.eclipse.papyrus.toolsmiths.profilemigration 0.8.100-SNAPSHOT SUCCESS [  0.585 s]
16:07:04 [INFO] org.eclipse.papyrus.toolsmiths.feature 1.2.0-SNAPSHOT SUCCESS [  1.639 s]
16:07:04 [INFO] org.eclipse.papyrus.uml.profile.types.generator.ui 1.4.0-SNAPSHOT SUCCESS [  0.741 s]
16:07:04 [INFO] org.eclipse.papyrus.uml.profile.assistants.generator.ui 1.2.100-SNAPSHOT SUCCESS [  0.475 s]
16:07:04 [INFO] org.eclipse.papyrus.uml.profile.newchildmenu.generator 1.2.100-SNAPSHOT SUCCESS [  0.781 s]
16:07:04 [INFO] org.eclipse.papyrus.uml.profile.newchildmenu.generator.ui 1.2.0-SNAPSHOT SUCCESS [  0.198 s]
16:07:04 [INFO] org.eclipse.papyrus.uml.assistants.feature 4.0.0-SNAPSHOT SUCCESS [  0.268 s]
16:07:04 [INFO] org.eclipse.papyrus.toolsmiths.validations 0.0.1-SNAPSHOT SUCCESS [  0.002 s]
16:07:04 [INFO] org.eclipse.papyrus.toolsmiths.validation.common 1.0.0-SNAPSHOT SUCCESS [  0.132 s]
16:07:04 [INFO] org.eclipse.papyrus.toolsmiths.validation.architecture 1.0.0-SNAPSHOT SUCCESS [  0.468 s]
16:07:04 [INFO] org.eclipse.papyrus.toolsmiths.validation.elementtypes 1.0.0-SNAPSHOT SUCCESS [  0.373 s]
16:07:04 [INFO] org.eclipse.papyrus.toolsmiths.validation.profile 1.0.0-SNAPSHOT SUCCESS [  0.407 s]
16:07:04 [INFO] org.eclipse.papyrus.toolsmiths.validation.feature 1.0.0-SNAPSHOT SUCCESS [  0.165 s]
16:07:04 [INFO] org.eclipse.papyrus.p2.toolsmiths 1.0.0-SNAPSHOT ... SUCCESS [ 24.717 s]
16:07:04 [INFO] org.eclipse.papyrus.toolsmiths.targetplatform.parent 0.0.1-SNAPSHOT SUCCESS [  0.006 s]
16:07:04 [INFO] org.eclipse.papyrus.toolsmiths.portable.targetplatform 0.0.1-SNAPSHOT SUCCESS [  0.006 s]
16:07:04 [INFO] org.eclipse.papyrus.tests.releng 0.0.1-SNAPSHOT .... SUCCESS [ 29.118 s]
16:07:04 [INFO] org.eclipse.papyrus.plugins.tests.releng 0.0.1-SNAPSHOT SUCCESS [  0.009 s]
16:07:04 [INFO] org.eclipse.papyrus.editor.tests.releng 0.0.1-SNAPSHOT SUCCESS [  0.004 s]
16:07:04 [INFO] org.eclipse.papyrus.editor.integration.tests 1.5.0-SNAPSHOT SUCCESS [  0.923 s]
16:07:04 [INFO] org.eclipse.papyrus.infra.tests.releng 0.0.1-SNAPSHOT SUCCESS [  0.004 s]
16:07:04 [INFO] org.eclipse.papyrus.infra.core.tests.releng 0.0.1-SNAPSHOT SUCCESS [  0.004 s]
16:07:04 [INFO] org.eclipse.papyrus.infra.core.clipboard.tests 1.3.0-SNAPSHOT SUCCESS [  0.461 s]
16:07:04 [INFO] org.eclipse.papyrus.infra.core.sasheditor.tests 1.2.0-SNAPSHOT SUCCESS [  0.579 s]
16:07:04 [INFO] org.eclipse.papyrus.infra.core.sasheditor.di.tests 1.2.0-SNAPSHOT SUCCESS [  0.303 s]
16:07:04 [INFO] org.eclipse.papyrus.infra.core.tests 3.1.0-SNAPSHOT  SUCCESS [  0.647 s]
16:07:04 [INFO] org.eclipse.papyrus.infra.editor.tests.releng 0.0.1-SNAPSHOT SUCCESS [  0.006 s]
16:07:04 [INFO] org.eclipse.papyrus.infra.editor.welcome.tests 1.2.100-SNAPSHOT SUCCESS [  0.604 s]
16:07:04 [INFO] org.eclipse.papyrus.infra.emf.tests.releng 0.0.1-SNAPSHOT SUCCESS [  0.004 s]
16:07:04 [INFO] org.eclipse.papyrus.infra.emf.gmf.tests 1.2.100-SNAPSHOT SUCCESS [  0.459 s]
16:07:04 [INFO] org.eclipse.papyrus.infra.emf.readonly.tests 1.4.0-SNAPSHOT SUCCESS [  0.538 s]
16:07:04 [INFO] org.eclipse.papyrus.infra.emf.tests 1.5.100-SNAPSHOT SUCCESS [  0.716 s]
16:07:04 [INFO] org.eclipse.papyrus.infra.filters.tests 1.2.0-SNAPSHOT SUCCESS [  0.127 s]
16:07:04 [INFO] org.eclipse.papyrus.infra.gmfdiag.tests.releng 0.0.1-SNAPSHOT SUCCESS [  0.003 s]
16:07:04 [INFO] org.eclipse.papyrus.infra.gmfdiag.assistant.tests.releng 0.0.1-SNAPSHOT SUCCESS [  0.003 s]
16:07:04 [INFO] org.eclipse.papyrus.infra.gmfdiag.assistant.tests 1.3.100-SNAPSHOT SUCCESS [  0.618 s]
16:07:04 [INFO] org.eclipse.papyrus.infra.gmfdiag.canonical.tests 1.3.100-SNAPSHOT SUCCESS [  0.830 s]
16:07:04 [INFO] org.eclipse.papyrus.infra.gmfdiag.commands.tests 1.3.100-SNAPSHOT SUCCESS [  0.670 s]
16:07:04 [INFO] org.eclipse.papyrus.infra.gmfdiag.common.tests 3.1.100-SNAPSHOT SUCCESS [  0.911 s]
16:07:04 [INFO] org.eclipse.papyrus.infra.gmfdiag.css.tests 1.3.0-SNAPSHOT SUCCESS [  0.617 s]
16:07:04 [INFO] org.eclipse.papyrus.infra.gmfdiag.menu.tests 1.2.200-SNAPSHOT SUCCESS [  0.377 s]
16:07:04 [INFO] org.eclipse.papyrus.infra.gmfdiag.paletteconfiguration.tests 1.3.100-SNAPSHOT SUCCESS [  0.407 s]
16:07:04 [INFO] org.eclipse.papyrus.infra.gmfdiag.welcome.tests 1.2.0-SNAPSHOT SUCCESS [  0.458 s]
16:07:04 [INFO] org.eclipse.papyrus.infra.nattable.main.test 1.2.0-SNAPSHOT SUCCESS [  0.007 s]
16:07:04 [INFO] org.eclipse.papyrus.infra.nattable.common.tests 1.2.200-SNAPSHOT SUCCESS [  0.609 s]
16:07:04 [INFO] org.eclipse.papyrus.infra.nattable.model.tests 1.2.100-SNAPSHOT SUCCESS [  4.068 s]
16:07:04 [INFO] org.eclipse.papyrus.infra.nattable.tests 1.2.200-SNAPSHOT SUCCESS [  0.728 s]
16:07:04 [INFO] org.eclipse.papyrus.infra.nattable.views.tests 1.2.100-SNAPSHOT SUCCESS [  0.666 s]
16:07:04 [INFO] org.eclipse.papyrus.infra.properties.tests.releng 0.0.1-SNAPSHOT SUCCESS [  0.005 s]
16:07:04 [INFO] org.eclipse.papyrus.infra.properties.ui.tests 2.0.0-SNAPSHOT SUCCESS [  0.555 s]
16:07:04 [INFO] org.eclipse.papyrus.infra.services.tests.releng 0.0.1-SNAPSHOT SUCCESS [  0.005 s]
16:07:04 [INFO] org.eclipse.papyrus.infra.services.controlmode.tests 1.5.100-SNAPSHOT SUCCESS [  0.648 s]
16:07:04 [INFO] org.eclipse.papyrus.infra.services.edit.tests 1.2.100-SNAPSHOT SUCCESS [  0.516 s]
16:07:04 [INFO] org.eclipse.papyrus.infra.services.edit.ui.tests 1.2.0-SNAPSHOT SUCCESS [  0.333 s]
16:07:04 [INFO] org.eclipse.papyrus.infra.services.resourceloading.tests 1.3.0-SNAPSHOT SUCCESS [  0.355 s]
16:07:04 [INFO] org.eclipse.papyrus.infra.services.semantic.tests 1.2.200-SNAPSHOT SUCCESS [  0.390 s]
16:07:04 [INFO] org.eclipse.papyrus.infra.tools.tests 1.3.0-SNAPSHOT SUCCESS [  0.569 s]
16:07:04 [INFO] org.eclipse.papyrus.infra.types.tests.releng 0.0.1-SNAPSHOT SUCCESS [  0.005 s]
16:07:04 [INFO] org.eclipse.papyrus.infra.types.tests 3.0.200-SNAPSHOT SUCCESS [  0.558 s]
16:07:04 [INFO] org.eclipse.papyrus.infra.types.ui.tests 3.0.100-SNAPSHOT SUCCESS [  0.492 s]
16:07:04 [INFO] org.eclipse.papyrus.infra.ui.emf.tests 1.4.0-SNAPSHOT SUCCESS [  0.546 s]
16:07:04 [INFO] org.eclipse.papyrus.infra.ui.tests 1.2.0-SNAPSHOT .. SUCCESS [  0.513 s]
16:07:04 [INFO] org.eclipse.papyrus.infra.viewpoints.tests.releng 0.0.1-SNAPSHOT SUCCESS [  0.005 s]
16:07:04 [INFO] org.eclipse.papyrus.infra.viewpoints.policy.tests 1.2.100-SNAPSHOT SUCCESS [  0.537 s]
16:07:04 [INFO] org.eclipse.papyrus.uml.tests.releng 0.0.1-SNAPSHOT  SUCCESS [  0.005 s]
16:07:04 [INFO] org.eclipse.papyrus.uml.diagram.tests.releng 1.2.0-SNAPSHOT SUCCESS [  0.006 s]
16:07:04 [INFO] org.eclipse.papyrus.uml.diagram.tests 1.3.100-SNAPSHOT SUCCESS [  1.013 s]
16:07:04 [INFO] org.eclipse.papyrus.uml.diagram.clazz.tests 1.3.200-SNAPSHOT SUCCESS [  4.492 s]
16:07:04 [INFO] org.eclipse.papyrus.uml.diagram.activity.tests 1.2.100-SNAPSHOT SUCCESS [  3.688 s]
16:07:04 [INFO] org.eclipse.papyrus.uml.diagram.usecase.tests 4.0.200-SNAPSHOT SUCCESS [  0.632 s]
16:07:04 [INFO] org.eclipse.papyrus.uml.diagram.deployment.tests 1.2.100-SNAPSHOT SUCCESS [  2.386 s]
16:07:04 [INFO] org.eclipse.papyrus.uml.diagram.component.tests 1.2.100-SNAPSHOT SUCCESS [  0.896 s]
16:07:04 [INFO] org.eclipse.papyrus.uml.diagram.timing.tests 1.2.100-SNAPSHOT SUCCESS [  2.892 s]
16:07:04 [INFO] org.eclipse.papyrus.uml.diagram.stereotypeproperty.tests 1.2.200-SNAPSHOT SUCCESS [  0.636 s]
16:07:04 [INFO] org.eclipse.papyrus.uml.diagram.sequence.tests 1.3.200-SNAPSHOT SUCCESS [  3.018 s]
16:07:04 [INFO] org.eclipse.papyrus.uml.diagram.composite.tests 1.2.200-SNAPSHOT SUCCESS [  0.779 s]
16:07:04 [INFO] org.eclipse.papyrus.uml.diagram.profile.tests 1.2.200-SNAPSHOT SUCCESS [  2.559 s]
16:07:04 [INFO] org.eclipse.papyrus.uml.dynamic.profile.tests 1.2.100-SNAPSHOT SUCCESS [  0.071 s]
16:07:04 [INFO] org.eclipse.papyrus.uml.diagram.common.tests 1.4.0-SNAPSHOT SUCCESS [  3.084 s]
16:07:04 [INFO] org.eclipse.papyrus.uml.diagram.wizards.tests 1.3.0-SNAPSHOT SUCCESS [  0.680 s]
16:07:04 [INFO] org.eclipse.papyrus.tests.uml.diagram.feature 1.2.0-SNAPSHOT SUCCESS [  0.491 s]
16:07:04 [INFO] org.eclipse.papyrus.tests.infra.services.feature 1.2.0-SNAPSHOT SUCCESS [  0.438 s]
16:07:04 [INFO] org.eclipse.papyrus.views.tests.releng 0.0.1-SNAPSHOT SUCCESS [  0.006 s]
16:07:04 [INFO] org.eclipse.papyrus.views.modelexplorer.tests 1.3.0-SNAPSHOT SUCCESS [  2.726 s]
16:07:04 [INFO] org.eclipse.papyrus.uml.modelexplorer.tests.releng 0.0.1-SNAPSHOT SUCCESS [  0.002 s]
16:07:04 [INFO] org.eclipse.papyrus.uml.modelexplorer.tests 1.3.100-SNAPSHOT SUCCESS [  0.453 s]
16:07:04 [INFO] org.eclipse.papyrus.uml.modelrepair.tests 1.3.100-SNAPSHOT SUCCESS [  2.454 s]
16:07:04 [INFO] org.eclipse.papyrus.uml.properties.tests 1.1.100-SNAPSHOT SUCCESS [  0.738 s]
16:07:04 [INFO] org.eclipse.papyrus.uml.service.types.tests 1.3.100-SNAPSHOT SUCCESS [  2.773 s]
16:07:04 [INFO] org.eclipse.papyrus.uml.service.types.ui.tests 1.2.200-SNAPSHOT SUCCESS [  0.567 s]
16:07:04 [INFO] org.eclipse.papyrus.uml.profile.tests.releng 0.0.1-SNAPSHOT SUCCESS [  0.006 s]
16:07:04 [INFO] org.eclipse.papyrus.uml.profile.drafter.tests 1.3.100-SNAPSHOT SUCCESS [  0.715 s]
16:07:04 [INFO] org.eclipse.papyrus.uml.filters.tests 1.2.0-SNAPSHOT SUCCESS [  2.323 s]
16:07:04 [INFO] org.eclipse.papyrus.uml.profile.tests 1.2.100-SNAPSHOT SUCCESS [  0.459 s]
16:07:04 [INFO] org.eclipse.papyrus.tests.uml.feature 1.2.0-SNAPSHOT SUCCESS [  0.274 s]
16:07:04 [INFO] org.eclipse.papyrus.views.documentation.tests 1.0.100-SNAPSHOT SUCCESS [  2.741 s]
16:07:04 [INFO] org.eclipse.papyrus.tests.views.feature 1.2.0-SNAPSHOT SUCCESS [  0.180 s]
16:07:04 [INFO] org.eclipse.papyrus.tests.infra.nattable.feature 1.4.0-SNAPSHOT SUCCESS [  0.559 s]
16:07:04 [INFO] org.eclipse.papyrus.uml.nattable.main.test 1.2.0-SNAPSHOT SUCCESS [  0.003 s]
16:07:04 [INFO] org.eclipse.papyrus.uml.nattable.tests 1.2.200-SNAPSHOT SUCCESS [  0.572 s]
16:07:04 [INFO] org.eclipse.papyrus.uml.nattable.generic.tests 1.2.300-SNAPSHOT SUCCESS [  2.926 s]
16:07:04 [INFO] org.eclipse.papyrus.uml.nattable.clazz.config.tests 1.2.300-SNAPSHOT SUCCESS [  4.139 s]
16:07:04 [INFO] org.eclipse.papyrus.uml.nattable.stereotyped.elements.tests 1.0.300-SNAPSHOT SUCCESS [  1.039 s]
16:07:04 [INFO] org.eclipse.papyrus.uml.nattable.matrix.tests 1.0.200-SNAPSHOT SUCCESS [  2.436 s]
16:07:04 [INFO] org.eclipse.papyrus.tests.uml.nattable.feature 1.3.0-SNAPSHOT SUCCESS [  0.295 s]
16:07:04 [INFO] org.eclipse.papyrus.tests.infra.feature 1.2.0-SNAPSHOT SUCCESS [  0.431 s]
16:07:04 [INFO] org.eclipse.papyrus.tests.infra.core.feature 1.2.0-SNAPSHOT SUCCESS [  0.146 s]
16:07:04 [INFO] org.eclipse.papyrus.uml.tools.tests.releng 0.0.1-SNAPSHOT SUCCESS [  0.014 s]
16:07:04 [INFO] org.eclipse.papyrus.uml.tools.tests 3.1.100-SNAPSHOT SUCCESS [  2.664 s]
16:07:04 [INFO] org.eclipse.papyrus.uml.tools.utils.tests 1.3.0-SNAPSHOT SUCCESS [  0.446 s]
16:07:04 [INFO] org.eclipse.papyrus.tests.uml.tools.feature 1.2.0-SNAPSHOT SUCCESS [  0.171 s]
16:07:04 [INFO] org.eclipse.papyrus.uml.decoratormodel.tests.releng 0.0.1-SNAPSHOT SUCCESS [  0.003 s]
16:07:04 [INFO] org.eclipse.papyrus.uml.decoratormodel.controlmode.tests 1.3.100-SNAPSHOT SUCCESS [  2.169 s]
16:07:04 [INFO] org.eclipse.papyrus.uml.decoratormodel.tests 1.3.100-SNAPSHOT SUCCESS [  0.536 s]
16:07:04 [INFO] org.eclipse.papyrus.tests.uml.decoratormodel.feature 1.2.0-SNAPSHOT SUCCESS [  0.127 s]
16:07:04 [INFO] org.eclipse.papyrus.uml.textedit.tests.releng 0.0.1-SNAPSHOT SUCCESS [  0.003 s]
16:07:04 [INFO] org.eclipse.papyrus.uml.textedit.parameter.tests 1.2.200-SNAPSHOT SUCCESS [  2.393 s]
16:07:04 [INFO] org.eclipse.papyrus.uml.textedit.port.tests 1.2.200-SNAPSHOT SUCCESS [  0.476 s]
16:07:04 [INFO] org.eclipse.papyrus.uml.textedit.property.tests 1.2.300-SNAPSHOT SUCCESS [  0.589 s]
16:07:04 [INFO] org.eclipse.papyrus.uml.textedit.tests 1.3.200-SNAPSHOT SUCCESS [  2.513 s]
16:07:04 [INFO] org.eclipse.papyrus.uml.textedit.tests.feature 1.2.0-SNAPSHOT SUCCESS [  0.181 s]
16:07:04 [INFO] org.eclipse.papyrus.uml.assistants.tests.releng 0.0.1-SNAPSHOT SUCCESS [  0.002 s]
16:07:04 [INFO] org.eclipse.papyrus.uml.profile.types.generator.tests 1.2.200-SNAPSHOT SUCCESS [  0.660 s]
16:07:04 [INFO] org.eclipse.papyrus.uml.profile.assistants.generator.tests 1.2.200-SNAPSHOT SUCCESS [  2.845 s]
16:07:04 [INFO] org.eclipse.papyrus.tests.uml.assistants.feature 1.2.0-SNAPSHOT SUCCESS [  0.177 s]
16:07:04 [INFO] org.eclipse.papyrus.toolsmiths.tests.releng 0.0.1-SNAPSHOT SUCCESS [  0.005 s]
16:07:04 [INFO] org.eclipse.papyrus.toolsmiths.profilemigration.tests 0.7.100-SNAPSHOT SUCCESS [  0.518 s]
16:07:04 [INFO] org.eclipse.papyrus.toolsmiths.validation.profile.tests 1.0.0-SNAPSHOT SUCCESS [  2.231 s]
16:07:04 [INFO] org.eclipse.papyrus.toolsmiths.validation.elementtypes.tests 1.0.0-SNAPSHOT SUCCESS [  0.342 s]
16:07:04 [INFO] org.eclipse.papyrus.tests.toolsmiths.feature 1.0.0-SNAPSHOT SUCCESS [  0.202 s]
16:07:04 [INFO] org.eclipse.papyrus.tests.feature 2.0.0-SNAPSHOT ... SUCCESS [  0.906 s]
16:07:04 [INFO] org.eclipse.papyrus.infra.emf.expressions.main.tests 0.0.1-SNAPSHOT SUCCESS [  0.003 s]
16:07:04 [INFO] org.eclipse.papyrus.infra.emf.expressions.tests 1.0.0-SNAPSHOT SUCCESS [  1.864 s]
16:07:04 [INFO] org.eclipse.papyrus.tests.infra.emf.expressions.feature 1.0.0-SNAPSHOT SUCCESS [  0.023 s]
16:07:04 [INFO] org.eclipse.papyrus.infra.internationalization.main.test 1.0.0-SNAPSHOT SUCCESS [  0.002 s]
16:07:04 [INFO] org.eclipse.papyrus.infra.internationalization.tests 1.100.100-SNAPSHOT SUCCESS [  0.447 s]
16:07:04 [INFO] org.eclipse.papyrus.tests.infra.internationalization.feature 1.0.0-SNAPSHOT SUCCESS [  0.127 s]
16:07:04 [INFO] org.eclipse.papyrus.uml.expressions.tests.releng 0.0.1-SNAPSHOT SUCCESS [  0.002 s]
16:07:04 [INFO] org.eclipse.papyrus.uml.expressions.tests 1.1.100-SNAPSHOT SUCCESS [  3.870 s]
16:07:04 [INFO] org.eclipse.papyrus.tests.uml.expressions.feature 1.0.0-SNAPSHOT SUCCESS [  0.255 s]
16:07:04 [INFO] org.eclipse.papyrus.uml.internationalization.main.test 1.0.0-SNAPSHOT SUCCESS [  0.006 s]
16:07:04 [INFO] org.eclipse.papyrus.uml.internationalization.tests 1.100.100-SNAPSHOT SUCCESS [  0.518 s]
16:07:04 [INFO] org.eclipse.papyrus.uml.internationalization.controlmode.tests 1.1.100-SNAPSHOT SUCCESS [  2.577 s]
16:07:04 [INFO] org.eclipse.papyrus.tests.uml.internationalization.feature 1.0.0-SNAPSHOT SUCCESS [  0.151 s]
16:07:04 [INFO] org.eclipse.papyrus.uml.alf.tests 1.2.0-SNAPSHOT ... SUCCESS [  4.359 s]
16:07:04 [INFO] org.eclipse.papyrus.uml.alf.tests.feature 1.2.0-SNAPSHOT SUCCESS [  0.132 s]
16:07:04 [INFO] Papyrus Tests Features 0.0.1-SNAPSHOT .............. SUCCESS [  0.002 s]
16:07:04 [INFO] org.eclipse.papyrus.developer.suite.tests 0.0.1-SNAPSHOT SUCCESS [ 38.908 s]
16:07:04 [INFO] org.eclipse.papyrus.bundles.tests 0.0.1-SNAPSHOT ... SUCCESS [  0.007 s]
16:07:04 [INFO] org.eclipse.papyrus.eclipse.project.editors.tests 2.1.0-SNAPSHOT SUCCESS [  4.421 s]
16:07:04 [INFO] org.eclipse.papyrus.editors.suite.tests 0.0.1-SNAPSHOT SUCCESS [05:19 min]
16:07:04 [INFO] org.eclipse.papyrus.infra.core.suite.tests 0.0.1-SNAPSHOT SUCCESS [01:00 min]
16:07:04 [INFO] org.eclipse.papyrus.infra.nattable.suite.tests 0.0.1-SNAPSHOT SUCCESS [ 56.385 s]
16:07:04 [INFO] org.eclipse.papyrus.infra.architecture.tests 1.0.0-SNAPSHOT SUCCESS [  1.239 s]
16:07:04 [INFO] org.eclipse.papyrus.infra.services.labelprovider.tests 1.2.200-SNAPSHOT SUCCESS [  0.243 s]
16:07:04 [INFO] org.eclipse.papyrus.infra.ui.architecture.tests 1.0.100-SNAPSHOT SUCCESS [  0.497 s]
16:07:04 [INFO] org.eclipse.papyrus.infra.suite.tests 0.0.1-SNAPSHOT SUCCESS [05:41 min]
16:07:04 [INFO] org.eclipse.papyrus.infra.newchild.tests 1.2.100-SNAPSHOT SUCCESS [  1.387 s]
16:07:04 [INFO] org.eclipse.papyrus.uml.diagram.communication.tests 1.2.100-SNAPSHOT SUCCESS [  0.750 s]
16:07:04 [INFO] org.eclipse.papyrus.uml.diagram.interactionoverview.tests 1.2.0-SNAPSHOT SUCCESS [  3.002 s]
16:07:04 [INFO] org.eclipse.papyrus.uml.diagram.statemachine.tests 1.2.200-SNAPSHOT SUCCESS [  1.018 s]
16:07:04 [INFO] org.eclipse.papyrus.uml.diagram.suite.tests 0.0.1-SNAPSHOT SUCCESS [10:35 min]
16:07:04 [INFO] org.eclipse.papyrus.uml.diagram.dnd.tests 1.2.200-SNAPSHOT SUCCESS [  1.323 s]
16:07:04 [INFO] org.eclipse.papyrus.uml.diagram.properties.tests 1.0.100-SNAPSHOT SUCCESS [  0.704 s]
16:07:04 [INFO] org.eclipse.papyrus.uml.nattable.stereotype.display.tests 1.3.0-SNAPSHOT SUCCESS [  2.674 s]
16:07:04 [INFO] org.eclipse.papyrus.uml.nattable.suite.tests 0.0.1-SNAPSHOT SUCCESS [10:52 min]
16:07:04 [INFO] org.eclipse.papyrus.uml.textedit.valuespecification.tests 1.2.200-SNAPSHOT SUCCESS [  0.641 s]
16:07:04 [INFO] org.eclipse.papyrus.uml.textedit.suite.tests 0.0.1-SNAPSHOT SUCCESS [ 39.417 s]
16:07:04 [INFO] org.eclipse.papyrus.uml.architecture.tests 1.1.200-SNAPSHOT SUCCESS [  0.135 s]
16:07:04 [INFO] org.eclipse.papyrus.uml.validation.tests.releng 0.0.1-SNAPSHOT SUCCESS [  0.003 s]
16:07:04 [INFO] org.eclipse.papyrus.uml.validation.tests.staticprofile 1.2.100-SNAPSHOT SUCCESS [  0.232 s]
16:07:04 [INFO] org.eclipse.papyrus.uml.validation.tests.genvalidation 1.2.0-SNAPSHOT SUCCESS [  3.172 s]
16:07:04 [INFO] org.eclipse.papyrus.uml.validation.tests 1.2.200-SNAPSHOT SUCCESS [  0.537 s]
16:07:04 [INFO] org.eclipse.papyrus.uml.suite.tests 0.0.1-SNAPSHOT . FAILURE [03:51 min]
16:07:04 [INFO] org.eclipse.papyrus.uml.alf.tests.releng 0.0.1-SNAPSHOT SKIPPED
16:07:04 [INFO] org.eclipse.papyrus.uml.alf.backend.tests 1.1.100-SNAPSHOT SKIPPED
16:07:04 [INFO] org.eclipse.papyrus.views.properties.toolsmiths.tests 1.2.100-SNAPSHOT SKIPPED
16:07:04 [INFO] org.eclipse.papyrus.views.suite.tests 0.0.1-SNAPSHOT SKIPPED
16:07:04 [INFO] org.eclipse.papyrus.views.documentation.tests.releng 0.0.1-SNAPSHOT SKIPPED
16:07:04 [INFO] org.eclipse.papyrus.toolsmiths.suite.tests 0.0.1-SNAPSHOT SKIPPED
16:07:04 [INFO] org.eclipse.papyrus.tests.main.releng 1.2.0-SNAPSHOT SKIPPED
16:07:04 [INFO] org.eclipse.papyrus.main.tests.target.parent 0.0.1-SNAPSHOT SKIPPED
16:07:04 [INFO] org.eclipse.papyrus.main.tests.portable.target 0.0.1-SNAPSHOT SKIPPED
16:07:04 [INFO] ------------------------------------------------------------------------
16:07:04 [INFO] BUILD FAILURE
16:07:04 [INFO] ------------------------------------------------------------------------
16:07:04 [INFO] Total time:  01:59 h
16:07:04 [INFO] Finished at: 2020-07-03T16:07:04-04:00
16:07:04 [INFO] ------------------------------------------------------------------------
16:07:04 [ERROR] Failed to execute goal org.eclipse.tycho:tycho-surefire-plugin:1.3.0:test (default-test) on project org.eclipse.papyrus.uml.suite.tests: An unexpected error occured while launching the test runtime (return code 143). See log /jobs/genie.papyrus/Papyrus-Gerrit-Master-With-Tests/workspace/source/tests/junit/plugins/uml/org.eclipse.papyrus.uml.suite.tests/target/work/data/.metadata/.log for details. -> [Help 1]
16:07:04 [ERROR] 
16:07:04 [ERROR] To see the full stack trace of the errors, re-run Maven with the -e switch.
16:07:04 [ERROR] Re-run Maven using the -X switch to enable full debug logging.
16:07:04 [ERROR] 
16:07:04 [ERROR] For more information about the errors and possible solutions, please read the following articles:
16:07:04 [ERROR] [Help 1] http://cwiki.apache.org/confluence/display/MAVEN/MojoFailureException
16:07:04 [ERROR] 
16:07:04 [ERROR] After correcting the problems, you can resume the build with the command
16:07:04 [ERROR]   mvn <args> -rf :org.eclipse.papyrus.uml.suite.tests
16:07:08 Terminating xvnc.
16:07:18 Build was aborted
16:07:18 Recording test results
16:07:19 Started calculate disk usage of build
16:07:19 Finished Calculation of disk usage of build in 0 seconds
16:07:19 Started calculate disk usage of workspace
16:07:21 Finished Calculation of disk usage of workspace in  2 second
16:07:22 [WS-CLEANUP] Deleting project workspace...
16:07:22 [WS-CLEANUP] Deferred wipeout is used...
16:07:22 [WS-CLEANUP] done
16:07:22 Finished: ABORTED