UnstableConsole Output

Skipping 1,434 KB.. Full Log
toreEList.delegateGet(EStoreEObjectImpl.java:241)
	at org.eclipse.emf.common.util.DelegatingEList.get(DelegatingEList.java:230)
	at org.eclipse.emf.common.util.AbstractEList$EIterator.doNext(AbstractEList.java:698)
	at org.eclipse.emf.common.util.AbstractEList$EIterator.next(AbstractEList.java:685)
	at com.google.common.collect.Iterators$5.computeNext(Iterators.java:636)
	at com.google.common.collect.AbstractIterator.tryToComputeNext(AbstractIterator.java:141)
	at com.google.common.collect.AbstractIterator.hasNext(AbstractIterator.java:136)
	at com.google.common.collect.Iterators.size(Iterators.java:163)
	at com.google.common.collect.Iterables.size(Iterables.java:126)
	at org.eclipse.papyrus.cdo.internal.core.importer.tests.ModelImporterTest.assertResource(ModelImporterTest.java:188)
	at org.eclipse.papyrus.cdo.internal.core.importer.tests.ModelImporterTest.testManyToOneImport(ModelImporterTest.java:124)
	at sun.reflect.NativeMethodAccessorImpl.invoke0(Native Method)
	at sun.reflect.NativeMethodAccessorImpl.invoke(NativeMethodAccessorImpl.java:62)
	at sun.reflect.DelegatingMethodAccessorImpl.invoke(DelegatingMethodAccessorImpl.java:43)
	at java.lang.reflect.Method.invoke(Method.java:498)
	at org.junit.runners.model.FrameworkMethod$1.runReflectiveCall(FrameworkMethod.java:59)
	at org.junit.internal.runners.model.ReflectiveCallable.run(ReflectiveCallable.java:12)
	at org.junit.runners.model.FrameworkMethod.invokeExplosively(FrameworkMethod.java:56)
	at org.junit.internal.runners.statements.InvokeMethod.evaluate(InvokeMethod.java:17)
	at org.junit.internal.runners.statements.RunBefores.evaluate(RunBefores.java:26)
	at org.junit.internal.runners.statements.RunAfters.evaluate(RunAfters.java:27)
	at org.eclipse.papyrus.junit.utils.rules.HouseKeeper$1.evaluate(HouseKeeper.java:76)
	at org.junit.rules.TestWatcher$1.evaluate(TestWatcher.java:61)
	at org.junit.rules.TestWatcher$1.evaluate(TestWatcher.java:61)
	at org.junit.runners.ParentRunner$3.evaluate(ParentRunner.java:306)
	at org.junit.runners.BlockJUnit4ClassRunner$1.evaluate(BlockJUnit4ClassRunner.java:100)
	at org.junit.runners.ParentRunner.runLeaf(ParentRunner.java:366)
	at org.junit.runners.BlockJUnit4ClassRunner.runChild(BlockJUnit4ClassRunner.java:103)
	at org.eclipse.papyrus.junit.framework.classification.ClassificationRunner.access$0(ClassificationRunner.java:1)
	at org.eclipse.papyrus.junit.framework.classification.ClassificationRunner$1.runChild(ClassificationRunner.java:58)
	at org.eclipse.papyrus.junit.framework.classification.ClassificationRunnerImpl.runChild(ClassificationRunnerImpl.java:87)
	at org.eclipse.papyrus.junit.framework.classification.ClassificationRunner.runChild(ClassificationRunner.java:86)
	at org.junit.runners.BlockJUnit4ClassRunner.runChild(BlockJUnit4ClassRunner.java:63)
	at org.junit.runners.ParentRunner$4.run(ParentRunner.java:331)
	at org.junit.runners.ParentRunner$1.schedule(ParentRunner.java:79)
	at org.junit.runners.ParentRunner.runChildren(ParentRunner.java:329)
	at org.junit.runners.ParentRunner.access$100(ParentRunner.java:66)
	at org.junit.runners.ParentRunner$2.evaluate(ParentRunner.java:293)
	at org.junit.runners.ParentRunner$3.evaluate(ParentRunner.java:306)
	at org.junit.rules.TestWatcher$1.evaluate(TestWatcher.java:61)
	at org.junit.runners.ParentRunner.run(ParentRunner.java:413)
	at org.apache.maven.surefire.junit4.JUnit4Provider.execute(JUnit4Provider.java:365)
	at org.apache.maven.surefire.junit4.JUnit4Provider.executeWithRerun(JUnit4Provider.java:273)
	at org.apache.maven.surefire.junit4.JUnit4Provider.executeTestSet(JUnit4Provider.java:238)
	at org.apache.maven.surefire.junit4.JUnit4Provider.invoke(JUnit4Provider.java:159)
	at sun.reflect.NativeMethodAccessorImpl.invoke0(Native Method)
	at sun.reflect.NativeMethodAccessorImpl.invoke(NativeMethodAccessorImpl.java:62)
	at sun.reflect.DelegatingMethodAccessorImpl.invoke(DelegatingMethodAccessorImpl.java:43)
	at java.lang.reflect.Method.invoke(Method.java:498)
	at org.apache.maven.surefire.util.ReflectionUtils.invokeMethodWithArray2(ReflectionUtils.java:206)
	at org.apache.maven.surefire.booter.ProviderFactory$ProviderProxy.invoke(ProviderFactory.java:161)
	at org.apache.maven.surefire.booter.ProviderFactory.invokeProvider(ProviderFactory.java:84)
	at org.eclipse.tycho.surefire.osgibooter.OsgiSurefireBooter.run(OsgiSurefireBooter.java:113)
	at org.eclipse.tycho.surefire.osgibooter.AbstractUITestApplication$1.run(AbstractUITestApplication.java:35)
	at org.eclipse.swt.widgets.RunnableLock.run(RunnableLock.java:40)
	at org.eclipse.swt.widgets.Synchronizer.runAsyncMessages(Synchronizer.java:185)
	at org.eclipse.swt.widgets.Display.runAsyncMessages(Display.java:4928)
	at org.eclipse.swt.widgets.Display.readAndDispatch(Display.java:4449)
	at org.eclipse.e4.ui.internal.workbench.swt.PartRenderingEngine$5.run(PartRenderingEngine.java:1158)
	at org.eclipse.core.databinding.observable.Realm.runWithDefault(Realm.java:338)
	at org.eclipse.e4.ui.internal.workbench.swt.PartRenderingEngine.run(PartRenderingEngine.java:1047)
	at org.eclipse.e4.ui.internal.workbench.E4Workbench.createAndRunUI(E4Workbench.java:155)
	at org.eclipse.ui.internal.Workbench.lambda$3(Workbench.java:658)
	at org.eclipse.core.databinding.observable.Realm.runWithDefault(Realm.java:338)
	at org.eclipse.ui.internal.Workbench.createAndRunWorkbench(Workbench.java:557)
	at org.eclipse.ui.PlatformUI.createAndRunWorkbench(PlatformUI.java:154)
	at org.eclipse.ui.internal.ide.application.IDEApplication.start(IDEApplication.java:150)
	at org.eclipse.tycho.surefire.osgibooter.UITestApplication.runApplication(UITestApplication.java:31)
	at org.eclipse.tycho.surefire.osgibooter.AbstractUITestApplication.run(AbstractUITestApplication.java:120)
	at org.eclipse.tycho.surefire.osgibooter.UITestApplication.start(UITestApplication.java:37)
	at org.eclipse.equinox.internal.app.EclipseAppHandle.run(EclipseAppHandle.java:203)
	at org.eclipse.core.runtime.internal.adaptor.EclipseAppLauncher.runApplication(EclipseAppLauncher.java:137)
	at org.eclipse.core.runtime.internal.adaptor.EclipseAppLauncher.start(EclipseAppLauncher.java:107)
	at org.eclipse.core.runtime.adaptor.EclipseStarter.run(EclipseStarter.java:401)
	at org.eclipse.core.runtime.adaptor.EclipseStarter.run(EclipseStarter.java:255)
	at sun.reflect.NativeMethodAccessorImpl.invoke0(Native Method)
	at sun.reflect.NativeMethodAccessorImpl.invoke(NativeMethodAccessorImpl.java:62)
	at sun.reflect.DelegatingMethodAccessorImpl.invoke(DelegatingMethodAccessorImpl.java:43)
	at java.lang.reflect.Method.invoke(Method.java:498)
	at org.eclipse.equinox.launcher.Main.invokeFramework(Main.java:657)
	at org.eclipse.equinox.launcher.Main.basicRun(Main.java:594)
	at org.eclipse.equinox.launcher.Main.run(Main.java:1447)
	at org.eclipse.equinox.launcher.Main.main(Main.java:1420)
Caused by: java.io.IOException: Unable to resolve plug-in "org.eclipse.papyrus.uml.nattable.generic.config".
	at org.eclipse.core.internal.runtime.PlatformURLPluginConnection.parse(PlatformURLPluginConnection.java:64)
	at org.eclipse.core.internal.runtime.PlatformURLPluginConnection.resolve(PlatformURLPluginConnection.java:73)
	at org.eclipse.core.internal.boot.PlatformURLHandler.openConnection(PlatformURLHandler.java:69)
	at org.eclipse.osgi.internal.url.URLStreamHandlerProxy.openConnection(URLStreamHandlerProxy.java:123)
	at java.net.URL.openConnection(URL.java:979)
	at org.eclipse.emf.ecore.resource.impl.URIHandlerImpl.createInputStream(URIHandlerImpl.java:200)
	at org.eclipse.emf.ecore.resource.impl.ExtensibleURIConverterImpl.createInputStream(ExtensibleURIConverterImpl.java:358)
	at org.eclipse.emf.ecore.resource.impl.ResourceImpl.load(ResourceImpl.java:1314)
	at org.eclipse.papyrus.emf.resources.AbstractEMFResource.load(AbstractEMFResource.java:67)
	at org.eclipse.emf.ecore.resource.impl.ResourceSetImpl.demandLoad(ResourceSetImpl.java:259)
	at org.eclipse.emf.ecore.resource.impl.ResourceSetImpl.demandLoadHelper(ResourceSetImpl.java:274)
	... 100 more
Tests run: 3, Failures: 0, Errors: 1, Skipped: 0, Time elapsed: 1.271 s <<< FAILURE! - in org.eclipse.papyrus.cdo.internal.core.importer.tests.ModelImporterTest
testWorkspaceResourcesURIsUpdated(org.eclipse.papyrus.cdo.internal.core.importer.tests.ModelImporterTest)  Time elapsed: 0.424 s
testOneToOneImport(org.eclipse.papyrus.cdo.internal.core.importer.tests.ModelImporterTest)  Time elapsed: 0.411 s
testManyToOneImport(org.eclipse.papyrus.cdo.internal.core.importer.tests.ModelImporterTest)  Time elapsed: 0.425 s  <<< ERROR!
org.eclipse.emf.ecore.resource.impl.ResourceSetImpl$1DiagnosticWrappedException: java.io.IOException: Unable to resolve plug-in "org.eclipse.papyrus.uml.nattable.generic.config".
	at org.eclipse.papyrus.cdo.internal.core.importer.tests.ModelImporterTest.assertResource(ModelImporterTest.java:188)
	at org.eclipse.papyrus.cdo.internal.core.importer.tests.ModelImporterTest.testManyToOneImport(ModelImporterTest.java:124)
Caused by: java.io.IOException: Unable to resolve plug-in "org.eclipse.papyrus.uml.nattable.generic.config".
	at org.eclipse.papyrus.cdo.internal.core.importer.tests.ModelImporterTest.assertResource(ModelImporterTest.java:188)
	at org.eclipse.papyrus.cdo.internal.core.importer.tests.ModelImporterTest.testManyToOneImport(ModelImporterTest.java:124)

Running org.eclipse.papyrus.cdo.internal.core.exporter.tests.ModelExporterTest
Tests run: 1, Failures: 0, Errors: 0, Skipped: 0, Time elapsed: 0.551 s - in org.eclipse.papyrus.cdo.internal.core.exporter.tests.ModelExporterTest
testExportWithDependencies(org.eclipse.papyrus.cdo.internal.core.exporter.tests.ModelExporterTest)  Time elapsed: 0.543 s
Running org.eclipse.papyrus.cdo.internal.core.exporter.tests.ModelExportMappingTest
Tests run: 4, Failures: 0, Errors: 0, Skipped: 0, Time elapsed: 2.012 s - in org.eclipse.papyrus.cdo.internal.core.exporter.tests.ModelExportMappingTest
testValidation_mappingAbsent(org.eclipse.papyrus.cdo.internal.core.exporter.tests.ModelExportMappingTest)  Time elapsed: 0.255 s
testValidation_nonUniqueMappings(org.eclipse.papyrus.cdo.internal.core.exporter.tests.ModelExportMappingTest)  Time elapsed: 0.992 s
testValidation_ok(org.eclipse.papyrus.cdo.internal.core.exporter.tests.ModelExportMappingTest)  Time elapsed: 0.417 s
testValidation_resourceExists(org.eclipse.papyrus.cdo.internal.core.exporter.tests.ModelExportMappingTest)  Time elapsed: 0.336 s
Running org.eclipse.papyrus.cdo.internal.core.expressions.tests.EObjectPropertyTesterTest
Tests run: 1, Failures: 0, Errors: 0, Skipped: 0, Time elapsed: 0.067 s - in org.eclipse.papyrus.cdo.internal.core.expressions.tests.EObjectPropertyTesterTest
testTest_isCDOObject(org.eclipse.papyrus.cdo.internal.core.expressions.tests.EObjectPropertyTesterTest)  Time elapsed: 0.064 s
Running org.eclipse.papyrus.cdo.internal.core.tests.CDOUtilsTest
Tests run: 4, Failures: 0, Errors: 0, Skipped: 0, Time elapsed: 0.006 s - in org.eclipse.papyrus.cdo.internal.core.tests.CDOUtilsTest
testIteratorEmptyReference(org.eclipse.papyrus.cdo.internal.core.tests.CDOUtilsTest)  Time elapsed: 0 s
testIteratorScalarAttribute(org.eclipse.papyrus.cdo.internal.core.tests.CDOUtilsTest)  Time elapsed: 0 s
testIteratorReferenceNonResolving(org.eclipse.papyrus.cdo.internal.core.tests.CDOUtilsTest)  Time elapsed: 0.003 s
testIteratorReferenceResolving(org.eclipse.papyrus.cdo.internal.core.tests.CDOUtilsTest)  Time elapsed: 0.002 s

Results:

Errors: 
org.eclipse.papyrus.cdo.internal.core.controlmode.tests.CDOControlModeTest.testControlOneResource(org.eclipse.papyrus.cdo.internal.core.controlmode.tests.CDOControlModeTest)
  Run 1: CDOControlModeTest.setControlModeStrategy:171 » Service Service Factory 'org.e...
  Run 2: CDOControlModeTest.restoreControlModeStrategy:181 » Service Service Factory 'o...

org.eclipse.papyrus.cdo.internal.core.controlmode.tests.CDOControlModeTest.testControlOneResource_newlyAddedObjects(org.eclipse.papyrus.cdo.internal.core.controlmode.tests.CDOControlModeTest)
  Run 1: CDOControlModeTest.setControlModeStrategy:171 » Service Service Factory 'org.e...
  Run 2: CDOControlModeTest.restoreControlModeStrategy:181 » Service Service Factory 'o...

org.eclipse.papyrus.cdo.internal.core.controlmode.tests.CDOControlModeTest.testUncontrolOneResource(org.eclipse.papyrus.cdo.internal.core.controlmode.tests.CDOControlModeTest)
  Run 1: CDOControlModeTest.setControlModeStrategy:171 » Service Service Factory 'org.e...
  Run 2: CDOControlModeTest.restoreControlModeStrategy:181 » Service Service Factory 'o...

  ModelImporterTest.testManyToOneImport:124->assertResource:188 » DiagnosticWrapped

Tests run: 65, Failures: 0, Errors: 4, Skipped: 0

[ERROR] There are test failures.

Please refer to /jobs/genie.papyrus/Papyrus-CDO/workspace/source/cdo/tests/org.eclipse.papyrus.cdo.core.tests/target/surefire-reports for the individual test results.
[INFO] 
[INFO] --- jacoco-maven-plugin:0.8.5:report (default-report) @ org.eclipse.papyrus.cdo.core.tests ---
[INFO] Loading execution data file /jobs/genie.papyrus/Papyrus-CDO/workspace/source/cdo/tests/org.eclipse.papyrus.cdo.core.tests/target/jacoco.exec
[INFO] Analyzed bundle 'org.eclipse.papyrus.cdo.core.tests' with 0 classes
[INFO] 
[INFO] ------< org.eclipse.papyrus.cdo:org.eclipse.papyrus.cdo.ui.tests >------
[INFO] Building org.eclipse.papyrus.cdo.ui.tests 1.2.0-SNAPSHOT         [30/35]
[INFO] ------------------------[ eclipse-test-plugin ]-------------------------
[INFO] 
[INFO] --- maven-clean-plugin:3.0.0:clean (default-clean) @ org.eclipse.papyrus.cdo.ui.tests ---
[INFO] 
[INFO] --- tycho-packaging-plugin:1.6.0:build-qualifier (default-build-qualifier) @ org.eclipse.papyrus.cdo.ui.tests ---
[INFO] The project's OSGi version is 1.2.0.202008071412
[INFO] 
[INFO] --- tycho-packaging-plugin:1.6.0:validate-id (default-validate-id) @ org.eclipse.papyrus.cdo.ui.tests ---
[INFO] 
[INFO] --- tycho-packaging-plugin:1.6.0:validate-version (default-validate-version) @ org.eclipse.papyrus.cdo.ui.tests ---
[INFO] 
[INFO] --- jacoco-maven-plugin:0.8.5:prepare-agent (default-prepare-agent) @ org.eclipse.papyrus.cdo.ui.tests ---
[INFO] tycho.testArgLine set to -javaagent:/home/hudson/genie.papyrus/.jenkins/jobs/Papyrus-CDO/workspace/.repository/org/jacoco/org.jacoco.agent/0.8.5/org.jacoco.agent-0.8.5-runtime.jar=destfile=/jobs/genie.papyrus/Papyrus-CDO/workspace/source/cdo/tests/org.eclipse.papyrus.cdo.ui.tests/target/jacoco.exec,includes=org.eclipse.papyrus.*,excludes=org.eclipse.uml2
[INFO] 
[INFO] --- maven-resources-plugin:2.7:resources (default-resources) @ org.eclipse.papyrus.cdo.ui.tests ---
[INFO] Using 'UTF-8' encoding to copy filtered resources.
[INFO] skip non existing resourceDirectory /jobs/genie.papyrus/Papyrus-CDO/workspace/source/cdo/tests/org.eclipse.papyrus.cdo.ui.tests/src/main/resources
[INFO] 
[INFO] --- tycho-compiler-plugin:1.6.0:compile (default-compile) @ org.eclipse.papyrus.cdo.ui.tests ---
[WARNING] The effective compiler target level 1.8 is incompatible with the following OSGi execution environments: [JavaSE-1.6 (assumes 1.6)] @ MavenProject: org.eclipse.papyrus.cdo:org.eclipse.papyrus.cdo.ui.tests:1.2.0-SNAPSHOT @ /jobs/genie.papyrus/Papyrus-CDO/workspace/source/cdo/tests/org.eclipse.papyrus.cdo.ui.tests/pom.xml
[INFO] Compiling 7 source files to /jobs/genie.papyrus/Papyrus-CDO/workspace/source/cdo/tests/org.eclipse.papyrus.cdo.ui.tests/target/classes
[WARNING] /jobs/genie.papyrus/Papyrus-CDO/workspace/source/cdo/tests/org.eclipse.papyrus.cdo.ui.tests/src/org/eclipse/papyrus/cdo/internal/ui/markers/tests/ModelValidationMarkersTest.java:[68] 
	assertThat("Did not find a marker.", marker, notNullValue());
	^^^^^^^^^^^^^^^^^^^^^^^^^^^^^^^^^^^^^^^^^^^^^^^^^^^^^^^^^^^^
The method assertThat(String, IPapyrusMarker, Matcher<? super IPapyrusMarker>) from the type Assert is deprecated
[WARNING] /jobs/genie.papyrus/Papyrus-CDO/workspace/source/cdo/tests/org.eclipse.papyrus.cdo.ui.tests/src/org/eclipse/papyrus/cdo/internal/ui/markers/tests/ModelValidationMarkersTest.java:[83] 
	assertThat("Did not find any markers.", markers.isEmpty(), is(false));
	^^^^^^^^^^^^^^^^^^^^^^^^^^^^^^^^^^^^^^^^^^^^^^^^^^^^^^^^^^^^^^^^^^^^^
The method assertThat(String, Boolean, Matcher<? super Boolean>) from the type Assert is deprecated
[WARNING] /jobs/genie.papyrus/Papyrus-CDO/workspace/source/cdo/tests/org.eclipse.papyrus.cdo.ui.tests/src/org/eclipse/papyrus/cdo/internal/ui/markers/tests/ModelValidationMarkersTest.java:[99] 
	assertThat("Found markers.", getMarkersMonitorService().getMarkers(getUMLModel().eResource(), null, true).isEmpty(), is(true));
	^^^^^^^^^^^^^^^^^^^^^^^^^^^^^^^^^^^^^^^^^^^^^^^^^^^^^^^^^^^^^^^^^^^^^^^^^^^^^^^^^^^^^^^^^^^^^^^^^^^^^^^^^^^^^^^^^^^^^^^^^^^^^^
The method assertThat(String, Boolean, Matcher<? super Boolean>) from the type Assert is deprecated
[WARNING] /jobs/genie.papyrus/Papyrus-CDO/workspace/source/cdo/tests/org.eclipse.papyrus.cdo.ui.tests/src/org/eclipse/papyrus/cdo/internal/ui/markers/tests/ModelValidationMarkersTest.java:[114] 
	assertThat("Did not find a marker.", marker, notNullValue());
	^^^^^^^^^^^^^^^^^^^^^^^^^^^^^^^^^^^^^^^^^^^^^^^^^^^^^^^^^^^^
The method assertThat(String, IPapyrusMarker, Matcher<? super IPapyrusMarker>) from the type Assert is deprecated
[WARNING] /jobs/genie.papyrus/Papyrus-CDO/workspace/source/cdo/tests/org.eclipse.papyrus.cdo.ui.tests/src/org/eclipse/papyrus/cdo/ui/tests/AbstractPapyrusCDOUITest.java:[212] 
	assertThat(result, instanceOf(IMultiDiagramEditor.class));
	^^^^^^^^^^^^^^^^^^^^^^^^^^^^^^^^^^^^^^^^^^^^^^^^^^^^^^^^^
The method assertThat(IEditorPart, Matcher<? super IEditorPart>) from the type Assert is deprecated
[WARNING] /jobs/genie.papyrus/Papyrus-CDO/workspace/source/cdo/tests/org.eclipse.papyrus.cdo.ui.tests/src/org/eclipse/papyrus/cdo/ui/tests/AbstractPapyrusCDOUITest.java:[296] 
	assertThat("UML model not found.", resource, notNullValue());
	^^^^^^^^^^^^^^^^^^^^^^^^^^^^^^^^^^^^^^^^^^^^^^^^^^^^^^^^^^^^
The method assertThat(String, Resource, Matcher<? super Resource>) from the type Assert is deprecated
[WARNING] /jobs/genie.papyrus/Papyrus-CDO/workspace/source/cdo/tests/org.eclipse.papyrus.cdo.ui.tests/src/org/eclipse/papyrus/cdo/ui/tests/AbstractPapyrusCDOUITest.java:[325] 
	assertThat("UML element not found.", result, notNullValue());
	^^^^^^^^^^^^^^^^^^^^^^^^^^^^^^^^^^^^^^^^^^^^^^^^^^^^^^^^^^^^
The method assertThat(String, N, Matcher<? super N>) from the type Assert is deprecated
[WARNING] /jobs/genie.papyrus/Papyrus-CDO/workspace/source/cdo/tests/org.eclipse.papyrus.cdo.ui.tests/src/org/eclipse/papyrus/cdo/ui/tests/AbstractPapyrusCDOUITest.java:[351] 
	assertThat("Required view not found.", result, notNullValue());
	^^^^^^^^^^^^^^^^^^^^^^^^^^^^^^^^^^^^^^^^^^^^^^^^^^^^^^^^^^^^^^
The method assertThat(String, View, Matcher<? super View>) from the type Assert is deprecated
[WARNING] /jobs/genie.papyrus/Papyrus-CDO/workspace/source/cdo/tests/org.eclipse.papyrus.cdo.ui.tests/src/org/eclipse/papyrus/cdo/ui/tests/AbstractPapyrusCDOUITest.java:[362] 
	assertThat("Required edit-part not found.", result, notNullValue());
	^^^^^^^^^^^^^^^^^^^^^^^^^^^^^^^^^^^^^^^^^^^^^^^^^^^^^^^^^^^^^^^^^^^
The method assertThat(String, EditPart, Matcher<? super EditPart>) from the type Assert is deprecated
[WARNING] /jobs/genie.papyrus/Papyrus-CDO/workspace/source/cdo/tests/org.eclipse.papyrus.cdo.ui.tests/src/org/eclipse/papyrus/cdo/internal/ui/editors/tests/BasicEditorTest.java:[25] 
	import org.eclipse.emf.cdo.util.CommitException;
	       ^^^^^^^^^^^^^^^^^^^^^^^^^^^^^^^^^^^^^^^^
The import org.eclipse.emf.cdo.util.CommitException is never used
[WARNING] /jobs/genie.papyrus/Papyrus-CDO/workspace/source/cdo/tests/org.eclipse.papyrus.cdo.ui.tests/src/org/eclipse/papyrus/cdo/internal/ui/editors/tests/BasicEditorTest.java:[26] 
	import org.eclipse.emf.cdo.util.ConcurrentAccessException;
	       ^^^^^^^^^^^^^^^^^^^^^^^^^^^^^^^^^^^^^^^^^^^^^^^^^^
The import org.eclipse.emf.cdo.util.ConcurrentAccessException is never used
[WARNING] /jobs/genie.papyrus/Papyrus-CDO/workspace/source/cdo/tests/org.eclipse.papyrus.cdo.ui.tests/src/org/eclipse/papyrus/cdo/internal/ui/editors/tests/BasicEditorTest.java:[39] 
	import org.eclipse.papyrus.infra.core.utils.AdapterUtils;
	       ^^^^^^^^^^^^^^^^^^^^^^^^^^^^^^^^^^^^^^^^^^^^^^^^^
The type AdapterUtils is deprecated
[WARNING] /jobs/genie.papyrus/Papyrus-CDO/workspace/source/cdo/tests/org.eclipse.papyrus.cdo.ui.tests/src/org/eclipse/papyrus/cdo/internal/ui/editors/tests/BasicEditorTest.java:[82] 
	assertThat(editPart.isActive(), is(true));
	^^^^^^^^^^^^^^^^^^^^^^^^^^^^^^^^^^^^^^^^^
The method assertThat(Boolean, Matcher<? super Boolean>) from the type Assert is deprecated
[WARNING] /jobs/genie.papyrus/Papyrus-CDO/workspace/source/cdo/tests/org.eclipse.papyrus.cdo.ui.tests/src/org/eclipse/papyrus/cdo/internal/ui/editors/tests/BasicEditorTest.java:[94] 
	assertThat(canLock, is(true));
	^^^^^^^^^^^^^^^^^^^^^^^^^^^^^
The method assertThat(Boolean, Matcher<? super Boolean>) from the type Assert is deprecated
[WARNING] /jobs/genie.papyrus/Papyrus-CDO/workspace/source/cdo/tests/org.eclipse.papyrus.cdo.ui.tests/src/org/eclipse/papyrus/cdo/internal/ui/editors/tests/BasicEditorTest.java:[108] 
	assertThat(isLocked, is(true));
	^^^^^^^^^^^^^^^^^^^^^^^^^^^^^^
The method assertThat(Boolean, Matcher<? super Boolean>) from the type Assert is deprecated
[WARNING] /jobs/genie.papyrus/Papyrus-CDO/workspace/source/cdo/tests/org.eclipse.papyrus.cdo.ui.tests/src/org/eclipse/papyrus/cdo/internal/ui/editors/tests/BasicEditorTest.java:[123] 
	assertThat(remote, notNullValue());
	^^^^^^^^^^^^^^^^^^^^^^^^^^^^^^^^^^
The method assertThat(EObject, Matcher<? super EObject>) from the type Assert is deprecated
[WARNING] /jobs/genie.papyrus/Papyrus-CDO/workspace/source/cdo/tests/org.eclipse.papyrus.cdo.ui.tests/src/org/eclipse/papyrus/cdo/internal/ui/editors/tests/BasicEditorTest.java:[131] 
	assertThat(isLocked, is(true));
	^^^^^^^^^^^^^^^^^^^^^^^^^^^^^^
The method assertThat(Boolean, Matcher<? super Boolean>) from the type Assert is deprecated
[WARNING] /jobs/genie.papyrus/Papyrus-CDO/workspace/source/cdo/tests/org.eclipse.papyrus.cdo.ui.tests/src/org/eclipse/papyrus/cdo/internal/ui/editors/tests/BasicEditorTest.java:[153] 
	assertThat(remote, notNullValue());
	^^^^^^^^^^^^^^^^^^^^^^^^^^^^^^^^^^
The method assertThat(Class, Matcher<? super Class>) from the type Assert is deprecated
[WARNING] /jobs/genie.papyrus/Papyrus-CDO/workspace/source/cdo/tests/org.eclipse.papyrus.cdo.ui.tests/src/org/eclipse/papyrus/cdo/internal/ui/editors/tests/BasicEditorTest.java:[162] 
	assertThat(isConflicting, is(true));
	^^^^^^^^^^^^^^^^^^^^^^^^^^^^^^^^^^^
The method assertThat(Boolean, Matcher<? super Boolean>) from the type Assert is deprecated
[WARNING] /jobs/genie.papyrus/Papyrus-CDO/workspace/source/cdo/tests/org.eclipse.papyrus.cdo.ui.tests/src/org/eclipse/papyrus/cdo/internal/ui/editors/tests/BasicEditorTest.java:[187] 
	assertThat(remote, notNullValue());
	^^^^^^^^^^^^^^^^^^^^^^^^^^^^^^^^^^
The method assertThat(Class, Matcher<? super Class>) from the type Assert is deprecated
[WARNING] /jobs/genie.papyrus/Papyrus-CDO/workspace/source/cdo/tests/org.eclipse.papyrus.cdo.ui.tests/src/org/eclipse/papyrus/cdo/internal/ui/editors/tests/BasicEditorTest.java:[197] 
	assertThat(isConflicting, is(true));
	^^^^^^^^^^^^^^^^^^^^^^^^^^^^^^^^^^^
The method assertThat(Boolean, Matcher<? super Boolean>) from the type Assert is deprecated
[WARNING] /jobs/genie.papyrus/Papyrus-CDO/workspace/source/cdo/tests/org.eclipse.papyrus.cdo.ui.tests/src/org/eclipse/papyrus/cdo/internal/ui/editors/tests/BasicEditorTest.java:[208] 
	Optional<ISashWindowsContainer> sashContainer = AdapterUtils.adapt(openEditor(), ISashWindowsContainer.class);
	                                                ^^^^^^^^^^^^
The type AdapterUtils is deprecated
[WARNING] /jobs/genie.papyrus/Papyrus-CDO/workspace/source/cdo/tests/org.eclipse.papyrus.cdo.ui.tests/src/org/eclipse/papyrus/cdo/internal/ui/editors/tests/BasicEditorTest.java:[208] 
	Optional<ISashWindowsContainer> sashContainer = AdapterUtils.adapt(openEditor(), ISashWindowsContainer.class);
	                                                             ^^^^^^^^^^^^^^^^^^^^^^^^^^^^^^^^^^^^^^^^^^^^^^^^
The method adapt(Object, Class<ISashWindowsContainer>) from the type AdapterUtils is deprecated
[WARNING] /jobs/genie.papyrus/Papyrus-CDO/workspace/source/cdo/tests/org.eclipse.papyrus.cdo.ui.tests/src/org/eclipse/papyrus/cdo/internal/ui/markers/tests/CDOPapyrusMarkerTest.java:[69] 
	assertThat(fixture.getAttribute(EValidator.URI_ATTRIBUTE), is((Object)URI));
	^^^^^^^^^^^^^^^^^^^^^^^^^^^^^^^^^^^^^^^^^^^^^^^^^^^^^^^^^^^^^^^^^^^^^^^^^^^
The method assertThat(Object, Matcher<? super Object>) from the type Assert is deprecated
[WARNING] /jobs/genie.papyrus/Papyrus-CDO/workspace/source/cdo/tests/org.eclipse.papyrus.cdo.ui.tests/src/org/eclipse/papyrus/cdo/internal/ui/markers/tests/CDOPapyrusMarkerTest.java:[70] 
	assertThat(fixture.getAttribute(EValidator.URI_ATTRIBUTE, ""), is(URI));
	^^^^^^^^^^^^^^^^^^^^^^^^^^^^^^^^^^^^^^^^^^^^^^^^^^^^^^^^^^^^^^^^^^^^^^^
The method assertThat(String, Matcher<? super String>) from the type Assert is deprecated
[WARNING] /jobs/genie.papyrus/Papyrus-CDO/workspace/source/cdo/tests/org.eclipse.papyrus.cdo.ui.tests/src/org/eclipse/papyrus/cdo/internal/ui/markers/tests/CDOPapyrusMarkerTest.java:[75] 
	assertThat(fixture.getAttribute(IPapyrusMarker.MESSAGE), is((Object)MESSAGE));
	^^^^^^^^^^^^^^^^^^^^^^^^^^^^^^^^^^^^^^^^^^^^^^^^^^^^^^^^^^^^^^^^^^^^^^^^^^^^^
The method assertThat(Object, Matcher<? super Object>) from the type Assert is deprecated
[WARNING] /jobs/genie.papyrus/Papyrus-CDO/workspace/source/cdo/tests/org.eclipse.papyrus.cdo.ui.tests/src/org/eclipse/papyrus/cdo/internal/ui/markers/tests/CDOPapyrusMarkerTest.java:[76] 
	assertThat(fixture.getAttribute(IPapyrusMarker.MESSAGE, ""), is(MESSAGE));
	^^^^^^^^^^^^^^^^^^^^^^^^^^^^^^^^^^^^^^^^^^^^^^^^^^^^^^^^^^^^^^^^^^^^^^^^^
The method assertThat(String, Matcher<? super String>) from the type Assert is deprecated
[WARNING] /jobs/genie.papyrus/Papyrus-CDO/workspace/source/cdo/tests/org.eclipse.papyrus.cdo.ui.tests/src/org/eclipse/papyrus/cdo/internal/ui/markers/tests/CDOPapyrusMarkerTest.java:[81] 
	assertThat(fixture.getAttribute(IPapyrusMarker.SEVERITY), is((Object)SEVERITY));
	^^^^^^^^^^^^^^^^^^^^^^^^^^^^^^^^^^^^^^^^^^^^^^^^^^^^^^^^^^^^^^^^^^^^^^^^^^^^^^^
The method assertThat(Object, Matcher<? super Object>) from the type Assert is deprecated
[WARNING] /jobs/genie.papyrus/Papyrus-CDO/workspace/source/cdo/tests/org.eclipse.papyrus.cdo.ui.tests/src/org/eclipse/papyrus/cdo/internal/ui/markers/tests/CDOPapyrusMarkerTest.java:[82] 
	assertThat(fixture.getAttribute(IPapyrusMarker.SEVERITY, -1), is(SEVERITY));
	^^^^^^^^^^^^^^^^^^^^^^^^^^^^^^^^^^^^^^^^^^^^^^^^^^^^^^^^^^^^^^^^^^^^^^^^^^^
The method assertThat(Integer, Matcher<? super Integer>) from the type Assert is deprecated
[WARNING] /jobs/genie.papyrus/Papyrus-CDO/workspace/source/cdo/tests/org.eclipse.papyrus.cdo.ui.tests/src/org/eclipse/papyrus/cdo/internal/ui/markers/tests/CDOPapyrusMarkerTest.java:[87] 
	assertThat(fixture.getAttribute(ATTR_BOOLEAN), is((Object)ATTR_BOOLEAN_VALUE));
	^^^^^^^^^^^^^^^^^^^^^^^^^^^^^^^^^^^^^^^^^^^^^^^^^^^^^^^^^^^^^^^^^^^^^^^^^^^^^^
The method assertThat(Object, Matcher<? super Object>) from the type Assert is deprecated
[WARNING] /jobs/genie.papyrus/Papyrus-CDO/workspace/source/cdo/tests/org.eclipse.papyrus.cdo.ui.tests/src/org/eclipse/papyrus/cdo/internal/ui/markers/tests/CDOPapyrusMarkerTest.java:[88] 
	assertThat(fixture.getAttribute(ATTR_BOOLEAN, false), is(ATTR_BOOLEAN_VALUE));
	^^^^^^^^^^^^^^^^^^^^^^^^^^^^^^^^^^^^^^^^^^^^^^^^^^^^^^^^^^^^^^^^^^^^^^^^^^^^^
The method assertThat(Boolean, Matcher<? super Boolean>) from the type Assert is deprecated
[WARNING] /jobs/genie.papyrus/Papyrus-CDO/workspace/source/cdo/tests/org.eclipse.papyrus.cdo.ui.tests/src/org/eclipse/papyrus/cdo/internal/ui/markers/tests/CDOPapyrusMarkerTest.java:[93] 
	assertThat(fixture.getAttribute(ATTR_INTEGER), is((Object)ATTR_INTEGER_VALUE));
	^^^^^^^^^^^^^^^^^^^^^^^^^^^^^^^^^^^^^^^^^^^^^^^^^^^^^^^^^^^^^^^^^^^^^^^^^^^^^^
The method assertThat(Object, Matcher<? super Object>) from the type Assert is deprecated
[WARNING] /jobs/genie.papyrus/Papyrus-CDO/workspace/source/cdo/tests/org.eclipse.papyrus.cdo.ui.tests/src/org/eclipse/papyrus/cdo/internal/ui/markers/tests/CDOPapyrusMarkerTest.java:[94] 
	assertThat(fixture.getAttribute(ATTR_INTEGER, 0), is(ATTR_INTEGER_VALUE));
	^^^^^^^^^^^^^^^^^^^^^^^^^^^^^^^^^^^^^^^^^^^^^^^^^^^^^^^^^^^^^^^^^^^^^^^^^
The method assertThat(Integer, Matcher<? super Integer>) from the type Assert is deprecated
[WARNING] /jobs/genie.papyrus/Papyrus-CDO/workspace/source/cdo/tests/org.eclipse.papyrus.cdo.ui.tests/src/org/eclipse/papyrus/cdo/internal/ui/markers/tests/CDOPapyrusMarkerTest.java:[99] 
	assertThat(fixture.getAttribute(ATTR_STRING), is((Object)ATTR_STRING_VALUE));
	^^^^^^^^^^^^^^^^^^^^^^^^^^^^^^^^^^^^^^^^^^^^^^^^^^^^^^^^^^^^^^^^^^^^^^^^^^^^
The method assertThat(Object, Matcher<? super Object>) from the type Assert is deprecated
[WARNING] /jobs/genie.papyrus/Papyrus-CDO/workspace/source/cdo/tests/org.eclipse.papyrus.cdo.ui.tests/src/org/eclipse/papyrus/cdo/internal/ui/markers/tests/CDOPapyrusMarkerTest.java:[100] 
	assertThat(fixture.getAttribute(ATTR_STRING, ""), is(ATTR_STRING_VALUE));
	^^^^^^^^^^^^^^^^^^^^^^^^^^^^^^^^^^^^^^^^^^^^^^^^^^^^^^^^^^^^^^^^^^^^^^^^
The method assertThat(String, Matcher<? super String>) from the type Assert is deprecated
[WARNING] /jobs/genie.papyrus/Papyrus-CDO/workspace/source/cdo/tests/org.eclipse.papyrus.cdo.ui.tests/src/org/eclipse/papyrus/cdo/internal/ui/markers/tests/CDOPapyrusMarkerTest.java:[107] 
	assertThat(attributes.get(EValidator.URI_ATTRIBUTE), is((Object)URI));
	^^^^^^^^^^^^^^^^^^^^^^^^^^^^^^^^^^^^^^^^^^^^^^^^^^^^^^^^^^^^^^^^^^^^^
The method assertThat(capture#2-of ?, Matcher<? super capture#2-of ?>) from the type Assert is deprecated
[WARNING] /jobs/genie.papyrus/Papyrus-CDO/workspace/source/cdo/tests/org.eclipse.papyrus.cdo.ui.tests/src/org/eclipse/papyrus/cdo/internal/ui/markers/tests/CDOPapyrusMarkerTest.java:[108] 
	assertThat(attributes.get(IPapyrusMarker.MESSAGE), is((Object)MESSAGE));
	^^^^^^^^^^^^^^^^^^^^^^^^^^^^^^^^^^^^^^^^^^^^^^^^^^^^^^^^^^^^^^^^^^^^^^^
The method assertThat(capture#3-of ?, Matcher<? super capture#3-of ?>) from the type Assert is deprecated
[WARNING] /jobs/genie.papyrus/Papyrus-CDO/workspace/source/cdo/tests/org.eclipse.papyrus.cdo.ui.tests/src/org/eclipse/papyrus/cdo/internal/ui/markers/tests/CDOPapyrusMarkerTest.java:[109] 
	assertThat(attributes.get(IPapyrusMarker.SEVERITY), is((Object)SEVERITY));
	^^^^^^^^^^^^^^^^^^^^^^^^^^^^^^^^^^^^^^^^^^^^^^^^^^^^^^^^^^^^^^^^^^^^^^^^^
The method assertThat(capture#4-of ?, Matcher<? super capture#4-of ?>) from the type Assert is deprecated
[WARNING] /jobs/genie.papyrus/Papyrus-CDO/workspace/source/cdo/tests/org.eclipse.papyrus.cdo.ui.tests/src/org/eclipse/papyrus/cdo/internal/ui/markers/tests/CDOPapyrusMarkerTest.java:[111] 
	assertThat(attributes.get(ATTR_BOOLEAN), is((Object)ATTR_BOOLEAN_VALUE));
	^^^^^^^^^^^^^^^^^^^^^^^^^^^^^^^^^^^^^^^^^^^^^^^^^^^^^^^^^^^^^^^^^^^^^^^^
The method assertThat(capture#5-of ?, Matcher<? super capture#5-of ?>) from the type Assert is deprecated
[WARNING] /jobs/genie.papyrus/Papyrus-CDO/workspace/source/cdo/tests/org.eclipse.papyrus.cdo.ui.tests/src/org/eclipse/papyrus/cdo/internal/ui/markers/tests/CDOPapyrusMarkerTest.java:[112] 
	assertThat(attributes.get(ATTR_INTEGER), is((Object)ATTR_INTEGER_VALUE));
	^^^^^^^^^^^^^^^^^^^^^^^^^^^^^^^^^^^^^^^^^^^^^^^^^^^^^^^^^^^^^^^^^^^^^^^^
The method assertThat(capture#6-of ?, Matcher<? super capture#6-of ?>) from the type Assert is deprecated
[WARNING] /jobs/genie.papyrus/Papyrus-CDO/workspace/source/cdo/tests/org.eclipse.papyrus.cdo.ui.tests/src/org/eclipse/papyrus/cdo/internal/ui/markers/tests/CDOPapyrusMarkerTest.java:[113] 
	assertThat(attributes.get(ATTR_STRING), is((Object)ATTR_STRING_VALUE));
	^^^^^^^^^^^^^^^^^^^^^^^^^^^^^^^^^^^^^^^^^^^^^^^^^^^^^^^^^^^^^^^^^^^^^^
The method assertThat(capture#7-of ?, Matcher<? super capture#7-of ?>) from the type Assert is deprecated
[WARNING] /jobs/genie.papyrus/Papyrus-CDO/workspace/source/cdo/tests/org.eclipse.papyrus.cdo.ui.tests/src/org/eclipse/papyrus/cdo/internal/ui/editors/tests/DawnEditorAdapterTest.java:[60] 
	assertThat(fixture, notNullValue());
	^^^^^^^^^^^^^^^^^^^^^^^^^^^^^^^^^^^
The method assertThat(IDawnEditor, Matcher<? super IDawnEditor>) from the type Assert is deprecated
[WARNING] /jobs/genie.papyrus/Papyrus-CDO/workspace/source/cdo/tests/org.eclipse.papyrus.cdo.ui.tests/src/org/eclipse/papyrus/cdo/internal/ui/editors/tests/DawnEditorAdapterTest.java:[66] 
	assertThat(fixture.getView(), sameInstance((CDOView)transaction));
	^^^^^^^^^^^^^^^^^^^^^^^^^^^^^^^^^^^^^^^^^^^^^^^^^^^^^^^^^^^^^^^^^
The method assertThat(CDOView, Matcher<? super CDOView>) from the type Assert is deprecated
[WARNING] /jobs/genie.papyrus/Papyrus-CDO/workspace/source/cdo/tests/org.eclipse.papyrus.cdo.ui.tests/src/org/eclipse/papyrus/cdo/internal/ui/editors/tests/DawnEditorAdapterTest.java:[71] 
	assertThat(fixture.getContributorID(), is("org.eclipse.papyrus.uml.diagram.clazz.part.UMLDiagramEditorID"));
	^^^^^^^^^^^^^^^^^^^^^^^^^^^^^^^^^^^^^^^^^^^^^^^^^^^^^^^^^^^^^^^^^^^^^^^^^^^^^^^^^^^^^^^^^^^^^^^^^^^^^^^^^^^
The method assertThat(String, Matcher<? super String>) from the type Assert is deprecated
[WARNING] /jobs/genie.papyrus/Papyrus-CDO/workspace/source/cdo/tests/org.eclipse.papyrus.cdo.ui.tests/src/org/eclipse/papyrus/cdo/internal/ui/editors/tests/DawnEditorAdapterTest.java:[77] 
	assertThat(getEditor().isDirty(), is(false));
	^^^^^^^^^^^^^^^^^^^^^^^^^^^^^^^^^^^^^^^^^^^^
The method assertThat(Boolean, Matcher<? super Boolean>) from the type Assert is deprecated
[WARNING] /jobs/genie.papyrus/Papyrus-CDO/workspace/source/cdo/tests/org.eclipse.papyrus.cdo.ui.tests/src/org/eclipse/papyrus/cdo/internal/ui/editors/tests/DawnEditorAdapterTest.java:[84] 
	assertThat(test.getAndClearPropertyID(), is(IEditorPart.PROP_DIRTY));
	^^^^^^^^^^^^^^^^^^^^^^^^^^^^^^^^^^^^^^^^^^^^^^^^^^^^^^^^^^^^^^^^^^^^
The method assertThat(Integer, Matcher<? super Integer>) from the type Assert is deprecated
[WARNING] /jobs/genie.papyrus/Papyrus-CDO/workspace/source/cdo/tests/org.eclipse.papyrus.cdo.ui.tests/src/org/eclipse/papyrus/cdo/internal/ui/editors/tests/DawnEditorAdapterTest.java:[90] 
	assertThat(expected, notNullValue());
	^^^^^^^^^^^^^^^^^^^^^^^^^^^^^^^^^^^^
The method assertThat(Object, Matcher<? super Object>) from the type Assert is deprecated
[WARNING] /jobs/genie.papyrus/Papyrus-CDO/workspace/source/cdo/tests/org.eclipse.papyrus.cdo.ui.tests/src/org/eclipse/papyrus/cdo/internal/ui/editors/tests/DawnEditorAdapterTest.java:[93] 
	assertThat(adapter, is(expected));
	^^^^^^^^^^^^^^^^^^^^^^^^^^^^^^^^^
The method assertThat(Object, Matcher<? super Object>) from the type Assert is deprecated
[WARNING] /jobs/genie.papyrus/Papyrus-CDO/workspace/source/cdo/tests/org.eclipse.papyrus.cdo.ui.tests/src/org/eclipse/papyrus/cdo/internal/ui/editors/tests/DawnEditorAdapterTest.java:[107] 
	assertThat(fixture.isDirty(), is(true));
	^^^^^^^^^^^^^^^^^^^^^^^^^^^^^^^^^^^^^^^
The method assertThat(Boolean, Matcher<? super Boolean>) from the type Assert is deprecated
[WARNING] /jobs/genie.papyrus/Papyrus-CDO/workspace/source/cdo/tests/org.eclipse.papyrus.cdo.ui.tests/src/org/eclipse/papyrus/cdo/internal/ui/editors/tests/DawnEditorAdapterTest.java:[111] 
	assertThat(fixture.isDirty(), is(false));
	^^^^^^^^^^^^^^^^^^^^^^^^^^^^^^^^^^^^^^^^
The method assertThat(Boolean, Matcher<? super Boolean>) from the type Assert is deprecated
[WARNING] /jobs/genie.papyrus/Papyrus-CDO/workspace/source/cdo/tests/org.eclipse.papyrus.cdo.ui.tests/src/org/eclipse/papyrus/cdo/internal/ui/editors/tests/DawnEditorAdapterTest.java:[116] 
	assertThat(fixture.getDawnEditorSupport(), instanceOf(PapyrusGMFEditorSupport.class));
	^^^^^^^^^^^^^^^^^^^^^^^^^^^^^^^^^^^^^^^^^^^^^^^^^^^^^^^^^^^^^^^^^^^^^^^^^^^^^^^^^^^^^
The method assertThat(IDawnEditorSupport, Matcher<? super IDawnEditorSupport>) from the type Assert is deprecated
[WARNING] /jobs/genie.papyrus/Papyrus-CDO/workspace/source/cdo/tests/org.eclipse.papyrus.cdo.ui.tests/src/org/eclipse/papyrus/cdo/internal/ui/editors/tests/DawnEditorAdapterTest.java:[122] 
	assertThat(input, notNullValue());
	^^^^^^^^^^^^^^^^^^^^^^^^^^^^^^^^^
The method assertThat(IEditorInput, Matcher<? super IEditorInput>) from the type Assert is deprecated
[WARNING] /jobs/genie.papyrus/Papyrus-CDO/workspace/source/cdo/tests/org.eclipse.papyrus.cdo.ui.tests/src/org/eclipse/papyrus/cdo/internal/ui/editors/tests/DawnEditorAdapterTest.java:[123] 
	assertThat(input, is(getDiagramEditor().getEditorInput()));
	^^^^^^^^^^^^^^^^^^^^^^^^^^^^^^^^^^^^^^^^^^^^^^^^^^^^^^^^^^
The method assertThat(IEditorInput, Matcher<? super IEditorInput>) from the type Assert is deprecated
[WARNING] /jobs/genie.papyrus/Papyrus-CDO/workspace/source/cdo/tests/org.eclipse.papyrus.cdo.ui.tests/src/org/eclipse/papyrus/cdo/internal/ui/editors/tests/DawnEditorAdapterTest.java:[129] 
	assertThat(site, notNullValue());
	^^^^^^^^^^^^^^^^^^^^^^^^^^^^^^^^
The method assertThat(IEditorSite, Matcher<? super IEditorSite>) from the type Assert is deprecated
[WARNING] /jobs/genie.papyrus/Papyrus-CDO/workspace/source/cdo/tests/org.eclipse.papyrus.cdo.ui.tests/src/org/eclipse/papyrus/cdo/internal/ui/editors/tests/DawnEditorAdapterTest.java:[130] 
	assertThat(site, is(getDiagramEditor().getEditorSite()));
	^^^^^^^^^^^^^^^^^^^^^^^^^^^^^^^^^^^^^^^^^^^^^^^^^^^^^^^^
The method assertThat(IEditorSite, Matcher<? super IEditorSite>) from the type Assert is deprecated
[WARNING] /jobs/genie.papyrus/Papyrus-CDO/workspace/source/cdo/tests/org.eclipse.papyrus.cdo.ui.tests/src/org/eclipse/papyrus/cdo/internal/ui/editors/tests/DawnEditorAdapterTest.java:[143] 
	assertThat(test.getAndClearPropertyID(), is(IEditorPart.PROP_DIRTY));
	^^^^^^^^^^^^^^^^^^^^^^^^^^^^^^^^^^^^^^^^^^^^^^^^^^^^^^^^^^^^^^^^^^^^
The method assertThat(Integer, Matcher<? super Integer>) from the type Assert is deprecated
[WARNING] /jobs/genie.papyrus/Papyrus-CDO/workspace/source/cdo/tests/org.eclipse.papyrus.cdo.ui.tests/src/org/eclipse/papyrus/cdo/internal/ui/editors/tests/DawnEditorAdapterTest.java:[148] 
	assertThat(test.getAndClearPropertyID(), is(-1));
	^^^^^^^^^^^^^^^^^^^^^^^^^^^^^^^^^^^^^^^^^^^^^^^^
The method assertThat(Integer, Matcher<? super Integer>) from the type Assert is deprecated
[WARNING] /jobs/genie.papyrus/Papyrus-CDO/workspace/source/cdo/tests/org.eclipse.papyrus.cdo.ui.tests/src/org/eclipse/papyrus/cdo/internal/ui/editors/tests/DawnEditorAdapterTest.java:[154] 
	assertThat(site, notNullValue());
	^^^^^^^^^^^^^^^^^^^^^^^^^^^^^^^^
The method assertThat(IWorkbenchPartSite, Matcher<? super IWorkbenchPartSite>) from the type Assert is deprecated
[WARNING] /jobs/genie.papyrus/Papyrus-CDO/workspace/source/cdo/tests/org.eclipse.papyrus.cdo.ui.tests/src/org/eclipse/papyrus/cdo/internal/ui/editors/tests/DawnEditorAdapterTest.java:[155] 
	assertThat(site, is(getDiagramEditor().getSite()));
	^^^^^^^^^^^^^^^^^^^^^^^^^^^^^^^^^^^^^^^^^^^^^^^^^^
The method assertThat(IWorkbenchPartSite, Matcher<? super IWorkbenchPartSite>) from the type Assert is deprecated
[WARNING] /jobs/genie.papyrus/Papyrus-CDO/workspace/source/cdo/tests/org.eclipse.papyrus.cdo.ui.tests/src/org/eclipse/papyrus/cdo/internal/ui/editors/tests/DawnEditorAdapterTest.java:[161] 
	assertThat(title, notNullValue());
	^^^^^^^^^^^^^^^^^^^^^^^^^^^^^^^^^
The method assertThat(String, Matcher<? super String>) from the type Assert is deprecated
[WARNING] /jobs/genie.papyrus/Papyrus-CDO/workspace/source/cdo/tests/org.eclipse.papyrus.cdo.ui.tests/src/org/eclipse/papyrus/cdo/internal/ui/editors/tests/DawnEditorAdapterTest.java:[162] 
	assertThat(title, is(getDiagramEditor().getTitle()));
	^^^^^^^^^^^^^^^^^^^^^^^^^^^^^^^^^^^^^^^^^^^^^^^^^^^^
The method assertThat(String, Matcher<? super String>) from the type Assert is deprecated
[WARNING] /jobs/genie.papyrus/Papyrus-CDO/workspace/source/cdo/tests/org.eclipse.papyrus.cdo.ui.tests/src/org/eclipse/papyrus/cdo/internal/ui/editors/tests/DawnEditorAdapterTest.java:[168] 
	assertThat(image, notNullValue());
	^^^^^^^^^^^^^^^^^^^^^^^^^^^^^^^^^
The method assertThat(Image, Matcher<? super Image>) from the type Assert is deprecated
[WARNING] /jobs/genie.papyrus/Papyrus-CDO/workspace/source/cdo/tests/org.eclipse.papyrus.cdo.ui.tests/src/org/eclipse/papyrus/cdo/internal/ui/editors/tests/DawnEditorAdapterTest.java:[169] 
	assertThat(image, is(getDiagramEditor().getTitleImage()));
	^^^^^^^^^^^^^^^^^^^^^^^^^^^^^^^^^^^^^^^^^^^^^^^^^^^^^^^^^
The method assertThat(Image, Matcher<? super Image>) from the type Assert is deprecated
[WARNING] /jobs/genie.papyrus/Papyrus-CDO/workspace/source/cdo/tests/org.eclipse.papyrus.cdo.ui.tests/src/org/eclipse/papyrus/cdo/internal/ui/editors/tests/DawnEditorAdapterTest.java:[175] 
	assertThat(title, notNullValue());
	^^^^^^^^^^^^^^^^^^^^^^^^^^^^^^^^^
The method assertThat(String, Matcher<? super String>) from the type Assert is deprecated
[WARNING] /jobs/genie.papyrus/Papyrus-CDO/workspace/source/cdo/tests/org.eclipse.papyrus.cdo.ui.tests/src/org/eclipse/papyrus/cdo/internal/ui/editors/tests/DawnEditorAdapterTest.java:[176] 
	assertThat(title, is(getDiagramEditor().getTitleToolTip()));
	^^^^^^^^^^^^^^^^^^^^^^^^^^^^^^^^^^^^^^^^^^^^^^^^^^^^^^^^^^^
The method assertThat(String, Matcher<? super String>) from the type Assert is deprecated
[WARNING] /jobs/genie.papyrus/Papyrus-CDO/workspace/source/cdo/tests/org.eclipse.papyrus.cdo.ui.tests/src/org/eclipse/papyrus/cdo/internal/ui/editors/tests/DawnEditorAdapterTest.java:[185] 
	assertThat(getWorkbenchPage().getActivePart(), not((IWorkbenchPart)getEditor()));
	^^^^^^^^^^^^^^^^^^^^^^^^^^^^^^^^^^^^^^^^^^^^^^^^^^^^^^^^^^^^^^^^^^^^^^^^^^^^^^^^
The method assertThat(IWorkbenchPart, Matcher<? super IWorkbenchPart>) from the type Assert is deprecated
[WARNING] /jobs/genie.papyrus/Papyrus-CDO/workspace/source/cdo/tests/org.eclipse.papyrus.cdo.ui.tests/src/org/eclipse/papyrus/cdo/internal/ui/editors/tests/DawnEditorAdapterTest.java:[190] 
	assertThat(getWorkbenchPage().getActivePart(), is((IWorkbenchPart)getEditor()));
	^^^^^^^^^^^^^^^^^^^^^^^^^^^^^^^^^^^^^^^^^^^^^^^^^^^^^^^^^^^^^^^^^^^^^^^^^^^^^^^
The method assertThat(IWorkbenchPart, Matcher<? super IWorkbenchPart>) from the type Assert is deprecated
[WARNING] /jobs/genie.papyrus/Papyrus-CDO/workspace/source/cdo/tests/org.eclipse.papyrus.cdo.ui.tests/src/org/eclipse/papyrus/cdo/internal/ui/editors/tests/DawnEditorAdapterTest.java:[228] 
	assertThat(test.getAndClearCommitted(), is(true));
	^^^^^^^^^^^^^^^^^^^^^^^^^^^^^^^^^^^^^^^^^^^^^^^^^
The method assertThat(Boolean, Matcher<? super Boolean>) from the type Assert is deprecated
68 problems (68 warnings)
[INFO] 
[INFO] --- maven-resources-plugin:2.7:testResources (default-testResources) @ org.eclipse.papyrus.cdo.ui.tests ---
[INFO] Using 'UTF-8' encoding to copy filtered resources.
[INFO] skip non existing resourceDirectory /jobs/genie.papyrus/Papyrus-CDO/workspace/source/cdo/tests/org.eclipse.papyrus.cdo.ui.tests/src/test/resources
[INFO] 
[INFO] --- tycho-source-plugin:1.6.0:plugin-source (plugin-source) @ org.eclipse.papyrus.cdo.ui.tests ---
[INFO] Building jar: /jobs/genie.papyrus/Papyrus-CDO/workspace/source/cdo/tests/org.eclipse.papyrus.cdo.ui.tests/target/org.eclipse.papyrus.cdo.ui.tests-1.2.0-SNAPSHOT-sources.jar
[INFO] 
[INFO] --- target-platform-configuration:1.6.0:target-platform (default-target-platform) @ org.eclipse.papyrus.cdo.ui.tests ---
[INFO] 
[INFO] --- tycho-packaging-plugin:1.6.0:package-plugin (default-package-plugin) @ org.eclipse.papyrus.cdo.ui.tests ---
[INFO] Building jar: /jobs/genie.papyrus/Papyrus-CDO/workspace/source/cdo/tests/org.eclipse.papyrus.cdo.ui.tests/target/org.eclipse.papyrus.cdo.ui.tests-1.2.0-SNAPSHOT.jar
[INFO] 
[INFO] --- tycho-p2-plugin:1.6.0:p2-metadata-default (default-p2-metadata-default) @ org.eclipse.papyrus.cdo.ui.tests ---
[INFO] 
[INFO] --- tycho-source-feature-plugin:1.6.0:source-feature (source-feature) @ org.eclipse.papyrus.cdo.ui.tests ---
[INFO] 
[INFO] --- tycho-p2-plugin:1.6.0:p2-metadata (attach-p2-metadata) @ org.eclipse.papyrus.cdo.ui.tests ---
[INFO] 
[INFO] --- tycho-surefire-plugin:1.6.0:test (default-test) @ org.eclipse.papyrus.cdo.ui.tests ---
[INFO] Expected eclipse log file: /jobs/genie.papyrus/Papyrus-CDO/workspace/source/cdo/tests/org.eclipse.papyrus.cdo.ui.tests/target/work/data/.metadata/.log
[INFO] Command line:
	[/opt/public/common/java/oracle/jdk1.8.0_202_x64/jre/bin/java, -Dosgi.noShutdown=false, -Dosgi.os=linux, -Dosgi.ws=gtk, -Dosgi.arch=x86_64, -javaagent:/home/hudson/genie.papyrus/.jenkins/jobs/Papyrus-CDO/workspace/.repository/org/jacoco/org.jacoco.agent/0.8.5/org.jacoco.agent-0.8.5-runtime.jar=destfile=/jobs/genie.papyrus/Papyrus-CDO/workspace/source/cdo/tests/org.eclipse.papyrus.cdo.ui.tests/target/jacoco.exec,includes=org.eclipse.papyrus.*,excludes=org.eclipse.uml2, -Xms512m, -Xmx2048m, -XX:SoftRefLRUPolicyMSPerMB=100, -Dosgi.clean=true, -jar, /jobs/genie.papyrus/Papyrus-CDO/workspace/.repository/p2/osgi/bundle/org.eclipse.equinox.launcher/1.5.700.v20200207-2156/org.eclipse.equinox.launcher-1.5.700.v20200207-2156.jar, -data, /jobs/genie.papyrus/Papyrus-CDO/workspace/source/cdo/tests/org.eclipse.papyrus.cdo.ui.tests/target/work/data, -install, /jobs/genie.papyrus/Papyrus-CDO/workspace/source/cdo/tests/org.eclipse.papyrus.cdo.ui.tests/target/work, -configuration, /jobs/genie.papyrus/Papyrus-CDO/workspace/source/cdo/tests/org.eclipse.papyrus.cdo.ui.tests/target/work/configuration, -application, org.eclipse.tycho.surefire.osgibooter.uitest, -testproperties, /jobs/genie.papyrus/Papyrus-CDO/workspace/source/cdo/tests/org.eclipse.papyrus.cdo.ui.tests/target/surefire.properties, -product, org.eclipse.sdk.ide, -testConfig=CI_TESTS_CONFIG]
Picked up JAVA_TOOL_OPTIONS: -Xmx2G -Djava.io.tmpdir=/tmp/genie.papyrus -DforkCount=1
***WARNING: GTK+ version too old (micro mismatch)
***WARNING: SWT requires GTK 3.20.0
***WARNING: Detected: 3.10.9

(SWT:8555): Gtk-WARNING **: Theme parsing error: <data>:31:11: 'min-height' is not a valid property name
Running org.eclipse.papyrus.cdo.internal.ui.markers.tests.ModelValidationMarkersTest
Tests run: 3, Failures: 0, Errors: 3, Skipped: 0, Time elapsed: 5.876 s <<< FAILURE! - in org.eclipse.papyrus.cdo.internal.ui.markers.tests.ModelValidationMarkersTest
testDeleteMarkers(org.eclipse.papyrus.cdo.internal.ui.markers.tests.ModelValidationMarkersTest)  Time elapsed: 2.968 s  <<< ERROR!
java.lang.NullPointerException

testMemoryLeaksInValidation(org.eclipse.papyrus.cdo.internal.ui.markers.tests.ModelValidationMarkersTest)  Time elapsed: 0.549 s  <<< ERROR!
java.lang.NullPointerException

testCreateMarkers(org.eclipse.papyrus.cdo.internal.ui.markers.tests.ModelValidationMarkersTest)  Time elapsed: 2.25 s  <<< ERROR!
java.lang.NullPointerException

Running org.eclipse.papyrus.cdo.internal.ui.markers.tests.CDOPapyrusMarkerTest
Tests run: 10, Failures: 0, Errors: 0, Skipped: 0, Time elapsed: 0.33 s - in org.eclipse.papyrus.cdo.internal.ui.markers.tests.CDOPapyrusMarkerTest
testGetInteger(org.eclipse.papyrus.cdo.internal.ui.markers.tests.CDOPapyrusMarkerTest)  Time elapsed: 0.037 s
testGetSeverity(org.eclipse.papyrus.cdo.internal.ui.markers.tests.CDOPapyrusMarkerTest)  Time elapsed: 0.115 s
testGetBoolean(org.eclipse.papyrus.cdo.internal.ui.markers.tests.CDOPapyrusMarkerTest)  Time elapsed: 0.023 s
testGetBooleanWrong(org.eclipse.papyrus.cdo.internal.ui.markers.tests.CDOPapyrusMarkerTest)  Time elapsed: 0.023 s
testGetIntegerWrong(org.eclipse.papyrus.cdo.internal.ui.markers.tests.CDOPapyrusMarkerTest)  Time elapsed: 0.019 s
testGetStringWrong(org.eclipse.papyrus.cdo.internal.ui.markers.tests.CDOPapyrusMarkerTest)  Time elapsed: 0.021 s
testGetMessage(org.eclipse.papyrus.cdo.internal.ui.markers.tests.CDOPapyrusMarkerTest)  Time elapsed: 0.019 s
testGetURI(org.eclipse.papyrus.cdo.internal.ui.markers.tests.CDOPapyrusMarkerTest)  Time elapsed: 0.024 s
testGetString(org.eclipse.papyrus.cdo.internal.ui.markers.tests.CDOPapyrusMarkerTest)  Time elapsed: 0.019 s
testGetAttributes(org.eclipse.papyrus.cdo.internal.ui.markers.tests.CDOPapyrusMarkerTest)  Time elapsed: 0.021 s
Running org.eclipse.papyrus.cdo.internal.ui.views.tests.ItemProviderFilterRegistryTest
Tests run: 1, Failures: 0, Errors: 0, Skipped: 0, Time elapsed: 0.04 s - in org.eclipse.papyrus.cdo.internal.ui.views.tests.ItemProviderFilterRegistryTest
testPredicateFilter(org.eclipse.papyrus.cdo.internal.ui.views.tests.ItemProviderFilterRegistryTest)  Time elapsed: 0.038 s
Running org.eclipse.papyrus.cdo.internal.ui.editors.tests.BasicEditorTest
Tests run: 6, Failures: 0, Errors: 6, Skipped: 0, Time elapsed: 1.499 s <<< FAILURE! - in org.eclipse.papyrus.cdo.internal.ui.editors.tests.BasicEditorTest
isLockedLocally(org.eclipse.papyrus.cdo.internal.ui.editors.tests.BasicEditorTest)  Time elapsed: 0.307 s  <<< ERROR!
java.lang.NullPointerException

isLockedRemotely(org.eclipse.papyrus.cdo.internal.ui.editors.tests.BasicEditorTest)  Time elapsed: 0.236 s  <<< ERROR!
java.lang.NullPointerException

editorOpens(org.eclipse.papyrus.cdo.internal.ui.editors.tests.BasicEditorTest)  Time elapsed: 0.22 s  <<< ERROR!
java.lang.NullPointerException

editorDoesNotLeakWhenClosed(org.eclipse.papyrus.cdo.internal.ui.editors.tests.BasicEditorTest)  Time elapsed: 0.208 s  <<< ERROR!
java.lang.NullPointerException

canLock(org.eclipse.papyrus.cdo.internal.ui.editors.tests.BasicEditorTest)  Time elapsed: 0.234 s  <<< ERROR!
java.lang.NullPointerException

isConflicting(org.eclipse.papyrus.cdo.internal.ui.editors.tests.BasicEditorTest)  Time elapsed: 0.29 s  <<< ERROR!
java.lang.NullPointerException

Running org.eclipse.papyrus.cdo.internal.ui.editors.tests.DawnEditorAdapterTest
Tests run: 16, Failures: 0, Errors: 16, Skipped: 0, Time elapsed: 4.768 s <<< FAILURE! - in org.eclipse.papyrus.cdo.internal.ui.editors.tests.DawnEditorAdapterTest
testGetTitle(org.eclipse.papyrus.cdo.internal.ui.editors.tests.DawnEditorAdapterTest)  Time elapsed: 0.235 s  <<< ERROR!
java.lang.NullPointerException

testGetAdapter(org.eclipse.papyrus.cdo.internal.ui.editors.tests.DawnEditorAdapterTest)  Time elapsed: 0.231 s  <<< ERROR!
java.lang.NullPointerException

testAddRemovePropertyListener(org.eclipse.papyrus.cdo.internal.ui.editors.tests.DawnEditorAdapterTest)  Time elapsed: 0.233 s  <<< ERROR!
java.lang.NullPointerException

testGetSite(org.eclipse.papyrus.cdo.internal.ui.editors.tests.DawnEditorAdapterTest)  Time elapsed: 0.28 s  <<< ERROR!
java.lang.NullPointerException

testGetView(org.eclipse.papyrus.cdo.internal.ui.editors.tests.DawnEditorAdapterTest)  Time elapsed: 0.3 s  <<< ERROR!
java.lang.NullPointerException

testGetTitleImage(org.eclipse.papyrus.cdo.internal.ui.editors.tests.DawnEditorAdapterTest)  Time elapsed: 0.278 s  <<< ERROR!
java.lang.NullPointerException

testGetEditorSite(org.eclipse.papyrus.cdo.internal.ui.editors.tests.DawnEditorAdapterTest)  Time elapsed: 0.343 s  <<< ERROR!
java.lang.NullPointerException

testGetTitleToolTip(org.eclipse.papyrus.cdo.internal.ui.editors.tests.DawnEditorAdapterTest)  Time elapsed: 0.337 s  <<< ERROR!
java.lang.NullPointerException

testDoSave(org.eclipse.papyrus.cdo.internal.ui.editors.tests.DawnEditorAdapterTest)  Time elapsed: 0.304 s  <<< ERROR!
java.lang.NullPointerException

testGetEditorInput(org.eclipse.papyrus.cdo.internal.ui.editors.tests.DawnEditorAdapterTest)  Time elapsed: 0.29 s  <<< ERROR!
java.lang.NullPointerException

testGetDawnEditorSupport(org.eclipse.papyrus.cdo.internal.ui.editors.tests.DawnEditorAdapterTest)  Time elapsed: 0.366 s  <<< ERROR!
java.lang.NullPointerException

testIsDirty(org.eclipse.papyrus.cdo.internal.ui.editors.tests.DawnEditorAdapterTest)  Time elapsed: 0.333 s  <<< ERROR!
java.lang.NullPointerException

testGetContributorID(org.eclipse.papyrus.cdo.internal.ui.editors.tests.DawnEditorAdapterTest)  Time elapsed: 0.303 s  <<< ERROR!
java.lang.NullPointerException

testGetDawnEditor(org.eclipse.papyrus.cdo.internal.ui.editors.tests.DawnEditorAdapterTest)  Time elapsed: 0.312 s  <<< ERROR!
java.lang.NullPointerException

testSetDirty(org.eclipse.papyrus.cdo.internal.ui.editors.tests.DawnEditorAdapterTest)  Time elapsed: 0.289 s  <<< ERROR!
java.lang.NullPointerException

testSetFocus(org.eclipse.papyrus.cdo.internal.ui.editors.tests.DawnEditorAdapterTest)  Time elapsed: 0.32 s  <<< ERROR!
java.lang.NullPointerException


Results:

Errors: 
  BasicEditorTest>AbstractPapyrusCDOUITest.initWorkbench:105 » NullPointer
  BasicEditorTest>AbstractPapyrusCDOUITest.initWorkbench:105 » NullPointer
  BasicEditorTest>AbstractPapyrusCDOUITest.initWorkbench:105 » NullPointer
  BasicEditorTest>AbstractPapyrusCDOUITest.initWorkbench:105 » NullPointer
  BasicEditorTest>AbstractPapyrusCDOUITest.initWorkbench:105 » NullPointer
  BasicEditorTest>AbstractPapyrusCDOUITest.initWorkbench:105 » NullPointer
  DawnEditorAdapterTest>AbstractPapyrusCDOUITest.initWorkbench:105 » NullPointer
  DawnEditorAdapterTest>AbstractPapyrusCDOUITest.initWorkbench:105 » NullPointer
  DawnEditorAdapterTest>AbstractPapyrusCDOUITest.initWorkbench:105 » NullPointer
  DawnEditorAdapterTest>AbstractPapyrusCDOUITest.initWorkbench:105 » NullPointer
  DawnEditorAdapterTest>AbstractPapyrusCDOUITest.initWorkbench:105 » NullPointer
  DawnEditorAdapterTest>AbstractPapyrusCDOUITest.initWorkbench:105 » NullPointer
  DawnEditorAdapterTest>AbstractPapyrusCDOUITest.initWorkbench:105 » NullPointer
  DawnEditorAdapterTest>AbstractPapyrusCDOUITest.initWorkbench:105 » NullPointer
  DawnEditorAdapterTest>AbstractPapyrusCDOUITest.initWorkbench:105 » NullPointer
  DawnEditorAdapterTest>AbstractPapyrusCDOUITest.initWorkbench:105 » NullPointer
  DawnEditorAdapterTest>AbstractPapyrusCDOUITest.initWorkbench:105 » NullPointer
  DawnEditorAdapterTest>AbstractPapyrusCDOUITest.initWorkbench:105 » NullPointer
  DawnEditorAdapterTest>AbstractPapyrusCDOUITest.initWorkbench:105 » NullPointer
  DawnEditorAdapterTest>AbstractPapyrusCDOUITest.initWorkbench:105 » NullPointer
  DawnEditorAdapterTest>AbstractPapyrusCDOUITest.initWorkbench:105 » NullPointer
  DawnEditorAdapterTest>AbstractPapyrusCDOUITest.initWorkbench:105 » NullPointer
  ModelValidationMarkersTest>AbstractPapyrusCDOUITest.initWorkbench:105 » NullPointer
  ModelValidationMarkersTest>AbstractPapyrusCDOUITest.initWorkbench:105 » NullPointer
  ModelValidationMarkersTest>AbstractPapyrusCDOUITest.initWorkbench:105 » NullPointer

Tests run: 36, Failures: 0, Errors: 25, Skipped: 0

[ERROR] There are test failures.

Please refer to /jobs/genie.papyrus/Papyrus-CDO/workspace/source/cdo/tests/org.eclipse.papyrus.cdo.ui.tests/target/surefire-reports for the individual test results.
[INFO] 
[INFO] --- jacoco-maven-plugin:0.8.5:report (default-report) @ org.eclipse.papyrus.cdo.ui.tests ---
[INFO] Loading execution data file /jobs/genie.papyrus/Papyrus-CDO/workspace/source/cdo/tests/org.eclipse.papyrus.cdo.ui.tests/target/jacoco.exec
[INFO] Analyzed bundle 'org.eclipse.papyrus.cdo.ui.tests' with 0 classes
[INFO] 
[INFO] --< org.eclipse.papyrus.cdo:org.eclipse.papyrus.cdo.validation.problems.tests >--
[INFO] Building org.eclipse.papyrus.cdo.validation.problems.tests 1.2.0-SNAPSHOT [31/35]
[INFO] ------------------------[ eclipse-test-plugin ]-------------------------
[INFO] 
[INFO] --- maven-clean-plugin:3.0.0:clean (default-clean) @ org.eclipse.papyrus.cdo.validation.problems.tests ---
[INFO] 
[INFO] --- tycho-packaging-plugin:1.6.0:build-qualifier (default-build-qualifier) @ org.eclipse.papyrus.cdo.validation.problems.tests ---
[INFO] The project's OSGi version is 1.2.0.202008071412
[INFO] 
[INFO] --- tycho-packaging-plugin:1.6.0:validate-id (default-validate-id) @ org.eclipse.papyrus.cdo.validation.problems.tests ---
[INFO] 
[INFO] --- tycho-packaging-plugin:1.6.0:validate-version (default-validate-version) @ org.eclipse.papyrus.cdo.validation.problems.tests ---
[INFO] 
[INFO] --- jacoco-maven-plugin:0.8.5:prepare-agent (default-prepare-agent) @ org.eclipse.papyrus.cdo.validation.problems.tests ---
[INFO] tycho.testArgLine set to -javaagent:/home/hudson/genie.papyrus/.jenkins/jobs/Papyrus-CDO/workspace/.repository/org/jacoco/org.jacoco.agent/0.8.5/org.jacoco.agent-0.8.5-runtime.jar=destfile=/jobs/genie.papyrus/Papyrus-CDO/workspace/source/cdo/tests/org.eclipse.papyrus.cdo.validation.problems.tests/target/jacoco.exec,includes=org.eclipse.papyrus.*,excludes=org.eclipse.uml2
[INFO] 
[INFO] --- maven-resources-plugin:2.7:resources (default-resources) @ org.eclipse.papyrus.cdo.validation.problems.tests ---
[INFO] Using 'UTF-8' encoding to copy filtered resources.
[INFO] skip non existing resourceDirectory /jobs/genie.papyrus/Papyrus-CDO/workspace/source/cdo/tests/org.eclipse.papyrus.cdo.validation.problems.tests/src/main/resources
[INFO] 
[INFO] --- tycho-compiler-plugin:1.6.0:compile (default-compile) @ org.eclipse.papyrus.cdo.validation.problems.tests ---
[WARNING] The effective compiler target level 1.8 is incompatible with the following OSGi execution environments: [JavaSE-1.6 (assumes 1.6)] @ MavenProject: org.eclipse.papyrus.cdo:org.eclipse.papyrus.cdo.validation.problems.tests:1.2.0-SNAPSHOT @ /jobs/genie.papyrus/Papyrus-CDO/workspace/source/cdo/tests/org.eclipse.papyrus.cdo.validation.problems.tests/pom.xml
[INFO] Compiling 9 source files to /jobs/genie.papyrus/Papyrus-CDO/workspace/source/cdo/tests/org.eclipse.papyrus.cdo.validation.problems.tests/target/classes
[WARNING] /jobs/genie.papyrus/Papyrus-CDO/workspace/source/cdo/tests/org.eclipse.papyrus.cdo.validation.problems.tests/src/org/eclipse/papyrus/cdo/validation/problems/util/tests/ProblemsManagerTest.java:[81] 
	assertThat(mgr,
				sameInstance(ProblemsManager.getProblemsManager(transaction
						.getResourceSet())));
	^^^^^^^^^^^^^^^^^^^^^^^^^^^^^^^^^^^^^^^^^^^^^^^^^^^^^^^^^^^^^^^^^^^^^^^^^^^^^^^^^^^^^^^^^^^^^^^^^^^^^^^^^^
The method assertThat(ProblemsManager, Matcher<? super ProblemsManager>) from the type Assert is deprecated
[WARNING] /jobs/genie.papyrus/Papyrus-CDO/workspace/source/cdo/tests/org.eclipse.papyrus.cdo.validation.problems.tests/src/org/eclipse/papyrus/cdo/validation/problems/util/tests/ProblemsManagerTest.java:[99] 
	assertThat(allProblems.size(), equalTo(expectedProblems));
	^^^^^^^^^^^^^^^^^^^^^^^^^^^^^^^^^^^^^^^^^^^^^^^^^^^^^^^^^
The method assertThat(Integer, Matcher<? super Integer>) from the type Assert is deprecated
[WARNING] /jobs/genie.papyrus/Papyrus-CDO/workspace/source/cdo/tests/org.eclipse.papyrus.cdo.validation.problems.tests/src/org/eclipse/papyrus/cdo/validation/problems/util/tests/ProblemsManagerTest.java:[119] 
	assertThat(problems.size(), equalTo(expectedProblems));
	^^^^^^^^^^^^^^^^^^^^^^^^^^^^^^^^^^^^^^^^^^^^^^^^^^^^^^
The method assertThat(Integer, Matcher<? super Integer>) from the type Assert is deprecated
[WARNING] /jobs/genie.papyrus/Papyrus-CDO/workspace/source/cdo/tests/org.eclipse.papyrus.cdo.validation.problems.tests/src/org/eclipse/papyrus/cdo/validation/problems/util/tests/ProblemsManagerTest.java:[142] 
	assertThat(problems.size(), equalTo(expectedProblems));
	^^^^^^^^^^^^^^^^^^^^^^^^^^^^^^^^^^^^^^^^^^^^^^^^^^^^^^
The method assertThat(Integer, Matcher<? super Integer>) from the type Assert is deprecated
[WARNING] /jobs/genie.papyrus/Papyrus-CDO/workspace/source/cdo/tests/org.eclipse.papyrus.cdo.validation.problems.tests/src/org/eclipse/papyrus/cdo/validation/problems/util/tests/ProblemsManagerTest.java:[160] 
	assertThat(mgr.getAllProblems().hasNext(), is(false));
	^^^^^^^^^^^^^^^^^^^^^^^^^^^^^^^^^^^^^^^^^^^^^^^^^^^^^
The method assertThat(Boolean, Matcher<? super Boolean>) from the type Assert is deprecated
[WARNING] /jobs/genie.papyrus/Papyrus-CDO/workspace/source/cdo/tests/org.eclipse.papyrus.cdo.validation.problems.tests/src/org/eclipse/papyrus/cdo/validation/problems/util/tests/ProblemsManagerTest.java:[180] 
	assertThat(mgr.getAllProblems().hasNext(), is(false));
	^^^^^^^^^^^^^^^^^^^^^^^^^^^^^^^^^^^^^^^^^^^^^^^^^^^^^
The method assertThat(Boolean, Matcher<? super Boolean>) from the type Assert is deprecated
[WARNING] /jobs/genie.papyrus/Papyrus-CDO/workspace/source/cdo/tests/org.eclipse.papyrus.cdo.validation.problems.tests/src/org/eclipse/papyrus/cdo/validation/problems/util/tests/ProblemsManagerTest.java:[199] 
	assertThat(problems.size(), equalTo(expectedTotalProblems - expectedClass3Problems));
	^^^^^^^^^^^^^^^^^^^^^^^^^^^^^^^^^^^^^^^^^^^^^^^^^^^^^^^^^^^^^^^^^^^^^^^^^^^^^^^^^^^^
The method assertThat(Integer, Matcher<? super Integer>) from the type Assert is deprecated
[WARNING] /jobs/genie.papyrus/Papyrus-CDO/workspace/source/cdo/tests/org.eclipse.papyrus.cdo.validation.problems.tests/src/org/eclipse/papyrus/cdo/validation/problems/util/tests/ProblemsManagerTest.java:[224] 
	assertThat(problems.size(), equalTo(expectedTotalProblems - expectedClass3Problems));
	^^^^^^^^^^^^^^^^^^^^^^^^^^^^^^^^^^^^^^^^^^^^^^^^^^^^^^^^^^^^^^^^^^^^^^^^^^^^^^^^^^^^
The method assertThat(Integer, Matcher<? super Integer>) from the type Assert is deprecated
[WARNING] /jobs/genie.papyrus/Papyrus-CDO/workspace/source/cdo/tests/org.eclipse.papyrus.cdo.validation.problems.tests/src/org/eclipse/papyrus/cdo/validation/problems/util/tests/ProblemsManagerTest.java:[264] 
	assertThat(ref, notNullValue());
	^^^^^^^^^^^^^^^^^^^^^^^^^^^^^^^
The method assertThat(Reference<capture#2-of ? extends EProblem>, Matcher<? super Reference<capture#2-of ? extends EProblem>>) from the type Assert is deprecated
[WARNING] /jobs/genie.papyrus/Papyrus-CDO/workspace/source/cdo/tests/org.eclipse.papyrus.cdo.validation.problems.tests/src/org/eclipse/papyrus/cdo/validation/problems/util/tests/ProblemsManagerTest.java:[303] 
	assertThat(ref, notNullValue());
	^^^^^^^^^^^^^^^^^^^^^^^^^^^^^^^
The method assertThat(Reference<capture#4-of ? extends EProblem>, Matcher<? super Reference<capture#4-of ? extends EProblem>>) from the type Assert is deprecated
[WARNING] /jobs/genie.papyrus/Papyrus-CDO/workspace/source/cdo/tests/org.eclipse.papyrus.cdo.validation.problems.tests/src/org/eclipse/papyrus/cdo/validation/problems/util/tests/ProblemsManagerTest.java:[323] 
	assertThat(allProblems.size(), equalTo(expectedProblems));
	^^^^^^^^^^^^^^^^^^^^^^^^^^^^^^^^^^^^^^^^^^^^^^^^^^^^^^^^^
The method assertThat(Integer, Matcher<? super Integer>) from the type Assert is deprecated
[WARNING] /jobs/genie.papyrus/Papyrus-CDO/workspace/source/cdo/tests/org.eclipse.papyrus.cdo.validation.problems.tests/src/org/eclipse/papyrus/cdo/validation/problems/util/tests/ProblemsManagerTest.java:[519] 
	assertThat(found, notNullValue());
	^^^^^^^^^^^^^^^^^^^^^^^^^^^^^^^^^
The method assertThat(EProblem, Matcher<? super EProblem>) from the type Assert is deprecated
12 problems (12 warnings)
[INFO] 
[INFO] --- maven-resources-plugin:2.7:testResources (default-testResources) @ org.eclipse.papyrus.cdo.validation.problems.tests ---
[INFO] Using 'UTF-8' encoding to copy filtered resources.
[INFO] skip non existing resourceDirectory /jobs/genie.papyrus/Papyrus-CDO/workspace/source/cdo/tests/org.eclipse.papyrus.cdo.validation.problems.tests/src/test/resources
[INFO] 
[INFO] --- tycho-source-plugin:1.6.0:plugin-source (plugin-source) @ org.eclipse.papyrus.cdo.validation.problems.tests ---
[INFO] Building jar: /jobs/genie.papyrus/Papyrus-CDO/workspace/source/cdo/tests/org.eclipse.papyrus.cdo.validation.problems.tests/target/org.eclipse.papyrus.cdo.validation.problems.tests-1.2.0-SNAPSHOT-sources.jar
[INFO] 
[INFO] --- target-platform-configuration:1.6.0:target-platform (default-target-platform) @ org.eclipse.papyrus.cdo.validation.problems.tests ---
[INFO] 
[INFO] --- tycho-packaging-plugin:1.6.0:package-plugin (default-package-plugin) @ org.eclipse.papyrus.cdo.validation.problems.tests ---
[INFO] Building jar: /jobs/genie.papyrus/Papyrus-CDO/workspace/source/cdo/tests/org.eclipse.papyrus.cdo.validation.problems.tests/target/org.eclipse.papyrus.cdo.validation.problems.tests-1.2.0-SNAPSHOT.jar
[INFO] 
[INFO] --- tycho-p2-plugin:1.6.0:p2-metadata-default (default-p2-metadata-default) @ org.eclipse.papyrus.cdo.validation.problems.tests ---
[INFO] 
[INFO] --- tycho-source-feature-plugin:1.6.0:source-feature (source-feature) @ org.eclipse.papyrus.cdo.validation.problems.tests ---
[INFO] 
[INFO] --- tycho-p2-plugin:1.6.0:p2-metadata (attach-p2-metadata) @ org.eclipse.papyrus.cdo.validation.problems.tests ---
[INFO] 
[INFO] --- tycho-surefire-plugin:1.6.0:test (default-test) @ org.eclipse.papyrus.cdo.validation.problems.tests ---
[INFO] Expected eclipse log file: /jobs/genie.papyrus/Papyrus-CDO/workspace/source/cdo/tests/org.eclipse.papyrus.cdo.validation.problems.tests/target/work/data/.metadata/.log
[INFO] Command line:
	[/opt/public/common/java/oracle/jdk1.8.0_202_x64/jre/bin/java, -Dosgi.noShutdown=false, -Dosgi.os=linux, -Dosgi.ws=gtk, -Dosgi.arch=x86_64, -javaagent:/home/hudson/genie.papyrus/.jenkins/jobs/Papyrus-CDO/workspace/.repository/org/jacoco/org.jacoco.agent/0.8.5/org.jacoco.agent-0.8.5-runtime.jar=destfile=/jobs/genie.papyrus/Papyrus-CDO/workspace/source/cdo/tests/org.eclipse.papyrus.cdo.validation.problems.tests/target/jacoco.exec,includes=org.eclipse.papyrus.*,excludes=org.eclipse.uml2, -Xms512m, -Xmx2048m, -XX:SoftRefLRUPolicyMSPerMB=100, -Dosgi.clean=true, -jar, /jobs/genie.papyrus/Papyrus-CDO/workspace/.repository/p2/osgi/bundle/org.eclipse.equinox.launcher/1.5.700.v20200207-2156/org.eclipse.equinox.launcher-1.5.700.v20200207-2156.jar, -data, /jobs/genie.papyrus/Papyrus-CDO/workspace/source/cdo/tests/org.eclipse.papyrus.cdo.validation.problems.tests/target/work/data, -install, /jobs/genie.papyrus/Papyrus-CDO/workspace/source/cdo/tests/org.eclipse.papyrus.cdo.validation.problems.tests/target/work, -configuration, /jobs/genie.papyrus/Papyrus-CDO/workspace/source/cdo/tests/org.eclipse.papyrus.cdo.validation.problems.tests/target/work/configuration, -application, org.eclipse.tycho.surefire.osgibooter.uitest, -testproperties, /jobs/genie.papyrus/Papyrus-CDO/workspace/source/cdo/tests/org.eclipse.papyrus.cdo.validation.problems.tests/target/surefire.properties, -product, org.eclipse.sdk.ide, -testConfig=CI_TESTS_CONFIG]
Picked up JAVA_TOOL_OPTIONS: -Xmx2G -Djava.io.tmpdir=/tmp/genie.papyrus -DforkCount=1
***WARNING: GTK+ version too old (micro mismatch)
***WARNING: SWT requires GTK 3.20.0
***WARNING: Detected: 3.10.9

(SWT:9307): Gtk-WARNING **: Theme parsing error: <data>:31:11: 'min-height' is not a valid property name
Running org.eclipse.papyrus.cdo.validation.problems.tests.EProblemTest
Tests run: 1, Failures: 0, Errors: 0, Skipped: 0, Time elapsed: 0.325 s - in org.eclipse.papyrus.cdo.validation.problems.tests.EProblemTest
testToDiagnostic(org.eclipse.papyrus.cdo.validation.problems.tests.EProblemTest)  Time elapsed: 0.301 s
Running org.eclipse.papyrus.cdo.validation.problems.tests.EProblemsContainerTest
Tests run: 5, Failures: 0, Errors: 0, Skipped: 0, Time elapsed: 0.024 s - in org.eclipse.papyrus.cdo.validation.problems.tests.EProblemsContainerTest
testAllProblems(org.eclipse.papyrus.cdo.validation.problems.tests.EProblemsContainerTest)  Time elapsed: 0.014 s
testGetWorstProblem__EObject(org.eclipse.papyrus.cdo.validation.problems.tests.EProblemsContainerTest)  Time elapsed: 0.003 s
testAllDiagnostics__EObject(org.eclipse.papyrus.cdo.validation.problems.tests.EProblemsContainerTest)  Time elapsed: 0.002 s
testAllProblems__EObject(org.eclipse.papyrus.cdo.validation.problems.tests.EProblemsContainerTest)  Time elapsed: 0.001 s
testAllDiagnostics(org.eclipse.papyrus.cdo.validation.problems.tests.EProblemsContainerTest)  Time elapsed: 0.001 s
Running org.eclipse.papyrus.cdo.validation.problems.tests.AttributeTest
Tests run: 1, Failures: 1, Errors: 0, Skipped: 0, Time elapsed: 0.004 s <<< FAILURE! - in org.eclipse.papyrus.cdo.validation.problems.tests.AttributeTest
warning(junit.framework.TestSuite$1)  Time elapsed: 0.003 s  <<< FAILURE!
junit.framework.AssertionFailedError: No tests found in org.eclipse.papyrus.cdo.validation.problems.tests.AttributeTest
	at junit.framework.TestSuite$1.runTest(TestSuite.java:96)

Running org.eclipse.papyrus.cdo.validation.problems.util.tests.ProblemsManagerTest
Tests run: 11, Failures: 0, Errors: 0, Skipped: 0, Time elapsed: 3.54 s - in org.eclipse.papyrus.cdo.validation.problems.util.tests.ProblemsManagerTest
dispose_crossReferencerAddedAfter(org.eclipse.papyrus.cdo.validation.problems.util.tests.ProblemsManagerTest)  Time elapsed: 1.991 s
disposeProblemsManager(org.eclipse.papyrus.cdo.validation.problems.util.tests.ProblemsManagerTest)  Time elapsed: 0.902 s
allProblems(org.eclipse.papyrus.cdo.validation.problems.util.tests.ProblemsManagerTest)  Time elapsed: 0.076 s
allProblems_EObject_noCrossReferencer(org.eclipse.papyrus.cdo.validation.problems.util.tests.ProblemsManagerTest)  Time elapsed: 0.053 s
purge_noCrossReferencer(org.eclipse.papyrus.cdo.validation.problems.util.tests.ProblemsManagerTest)  Time elapsed: 0.096 s
purgeAll_noCrossReferencer(org.eclipse.papyrus.cdo.validation.problems.util.tests.ProblemsManagerTest)  Time elapsed: 0.038 s
customProblemClass(org.eclipse.papyrus.cdo.validation.problems.util.tests.ProblemsManagerTest)  Time elapsed: 0.105 s
allProblems_EObject_crossReferencer(org.eclipse.papyrus.cdo.validation.problems.util.tests.ProblemsManagerTest)  Time elapsed: 0.05 s
getProblemsAdapter(org.eclipse.papyrus.cdo.validation.problems.util.tests.ProblemsManagerTest)  Time elapsed: 0.032 s
purgeAll_crossReferencer(org.eclipse.papyrus.cdo.validation.problems.util.tests.ProblemsManagerTest)  Time elapsed: 0.045 s
purge_crossReferencer(org.eclipse.papyrus.cdo.validation.problems.util.tests.ProblemsManagerTest)  Time elapsed: 0.044 s
Running org.eclipse.papyrus.cdo.validation.problems.edit.tests.ProblemEditUtilTest
Tests run: 3, Failures: 0, Errors: 0, Skipped: 0, Time elapsed: 0.038 s - in org.eclipse.papyrus.cdo.validation.problems.edit.tests.ProblemEditUtilTest
testDefaultProblemType(org.eclipse.papyrus.cdo.validation.problems.edit.tests.ProblemEditUtilTest)  Time elapsed: 0.025 s
testProblemTypeProvider(org.eclipse.papyrus.cdo.validation.problems.edit.tests.ProblemEditUtilTest)  Time elapsed: 0.011 s
testDefaultProblemType_nullElement(org.eclipse.papyrus.cdo.validation.problems.edit.tests.ProblemEditUtilTest)  Time elapsed: 0 s

Results:

Failures: 
  TestSuite$1.warning No tests found in org.eclipse.papyrus.cdo.validation.problems.tests.AttributeTest

Tests run: 21, Failures: 1, Errors: 0, Skipped: 0

[ERROR] There are test failures.

Please refer to /jobs/genie.papyrus/Papyrus-CDO/workspace/source/cdo/tests/org.eclipse.papyrus.cdo.validation.problems.tests/target/surefire-reports for the individual test results.
[INFO] 
[INFO] --- jacoco-maven-plugin:0.8.5:report (default-report) @ org.eclipse.papyrus.cdo.validation.problems.tests ---
[INFO] Loading execution data file /jobs/genie.papyrus/Papyrus-CDO/workspace/source/cdo/tests/org.eclipse.papyrus.cdo.validation.problems.tests/target/jacoco.exec
[INFO] Analyzed bundle 'org.eclipse.papyrus.cdo.validation.problems.tests' with 0 classes
[INFO] 
[INFO] ----< org.eclipse.papyrus.cdo:org.eclipse.papyrus.cdo.uml.ui.tests >----
[INFO] Building org.eclipse.papyrus.cdo.uml.ui.tests 1.2.0-SNAPSHOT     [32/35]
[INFO] ------------------------[ eclipse-test-plugin ]-------------------------
[INFO] 
[INFO] --- maven-clean-plugin:3.0.0:clean (default-clean) @ org.eclipse.papyrus.cdo.uml.ui.tests ---
[INFO] 
[INFO] --- tycho-packaging-plugin:1.6.0:build-qualifier (default-build-qualifier) @ org.eclipse.papyrus.cdo.uml.ui.tests ---
[INFO] The project's OSGi version is 1.2.0.202008071412
[INFO] 
[INFO] --- tycho-packaging-plugin:1.6.0:validate-id (default-validate-id) @ org.eclipse.papyrus.cdo.uml.ui.tests ---
[INFO] 
[INFO] --- tycho-packaging-plugin:1.6.0:validate-version (default-validate-version) @ org.eclipse.papyrus.cdo.uml.ui.tests ---
[INFO] 
[INFO] --- jacoco-maven-plugin:0.8.5:prepare-agent (default-prepare-agent) @ org.eclipse.papyrus.cdo.uml.ui.tests ---
[INFO] tycho.testArgLine set to -javaagent:/home/hudson/genie.papyrus/.jenkins/jobs/Papyrus-CDO/workspace/.repository/org/jacoco/org.jacoco.agent/0.8.5/org.jacoco.agent-0.8.5-runtime.jar=destfile=/jobs/genie.papyrus/Papyrus-CDO/workspace/source/cdo/tests/org.eclipse.papyrus.cdo.uml.ui.tests/target/jacoco.exec,includes=org.eclipse.papyrus.*,excludes=org.eclipse.uml2
[INFO] 
[INFO] --- maven-resources-plugin:2.7:resources (default-resources) @ org.eclipse.papyrus.cdo.uml.ui.tests ---
[INFO] Using 'UTF-8' encoding to copy filtered resources.
[INFO] skip non existing resourceDirectory /jobs/genie.papyrus/Papyrus-CDO/workspace/source/cdo/tests/org.eclipse.papyrus.cdo.uml.ui.tests/src/main/resources
[INFO] 
[INFO] --- tycho-compiler-plugin:1.6.0:compile (default-compile) @ org.eclipse.papyrus.cdo.uml.ui.tests ---
[WARNING] The effective compiler target level 1.8 is incompatible with the following OSGi execution environments: [JavaSE-1.6 (assumes 1.6)] @ MavenProject: org.eclipse.papyrus.cdo:org.eclipse.papyrus.cdo.uml.ui.tests:1.2.0-SNAPSHOT @ /jobs/genie.papyrus/Papyrus-CDO/workspace/source/cdo/tests/org.eclipse.papyrus.cdo.uml.ui.tests/pom.xml
[INFO] Compiling 2 source files to /jobs/genie.papyrus/Papyrus-CDO/workspace/source/cdo/tests/org.eclipse.papyrus.cdo.uml.ui.tests/target/classes
[WARNING] /jobs/genie.papyrus/Papyrus-CDO/workspace/source/cdo/tests/org.eclipse.papyrus.cdo.uml.ui.tests/src/org/eclipse/papyrus/cdo/uml/internal/ui/importsources/tests/CDOPackageImportSourceTest.java:[67] 
	assertThat(fixture.canImportInto(singleton(model)), is(true));
	^^^^^^^^^^^^^^^^^^^^^^^^^^^^^^^^^^^^^^^^^^^^^^^^^^^^^^^^^^^^^
The method assertThat(Boolean, Matcher<? super Boolean>) from the type Assert is deprecated
[WARNING] /jobs/genie.papyrus/Papyrus-CDO/workspace/source/cdo/tests/org.eclipse.papyrus.cdo.uml.ui.tests/src/org/eclipse/papyrus/cdo/uml/internal/ui/importsources/tests/CDOPackageImportSourceTest.java:[68] 
	assertThat(fixture.canImportInto(singleton(model.getOwnedTypes().get(0))), is(false));
	^^^^^^^^^^^^^^^^^^^^^^^^^^^^^^^^^^^^^^^^^^^^^^^^^^^^^^^^^^^^^^^^^^^^^^^^^^^^^^^^^^^^^
The method assertThat(Boolean, Matcher<? super Boolean>) from the type Assert is deprecated
[WARNING] /jobs/genie.papyrus/Papyrus-CDO/workspace/source/cdo/tests/org.eclipse.papyrus.cdo.uml.ui.tests/src/org/eclipse/papyrus/cdo/uml/internal/ui/importsources/tests/CDOPackageImportSourceTest.java:[75] 
	assertThat(provider, notNullValue());
	^^^^^^^^^^^^^^^^^^^^^^^^^^^^^^^^^^^^
The method assertThat(ILabelProvider, Matcher<? super ILabelProvider>) from the type Assert is deprecated
[WARNING] /jobs/genie.papyrus/Papyrus-CDO/workspace/source/cdo/tests/org.eclipse.papyrus.cdo.uml.ui.tests/src/org/eclipse/papyrus/cdo/uml/internal/ui/importsources/tests/CDOPackageImportSourceTest.java:[79] 
	assertThat(provider.getText(model), containsString("model"));
	^^^^^^^^^^^^^^^^^^^^^^^^^^^^^^^^^^^^^^^^^^^^^^^^^^^^^^^^^^^^
The method assertThat(String, Matcher<? super String>) from the type Assert is deprecated
[WARNING] /jobs/genie.papyrus/Papyrus-CDO/workspace/source/cdo/tests/org.eclipse.papyrus.cdo.uml.ui.tests/src/org/eclipse/papyrus/cdo/uml/internal/ui/importsources/tests/CDOPackageImportSourceTest.java:[80] 
	assertThat(provider.getImage(model), notNullValue());
	^^^^^^^^^^^^^^^^^^^^^^^^^^^^^^^^^^^^^^^^^^^^^^^^^^^^
The method assertThat(Image, Matcher<? super Image>) from the type Assert is deprecated
[WARNING] /jobs/genie.papyrus/Papyrus-CDO/workspace/source/cdo/tests/org.eclipse.papyrus.cdo.uml.ui.tests/src/org/eclipse/papyrus/cdo/uml/internal/ui/importsources/tests/CDOPackageImportSourceTest.java:[87] 
	assertThat(provider, instanceOf(ITreeContentProvider.class));
	^^^^^^^^^^^^^^^^^^^^^^^^^^^^^^^^^^^^^^^^^^^^^^^^^^^^^^^^^^^^
The method assertThat(IStaticContentProvider, Matcher<? super IStaticContentProvider>) from the type Assert is deprecated
[WARNING] /jobs/genie.papyrus/Papyrus-CDO/workspace/source/cdo/tests/org.eclipse.papyrus.cdo.uml.ui.tests/src/org/eclipse/papyrus/cdo/uml/internal/ui/importsources/tests/CDOPackageImportSourceTest.java:[96] 
	DIResourceQuery.waitFor(getInternalCheckout().getView(), 10, TimeUnit.SECONDS);
	                                              ^^^^^^^
Discouraged access: The method 'CDOCheckoutImpl.getView()' is not API (restriction on classpath entry '/home/hudson/genie.papyrus/.jenkins/jobs/Papyrus-CDO/workspace/.repository/p2/osgi/bundle/org.eclipse.emf.cdo.explorer/4.6.1.v20200610-0352/org.eclipse.emf.cdo.explorer-4.6.1.v20200610-0352.jar')
[WARNING] /jobs/genie.papyrus/Papyrus-CDO/workspace/source/cdo/tests/org.eclipse.papyrus.cdo.uml.ui.tests/src/org/eclipse/papyrus/cdo/uml/internal/ui/importsources/tests/CDOPackageImportSourceTest.java:[99] 
	assertThat(Arrays.asList(children), hasItem((Object) model));
	^^^^^^^^^^^^^^^^^^^^^^^^^^^^^^^^^^^^^^^^^^^^^^^^^^^^^^^^^^^^
The method assertThat(List<Object>, Matcher<? super List<Object>>) from the type Assert is deprecated
[WARNING] /jobs/genie.papyrus/Papyrus-CDO/workspace/source/cdo/tests/org.eclipse.papyrus.cdo.uml.ui.tests/src/org/eclipse/papyrus/cdo/uml/internal/ui/importsources/tests/CDOPackageImportSourceTest.java:[100] 
	assertThat(treeContent.getParent(model), sameInstance((Object) model.getResource().getFolder()));
	^^^^^^^^^^^^^^^^^^^^^^^^^^^^^^^^^^^^^^^^^^^^^^^^^^^^^^^^^^^^^^^^^^^^^^^^^^^^^^^^^^^^^^^^^^^^^^^^
The method assertThat(Object, Matcher<? super Object>) from the type Assert is deprecated
[WARNING] /jobs/genie.papyrus/Papyrus-CDO/workspace/source/cdo/tests/org.eclipse.papyrus.cdo.uml.ui.tests/src/org/eclipse/papyrus/cdo/uml/internal/ui/importsources/tests/CDOPackageImportSourceTest.java:[101] 
	assertThat(treeContent.hasChildren(model.getResource().getFolder()), is(true));
	^^^^^^^^^^^^^^^^^^^^^^^^^^^^^^^^^^^^^^^^^^^^^^^^^^^^^^^^^^^^^^^^^^^^^^^^^^^^^^
The method assertThat(Boolean, Matcher<? super Boolean>) from the type Assert is deprecated
[WARNING] /jobs/genie.papyrus/Papyrus-CDO/workspace/source/cdo/tests/org.eclipse.papyrus.cdo.uml.ui.tests/src/org/eclipse/papyrus/cdo/uml/internal/ui/importsources/tests/CDOPackageImportSourceTest.java:[112] 
	assertThat(packages, hasItem(modelInMasterView));
	^^^^^^^^^^^^^^^^^^^^^^^^^^^^^^^^^^^^^^^^^^^^^^^^
The method assertThat(List<Package>, Matcher<? super List<Package>>) from the type Assert is deprecated
[WARNING] /jobs/genie.papyrus/Papyrus-CDO/workspace/source/cdo/tests/org.eclipse.papyrus.cdo.uml.ui.tests/src/org/eclipse/papyrus/cdo/uml/internal/ui/importsources/tests/CDOPackageImportSourceTest.java:[138] 
	assertThat(fixture.getCDOResource(diModel), sameInstance(diModel.getResource()));
	^^^^^^^^^^^^^^^^^^^^^^^^^^^^^^^^^^^^^^^^^^^^^^^^^^^^^^^^^^^^^^^^^^^^^^^^^^^^^^^^
The method assertThat(CDOResource, Matcher<? super CDOResource>) from the type Assert is deprecated
12 problems (12 warnings)
[INFO] 
[INFO] --- maven-resources-plugin:2.7:testResources (default-testResources) @ org.eclipse.papyrus.cdo.uml.ui.tests ---
[INFO] Using 'UTF-8' encoding to copy filtered resources.
[INFO] skip non existing resourceDirectory /jobs/genie.papyrus/Papyrus-CDO/workspace/source/cdo/tests/org.eclipse.papyrus.cdo.uml.ui.tests/src/test/resources
[INFO] 
[INFO] --- tycho-source-plugin:1.6.0:plugin-source (plugin-source) @ org.eclipse.papyrus.cdo.uml.ui.tests ---
[INFO] Building jar: /jobs/genie.papyrus/Papyrus-CDO/workspace/source/cdo/tests/org.eclipse.papyrus.cdo.uml.ui.tests/target/org.eclipse.papyrus.cdo.uml.ui.tests-1.2.0-SNAPSHOT-sources.jar
[INFO] 
[INFO] --- target-platform-configuration:1.6.0:target-platform (default-target-platform) @ org.eclipse.papyrus.cdo.uml.ui.tests ---
[INFO] 
[INFO] --- tycho-packaging-plugin:1.6.0:package-plugin (default-package-plugin) @ org.eclipse.papyrus.cdo.uml.ui.tests ---
[INFO] Building jar: /jobs/genie.papyrus/Papyrus-CDO/workspace/source/cdo/tests/org.eclipse.papyrus.cdo.uml.ui.tests/target/org.eclipse.papyrus.cdo.uml.ui.tests-1.2.0-SNAPSHOT.jar
[INFO] 
[INFO] --- tycho-p2-plugin:1.6.0:p2-metadata-default (default-p2-metadata-default) @ org.eclipse.papyrus.cdo.uml.ui.tests ---
[INFO] 
[INFO] --- tycho-source-feature-plugin:1.6.0:source-feature (source-feature) @ org.eclipse.papyrus.cdo.uml.ui.tests ---
[INFO] 
[INFO] --- tycho-p2-plugin:1.6.0:p2-metadata (attach-p2-metadata) @ org.eclipse.papyrus.cdo.uml.ui.tests ---
[INFO] 
[INFO] --- tycho-surefire-plugin:1.6.0:test (default-test) @ org.eclipse.papyrus.cdo.uml.ui.tests ---
[INFO] Expected eclipse log file: /jobs/genie.papyrus/Papyrus-CDO/workspace/source/cdo/tests/org.eclipse.papyrus.cdo.uml.ui.tests/target/work/data/.metadata/.log
[INFO] Command line:
	[/opt/public/common/java/oracle/jdk1.8.0_202_x64/jre/bin/java, -Dosgi.noShutdown=false, -Dosgi.os=linux, -Dosgi.ws=gtk, -Dosgi.arch=x86_64, -javaagent:/home/hudson/genie.papyrus/.jenkins/jobs/Papyrus-CDO/workspace/.repository/org/jacoco/org.jacoco.agent/0.8.5/org.jacoco.agent-0.8.5-runtime.jar=destfile=/jobs/genie.papyrus/Papyrus-CDO/workspace/source/cdo/tests/org.eclipse.papyrus.cdo.uml.ui.tests/target/jacoco.exec,includes=org.eclipse.papyrus.*,excludes=org.eclipse.uml2, -Xms512m, -Xmx2048m, -XX:SoftRefLRUPolicyMSPerMB=100, -Dosgi.clean=true, -jar, /jobs/genie.papyrus/Papyrus-CDO/workspace/.repository/p2/osgi/bundle/org.eclipse.equinox.launcher/1.5.700.v20200207-2156/org.eclipse.equinox.launcher-1.5.700.v20200207-2156.jar, -data, /jobs/genie.papyrus/Papyrus-CDO/workspace/source/cdo/tests/org.eclipse.papyrus.cdo.uml.ui.tests/target/work/data, -install, /jobs/genie.papyrus/Papyrus-CDO/workspace/source/cdo/tests/org.eclipse.papyrus.cdo.uml.ui.tests/target/work, -configuration, /jobs/genie.papyrus/Papyrus-CDO/workspace/source/cdo/tests/org.eclipse.papyrus.cdo.uml.ui.tests/target/work/configuration, -application, org.eclipse.tycho.surefire.osgibooter.uitest, -testproperties, /jobs/genie.papyrus/Papyrus-CDO/workspace/source/cdo/tests/org.eclipse.papyrus.cdo.uml.ui.tests/target/surefire.properties, -product, org.eclipse.sdk.ide, -testConfig=CI_TESTS_CONFIG]
Picked up JAVA_TOOL_OPTIONS: -Xmx2G -Djava.io.tmpdir=/tmp/genie.papyrus -DforkCount=1
***WARNING: GTK+ version too old (micro mismatch)
***WARNING: SWT requires GTK 3.20.0
***WARNING: Detected: 3.10.9

(SWT:9639): Gtk-WARNING **: Theme parsing error: <data>:31:11: 'min-height' is not a valid property name
Running org.eclipse.papyrus.cdo.uml.internal.ui.importsources.tests.CDOPackageImportSourceTest
Tests run: 12, Failures: 0, Errors: 12, Skipped: 0, Time elapsed: 6.154 s <<< FAILURE! - in org.eclipse.papyrus.cdo.uml.internal.ui.importsources.tests.CDOPackageImportSourceTest
testGetPackages(org.eclipse.papyrus.cdo.uml.internal.ui.importsources.tests.CDOPackageImportSourceTest)  Time elapsed: 3.539 s  <<< ERROR!
java.lang.NullPointerException

testGetPackages(org.eclipse.papyrus.cdo.uml.internal.ui.importsources.tests.CDOPackageImportSourceTest)  Time elapsed: 3.541 s  <<< ERROR!
java.lang.NullPointerException
	at org.eclipse.papyrus.cdo.uml.internal.ui.importsources.tests.CDOPackageImportSourceTest.disposeTestFixture(CDOPackageImportSourceTest.java:159)

testCanImportInto(org.eclipse.papyrus.cdo.uml.internal.ui.importsources.tests.CDOPackageImportSourceTest)  Time elapsed: 0.517 s  <<< ERROR!
java.lang.NullPointerException

testCanImportInto(org.eclipse.papyrus.cdo.uml.internal.ui.importsources.tests.CDOPackageImportSourceTest)  Time elapsed: 0.517 s  <<< ERROR!
java.lang.NullPointerException
	at org.eclipse.papyrus.cdo.uml.internal.ui.importsources.tests.CDOPackageImportSourceTest.disposeTestFixture(CDOPackageImportSourceTest.java:159)

testValidateSelection(org.eclipse.papyrus.cdo.uml.internal.ui.importsources.tests.CDOPackageImportSourceTest)  Time elapsed: 0.515 s  <<< ERROR!
java.lang.NullPointerException

testValidateSelection(org.eclipse.papyrus.cdo.uml.internal.ui.importsources.tests.CDOPackageImportSourceTest)  Time elapsed: 0.515 s  <<< ERROR!
java.lang.NullPointerException
	at org.eclipse.papyrus.cdo.uml.internal.ui.importsources.tests.CDOPackageImportSourceTest.disposeTestFixture(CDOPackageImportSourceTest.java:159)

testCreateModelHierarchyContentProvider(org.eclipse.papyrus.cdo.uml.internal.ui.importsources.tests.CDOPackageImportSourceTest)  Time elapsed: 0.339 s  <<< ERROR!
java.lang.NullPointerException

testCreateModelHierarchyContentProvider(org.eclipse.papyrus.cdo.uml.internal.ui.importsources.tests.CDOPackageImportSourceTest)  Time elapsed: 0.34 s  <<< ERROR!
java.lang.NullPointerException
	at org.eclipse.papyrus.cdo.uml.internal.ui.importsources.tests.CDOPackageImportSourceTest.disposeTestFixture(CDOPackageImportSourceTest.java:159)

testGetCDOResource(org.eclipse.papyrus.cdo.uml.internal.ui.importsources.tests.CDOPackageImportSourceTest)  Time elapsed: 0.391 s  <<< ERROR!
java.lang.NullPointerException

testGetCDOResource(org.eclipse.papyrus.cdo.uml.internal.ui.importsources.tests.CDOPackageImportSourceTest)  Time elapsed: 0.391 s  <<< ERROR!
java.lang.NullPointerException
	at org.eclipse.papyrus.cdo.uml.internal.ui.importsources.tests.CDOPackageImportSourceTest.disposeTestFixture(CDOPackageImportSourceTest.java:159)

testCreateModelHierarchyLabelProvider(org.eclipse.papyrus.cdo.uml.internal.ui.importsources.tests.CDOPackageImportSourceTest)  Time elapsed: 0.291 s  <<< ERROR!
java.lang.NullPointerException

testCreateModelHierarchyLabelProvider(org.eclipse.papyrus.cdo.uml.internal.ui.importsources.tests.CDOPackageImportSourceTest)  Time elapsed: 0.291 s  <<< ERROR!
java.lang.NullPointerException
	at org.eclipse.papyrus.cdo.uml.internal.ui.importsources.tests.CDOPackageImportSourceTest.disposeTestFixture(CDOPackageImportSourceTest.java:159)


Results:

Errors: 
org.eclipse.papyrus.cdo.uml.internal.ui.importsources.tests.CDOPackageImportSourceTest.testCanImportInto(org.eclipse.papyrus.cdo.uml.internal.ui.importsources.tests.CDOPackageImportSourceTest)
  Run 1: CDOPackageImportSourceTest>AbstractPapyrusCDOUITest.initWorkbench:105 » NullPointer
  Run 2: CDOPackageImportSourceTest.disposeTestFixture:159 NullPointer

org.eclipse.papyrus.cdo.uml.internal.ui.importsources.tests.CDOPackageImportSourceTest.testCreateModelHierarchyContentProvider(org.eclipse.papyrus.cdo.uml.internal.ui.importsources.tests.CDOPackageImportSourceTest)
  Run 1: CDOPackageImportSourceTest>AbstractPapyrusCDOUITest.initWorkbench:105 » NullPointer
  Run 2: CDOPackageImportSourceTest.disposeTestFixture:159 NullPointer

org.eclipse.papyrus.cdo.uml.internal.ui.importsources.tests.CDOPackageImportSourceTest.testCreateModelHierarchyLabelProvider(org.eclipse.papyrus.cdo.uml.internal.ui.importsources.tests.CDOPackageImportSourceTest)
  Run 1: CDOPackageImportSourceTest>AbstractPapyrusCDOUITest.initWorkbench:105 » NullPointer
  Run 2: CDOPackageImportSourceTest.disposeTestFixture:159 NullPointer

org.eclipse.papyrus.cdo.uml.internal.ui.importsources.tests.CDOPackageImportSourceTest.testGetCDOResource(org.eclipse.papyrus.cdo.uml.internal.ui.importsources.tests.CDOPackageImportSourceTest)
  Run 1: CDOPackageImportSourceTest>AbstractPapyrusCDOUITest.initWorkbench:105 » NullPointer
  Run 2: CDOPackageImportSourceTest.disposeTestFixture:159 NullPointer

org.eclipse.papyrus.cdo.uml.internal.ui.importsources.tests.CDOPackageImportSourceTest.testGetPackages(org.eclipse.papyrus.cdo.uml.internal.ui.importsources.tests.CDOPackageImportSourceTest)
  Run 1: CDOPackageImportSourceTest>AbstractPapyrusCDOUITest.initWorkbench:105 » NullPointer
  Run 2: CDOPackageImportSourceTest.disposeTestFixture:159 NullPointer

org.eclipse.papyrus.cdo.uml.internal.ui.importsources.tests.CDOPackageImportSourceTest.testValidateSelection(org.eclipse.papyrus.cdo.uml.internal.ui.importsources.tests.CDOPackageImportSourceTest)
  Run 1: CDOPackageImportSourceTest>AbstractPapyrusCDOUITest.initWorkbench:105 » NullPointer
  Run 2: CDOPackageImportSourceTest.disposeTestFixture:159 NullPointer


Tests run: 6, Failures: 0, Errors: 6, Skipped: 0

[ERROR] There are test failures.

Please refer to /jobs/genie.papyrus/Papyrus-CDO/workspace/source/cdo/tests/org.eclipse.papyrus.cdo.uml.ui.tests/target/surefire-reports for the individual test results.
[INFO] 
[INFO] --- jacoco-maven-plugin:0.8.5:report (default-report) @ org.eclipse.papyrus.cdo.uml.ui.tests ---
[INFO] Loading execution data file /jobs/genie.papyrus/Papyrus-CDO/workspace/source/cdo/tests/org.eclipse.papyrus.cdo.uml.ui.tests/target/jacoco.exec
[INFO] Analyzed bundle 'org.eclipse.papyrus.cdo.uml.ui.tests' with 0 classes
[INFO] 
[INFO] --< org.eclipse.papyrus.cdo:org.eclipse.papyrus.cdo.uml.search.ui.tests >--
[INFO] Building org.eclipse.papyrus.cdo.uml.search.ui.tests 1.2.0-SNAPSHOT [33/35]
[INFO] ------------------------[ eclipse-test-plugin ]-------------------------
[INFO] 
[INFO] --- maven-clean-plugin:3.0.0:clean (default-clean) @ org.eclipse.papyrus.cdo.uml.search.ui.tests ---
[INFO] 
[INFO] --- tycho-packaging-plugin:1.6.0:build-qualifier (default-build-qualifier) @ org.eclipse.papyrus.cdo.uml.search.ui.tests ---
[INFO] The project's OSGi version is 1.2.0.202008071412
[INFO] 
[INFO] --- tycho-packaging-plugin:1.6.0:validate-id (default-validate-id) @ org.eclipse.papyrus.cdo.uml.search.ui.tests ---
[INFO] 
[INFO] --- tycho-packaging-plugin:1.6.0:validate-version (default-validate-version) @ org.eclipse.papyrus.cdo.uml.search.ui.tests ---
[INFO] 
[INFO] --- jacoco-maven-plugin:0.8.5:prepare-agent (default-prepare-agent) @ org.eclipse.papyrus.cdo.uml.search.ui.tests ---
[INFO] tycho.testArgLine set to -javaagent:/home/hudson/genie.papyrus/.jenkins/jobs/Papyrus-CDO/workspace/.repository/org/jacoco/org.jacoco.agent/0.8.5/org.jacoco.agent-0.8.5-runtime.jar=destfile=/jobs/genie.papyrus/Papyrus-CDO/workspace/source/cdo/tests/org.eclipse.papyrus.cdo.uml.search.ui.tests/target/jacoco.exec,includes=org.eclipse.papyrus.*,excludes=org.eclipse.uml2
[INFO] 
[INFO] --- maven-resources-plugin:2.7:resources (default-resources) @ org.eclipse.papyrus.cdo.uml.search.ui.tests ---
[INFO] Using 'UTF-8' encoding to copy filtered resources.
[INFO] skip non existing resourceDirectory /jobs/genie.papyrus/Papyrus-CDO/workspace/source/cdo/tests/org.eclipse.papyrus.cdo.uml.search.ui.tests/src/main/resources
[INFO] 
[INFO] --- tycho-compiler-plugin:1.6.0:compile (default-compile) @ org.eclipse.papyrus.cdo.uml.search.ui.tests ---
[WARNING] The effective compiler target level 1.8 is incompatible with the following OSGi execution environments: [JavaSE-1.6 (assumes 1.6)] @ MavenProject: org.eclipse.papyrus.cdo:org.eclipse.papyrus.cdo.uml.search.ui.tests:1.2.0-SNAPSHOT @ /jobs/genie.papyrus/Papyrus-CDO/workspace/source/cdo/tests/org.eclipse.papyrus.cdo.uml.search.ui.tests/pom.xml
[INFO] Compiling 5 source files to /jobs/genie.papyrus/Papyrus-CDO/workspace/source/cdo/tests/org.eclipse.papyrus.cdo.uml.search.ui.tests/target/classes
[WARNING] /jobs/genie.papyrus/Papyrus-CDO/workspace/source/cdo/tests/org.eclipse.papyrus.cdo.uml.search.ui.tests/src/org/eclipse/papyrus/cdo/uml/search/ui/tests/AbstractPapyrusCDOSearchTest.java:[81] 
	@SuppressWarnings("restriction")
	                  ^^^^^^^^^^^^^
Unnecessary @SuppressWarnings("restriction")
1 problem (1 warning)
[INFO] 
[INFO] --- maven-resources-plugin:2.7:testResources (default-testResources) @ org.eclipse.papyrus.cdo.uml.search.ui.tests ---
[INFO] Using 'UTF-8' encoding to copy filtered resources.
[INFO] skip non existing resourceDirectory /jobs/genie.papyrus/Papyrus-CDO/workspace/source/cdo/tests/org.eclipse.papyrus.cdo.uml.search.ui.tests/src/test/resources
[INFO] 
[INFO] --- tycho-source-plugin:1.6.0:plugin-source (plugin-source) @ org.eclipse.papyrus.cdo.uml.search.ui.tests ---
[INFO] Building jar: /jobs/genie.papyrus/Papyrus-CDO/workspace/source/cdo/tests/org.eclipse.papyrus.cdo.uml.search.ui.tests/target/org.eclipse.papyrus.cdo.uml.search.ui.tests-1.2.0-SNAPSHOT-sources.jar
[INFO] 
[INFO] --- target-platform-configuration:1.6.0:target-platform (default-target-platform) @ org.eclipse.papyrus.cdo.uml.search.ui.tests ---
[INFO] 
[INFO] --- tycho-packaging-plugin:1.6.0:package-plugin (default-package-plugin) @ org.eclipse.papyrus.cdo.uml.search.ui.tests ---
[INFO] Building jar: /jobs/genie.papyrus/Papyrus-CDO/workspace/source/cdo/tests/org.eclipse.papyrus.cdo.uml.search.ui.tests/target/org.eclipse.papyrus.cdo.uml.search.ui.tests-1.2.0-SNAPSHOT.jar
[INFO] 
[INFO] --- tycho-p2-plugin:1.6.0:p2-metadata-default (default-p2-metadata-default) @ org.eclipse.papyrus.cdo.uml.search.ui.tests ---
[INFO] 
[INFO] --- tycho-source-feature-plugin:1.6.0:source-feature (source-feature) @ org.eclipse.papyrus.cdo.uml.search.ui.tests ---
[INFO] 
[INFO] --- tycho-p2-plugin:1.6.0:p2-metadata (attach-p2-metadata) @ org.eclipse.papyrus.cdo.uml.search.ui.tests ---
[INFO] 
[INFO] --- tycho-surefire-plugin:1.6.0:test (default-test) @ org.eclipse.papyrus.cdo.uml.search.ui.tests ---
[INFO] Expected eclipse log file: /jobs/genie.papyrus/Papyrus-CDO/workspace/source/cdo/tests/org.eclipse.papyrus.cdo.uml.search.ui.tests/target/work/data/.metadata/.log
[INFO] Command line:
	[/opt/public/common/java/oracle/jdk1.8.0_202_x64/jre/bin/java, -Dosgi.noShutdown=false, -Dosgi.os=linux, -Dosgi.ws=gtk, -Dosgi.arch=x86_64, -javaagent:/home/hudson/genie.papyrus/.jenkins/jobs/Papyrus-CDO/workspace/.repository/org/jacoco/org.jacoco.agent/0.8.5/org.jacoco.agent-0.8.5-runtime.jar=destfile=/jobs/genie.papyrus/Papyrus-CDO/workspace/source/cdo/tests/org.eclipse.papyrus.cdo.uml.search.ui.tests/target/jacoco.exec,includes=org.eclipse.papyrus.*,excludes=org.eclipse.uml2, -Xms512m, -Xmx2048m, -XX:SoftRefLRUPolicyMSPerMB=100, -Dosgi.clean=true, -jar, /jobs/genie.papyrus/Papyrus-CDO/workspace/.repository/p2/osgi/bundle/org.eclipse.equinox.launcher/1.5.700.v20200207-2156/org.eclipse.equinox.launcher-1.5.700.v20200207-2156.jar, -data, /jobs/genie.papyrus/Papyrus-CDO/workspace/source/cdo/tests/org.eclipse.papyrus.cdo.uml.search.ui.tests/target/work/data, -install, /jobs/genie.papyrus/Papyrus-CDO/workspace/source/cdo/tests/org.eclipse.papyrus.cdo.uml.search.ui.tests/target/work, -configuration, /jobs/genie.papyrus/Papyrus-CDO/workspace/source/cdo/tests/org.eclipse.papyrus.cdo.uml.search.ui.tests/target/work/configuration, -application, org.eclipse.tycho.surefire.osgibooter.uitest, -testproperties, /jobs/genie.papyrus/Papyrus-CDO/workspace/source/cdo/tests/org.eclipse.papyrus.cdo.uml.search.ui.tests/target/surefire.properties, -product, org.eclipse.sdk.ide, -testConfig=CI_TESTS_CONFIG]
Picked up JAVA_TOOL_OPTIONS: -Xmx2G -Djava.io.tmpdir=/tmp/genie.papyrus -DforkCount=1
***WARNING: GTK+ version too old (micro mismatch)
***WARNING: SWT requires GTK 3.20.0
***WARNING: Detected: 3.10.9

(SWT:9991): Gtk-WARNING **: Theme parsing error: <data>:31:11: 'min-height' is not a valid property name
Running org.eclipse.papyrus.cdo.uml.search.ui.tests.AdvancedTextSearchTest
Tests run: 4, Failures: 0, Errors: 4, Skipped: 0, Time elapsed: 3.206 s <<< FAILURE! - in org.eclipse.papyrus.cdo.uml.search.ui.tests.AdvancedTextSearchTest
testSearchByOneAttributesOfTwoMetaclasses(org.eclipse.papyrus.cdo.uml.search.ui.tests.AdvancedTextSearchTest)  Time elapsed: 1.913 s  <<< ERROR!
java.lang.IllegalArgumentException: The datatype 'EFeatureMapEntry' is not a valid classifier

testSearchByOneAttributeOfOneMetaclass(org.eclipse.papyrus.cdo.uml.search.ui.tests.AdvancedTextSearchTest)  Time elapsed: 0.582 s  <<< ERROR!
java.lang.IllegalArgumentException: The datatype 'EFeatureMapEntry' is not a valid classifier

testSearchByAllAttributesOfAMetaclass(org.eclipse.papyrus.cdo.uml.search.ui.tests.AdvancedTextSearchTest)  Time elapsed: 0.34 s  <<< ERROR!
java.lang.IllegalArgumentException: The datatype 'EFeatureMapEntry' is not a valid classifier

testSearchByNonStringAttribute(org.eclipse.papyrus.cdo.uml.search.ui.tests.AdvancedTextSearchTest)  Time elapsed: 0.276 s  <<< ERROR!
java.lang.IllegalArgumentException: The datatype 'EFeatureMapEntry' is not a valid classifier

Running org.eclipse.papyrus.cdo.uml.search.ui.tests.BasicTextSearchTest
Tests run: 4, Failures: 0, Errors: 4, Skipped: 0, Time elapsed: 1.826 s <<< FAILURE! - in org.eclipse.papyrus.cdo.uml.search.ui.tests.BasicTextSearchTest
testSearchByNameCaseSensitive(org.eclipse.papyrus.cdo.uml.search.ui.tests.BasicTextSearchTest)  Time elapsed: 0.326 s  <<< ERROR!
java.lang.IllegalArgumentException: The datatype 'EFeatureMapEntry' is not a valid classifier

testSearchByName(org.eclipse.papyrus.cdo.uml.search.ui.tests.BasicTextSearchTest)  Time elapsed: 0.274 s  <<< ERROR!
java.lang.IllegalArgumentException: The datatype 'EFeatureMapEntry' is not a valid classifier

testSearchByNameRegex(org.eclipse.papyrus.cdo.uml.search.ui.tests.BasicTextSearchTest)  Time elapsed: 0.249 s  <<< ERROR!
java.lang.IllegalArgumentException: The datatype 'EFeatureMapEntry' is not a valid classifier

testSearchByAnyString(org.eclipse.papyrus.cdo.uml.search.ui.tests.BasicTextSearchTest)  Time elapsed: 0.96 s  <<< ERROR!
java.lang.IllegalArgumentException: The datatype 'EFeatureMapEntry' is not a valid classifier

Running org.eclipse.papyrus.cdo.uml.search.ui.tests.SearchScopingTest
Tests run: 3, Failures: 0, Errors: 3, Skipped: 0, Time elapsed: 2.504 s <<< FAILURE! - in org.eclipse.papyrus.cdo.uml.search.ui.tests.SearchScopingTest
testSearchModel(org.eclipse.papyrus.cdo.uml.search.ui.tests.SearchScopingTest)  Time elapsed: 1.743 s  <<< ERROR!
java.lang.IllegalArgumentException: The datatype 'EFeatureMapEntry' is not a valid classifier

testSearchWholeFolder(org.eclipse.papyrus.cdo.uml.search.ui.tests.SearchScopingTest)  Time elapsed: 0.427 s  <<< ERROR!
java.lang.IllegalArgumentException: The datatype 'EFeatureMapEntry' is not a valid classifier

testCanProvideFor(org.eclipse.papyrus.cdo.uml.search.ui.tests.SearchScopingTest)  Time elapsed: 0.33 s  <<< ERROR!
java.lang.IllegalArgumentException: The datatype 'EFeatureMapEntry' is not a valid classifier


Results:

Errors: 
  AdvancedTextSearchTest>AbstractPapyrusCDOSearchTest.importTestModel:98->AbstractPapyrusCDOSearchTest.importModel:106->AbstractPapyrusCDOSearchTest.importResource:120 » IllegalArgument
  AdvancedTextSearchTest>AbstractPapyrusCDOSearchTest.importTestModel:98->AbstractPapyrusCDOSearchTest.importModel:106->AbstractPapyrusCDOSearchTest.importResource:120 » IllegalArgument
  AdvancedTextSearchTest>AbstractPapyrusCDOSearchTest.importTestModel:98->AbstractPapyrusCDOSearchTest.importModel:106->AbstractPapyrusCDOSearchTest.importResource:120 » IllegalArgument
  AdvancedTextSearchTest>AbstractPapyrusCDOSearchTest.importTestModel:98->AbstractPapyrusCDOSearchTest.importModel:106->AbstractPapyrusCDOSearchTest.importResource:120 » IllegalArgument
  BasicTextSearchTest>AbstractPapyrusCDOSearchTest.importTestModel:98->AbstractPapyrusCDOSearchTest.importModel:106->AbstractPapyrusCDOSearchTest.importResource:120 » IllegalArgument
  BasicTextSearchTest>AbstractPapyrusCDOSearchTest.importTestModel:98->AbstractPapyrusCDOSearchTest.importModel:106->AbstractPapyrusCDOSearchTest.importResource:120 » IllegalArgument
  BasicTextSearchTest>AbstractPapyrusCDOSearchTest.importTestModel:98->AbstractPapyrusCDOSearchTest.importModel:106->AbstractPapyrusCDOSearchTest.importResource:120 » IllegalArgument
  BasicTextSearchTest>AbstractPapyrusCDOSearchTest.importTestModel:98->AbstractPapyrusCDOSearchTest.importModel:106->AbstractPapyrusCDOSearchTest.importResource:120 » IllegalArgument
  SearchScopingTest>AbstractPapyrusCDOSearchTest.importTestModel:98->AbstractPapyrusCDOSearchTest.importModel:106->AbstractPapyrusCDOSearchTest.importResource:120 » IllegalArgument
  SearchScopingTest>AbstractPapyrusCDOSearchTest.importTestModel:98->AbstractPapyrusCDOSearchTest.importModel:106->AbstractPapyrusCDOSearchTest.importResource:120 » IllegalArgument
  SearchScopingTest>AbstractPapyrusCDOSearchTest.importTestModel:98->AbstractPapyrusCDOSearchTest.importModel:106->AbstractPapyrusCDOSearchTest.importResource:120 » IllegalArgument

Tests run: 11, Failures: 0, Errors: 11, Skipped: 0

[ERROR] There are test failures.

Please refer to /jobs/genie.papyrus/Papyrus-CDO/workspace/source/cdo/tests/org.eclipse.papyrus.cdo.uml.search.ui.tests/target/surefire-reports for the individual test results.
[INFO] 
[INFO] --- jacoco-maven-plugin:0.8.5:report (default-report) @ org.eclipse.papyrus.cdo.uml.search.ui.tests ---
[INFO] Loading execution data file /jobs/genie.papyrus/Papyrus-CDO/workspace/source/cdo/tests/org.eclipse.papyrus.cdo.uml.search.ui.tests/target/jacoco.exec
[INFO] Analyzed bundle 'org.eclipse.papyrus.cdo.uml.search.ui.tests' with 0 classes
[INFO] 
[INFO] -------< org.eclipse.papyrus.cdo:org.eclipse.papyrus.cdo.tests >--------
[INFO] Building org.eclipse.papyrus.cdo.tests 1.2.0-SNAPSHOT            [34/35]
[INFO] ------------------------[ eclipse-test-plugin ]-------------------------
[INFO] 
[INFO] --- maven-clean-plugin:3.0.0:clean (default-clean) @ org.eclipse.papyrus.cdo.tests ---
[INFO] 
[INFO] --- tycho-packaging-plugin:1.6.0:build-qualifier (default-build-qualifier) @ org.eclipse.papyrus.cdo.tests ---
[INFO] The project's OSGi version is 1.2.0.202008071412
[INFO] 
[INFO] --- tycho-packaging-plugin:1.6.0:validate-id (default-validate-id) @ org.eclipse.papyrus.cdo.tests ---
[INFO] 
[INFO] --- tycho-packaging-plugin:1.6.0:validate-version (default-validate-version) @ org.eclipse.papyrus.cdo.tests ---
[INFO] 
[INFO] --- jacoco-maven-plugin:0.8.5:prepare-agent (default-prepare-agent) @ org.eclipse.papyrus.cdo.tests ---
[INFO] tycho.testArgLine set to -javaagent:/home/hudson/genie.papyrus/.jenkins/jobs/Papyrus-CDO/workspace/.repository/org/jacoco/org.jacoco.agent/0.8.5/org.jacoco.agent-0.8.5-runtime.jar=destfile=/jobs/genie.papyrus/Papyrus-CDO/workspace/source/cdo/tests/org.eclipse.papyrus.cdo.tests/target/jacoco.exec,includes=org.eclipse.papyrus.*,excludes=org.eclipse.uml2
[INFO] 
[INFO] --- maven-resources-plugin:2.7:resources (default-resources) @ org.eclipse.papyrus.cdo.tests ---
[INFO] Using 'UTF-8' encoding to copy filtered resources.
[INFO] skip non existing resourceDirectory /jobs/genie.papyrus/Papyrus-CDO/workspace/source/cdo/tests/org.eclipse.papyrus.cdo.tests/src/main/resources
[INFO] 
[INFO] --- tycho-compiler-plugin:1.6.0:compile (default-compile) @ org.eclipse.papyrus.cdo.tests ---
[WARNING] The effective compiler target level 1.8 is incompatible with the following OSGi execution environments: [JavaSE-1.6 (assumes 1.6)] @ MavenProject: org.eclipse.papyrus.cdo:org.eclipse.papyrus.cdo.tests:1.2.0-SNAPSHOT @ /jobs/genie.papyrus/Papyrus-CDO/workspace/source/cdo/tests/org.eclipse.papyrus.cdo.tests/pom.xml
[INFO] Compiling 1 source file to /jobs/genie.papyrus/Papyrus-CDO/workspace/source/cdo/tests/org.eclipse.papyrus.cdo.tests/target/classes
[INFO] 
[INFO] --- maven-resources-plugin:2.7:testResources (default-testResources) @ org.eclipse.papyrus.cdo.tests ---
[INFO] Using 'UTF-8' encoding to copy filtered resources.
[INFO] skip non existing resourceDirectory /jobs/genie.papyrus/Papyrus-CDO/workspace/source/cdo/tests/org.eclipse.papyrus.cdo.tests/src/test/resources
[INFO] 
[INFO] --- tycho-source-plugin:1.6.0:plugin-source (plugin-source) @ org.eclipse.papyrus.cdo.tests ---
[INFO] Building jar: /jobs/genie.papyrus/Papyrus-CDO/workspace/source/cdo/tests/org.eclipse.papyrus.cdo.tests/target/org.eclipse.papyrus.cdo.tests-1.2.0-SNAPSHOT-sources.jar
[INFO] 
[INFO] --- target-platform-configuration:1.6.0:target-platform (default-target-platform) @ org.eclipse.papyrus.cdo.tests ---
[INFO] 
[INFO] --- tycho-packaging-plugin:1.6.0:package-plugin (default-package-plugin) @ org.eclipse.papyrus.cdo.tests ---
[INFO] Building jar: /jobs/genie.papyrus/Papyrus-CDO/workspace/source/cdo/tests/org.eclipse.papyrus.cdo.tests/target/org.eclipse.papyrus.cdo.tests-1.2.0-SNAPSHOT.jar
[INFO] 
[INFO] --- tycho-p2-plugin:1.6.0:p2-metadata-default (default-p2-metadata-default) @ org.eclipse.papyrus.cdo.tests ---
[INFO] 
[INFO] --- tycho-source-feature-plugin:1.6.0:source-feature (source-feature) @ org.eclipse.papyrus.cdo.tests ---
[INFO] 
[INFO] --- tycho-p2-plugin:1.6.0:p2-metadata (attach-p2-metadata) @ org.eclipse.papyrus.cdo.tests ---
[INFO] 
[INFO] --- tycho-surefire-plugin:1.6.0:test (default-test) @ org.eclipse.papyrus.cdo.tests ---
[INFO] Expected eclipse log file: /jobs/genie.papyrus/Papyrus-CDO/workspace/source/cdo/tests/org.eclipse.papyrus.cdo.tests/target/work/data/.metadata/.log
[INFO] Command line:
	[/opt/public/common/java/oracle/jdk1.8.0_202_x64/jre/bin/java, -Dosgi.noShutdown=false, -Dosgi.os=linux, -Dosgi.ws=gtk, -Dosgi.arch=x86_64, -javaagent:/home/hudson/genie.papyrus/.jenkins/jobs/Papyrus-CDO/workspace/.repository/org/jacoco/org.jacoco.agent/0.8.5/org.jacoco.agent-0.8.5-runtime.jar=destfile=/jobs/genie.papyrus/Papyrus-CDO/workspace/source/cdo/tests/org.eclipse.papyrus.cdo.tests/target/jacoco.exec,includes=org.eclipse.papyrus.*,excludes=org.eclipse.uml2, -Xms512m, -Xmx2048m, -XX:SoftRefLRUPolicyMSPerMB=100, -Dosgi.clean=true, -jar, /jobs/genie.papyrus/Papyrus-CDO/workspace/.repository/p2/osgi/bundle/org.eclipse.equinox.launcher/1.5.700.v20200207-2156/org.eclipse.equinox.launcher-1.5.700.v20200207-2156.jar, -data, /jobs/genie.papyrus/Papyrus-CDO/workspace/source/cdo/tests/org.eclipse.papyrus.cdo.tests/target/work/data, -install, /jobs/genie.papyrus/Papyrus-CDO/workspace/source/cdo/tests/org.eclipse.papyrus.cdo.tests/target/work, -configuration, /jobs/genie.papyrus/Papyrus-CDO/workspace/source/cdo/tests/org.eclipse.papyrus.cdo.tests/target/work/configuration, -application, org.eclipse.tycho.surefire.osgibooter.uitest, -testproperties, /jobs/genie.papyrus/Papyrus-CDO/workspace/source/cdo/tests/org.eclipse.papyrus.cdo.tests/target/surefire.properties, -product, org.eclipse.sdk.ide, -testConfig=CI_TESTS_CONFIG]
Picked up JAVA_TOOL_OPTIONS: -Xmx2G -Djava.io.tmpdir=/tmp/genie.papyrus -DforkCount=1
***WARNING: GTK+ version too old (micro mismatch)
***WARNING: SWT requires GTK 3.20.0
***WARNING: Detected: 3.10.9

(SWT:10426): Gtk-WARNING **: Theme parsing error: <data>:31:11: 'min-height' is not a valid property name

Results:

Tests run: 0, Failures: 0, Errors: 0, Skipped: 0

[WARNING] No tests found.
[INFO] 
[INFO] --- jacoco-maven-plugin:0.8.5:report (default-report) @ org.eclipse.papyrus.cdo.tests ---
[INFO] Loading execution data file /jobs/genie.papyrus/Papyrus-CDO/workspace/source/cdo/tests/org.eclipse.papyrus.cdo.tests/target/jacoco.exec
[INFO] Analyzed bundle 'org.eclipse.papyrus.cdo.tests' with 0 classes
[INFO] 
[INFO] -----< org.eclipse.papyrus.cdo:org.eclipse.papyrus.uml.cdo-tests >------
[INFO] Building org.eclipse.papyrus.uml.cdo-tests 1.2.0-SNAPSHOT        [35/35]
[INFO] --------------------------------[ pom ]---------------------------------
[INFO] 
[INFO] --- maven-clean-plugin:3.0.0:clean (default-clean) @ org.eclipse.papyrus.uml.cdo-tests ---
[INFO] 
[INFO] --- jacoco-maven-plugin:0.8.5:prepare-agent (default-prepare-agent) @ org.eclipse.papyrus.uml.cdo-tests ---
[INFO] argLine set to -javaagent:/home/hudson/genie.papyrus/.jenkins/jobs/Papyrus-CDO/workspace/.repository/org/jacoco/org.jacoco.agent/0.8.5/org.jacoco.agent-0.8.5-runtime.jar=destfile=/jobs/genie.papyrus/Papyrus-CDO/workspace/source/cdo/tests/uml/target/jacoco.exec,includes=org.eclipse.papyrus.*,excludes=org.eclipse.uml2
[INFO] 
[INFO] --- tycho-source-plugin:1.6.0:plugin-source (plugin-source) @ org.eclipse.papyrus.uml.cdo-tests ---
[INFO] 
[INFO] --- tycho-source-feature-plugin:1.6.0:source-feature (source-feature) @ org.eclipse.papyrus.uml.cdo-tests ---
[INFO] 
[INFO] --- tycho-p2-plugin:1.6.0:p2-metadata (attach-p2-metadata) @ org.eclipse.papyrus.uml.cdo-tests ---
[INFO] 
[INFO] --- jacoco-maven-plugin:0.8.5:report (default-report) @ org.eclipse.papyrus.uml.cdo-tests ---
[INFO] Skipping JaCoCo execution due to missing execution data file.
[INFO] ------------------------------------------------------------------------
[INFO] Reactor Summary:
[INFO] 
[INFO] Collaborative Modeling - CDO 1.2.0-SNAPSHOT ........ SUCCESS [01:06 min]
[INFO] org.eclipse.papyrus.cdo-bundles 1.2.0-SNAPSHOT ..... SUCCESS [  0.009 s]
[INFO] org.eclipse.papyrus.cdo.core 2.0.1-SNAPSHOT ........ SUCCESS [ 35.230 s]
[INFO] org.eclipse.papyrus.cdo.security 1.0.0-SNAPSHOT .... SUCCESS [  0.327 s]
[INFO] org.eclipse.papyrus.cdo.security.properties 1.0.0-SNAPSHOT SUCCESS [  0.229 s]
[INFO] org.eclipse.papyrus.cdo.validation.problems 1.2.0-SNAPSHOT SUCCESS [  0.283 s]
[INFO] org.eclipse.papyrus.cdo.validation.problems.edit 1.2.0-SNAPSHOT SUCCESS [  0.159 s]
[INFO] org.eclipse.papyrus.cdo.ui 1.2.0-SNAPSHOT .......... SUCCESS [  0.850 s]
[INFO] org.eclipse.papyrus.cdo.ui.customization.properties 1.2.0-SNAPSHOT SUCCESS [  0.419 s]
[INFO] org.eclipse.papyrus.cdo.ui.hyperlink 1.2.0-SNAPSHOT  SUCCESS [  0.345 s]
[INFO] org.eclipse.papyrus.cdo.uml.diagram.ui 1.2.0-SNAPSHOT SUCCESS [  0.374 s]
[INFO] org.eclipse.papyrus.cdo.uml.search.ui 1.2.0-SNAPSHOT SUCCESS [  0.470 s]
[INFO] org.eclipse.papyrus.cdo.uml.ui 1.2.0-SNAPSHOT ...... SUCCESS [  1.035 s]
[INFO] org.eclipse.papyrus.infra.gmfdiag.css.cdo 2.2.100-SNAPSHOT SUCCESS [  0.552 s]
[INFO] org.eclipse.papyrus.infra.gmfdiag.style.cdo 2.0.0-SNAPSHOT SUCCESS [  0.273 s]
[INFO] org.eclipse.papyrus.infra.core.architecture.cdo 2.1.0-SNAPSHOT SUCCESS [  0.272 s]
[INFO] org.eclipse.papyrus.infra.nattable.model.cdo 4.2.0-SNAPSHOT SUCCESS [  0.414 s]
[INFO] uml 1.2.0-SNAPSHOT ................................. SUCCESS [  0.008 s]
[INFO] org.eclipse.uml2.uml.cdo 5.4.0-SNAPSHOT ............ SUCCESS [  2.207 s]
[INFO] org.eclipse.uml2.uml.profile.standard.cdo 1.5.0-SNAPSHOT SUCCESS [  0.175 s]
[INFO] org.eclipse.papyrus.cdo-features 1.2.0-SNAPSHOT .... SUCCESS [  0.004 s]
[INFO] org.eclipse.papyrus.cdo.feature 1.2.0-SNAPSHOT ..... SUCCESS [  0.358 s]
[INFO] org.eclipse.papyrus.cdo.models.feature 1.0.0-SNAPSHOT SUCCESS [  0.262 s]
[INFO] org.eclipse.papyrus.cdo-releng 1.2.0-SNAPSHOT ...... SUCCESS [  0.004 s]
[INFO] org.eclipse.papyrus.cdo.p2 1.2.0-SNAPSHOT .......... SUCCESS [  4.679 s]
[INFO] org.eclipse.papyrus.cdo-targetplatforms 1.2.0-SNAPSHOT SUCCESS [  0.008 s]
[INFO] org.eclipse.papyrus.cdo.targetplatform 1.2.0-SNAPSHOT SUCCESS [  0.008 s]
[INFO] org.eclipse.papyrus.cdo-tests 1.2.0-SNAPSHOT ....... SUCCESS [  0.006 s]
[INFO] org.eclipse.papyrus.cdo.core.tests 1.2.0-SNAPSHOT .. SUCCESS [ 39.052 s]
[INFO] org.eclipse.papyrus.cdo.ui.tests 1.2.0-SNAPSHOT .... SUCCESS [ 21.449 s]
[INFO] org.eclipse.papyrus.cdo.validation.problems.tests 1.2.0-SNAPSHOT SUCCESS [ 12.067 s]
[INFO] org.eclipse.papyrus.cdo.uml.ui.tests 1.2.0-SNAPSHOT  SUCCESS [ 16.819 s]
[INFO] org.eclipse.papyrus.cdo.uml.search.ui.tests 1.2.0-SNAPSHOT SUCCESS [ 17.790 s]
[INFO] org.eclipse.papyrus.cdo.tests 1.2.0-SNAPSHOT ....... SUCCESS [ 10.388 s]
[INFO] org.eclipse.papyrus.uml.cdo-tests 1.2.0-SNAPSHOT ... SUCCESS [  0.009 s]
[INFO] ------------------------------------------------------------------------
[INFO] BUILD SUCCESS
[INFO] ------------------------------------------------------------------------
[INFO] Total time:  09:24 min
[INFO] Finished at: 2020-08-07T10:22:22-04:00
[INFO] ------------------------------------------------------------------------
[workspace] $ /bin/sh -xe /tmp/genie.papyrus/jenkins793242698434429202.sh
+ . source/cdo/releng/toolkit/server/build-after.sh
++ p2UpdateSiteDir=/home/hudson/genie.papyrus/.jenkins/jobs/Papyrus-CDO/workspace/source/cdo/releng/org.eclipse.papyrus.cdo.p2/target/repository/
++ updateSite=/home/hudson/genie.papyrus/.jenkins/jobs/Papyrus-CDO/workspace/repository
++ '[' -n '' ']'
++ buildType=N
++ COMPACT_BUILD_ID=202008071012
++ FULL_BUILD_ID=N202008071012
++ '[' -n '' ']'
++ updateZipName=Papyrus-CDO-N202008071012.zip
++ zipName=Papyrus-CDO.zip
++ rm -rf tmp
++ mkdir -p tmp/N202008071012
++ rm -rf /home/hudson/genie.papyrus/.jenkins/jobs/Papyrus-CDO/workspace/repository
++ mv /home/hudson/genie.papyrus/.jenkins/jobs/Papyrus-CDO/workspace/source/cdo/releng/org.eclipse.papyrus.cdo.p2/target/repository/ /home/hudson/genie.papyrus/.jenkins/jobs/Papyrus-CDO/workspace/repository
++ cd /home/hudson/genie.papyrus/.jenkins/jobs/Papyrus-CDO/workspace/repository
++ zip -r Papyrus-CDO-N202008071012.zip artifacts.jar artifacts.xml.xz content.jar content.xml.xz features p2.index plugins
  adding: artifacts.jar (deflated 0%)
  adding: artifacts.xml.xz (stored 0%)
  adding: content.jar (deflated 5%)
  adding: content.xml.xz (stored 0%)
  adding: features/ (stored 0%)
  adding: features/org.eclipse.papyrus.cdo.feature.source_1.2.0.202008071412.jar (deflated 7%)
  adding: features/org.eclipse.papyrus.cdo.models.feature.source_1.0.0.202008071412.jar (deflated 7%)
  adding: features/org.eclipse.papyrus.cdo.feature_1.2.0.202008071412.jar (deflated 2%)
  adding: features/org.eclipse.papyrus.cdo.models.feature_1.0.0.202008071412.jar (deflated 2%)
  adding: p2.index (deflated 37%)
  adding: plugins/ (stored 0%)
  adding: plugins/org.eclipse.uml2.uml.profile.standard.cdo.source_1.5.0.202008071412.jar (deflated 14%)
  adding: plugins/org.eclipse.papyrus.cdo.core.source_2.0.1.202008071412.jar (deflated 15%)
  adding: plugins/org.eclipse.papyrus.cdo.validation.problems.edit.source_1.2.0.202008071412.jar (deflated 18%)
  adding: plugins/org.eclipse.papyrus.infra.nattable.model.cdo.source_4.2.0.202008071412.jar (deflated 18%)
  adding: plugins/org.eclipse.papyrus.cdo.core_2.0.1.202008071412.jar (deflated 15%)
  adding: plugins/org.eclipse.papyrus.cdo.security.source_1.0.0.202008071412.jar (deflated 22%)
  adding: plugins/org.eclipse.papyrus.cdo.ui.source_1.2.0.202008071412.jar (deflated 11%)
  adding: plugins/org.eclipse.papyrus.cdo.validation.problems.edit_1.2.0.202008071412.jar (deflated 22%)
  adding: plugins/org.eclipse.papyrus.infra.gmfdiag.css.cdo_2.2.100.202008071412.jar (deflated 11%)
  adding: plugins/org.eclipse.papyrus.cdo.ui_1.2.0.202008071412.jar (deflated 12%)
  adding: plugins/org.eclipse.papyrus.cdo.security.properties_1.0.0.202008071412.jar (deflated 49%)
  adding: plugins/org.eclipse.papyrus.cdo.uml.search.ui_1.2.0.202008071412.jar (deflated 16%)
  adding: plugins/org.eclipse.papyrus.infra.nattable.model.cdo_4.2.0.202008071412.jar (deflated 13%)
  adding: plugins/org.eclipse.papyrus.cdo.ui.hyperlink.source_1.2.0.202008071412.jar (deflated 19%)
  adding: plugins/org.eclipse.papyrus.cdo.uml.search.ui.source_1.2.0.202008071412.jar (deflated 18%)
  adding: plugins/org.eclipse.papyrus.infra.core.architecture.cdo.source_2.1.0.202008071412.jar (deflated 14%)
  adding: plugins/org.eclipse.papyrus.cdo.ui.customization.properties.source_1.2.0.202008071412.jar (deflated 21%)
  adding: plugins/org.eclipse.papyrus.cdo.ui.hyperlink_1.2.0.202008071412.jar (deflated 18%)
  adding: plugins/org.eclipse.papyrus.infra.gmfdiag.style.cdo.source_2.0.0.202008071412.jar (deflated 24%)
  adding: plugins/org.eclipse.papyrus.cdo.uml.diagram.ui_1.2.0.202008071412.jar (deflated 18%)
  adding: plugins/org.eclipse.papyrus.cdo.uml.ui_1.2.0.202008071412.jar (deflated 25%)
  adding: plugins/org.eclipse.papyrus.cdo.validation.problems_1.2.0.202008071412.jar (deflated 14%)
  adding: plugins/org.eclipse.uml2.uml.profile.standard.cdo_1.5.0.202008071412.jar (deflated 15%)
  adding: plugins/org.eclipse.papyrus.cdo.uml.diagram.ui.source_1.2.0.202008071412.jar (deflated 21%)
  adding: plugins/org.eclipse.papyrus.infra.gmfdiag.css.cdo.source_2.2.100.202008071412.jar (deflated 14%)
  adding: plugins/org.eclipse.uml2.uml.cdo.source_5.4.0.202008071412.jar (deflated 3%)
  adding: plugins/org.eclipse.papyrus.cdo.security_1.0.0.202008071412.jar (deflated 22%)
  adding: plugins/org.eclipse.papyrus.infra.gmfdiag.style.cdo_2.0.0.202008071412.jar (deflated 30%)
  adding: plugins/org.eclipse.uml2.uml.cdo_5.4.0.202008071412.jar (deflated 3%)
  adding: plugins/org.eclipse.papyrus.cdo.validation.problems.source_1.2.0.202008071412.jar (deflated 13%)
  adding: plugins/org.eclipse.papyrus.cdo.security.properties.source_1.0.0.202008071412.jar (deflated 36%)
  adding: plugins/org.eclipse.papyrus.cdo.uml.ui.source_1.2.0.202008071412.jar (deflated 27%)
  adding: plugins/org.eclipse.papyrus.cdo.ui.customization.properties_1.2.0.202008071412.jar (deflated 18%)
  adding: plugins/org.eclipse.papyrus.infra.core.architecture.cdo_2.1.0.202008071412.jar (deflated 9%)
++ mv /home/hudson/genie.papyrus/.jenkins/jobs/Papyrus-CDO/workspace/repository/Papyrus-CDO-N202008071012.zip tmp/N202008071012
++ cd tmp
++ zip -r Papyrus-CDO.zip N202008071012
  adding: N202008071012/ (stored 0%)
  adding: N202008071012/Papyrus-CDO-N202008071012.zip (stored 0%)
++ mv tmp/Papyrus-CDO.zip .
Terminating xvnc.
Sending e-mails to: quentin.lemenez@cea.fr
Recording test results
Build step 'Publish JUnit test result report' changed build result to UNSTABLE
Archiving artifacts
Started calculate disk usage of build
Finished Calculation of disk usage of build in 0 seconds
Started calculate disk usage of workspace
Finished Calculation of disk usage of workspace in 0 seconds
Finished: UNSTABLE