UnstableConsole Output

Skipping 1,394 KB.. Full Log
NFO] --- maven-resources-plugin:2.7:resources (default-resources) @ org.eclipse.papyrus.infra.gmfdiag.style.cdo ---
[INFO] Using 'UTF-8' encoding to copy filtered resources.
[INFO] skip non existing resourceDirectory /jobs/genie.papyrus/Papyrus-CDO/workspace/source/cdo/bundles/org.eclipse.papyrus.infra.gmfdiag.style.cdo/src/main/resources
[INFO] 
[INFO] --- tycho-compiler-plugin:1.3.0:compile (default-compile) @ org.eclipse.papyrus.infra.gmfdiag.style.cdo ---
[INFO] Compiling 2 source files to /jobs/genie.papyrus/Papyrus-CDO/workspace/source/cdo/bundles/org.eclipse.papyrus.infra.gmfdiag.style.cdo/target/classes
[INFO] 
[INFO] --- maven-resources-plugin:2.7:testResources (default-testResources) @ org.eclipse.papyrus.infra.gmfdiag.style.cdo ---
[INFO] Using 'UTF-8' encoding to copy filtered resources.
[INFO] skip non existing resourceDirectory /jobs/genie.papyrus/Papyrus-CDO/workspace/source/cdo/bundles/org.eclipse.papyrus.infra.gmfdiag.style.cdo/src/test/resources
[INFO] 
[INFO] --- tycho-source-plugin:1.3.0:plugin-source (plugin-source) @ org.eclipse.papyrus.infra.gmfdiag.style.cdo ---
[INFO] Building jar: /jobs/genie.papyrus/Papyrus-CDO/workspace/source/cdo/bundles/org.eclipse.papyrus.infra.gmfdiag.style.cdo/target/org.eclipse.papyrus.infra.gmfdiag.style.cdo-2.0.0-SNAPSHOT-sources.jar
[INFO] 
[INFO] --- target-platform-configuration:1.3.0:target-platform (default-target-platform) @ org.eclipse.papyrus.infra.gmfdiag.style.cdo ---
[INFO] 
[INFO] --- tycho-packaging-plugin:1.3.0:package-plugin (default-package-plugin) @ org.eclipse.papyrus.infra.gmfdiag.style.cdo ---
[INFO] Building jar: /jobs/genie.papyrus/Papyrus-CDO/workspace/source/cdo/bundles/org.eclipse.papyrus.infra.gmfdiag.style.cdo/target/org.eclipse.papyrus.infra.gmfdiag.style.cdo-2.0.0-SNAPSHOT.jar
[INFO] 
[INFO] --- tycho-p2-plugin:1.3.0:p2-metadata-default (default-p2-metadata-default) @ org.eclipse.papyrus.infra.gmfdiag.style.cdo ---
[INFO] 
[INFO] --- tycho-source-feature-plugin:1.3.0:source-feature (source-feature) @ org.eclipse.papyrus.infra.gmfdiag.style.cdo ---
[INFO] 
[INFO] --- tycho-p2-plugin:1.3.0:p2-metadata (attach-p2-metadata) @ org.eclipse.papyrus.infra.gmfdiag.style.cdo ---
[INFO] 
[INFO] --- jacoco-maven-plugin:0.8.2:report (default-report) @ org.eclipse.papyrus.infra.gmfdiag.style.cdo ---
[INFO] Skipping JaCoCo execution due to missing execution data file.
[INFO] 
[INFO] --------------------< org.eclipse.papyrus.cdo:uml >---------------------
[INFO] Building uml 1.2.0-SNAPSHOT                                      [20/34]
[INFO] --------------------------------[ pom ]---------------------------------
[INFO] 
[INFO] --- maven-clean-plugin:3.0.0:clean (default-clean) @ uml ---
[INFO] 
[INFO] --- jacoco-maven-plugin:0.8.2:prepare-agent (default-prepare-agent) @ uml ---
[INFO] argLine set to -javaagent:/home/hudson/genie.papyrus/.jenkins/jobs/Papyrus-CDO/workspace/.repository/org/jacoco/org.jacoco.agent/0.8.2/org.jacoco.agent-0.8.2-runtime.jar=destfile=/jobs/genie.papyrus/Papyrus-CDO/workspace/source/cdo/bundles/uml/target/jacoco.exec,includes=org.eclipse.papyrus.*,excludes=org.eclipse.uml2
[INFO] 
[INFO] --- tycho-source-plugin:1.3.0:plugin-source (plugin-source) @ uml ---
[INFO] 
[INFO] --- tycho-source-feature-plugin:1.3.0:source-feature (source-feature) @ uml ---
[INFO] 
[INFO] --- tycho-p2-plugin:1.3.0:p2-metadata (attach-p2-metadata) @ uml ---
[INFO] 
[INFO] --- jacoco-maven-plugin:0.8.2:report (default-report) @ uml ---
[INFO] Skipping JaCoCo execution due to missing execution data file.
[INFO] 
[INFO] ----------< org.eclipse.papyrus.cdo:org.eclipse.uml2.uml.cdo >----------
[INFO] Building org.eclipse.uml2.uml.cdo 5.4.0-SNAPSHOT                 [21/34]
[INFO] ---------------------------[ eclipse-plugin ]---------------------------
[INFO] 
[INFO] --- maven-clean-plugin:3.0.0:clean (default-clean) @ org.eclipse.uml2.uml.cdo ---
[INFO] 
[INFO] --- tycho-packaging-plugin:1.3.0:build-qualifier (default-build-qualifier) @ org.eclipse.uml2.uml.cdo ---
[INFO] The project's OSGi version is 5.4.0.201910160127
[INFO] 
[INFO] --- tycho-packaging-plugin:1.3.0:validate-id (default-validate-id) @ org.eclipse.uml2.uml.cdo ---
[INFO] 
[INFO] --- tycho-packaging-plugin:1.3.0:validate-version (default-validate-version) @ org.eclipse.uml2.uml.cdo ---
[INFO] 
[INFO] --- jacoco-maven-plugin:0.8.2:prepare-agent (default-prepare-agent) @ org.eclipse.uml2.uml.cdo ---
[INFO] argLine set to -javaagent:/home/hudson/genie.papyrus/.jenkins/jobs/Papyrus-CDO/workspace/.repository/org/jacoco/org.jacoco.agent/0.8.2/org.jacoco.agent-0.8.2-runtime.jar=destfile=/jobs/genie.papyrus/Papyrus-CDO/workspace/source/cdo/bundles/uml/org.eclipse.uml2.uml.cdo/target/jacoco.exec,includes=org.eclipse.papyrus.*,excludes=org.eclipse.uml2
[INFO] 
[INFO] --- maven-resources-plugin:2.7:resources (default-resources) @ org.eclipse.uml2.uml.cdo ---
[INFO] Using 'UTF-8' encoding to copy filtered resources.
[INFO] skip non existing resourceDirectory /jobs/genie.papyrus/Papyrus-CDO/workspace/source/cdo/bundles/uml/org.eclipse.uml2.uml.cdo/src/main/resources
[INFO] 
[INFO] --- tycho-compiler-plugin:1.3.0:compile (default-compile) @ org.eclipse.uml2.uml.cdo ---
[WARNING] The effective compiler target level 1.8 is incompatible with the following OSGi execution environments: [J2SE-1.5 (assumes 1.5)] @ MavenProject: org.eclipse.papyrus.cdo:org.eclipse.uml2.uml.cdo:5.4.0-SNAPSHOT @ /jobs/genie.papyrus/Papyrus-CDO/workspace/source/cdo/bundles/uml/org.eclipse.uml2.uml.cdo/pom.xml
[INFO] Compiling 255 source files to /jobs/genie.papyrus/Papyrus-CDO/workspace/source/cdo/bundles/uml/org.eclipse.uml2.uml.cdo/target/classes
[INFO] 
[INFO] --- maven-resources-plugin:2.7:testResources (default-testResources) @ org.eclipse.uml2.uml.cdo ---
[INFO] Using 'UTF-8' encoding to copy filtered resources.
[INFO] skip non existing resourceDirectory /jobs/genie.papyrus/Papyrus-CDO/workspace/source/cdo/bundles/uml/org.eclipse.uml2.uml.cdo/src/test/resources
[INFO] 
[INFO] --- tycho-source-plugin:1.3.0:plugin-source (plugin-source) @ org.eclipse.uml2.uml.cdo ---
[INFO] Building jar: /jobs/genie.papyrus/Papyrus-CDO/workspace/source/cdo/bundles/uml/org.eclipse.uml2.uml.cdo/target/org.eclipse.uml2.uml.cdo-5.4.0-SNAPSHOT-sources.jar
[INFO] 
[INFO] --- target-platform-configuration:1.3.0:target-platform (default-target-platform) @ org.eclipse.uml2.uml.cdo ---
[INFO] 
[INFO] --- tycho-packaging-plugin:1.3.0:package-plugin (default-package-plugin) @ org.eclipse.uml2.uml.cdo ---
[INFO] Building jar: /jobs/genie.papyrus/Papyrus-CDO/workspace/source/cdo/bundles/uml/org.eclipse.uml2.uml.cdo/target/org.eclipse.uml2.uml.cdo-5.4.0-SNAPSHOT.jar
[INFO] 
[INFO] --- tycho-p2-plugin:1.3.0:p2-metadata-default (default-p2-metadata-default) @ org.eclipse.uml2.uml.cdo ---
[INFO] 
[INFO] --- tycho-source-feature-plugin:1.3.0:source-feature (source-feature) @ org.eclipse.uml2.uml.cdo ---
[INFO] 
[INFO] --- tycho-p2-plugin:1.3.0:p2-metadata (attach-p2-metadata) @ org.eclipse.uml2.uml.cdo ---
[INFO] 
[INFO] --- jacoco-maven-plugin:0.8.2:report (default-report) @ org.eclipse.uml2.uml.cdo ---
[INFO] Skipping JaCoCo execution due to missing execution data file.
[INFO] 
[INFO] ------< org.eclipse.papyrus.cdo:org.eclipse.papyrus.cdo-features >------
[INFO] Building org.eclipse.papyrus.cdo-features 1.2.0-SNAPSHOT         [22/34]
[INFO] --------------------------------[ pom ]---------------------------------
[INFO] 
[INFO] --- maven-clean-plugin:3.0.0:clean (default-clean) @ org.eclipse.papyrus.cdo-features ---
[INFO] 
[INFO] --- jacoco-maven-plugin:0.8.2:prepare-agent (default-prepare-agent) @ org.eclipse.papyrus.cdo-features ---
[INFO] argLine set to -javaagent:/home/hudson/genie.papyrus/.jenkins/jobs/Papyrus-CDO/workspace/.repository/org/jacoco/org.jacoco.agent/0.8.2/org.jacoco.agent-0.8.2-runtime.jar=destfile=/jobs/genie.papyrus/Papyrus-CDO/workspace/source/cdo/features/target/jacoco.exec,includes=org.eclipse.papyrus.*,excludes=org.eclipse.uml2
[INFO] 
[INFO] --- tycho-source-plugin:1.3.0:plugin-source (plugin-source) @ org.eclipse.papyrus.cdo-features ---
[INFO] 
[INFO] --- tycho-source-feature-plugin:1.3.0:source-feature (source-feature) @ org.eclipse.papyrus.cdo-features ---
[INFO] 
[INFO] --- tycho-p2-plugin:1.3.0:p2-metadata (attach-p2-metadata) @ org.eclipse.papyrus.cdo-features ---
[INFO] 
[INFO] --- jacoco-maven-plugin:0.8.2:report (default-report) @ org.eclipse.papyrus.cdo-features ---
[INFO] Skipping JaCoCo execution due to missing execution data file.
[INFO] 
[INFO] --------< org.eclipse.papyrus:org.eclipse.papyrus.cdo.feature >---------
[INFO] Building org.eclipse.papyrus.cdo.feature 1.2.0-SNAPSHOT          [23/34]
[INFO] --------------------------[ eclipse-feature ]---------------------------
[INFO] 
[INFO] --- maven-clean-plugin:3.0.0:clean (default-clean) @ org.eclipse.papyrus.cdo.feature ---
[INFO] Deleting /jobs/genie.papyrus/Papyrus-CDO/workspace/source/cdo/features/org.eclipse.papyrus.cdo.feature/target
[INFO] 
[INFO] --- tycho-packaging-plugin:1.3.0:build-qualifier-aggregator (default-build-qualifier-aggregator) @ org.eclipse.papyrus.cdo.feature ---
[INFO] The project's OSGi version is 1.2.0.201910160127
[INFO] 
[INFO] --- tycho-packaging-plugin:1.3.0:validate-id (default-validate-id) @ org.eclipse.papyrus.cdo.feature ---
[INFO] 
[INFO] --- tycho-packaging-plugin:1.3.0:validate-version (default-validate-version) @ org.eclipse.papyrus.cdo.feature ---
[INFO] 
[INFO] --- jacoco-maven-plugin:0.8.2:prepare-agent (default-prepare-agent) @ org.eclipse.papyrus.cdo.feature ---
[INFO] argLine set to -javaagent:/home/hudson/genie.papyrus/.jenkins/jobs/Papyrus-CDO/workspace/.repository/org/jacoco/org.jacoco.agent/0.8.2/org.jacoco.agent-0.8.2-runtime.jar=destfile=/jobs/genie.papyrus/Papyrus-CDO/workspace/source/cdo/features/org.eclipse.papyrus.cdo.feature/target/jacoco.exec,includes=org.eclipse.papyrus.*,excludes=org.eclipse.uml2
[INFO] 
[INFO] --- tycho-source-plugin:1.3.0:plugin-source (plugin-source) @ org.eclipse.papyrus.cdo.feature ---
[INFO] 
[INFO] --- target-platform-configuration:1.3.0:target-platform (default-target-platform) @ org.eclipse.papyrus.cdo.feature ---
[INFO] 
[INFO] --- tycho-packaging-plugin:1.3.0:package-feature (default-package-feature) @ org.eclipse.papyrus.cdo.feature ---
[INFO] Building jar: /jobs/genie.papyrus/Papyrus-CDO/workspace/source/cdo/features/org.eclipse.papyrus.cdo.feature/target/org.eclipse.papyrus.cdo.feature-1.2.0-SNAPSHOT.jar
[INFO] 
[INFO] --- tycho-p2-plugin:1.3.0:p2-metadata-default (default-p2-metadata-default) @ org.eclipse.papyrus.cdo.feature ---
[INFO] 
[INFO] --- tycho-p2-plugin:1.3.0:feature-p2-metadata (default-feature-p2-metadata) @ org.eclipse.papyrus.cdo.feature ---
[INFO] 
[INFO] --- tycho-source-feature-plugin:1.3.0:source-feature (source-feature) @ org.eclipse.papyrus.cdo.feature ---
[INFO] Building jar: /jobs/genie.papyrus/Papyrus-CDO/workspace/source/cdo/features/org.eclipse.papyrus.cdo.feature/target/org.eclipse.papyrus.cdo.feature-1.2.0-SNAPSHOT-sources-feature.jar
[INFO] 
[INFO] --- tycho-p2-plugin:1.3.0:p2-metadata (attach-p2-metadata) @ org.eclipse.papyrus.cdo.feature ---
[INFO] 
[INFO] --- jacoco-maven-plugin:0.8.2:report (default-report) @ org.eclipse.papyrus.cdo.feature ---
[INFO] Skipping JaCoCo execution due to missing execution data file.
[INFO] 
[INFO] -----< org.eclipse.papyrus:org.eclipse.papyrus.cdo.models.feature >-----
[INFO] Building org.eclipse.papyrus.cdo.models.feature 1.0.0-SNAPSHOT   [24/34]
[INFO] --------------------------[ eclipse-feature ]---------------------------
[INFO] 
[INFO] --- maven-clean-plugin:3.0.0:clean (default-clean) @ org.eclipse.papyrus.cdo.models.feature ---
[INFO] Deleting /jobs/genie.papyrus/Papyrus-CDO/workspace/source/cdo/features/org.eclipse.papyrus.cdo.models.feature/target
[INFO] 
[INFO] --- tycho-packaging-plugin:1.3.0:build-qualifier-aggregator (default-build-qualifier-aggregator) @ org.eclipse.papyrus.cdo.models.feature ---
[INFO] The project's OSGi version is 1.0.0.201910160127
[INFO] 
[INFO] --- tycho-packaging-plugin:1.3.0:validate-id (default-validate-id) @ org.eclipse.papyrus.cdo.models.feature ---
[INFO] 
[INFO] --- tycho-packaging-plugin:1.3.0:validate-version (default-validate-version) @ org.eclipse.papyrus.cdo.models.feature ---
[INFO] 
[INFO] --- jacoco-maven-plugin:0.8.2:prepare-agent (default-prepare-agent) @ org.eclipse.papyrus.cdo.models.feature ---
[INFO] argLine set to -javaagent:/home/hudson/genie.papyrus/.jenkins/jobs/Papyrus-CDO/workspace/.repository/org/jacoco/org.jacoco.agent/0.8.2/org.jacoco.agent-0.8.2-runtime.jar=destfile=/jobs/genie.papyrus/Papyrus-CDO/workspace/source/cdo/features/org.eclipse.papyrus.cdo.models.feature/target/jacoco.exec,includes=org.eclipse.papyrus.*,excludes=org.eclipse.uml2
[INFO] 
[INFO] --- tycho-source-plugin:1.3.0:plugin-source (plugin-source) @ org.eclipse.papyrus.cdo.models.feature ---
[INFO] 
[INFO] --- target-platform-configuration:1.3.0:target-platform (default-target-platform) @ org.eclipse.papyrus.cdo.models.feature ---
[INFO] 
[INFO] --- tycho-packaging-plugin:1.3.0:package-feature (default-package-feature) @ org.eclipse.papyrus.cdo.models.feature ---
[INFO] Building jar: /jobs/genie.papyrus/Papyrus-CDO/workspace/source/cdo/features/org.eclipse.papyrus.cdo.models.feature/target/org.eclipse.papyrus.cdo.models.feature-1.0.0-SNAPSHOT.jar
[INFO] 
[INFO] --- tycho-p2-plugin:1.3.0:p2-metadata-default (default-p2-metadata-default) @ org.eclipse.papyrus.cdo.models.feature ---
[INFO] 
[INFO] --- tycho-p2-plugin:1.3.0:feature-p2-metadata (default-feature-p2-metadata) @ org.eclipse.papyrus.cdo.models.feature ---
[INFO] 
[INFO] --- tycho-source-feature-plugin:1.3.0:source-feature (source-feature) @ org.eclipse.papyrus.cdo.models.feature ---
[INFO] Building jar: /jobs/genie.papyrus/Papyrus-CDO/workspace/source/cdo/features/org.eclipse.papyrus.cdo.models.feature/target/org.eclipse.papyrus.cdo.models.feature-1.0.0-SNAPSHOT-sources-feature.jar
[INFO] 
[INFO] --- tycho-p2-plugin:1.3.0:p2-metadata (attach-p2-metadata) @ org.eclipse.papyrus.cdo.models.feature ---
[INFO] 
[INFO] --- jacoco-maven-plugin:0.8.2:report (default-report) @ org.eclipse.papyrus.cdo.models.feature ---
[INFO] Skipping JaCoCo execution due to missing execution data file.
[INFO] 
[INFO] -------< org.eclipse.papyrus.cdo:org.eclipse.papyrus.cdo-releng >-------
[INFO] Building org.eclipse.papyrus.cdo-releng 1.2.0-SNAPSHOT           [25/34]
[INFO] --------------------------------[ pom ]---------------------------------
[INFO] 
[INFO] --- maven-clean-plugin:3.0.0:clean (default-clean) @ org.eclipse.papyrus.cdo-releng ---
[INFO] 
[INFO] --- jacoco-maven-plugin:0.8.2:prepare-agent (default-prepare-agent) @ org.eclipse.papyrus.cdo-releng ---
[INFO] argLine set to -javaagent:/home/hudson/genie.papyrus/.jenkins/jobs/Papyrus-CDO/workspace/.repository/org/jacoco/org.jacoco.agent/0.8.2/org.jacoco.agent-0.8.2-runtime.jar=destfile=/jobs/genie.papyrus/Papyrus-CDO/workspace/source/cdo/releng/target/jacoco.exec,includes=org.eclipse.papyrus.*,excludes=org.eclipse.uml2
[INFO] 
[INFO] --- tycho-source-plugin:1.3.0:plugin-source (plugin-source) @ org.eclipse.papyrus.cdo-releng ---
[INFO] 
[INFO] --- tycho-source-feature-plugin:1.3.0:source-feature (source-feature) @ org.eclipse.papyrus.cdo-releng ---
[INFO] 
[INFO] --- tycho-p2-plugin:1.3.0:p2-metadata (attach-p2-metadata) @ org.eclipse.papyrus.cdo-releng ---
[INFO] 
[INFO] --- jacoco-maven-plugin:0.8.2:report (default-report) @ org.eclipse.papyrus.cdo-releng ---
[INFO] Skipping JaCoCo execution due to missing execution data file.
[INFO] 
[INFO] ---------< org.eclipse.papyrus.cdo:org.eclipse.papyrus.cdo.p2 >---------
[INFO] Building org.eclipse.papyrus.cdo.p2 1.2.0-SNAPSHOT               [26/34]
[INFO] -------------------------[ eclipse-repository ]-------------------------
[INFO] 
[INFO] --- maven-clean-plugin:3.0.0:clean (default-clean) @ org.eclipse.papyrus.cdo.p2 ---
[INFO] 
[INFO] --- tycho-packaging-plugin:1.3.0:build-qualifier-aggregator (default-build-qualifier-aggregator) @ org.eclipse.papyrus.cdo.p2 ---
[INFO] The project's OSGi version is 1.2.0.201910160127
[INFO] 
[INFO] --- maven-clean-plugin:3.0.0:clean (default-clean-1) @ org.eclipse.papyrus.cdo.p2 ---
[INFO] 
[INFO] --- jacoco-maven-plugin:0.8.2:prepare-agent (default-prepare-agent) @ org.eclipse.papyrus.cdo.p2 ---
[INFO] argLine set to -javaagent:/home/hudson/genie.papyrus/.jenkins/jobs/Papyrus-CDO/workspace/.repository/org/jacoco/org.jacoco.agent/0.8.2/org.jacoco.agent-0.8.2-runtime.jar=destfile=/jobs/genie.papyrus/Papyrus-CDO/workspace/source/cdo/releng/org.eclipse.papyrus.cdo.p2/target/jacoco.exec,includes=org.eclipse.papyrus.*,excludes=org.eclipse.uml2
[INFO] 
[INFO] --- maven-resources-plugin:2.7:resources (default-resources) @ org.eclipse.papyrus.cdo.p2 ---
[INFO] Using 'UTF-8' encoding to copy filtered resources.
[INFO] skip non existing resourceDirectory /jobs/genie.papyrus/Papyrus-CDO/workspace/source/cdo/releng/org.eclipse.papyrus.cdo.p2/src/main/resources
[INFO] 
[INFO] --- tycho-source-plugin:1.3.0:plugin-source (plugin-source) @ org.eclipse.papyrus.cdo.p2 ---
[INFO] 
[INFO] --- target-platform-configuration:1.3.0:target-platform (default-target-platform) @ org.eclipse.papyrus.cdo.p2 ---
[INFO] 
[INFO] --- tycho-p2-publisher-plugin:1.3.0:publish-osgi-ee (default-publish-osgi-ee) @ org.eclipse.papyrus.cdo.p2 ---
[INFO] Published profile IUs: [a.jre.javase 10.0.0, config.a.jre.javase 10.0.0]
[INFO] Published profile IUs: [a.jre.javase 11.0.0, config.a.jre.javase 11.0.0]
[INFO] 
[INFO] --- tycho-p2-publisher-plugin:1.3.0:publish-products (default-publish-products) @ org.eclipse.papyrus.cdo.p2 ---
[INFO] 
[INFO] --- tycho-p2-publisher-plugin:1.3.0:publish-categories (default-publish-categories) @ org.eclipse.papyrus.cdo.p2 ---
[INFO] 
[INFO] --- tycho-p2-publisher-plugin:1.3.0:attach-artifacts (default-attach-artifacts) @ org.eclipse.papyrus.cdo.p2 ---
[INFO] 
[INFO] --- tycho-p2-repository-plugin:1.3.0:assemble-repository (default-assemble-repository) @ org.eclipse.papyrus.cdo.p2 ---
[INFO] 
[INFO] --- tycho-p2-repository-plugin:1.3.0:archive-repository (default-archive-repository) @ org.eclipse.papyrus.cdo.p2 ---
[INFO] Building zip: /jobs/genie.papyrus/Papyrus-CDO/workspace/source/cdo/releng/org.eclipse.papyrus.cdo.p2/target/org.eclipse.papyrus.cdo.p2-1.2.0-SNAPSHOT.zip
[INFO] 
[INFO] --- tycho-source-feature-plugin:1.3.0:source-feature (source-feature) @ org.eclipse.papyrus.cdo.p2 ---
[INFO] 
[INFO] --- tycho-p2-plugin:1.3.0:p2-metadata (attach-p2-metadata) @ org.eclipse.papyrus.cdo.p2 ---
[INFO] 
[INFO] --- jacoco-maven-plugin:0.8.2:report (default-report) @ org.eclipse.papyrus.cdo.p2 ---
[INFO] Skipping JaCoCo execution due to missing execution data file.
[INFO] 
[INFO] --< org.eclipse.papyrus.cdo:org.eclipse.papyrus.cdo-targetplatforms >---
[INFO] Building org.eclipse.papyrus.cdo-targetplatforms 1.2.0-SNAPSHOT  [27/34]
[INFO] --------------------------------[ pom ]---------------------------------
[INFO] 
[INFO] --- maven-clean-plugin:3.0.0:clean (default-clean) @ org.eclipse.papyrus.cdo-targetplatforms ---
[INFO] 
[INFO] --- jacoco-maven-plugin:0.8.2:prepare-agent (default-prepare-agent) @ org.eclipse.papyrus.cdo-targetplatforms ---
[INFO] argLine set to -javaagent:/home/hudson/genie.papyrus/.jenkins/jobs/Papyrus-CDO/workspace/.repository/org/jacoco/org.jacoco.agent/0.8.2/org.jacoco.agent-0.8.2-runtime.jar=destfile=/jobs/genie.papyrus/Papyrus-CDO/workspace/source/cdo/releng/targetplatforms/target/jacoco.exec,includes=org.eclipse.papyrus.*,excludes=org.eclipse.uml2
[INFO] 
[INFO] --- tycho-source-plugin:1.3.0:plugin-source (plugin-source) @ org.eclipse.papyrus.cdo-targetplatforms ---
[INFO] 
[INFO] --- tycho-source-feature-plugin:1.3.0:source-feature (source-feature) @ org.eclipse.papyrus.cdo-targetplatforms ---
[INFO] 
[INFO] --- tycho-p2-plugin:1.3.0:p2-metadata (attach-p2-metadata) @ org.eclipse.papyrus.cdo-targetplatforms ---
[INFO] 
[INFO] --- jacoco-maven-plugin:0.8.2:report (default-report) @ org.eclipse.papyrus.cdo-targetplatforms ---
[INFO] Skipping JaCoCo execution due to missing execution data file.
[INFO] 
[INFO] ---< org.eclipse.papyrus.cdo:org.eclipse.papyrus.cdo.targetplatform >---
[INFO] Building org.eclipse.papyrus.cdo.targetplatform 1.2.0-SNAPSHOT   [28/34]
[INFO] ---------------------[ eclipse-target-definition ]----------------------
[INFO] 
[INFO] --- maven-clean-plugin:3.0.0:clean (default-clean) @ org.eclipse.papyrus.cdo.targetplatform ---
[INFO] 
[INFO] --- jacoco-maven-plugin:0.8.2:prepare-agent (default-prepare-agent) @ org.eclipse.papyrus.cdo.targetplatform ---
[INFO] argLine set to -javaagent:/home/hudson/genie.papyrus/.jenkins/jobs/Papyrus-CDO/workspace/.repository/org/jacoco/org.jacoco.agent/0.8.2/org.jacoco.agent-0.8.2-runtime.jar=destfile=/jobs/genie.papyrus/Papyrus-CDO/workspace/source/cdo/releng/targetplatforms/org.eclipse.papyrus.cdo.targetplatform/target/jacoco.exec,includes=org.eclipse.papyrus.*,excludes=org.eclipse.uml2
[INFO] 
[INFO] --- tycho-source-plugin:1.3.0:plugin-source (plugin-source) @ org.eclipse.papyrus.cdo.targetplatform ---
[INFO] 
[INFO] --- tycho-packaging-plugin:1.3.0:package-target-definition (default-package-target-definition) @ org.eclipse.papyrus.cdo.targetplatform ---
[INFO] 
[INFO] --- tycho-source-feature-plugin:1.3.0:source-feature (source-feature) @ org.eclipse.papyrus.cdo.targetplatform ---
[INFO] 
[INFO] --- tycho-p2-plugin:1.3.0:p2-metadata (attach-p2-metadata) @ org.eclipse.papyrus.cdo.targetplatform ---
[INFO] 
[INFO] --- jacoco-maven-plugin:0.8.2:report (default-report) @ org.eclipse.papyrus.cdo.targetplatform ---
[INFO] Skipping JaCoCo execution due to missing execution data file.
[INFO] 
[INFO] ------< org.eclipse.papyrus.cdo:org.eclipse.papyrus.cdo.ui.tests >------
[INFO] Building org.eclipse.papyrus.cdo.ui.tests 1.2.0-SNAPSHOT         [29/34]
[INFO] ------------------------[ eclipse-test-plugin ]-------------------------
[INFO] 
[INFO] --- maven-clean-plugin:3.0.0:clean (default-clean) @ org.eclipse.papyrus.cdo.ui.tests ---
[INFO] 
[INFO] --- tycho-packaging-plugin:1.3.0:build-qualifier (default-build-qualifier) @ org.eclipse.papyrus.cdo.ui.tests ---
[INFO] The project's OSGi version is 1.2.0.201910160127
[INFO] 
[INFO] --- tycho-packaging-plugin:1.3.0:validate-id (default-validate-id) @ org.eclipse.papyrus.cdo.ui.tests ---
[INFO] 
[INFO] --- tycho-packaging-plugin:1.3.0:validate-version (default-validate-version) @ org.eclipse.papyrus.cdo.ui.tests ---
[INFO] 
[INFO] --- jacoco-maven-plugin:0.8.2:prepare-agent (default-prepare-agent) @ org.eclipse.papyrus.cdo.ui.tests ---
[INFO] tycho.testArgLine set to -javaagent:/home/hudson/genie.papyrus/.jenkins/jobs/Papyrus-CDO/workspace/.repository/org/jacoco/org.jacoco.agent/0.8.2/org.jacoco.agent-0.8.2-runtime.jar=destfile=/jobs/genie.papyrus/Papyrus-CDO/workspace/source/cdo/tests/org.eclipse.papyrus.cdo.ui.tests/target/jacoco.exec,includes=org.eclipse.papyrus.*,excludes=org.eclipse.uml2
[INFO] 
[INFO] --- maven-resources-plugin:2.7:resources (default-resources) @ org.eclipse.papyrus.cdo.ui.tests ---
[INFO] Using 'UTF-8' encoding to copy filtered resources.
[INFO] skip non existing resourceDirectory /jobs/genie.papyrus/Papyrus-CDO/workspace/source/cdo/tests/org.eclipse.papyrus.cdo.ui.tests/src/main/resources
[INFO] 
[INFO] --- tycho-compiler-plugin:1.3.0:compile (default-compile) @ org.eclipse.papyrus.cdo.ui.tests ---
[WARNING] The effective compiler target level 1.8 is incompatible with the following OSGi execution environments: [JavaSE-1.6 (assumes 1.6)] @ MavenProject: org.eclipse.papyrus.cdo:org.eclipse.papyrus.cdo.ui.tests:1.2.0-SNAPSHOT @ /jobs/genie.papyrus/Papyrus-CDO/workspace/source/cdo/tests/org.eclipse.papyrus.cdo.ui.tests/pom.xml
[INFO] Compiling 7 source files to /jobs/genie.papyrus/Papyrus-CDO/workspace/source/cdo/tests/org.eclipse.papyrus.cdo.ui.tests/target/classes
[WARNING] /jobs/genie.papyrus/Papyrus-CDO/workspace/source/cdo/tests/org.eclipse.papyrus.cdo.ui.tests/src/org/eclipse/papyrus/cdo/internal/ui/editors/tests/BasicEditorTest.java:[25] 
	import org.eclipse.emf.cdo.util.CommitException;
	       ^^^^^^^^^^^^^^^^^^^^^^^^^^^^^^^^^^^^^^^^
The import org.eclipse.emf.cdo.util.CommitException is never used
[WARNING] /jobs/genie.papyrus/Papyrus-CDO/workspace/source/cdo/tests/org.eclipse.papyrus.cdo.ui.tests/src/org/eclipse/papyrus/cdo/internal/ui/editors/tests/BasicEditorTest.java:[26] 
	import org.eclipse.emf.cdo.util.ConcurrentAccessException;
	       ^^^^^^^^^^^^^^^^^^^^^^^^^^^^^^^^^^^^^^^^^^^^^^^^^^
The import org.eclipse.emf.cdo.util.ConcurrentAccessException is never used
[WARNING] /jobs/genie.papyrus/Papyrus-CDO/workspace/source/cdo/tests/org.eclipse.papyrus.cdo.ui.tests/src/org/eclipse/papyrus/cdo/internal/ui/editors/tests/BasicEditorTest.java:[39] 
	import org.eclipse.papyrus.infra.core.utils.AdapterUtils;
	       ^^^^^^^^^^^^^^^^^^^^^^^^^^^^^^^^^^^^^^^^^^^^^^^^^
The type AdapterUtils is deprecated
[WARNING] /jobs/genie.papyrus/Papyrus-CDO/workspace/source/cdo/tests/org.eclipse.papyrus.cdo.ui.tests/src/org/eclipse/papyrus/cdo/internal/ui/editors/tests/BasicEditorTest.java:[208] 
	Optional<ISashWindowsContainer> sashContainer = AdapterUtils.adapt(openEditor(), ISashWindowsContainer.class);
	                                                ^^^^^^^^^^^^
The type AdapterUtils is deprecated
[WARNING] /jobs/genie.papyrus/Papyrus-CDO/workspace/source/cdo/tests/org.eclipse.papyrus.cdo.ui.tests/src/org/eclipse/papyrus/cdo/internal/ui/editors/tests/BasicEditorTest.java:[208] 
	Optional<ISashWindowsContainer> sashContainer = AdapterUtils.adapt(openEditor(), ISashWindowsContainer.class);
	                                                             ^^^^^^^^^^^^^^^^^^^^^^^^^^^^^^^^^^^^^^^^^^^^^^^^
The method adapt(Object, Class<ISashWindowsContainer>) from the type AdapterUtils is deprecated
5 problems (5 warnings)
[INFO] 
[INFO] --- maven-resources-plugin:2.7:testResources (default-testResources) @ org.eclipse.papyrus.cdo.ui.tests ---
[INFO] Using 'UTF-8' encoding to copy filtered resources.
[INFO] skip non existing resourceDirectory /jobs/genie.papyrus/Papyrus-CDO/workspace/source/cdo/tests/org.eclipse.papyrus.cdo.ui.tests/src/test/resources
[INFO] 
[INFO] --- tycho-source-plugin:1.3.0:plugin-source (plugin-source) @ org.eclipse.papyrus.cdo.ui.tests ---
[INFO] Building jar: /jobs/genie.papyrus/Papyrus-CDO/workspace/source/cdo/tests/org.eclipse.papyrus.cdo.ui.tests/target/org.eclipse.papyrus.cdo.ui.tests-1.2.0-SNAPSHOT-sources.jar
[INFO] 
[INFO] --- target-platform-configuration:1.3.0:target-platform (default-target-platform) @ org.eclipse.papyrus.cdo.ui.tests ---
[INFO] 
[INFO] --- tycho-packaging-plugin:1.3.0:package-plugin (default-package-plugin) @ org.eclipse.papyrus.cdo.ui.tests ---
[INFO] Building jar: /jobs/genie.papyrus/Papyrus-CDO/workspace/source/cdo/tests/org.eclipse.papyrus.cdo.ui.tests/target/org.eclipse.papyrus.cdo.ui.tests-1.2.0-SNAPSHOT.jar
[INFO] 
[INFO] --- tycho-p2-plugin:1.3.0:p2-metadata-default (default-p2-metadata-default) @ org.eclipse.papyrus.cdo.ui.tests ---
[INFO] 
[INFO] --- tycho-source-feature-plugin:1.3.0:source-feature (source-feature) @ org.eclipse.papyrus.cdo.ui.tests ---
[INFO] 
[INFO] --- tycho-p2-plugin:1.3.0:p2-metadata (attach-p2-metadata) @ org.eclipse.papyrus.cdo.ui.tests ---
[INFO] 
[INFO] --- tycho-surefire-plugin:1.3.0:test (default-test) @ org.eclipse.papyrus.cdo.ui.tests ---
[INFO] Expected eclipse log file: /jobs/genie.papyrus/Papyrus-CDO/workspace/source/cdo/tests/org.eclipse.papyrus.cdo.ui.tests/target/work/data/.metadata/.log
[INFO] Command line:
	[/opt/public/common/java/oracle/jdk1.8.0_192_x64/jre/bin/java, -Dosgi.noShutdown=false, -Dosgi.os=linux, -Dosgi.ws=gtk, -Dosgi.arch=x86_64, -javaagent:/home/hudson/genie.papyrus/.jenkins/jobs/Papyrus-CDO/workspace/.repository/org/jacoco/org.jacoco.agent/0.8.2/org.jacoco.agent-0.8.2-runtime.jar=destfile=/jobs/genie.papyrus/Papyrus-CDO/workspace/source/cdo/tests/org.eclipse.papyrus.cdo.ui.tests/target/jacoco.exec,includes=org.eclipse.papyrus.*,excludes=org.eclipse.uml2, -Xms512m, -Xmx2048m, -XX:SoftRefLRUPolicyMSPerMB=100, -Dosgi.clean=true, -jar, /jobs/genie.papyrus/Papyrus-CDO/workspace/.repository/p2/osgi/bundle/org.eclipse.equinox.launcher/1.5.400.v20190515-0925/org.eclipse.equinox.launcher-1.5.400.v20190515-0925.jar, -data, /jobs/genie.papyrus/Papyrus-CDO/workspace/source/cdo/tests/org.eclipse.papyrus.cdo.ui.tests/target/work/data, -install, /jobs/genie.papyrus/Papyrus-CDO/workspace/source/cdo/tests/org.eclipse.papyrus.cdo.ui.tests/target/work, -configuration, /jobs/genie.papyrus/Papyrus-CDO/workspace/source/cdo/tests/org.eclipse.papyrus.cdo.ui.tests/target/work/configuration, -application, org.eclipse.tycho.surefire.osgibooter.uitest, -testproperties, /jobs/genie.papyrus/Papyrus-CDO/workspace/source/cdo/tests/org.eclipse.papyrus.cdo.ui.tests/target/surefire.properties, -product, org.eclipse.sdk.ide, -testConfig=CI_TESTS_CONFIG]
Picked up JAVA_TOOL_OPTIONS: -Xmx2G -Djava.io.tmpdir=/tmp/genie.papyrus -DforkCount=1
Running org.eclipse.papyrus.cdo.internal.ui.markers.tests.ModelValidationMarkersTest
Tests run: 6, Failures: 0, Errors: 6, Skipped: 0, Time elapsed: 34.822 s <<< FAILURE! - in org.eclipse.papyrus.cdo.internal.ui.markers.tests.ModelValidationMarkersTest
testDeleteMarkers(org.eclipse.papyrus.cdo.internal.ui.markers.tests.ModelValidationMarkersTest)  Time elapsed: 12.351 s  <<< ERROR!
org.eclipse.net4j.util.transaction.TransactionException: org.eclipse.emf.cdo.util.DanglingIntegrityException: The object "org.eclipse.uml2.uml.internal.impl.ModelImpl@6d9bcf19 (eProxyURI: pathmap://UML_LIBRARIES/UMLPrimitiveTypes.library.uml#_0)(org.eclipse.uml2.uml.internal.impl.ModelImpl)" is not contained in a resource
Caused by: org.eclipse.emf.cdo.util.DanglingIntegrityException: The object "org.eclipse.uml2.uml.internal.impl.ModelImpl@6d9bcf19 (eProxyURI: pathmap://UML_LIBRARIES/UMLPrimitiveTypes.library.uml#_0)(org.eclipse.uml2.uml.internal.impl.ModelImpl)" is not contained in a resource
Caused by: org.eclipse.emf.cdo.util.DanglingReferenceException: The object "org.eclipse.uml2.uml.internal.impl.ModelImpl@6d9bcf19 (eProxyURI: pathmap://UML_LIBRARIES/UMLPrimitiveTypes.library.uml#_0)(org.eclipse.uml2.uml.internal.impl.ModelImpl)" is not contained in a resource

testDeleteMarkers(org.eclipse.papyrus.cdo.internal.ui.markers.tests.ModelValidationMarkersTest)  Time elapsed: 12.352 s  <<< ERROR!
java.lang.NullPointerException
	at org.eclipse.papyrus.cdo.internal.ui.markers.tests.ModelValidationMarkersTest.closeEditor(ModelValidationMarkersTest.java:137)

testMemoryLeaksInValidation(org.eclipse.papyrus.cdo.internal.ui.markers.tests.ModelValidationMarkersTest)  Time elapsed: 11.168 s  <<< ERROR!
org.eclipse.net4j.util.transaction.TransactionException: org.eclipse.emf.cdo.util.DanglingIntegrityException: The object "org.eclipse.uml2.uml.internal.impl.PrimitiveTypeImpl@1bb509a6 (eProxyURI: pathmap://UML_LIBRARIES/UMLPrimitiveTypes.library.uml#String)(org.eclipse.uml2.uml.internal.impl.PrimitiveTypeImpl)" is not contained in a resource
Caused by: org.eclipse.emf.cdo.util.DanglingIntegrityException: The object "org.eclipse.uml2.uml.internal.impl.PrimitiveTypeImpl@1bb509a6 (eProxyURI: pathmap://UML_LIBRARIES/UMLPrimitiveTypes.library.uml#String)(org.eclipse.uml2.uml.internal.impl.PrimitiveTypeImpl)" is not contained in a resource
Caused by: org.eclipse.emf.cdo.util.DanglingReferenceException: The object "org.eclipse.uml2.uml.internal.impl.PrimitiveTypeImpl@1bb509a6 (eProxyURI: pathmap://UML_LIBRARIES/UMLPrimitiveTypes.library.uml#String)(org.eclipse.uml2.uml.internal.impl.PrimitiveTypeImpl)" is not contained in a resource

testMemoryLeaksInValidation(org.eclipse.papyrus.cdo.internal.ui.markers.tests.ModelValidationMarkersTest)  Time elapsed: 11.168 s  <<< ERROR!
java.lang.NullPointerException
	at org.eclipse.papyrus.cdo.internal.ui.markers.tests.ModelValidationMarkersTest.closeEditor(ModelValidationMarkersTest.java:137)

testCreateMarkers(org.eclipse.papyrus.cdo.internal.ui.markers.tests.ModelValidationMarkersTest)  Time elapsed: 11.163 s  <<< ERROR!
org.eclipse.net4j.util.transaction.TransactionException: org.eclipse.emf.cdo.util.DanglingIntegrityException: The object "org.eclipse.uml2.uml.internal.impl.ModelImpl@4704b66a (eProxyURI: pathmap://UML_LIBRARIES/UMLPrimitiveTypes.library.uml#_0)(org.eclipse.uml2.uml.internal.impl.ModelImpl)" is not contained in a resource
Caused by: org.eclipse.emf.cdo.util.DanglingIntegrityException: The object "org.eclipse.uml2.uml.internal.impl.ModelImpl@4704b66a (eProxyURI: pathmap://UML_LIBRARIES/UMLPrimitiveTypes.library.uml#_0)(org.eclipse.uml2.uml.internal.impl.ModelImpl)" is not contained in a resource
Caused by: org.eclipse.emf.cdo.util.DanglingReferenceException: The object "org.eclipse.uml2.uml.internal.impl.ModelImpl@4704b66a (eProxyURI: pathmap://UML_LIBRARIES/UMLPrimitiveTypes.library.uml#_0)(org.eclipse.uml2.uml.internal.impl.ModelImpl)" is not contained in a resource

testCreateMarkers(org.eclipse.papyrus.cdo.internal.ui.markers.tests.ModelValidationMarkersTest)  Time elapsed: 11.163 s  <<< ERROR!
java.lang.NullPointerException
	at org.eclipse.papyrus.cdo.internal.ui.markers.tests.ModelValidationMarkersTest.closeEditor(ModelValidationMarkersTest.java:137)

Running org.eclipse.papyrus.cdo.internal.ui.markers.tests.CDOPapyrusMarkerTest
Tests run: 10, Failures: 0, Errors: 0, Skipped: 0, Time elapsed: 0.253 s - in org.eclipse.papyrus.cdo.internal.ui.markers.tests.CDOPapyrusMarkerTest
testGetInteger(org.eclipse.papyrus.cdo.internal.ui.markers.tests.CDOPapyrusMarkerTest)  Time elapsed: 0.047 s
testGetSeverity(org.eclipse.papyrus.cdo.internal.ui.markers.tests.CDOPapyrusMarkerTest)  Time elapsed: 0.024 s
testGetBoolean(org.eclipse.papyrus.cdo.internal.ui.markers.tests.CDOPapyrusMarkerTest)  Time elapsed: 0.022 s
testGetBooleanWrong(org.eclipse.papyrus.cdo.internal.ui.markers.tests.CDOPapyrusMarkerTest)  Time elapsed: 0.026 s
testGetIntegerWrong(org.eclipse.papyrus.cdo.internal.ui.markers.tests.CDOPapyrusMarkerTest)  Time elapsed: 0.021 s
testGetStringWrong(org.eclipse.papyrus.cdo.internal.ui.markers.tests.CDOPapyrusMarkerTest)  Time elapsed: 0.021 s
testGetMessage(org.eclipse.papyrus.cdo.internal.ui.markers.tests.CDOPapyrusMarkerTest)  Time elapsed: 0.022 s
testGetURI(org.eclipse.papyrus.cdo.internal.ui.markers.tests.CDOPapyrusMarkerTest)  Time elapsed: 0.024 s
testGetString(org.eclipse.papyrus.cdo.internal.ui.markers.tests.CDOPapyrusMarkerTest)  Time elapsed: 0.018 s
testGetAttributes(org.eclipse.papyrus.cdo.internal.ui.markers.tests.CDOPapyrusMarkerTest)  Time elapsed: 0.017 s
Running org.eclipse.papyrus.cdo.internal.ui.views.tests.ItemProviderFilterRegistryTest
Tests run: 1, Failures: 0, Errors: 0, Skipped: 0, Time elapsed: 0.046 s - in org.eclipse.papyrus.cdo.internal.ui.views.tests.ItemProviderFilterRegistryTest
testPredicateFilter(org.eclipse.papyrus.cdo.internal.ui.views.tests.ItemProviderFilterRegistryTest)  Time elapsed: 0.045 s
Running org.eclipse.papyrus.cdo.internal.ui.editors.tests.BasicEditorTest
Tests run: 6, Failures: 0, Errors: 6, Skipped: 0, Time elapsed: 52.341 s <<< FAILURE! - in org.eclipse.papyrus.cdo.internal.ui.editors.tests.BasicEditorTest
isLockedLocally(org.eclipse.papyrus.cdo.internal.ui.editors.tests.BasicEditorTest)  Time elapsed: 18.913 s  <<< ERROR!
org.eclipse.net4j.util.transaction.TransactionException: org.eclipse.emf.cdo.util.DanglingIntegrityException: The object "org.eclipse.uml2.uml.internal.impl.ModelImpl@48acb864 (eProxyURI: pathmap://UML_LIBRARIES/UMLPrimitiveTypes.library.uml#_0)(org.eclipse.uml2.uml.internal.impl.ModelImpl)" is not contained in a resource
Caused by: org.eclipse.emf.cdo.util.DanglingIntegrityException: The object "org.eclipse.uml2.uml.internal.impl.ModelImpl@48acb864 (eProxyURI: pathmap://UML_LIBRARIES/UMLPrimitiveTypes.library.uml#_0)(org.eclipse.uml2.uml.internal.impl.ModelImpl)" is not contained in a resource
Caused by: org.eclipse.emf.cdo.util.DanglingReferenceException: The object "org.eclipse.uml2.uml.internal.impl.ModelImpl@48acb864 (eProxyURI: pathmap://UML_LIBRARIES/UMLPrimitiveTypes.library.uml#_0)(org.eclipse.uml2.uml.internal.impl.ModelImpl)" is not contained in a resource

isLockedRemotely(org.eclipse.papyrus.cdo.internal.ui.editors.tests.BasicEditorTest)  Time elapsed: 6.25 s  <<< ERROR!
org.eclipse.net4j.util.transaction.TransactionException: org.eclipse.emf.cdo.util.DanglingIntegrityException: The object "org.eclipse.uml2.uml.internal.impl.ModelImpl@e156110 (eProxyURI: pathmap://UML_LIBRARIES/UMLPrimitiveTypes.library.uml#_0)(org.eclipse.uml2.uml.internal.impl.ModelImpl)" is not contained in a resource
Caused by: org.eclipse.emf.cdo.util.DanglingIntegrityException: The object "org.eclipse.uml2.uml.internal.impl.ModelImpl@e156110 (eProxyURI: pathmap://UML_LIBRARIES/UMLPrimitiveTypes.library.uml#_0)(org.eclipse.uml2.uml.internal.impl.ModelImpl)" is not contained in a resource
Caused by: org.eclipse.emf.cdo.util.DanglingReferenceException: The object "org.eclipse.uml2.uml.internal.impl.ModelImpl@e156110 (eProxyURI: pathmap://UML_LIBRARIES/UMLPrimitiveTypes.library.uml#_0)(org.eclipse.uml2.uml.internal.impl.ModelImpl)" is not contained in a resource

editorOpens(org.eclipse.papyrus.cdo.internal.ui.editors.tests.BasicEditorTest)  Time elapsed: 14.32 s  <<< ERROR!
org.eclipse.net4j.util.transaction.TransactionException: org.eclipse.emf.cdo.util.DanglingIntegrityException: The object "org.eclipse.uml2.uml.internal.impl.ModelImpl@3d6f549c (eProxyURI: pathmap://UML_LIBRARIES/UMLPrimitiveTypes.library.uml#_0)(org.eclipse.uml2.uml.internal.impl.ModelImpl)" is not contained in a resource
Caused by: org.eclipse.emf.cdo.util.DanglingIntegrityException: The object "org.eclipse.uml2.uml.internal.impl.ModelImpl@3d6f549c (eProxyURI: pathmap://UML_LIBRARIES/UMLPrimitiveTypes.library.uml#_0)(org.eclipse.uml2.uml.internal.impl.ModelImpl)" is not contained in a resource
Caused by: org.eclipse.emf.cdo.util.DanglingReferenceException: The object "org.eclipse.uml2.uml.internal.impl.ModelImpl@3d6f549c (eProxyURI: pathmap://UML_LIBRARIES/UMLPrimitiveTypes.library.uml#_0)(org.eclipse.uml2.uml.internal.impl.ModelImpl)" is not contained in a resource

editorDoesNotLeakWhenClosed(org.eclipse.papyrus.cdo.internal.ui.editors.tests.BasicEditorTest)  Time elapsed: 1.461 s  <<< ERROR!
org.eclipse.net4j.util.transaction.TransactionException: org.eclipse.emf.cdo.util.DanglingIntegrityException: The object "org.eclipse.uml2.uml.internal.impl.PrimitiveTypeImpl@4fa9533f (eProxyURI: pathmap://UML_LIBRARIES/UMLPrimitiveTypes.library.uml#String)(org.eclipse.uml2.uml.internal.impl.PrimitiveTypeImpl)" is not contained in a resource
Caused by: org.eclipse.emf.cdo.util.DanglingIntegrityException: The object "org.eclipse.uml2.uml.internal.impl.PrimitiveTypeImpl@4fa9533f (eProxyURI: pathmap://UML_LIBRARIES/UMLPrimitiveTypes.library.uml#String)(org.eclipse.uml2.uml.internal.impl.PrimitiveTypeImpl)" is not contained in a resource
Caused by: org.eclipse.emf.cdo.util.DanglingReferenceException: The object "org.eclipse.uml2.uml.internal.impl.PrimitiveTypeImpl@4fa9533f (eProxyURI: pathmap://UML_LIBRARIES/UMLPrimitiveTypes.library.uml#String)(org.eclipse.uml2.uml.internal.impl.PrimitiveTypeImpl)" is not contained in a resource

canLock(org.eclipse.papyrus.cdo.internal.ui.editors.tests.BasicEditorTest)  Time elapsed: 0.326 s  <<< ERROR!
org.eclipse.net4j.util.transaction.TransactionException: org.eclipse.emf.cdo.util.DanglingIntegrityException: The object "org.eclipse.uml2.uml.internal.impl.ModelImpl@a983f06 (eProxyURI: pathmap://UML_LIBRARIES/UMLPrimitiveTypes.library.uml#_0)(org.eclipse.uml2.uml.internal.impl.ModelImpl)" is not contained in a resource
Caused by: org.eclipse.emf.cdo.util.DanglingIntegrityException: The object "org.eclipse.uml2.uml.internal.impl.ModelImpl@a983f06 (eProxyURI: pathmap://UML_LIBRARIES/UMLPrimitiveTypes.library.uml#_0)(org.eclipse.uml2.uml.internal.impl.ModelImpl)" is not contained in a resource
Caused by: org.eclipse.emf.cdo.util.DanglingReferenceException: The object "org.eclipse.uml2.uml.internal.impl.ModelImpl@a983f06 (eProxyURI: pathmap://UML_LIBRARIES/UMLPrimitiveTypes.library.uml#_0)(org.eclipse.uml2.uml.internal.impl.ModelImpl)" is not contained in a resource

isConflicting(org.eclipse.papyrus.cdo.internal.ui.editors.tests.BasicEditorTest)  Time elapsed: 11.065 s  <<< ERROR!
org.eclipse.net4j.util.transaction.TransactionException: org.eclipse.emf.cdo.util.DanglingIntegrityException: The object "org.eclipse.uml2.uml.internal.impl.ModelImpl@5241aea8 (eProxyURI: pathmap://UML_LIBRARIES/UMLPrimitiveTypes.library.uml#_0)(org.eclipse.uml2.uml.internal.impl.ModelImpl)" is not contained in a resource
Caused by: org.eclipse.emf.cdo.util.DanglingIntegrityException: The object "org.eclipse.uml2.uml.internal.impl.ModelImpl@5241aea8 (eProxyURI: pathmap://UML_LIBRARIES/UMLPrimitiveTypes.library.uml#_0)(org.eclipse.uml2.uml.internal.impl.ModelImpl)" is not contained in a resource
Caused by: org.eclipse.emf.cdo.util.DanglingReferenceException: The object "org.eclipse.uml2.uml.internal.impl.ModelImpl@5241aea8 (eProxyURI: pathmap://UML_LIBRARIES/UMLPrimitiveTypes.library.uml#_0)(org.eclipse.uml2.uml.internal.impl.ModelImpl)" is not contained in a resource

Running org.eclipse.papyrus.cdo.internal.ui.editors.tests.DawnEditorAdapterTest
Tests run: 16, Failures: 0, Errors: 16, Skipped: 0, Time elapsed: 125.896 s <<< FAILURE! - in org.eclipse.papyrus.cdo.internal.ui.editors.tests.DawnEditorAdapterTest
testGetTitle(org.eclipse.papyrus.cdo.internal.ui.editors.tests.DawnEditorAdapterTest)  Time elapsed: 10.232 s  <<< ERROR!
org.eclipse.net4j.util.transaction.TransactionException: org.eclipse.emf.cdo.util.DanglingIntegrityException: The object "org.eclipse.uml2.uml.internal.impl.PrimitiveTypeImpl@eba3009 (eProxyURI: pathmap://UML_LIBRARIES/UMLPrimitiveTypes.library.uml#String)(org.eclipse.uml2.uml.internal.impl.PrimitiveTypeImpl)" is not contained in a resource
Caused by: org.eclipse.emf.cdo.util.DanglingIntegrityException: The object "org.eclipse.uml2.uml.internal.impl.PrimitiveTypeImpl@eba3009 (eProxyURI: pathmap://UML_LIBRARIES/UMLPrimitiveTypes.library.uml#String)(org.eclipse.uml2.uml.internal.impl.PrimitiveTypeImpl)" is not contained in a resource
Caused by: org.eclipse.emf.cdo.util.DanglingReferenceException: The object "org.eclipse.uml2.uml.internal.impl.PrimitiveTypeImpl@eba3009 (eProxyURI: pathmap://UML_LIBRARIES/UMLPrimitiveTypes.library.uml#String)(org.eclipse.uml2.uml.internal.impl.PrimitiveTypeImpl)" is not contained in a resource

testGetAdapter(org.eclipse.papyrus.cdo.internal.ui.editors.tests.DawnEditorAdapterTest)  Time elapsed: 10.237 s  <<< ERROR!
org.eclipse.net4j.util.transaction.TransactionException: org.eclipse.emf.cdo.util.DanglingIntegrityException: The object "org.eclipse.uml2.uml.internal.impl.PrimitiveTypeImpl@781a51d0 (eProxyURI: pathmap://UML_LIBRARIES/UMLPrimitiveTypes.library.uml#String)(org.eclipse.uml2.uml.internal.impl.PrimitiveTypeImpl)" is not contained in a resource
Caused by: org.eclipse.emf.cdo.util.DanglingIntegrityException: The object "org.eclipse.uml2.uml.internal.impl.PrimitiveTypeImpl@781a51d0 (eProxyURI: pathmap://UML_LIBRARIES/UMLPrimitiveTypes.library.uml#String)(org.eclipse.uml2.uml.internal.impl.PrimitiveTypeImpl)" is not contained in a resource
Caused by: org.eclipse.emf.cdo.util.DanglingReferenceException: The object "org.eclipse.uml2.uml.internal.impl.PrimitiveTypeImpl@781a51d0 (eProxyURI: pathmap://UML_LIBRARIES/UMLPrimitiveTypes.library.uml#String)(org.eclipse.uml2.uml.internal.impl.PrimitiveTypeImpl)" is not contained in a resource

testAddRemovePropertyListener(org.eclipse.papyrus.cdo.internal.ui.editors.tests.DawnEditorAdapterTest)  Time elapsed: 11.136 s  <<< ERROR!
org.eclipse.net4j.util.transaction.TransactionException: org.eclipse.emf.cdo.util.DanglingIntegrityException: The object "org.eclipse.uml2.uml.internal.impl.ModelImpl@8c29e75 (eProxyURI: pathmap://UML_LIBRARIES/UMLPrimitiveTypes.library.uml#_0)(org.eclipse.uml2.uml.internal.impl.ModelImpl)" is not contained in a resource
Caused by: org.eclipse.emf.cdo.util.DanglingIntegrityException: The object "org.eclipse.uml2.uml.internal.impl.ModelImpl@8c29e75 (eProxyURI: pathmap://UML_LIBRARIES/UMLPrimitiveTypes.library.uml#_0)(org.eclipse.uml2.uml.internal.impl.ModelImpl)" is not contained in a resource
Caused by: org.eclipse.emf.cdo.util.DanglingReferenceException: The object "org.eclipse.uml2.uml.internal.impl.ModelImpl@8c29e75 (eProxyURI: pathmap://UML_LIBRARIES/UMLPrimitiveTypes.library.uml#_0)(org.eclipse.uml2.uml.internal.impl.ModelImpl)" is not contained in a resource

testGetSite(org.eclipse.papyrus.cdo.internal.ui.editors.tests.DawnEditorAdapterTest)  Time elapsed: 17.369 s  <<< ERROR!
org.eclipse.net4j.util.transaction.TransactionException: org.eclipse.emf.cdo.util.DanglingIntegrityException: The object "org.eclipse.uml2.uml.internal.impl.PrimitiveTypeImpl@72dc7b05 (eProxyURI: pathmap://UML_LIBRARIES/UMLPrimitiveTypes.library.uml#String)(org.eclipse.uml2.uml.internal.impl.PrimitiveTypeImpl)" is not contained in a resource
Caused by: org.eclipse.emf.cdo.util.DanglingIntegrityException: The object "org.eclipse.uml2.uml.internal.impl.PrimitiveTypeImpl@72dc7b05 (eProxyURI: pathmap://UML_LIBRARIES/UMLPrimitiveTypes.library.uml#String)(org.eclipse.uml2.uml.internal.impl.PrimitiveTypeImpl)" is not contained in a resource
Caused by: org.eclipse.emf.cdo.util.DanglingReferenceException: The object "org.eclipse.uml2.uml.internal.impl.PrimitiveTypeImpl@72dc7b05 (eProxyURI: pathmap://UML_LIBRARIES/UMLPrimitiveTypes.library.uml#String)(org.eclipse.uml2.uml.internal.impl.PrimitiveTypeImpl)" is not contained in a resource

testGetView(org.eclipse.papyrus.cdo.internal.ui.editors.tests.DawnEditorAdapterTest)  Time elapsed: 0.7 s  <<< ERROR!
org.eclipse.net4j.util.transaction.TransactionException: org.eclipse.emf.cdo.util.DanglingIntegrityException: The object "org.eclipse.uml2.uml.internal.impl.PrimitiveTypeImpl@1c584c7f (eProxyURI: pathmap://UML_LIBRARIES/UMLPrimitiveTypes.library.uml#String)(org.eclipse.uml2.uml.internal.impl.PrimitiveTypeImpl)" is not contained in a resource
Caused by: org.eclipse.emf.cdo.util.DanglingIntegrityException: The object "org.eclipse.uml2.uml.internal.impl.PrimitiveTypeImpl@1c584c7f (eProxyURI: pathmap://UML_LIBRARIES/UMLPrimitiveTypes.library.uml#String)(org.eclipse.uml2.uml.internal.impl.PrimitiveTypeImpl)" is not contained in a resource
Caused by: org.eclipse.emf.cdo.util.DanglingReferenceException: The object "org.eclipse.uml2.uml.internal.impl.PrimitiveTypeImpl@1c584c7f (eProxyURI: pathmap://UML_LIBRARIES/UMLPrimitiveTypes.library.uml#String)(org.eclipse.uml2.uml.internal.impl.PrimitiveTypeImpl)" is not contained in a resource

testGetTitleImage(org.eclipse.papyrus.cdo.internal.ui.editors.tests.DawnEditorAdapterTest)  Time elapsed: 10.191 s  <<< ERROR!
org.eclipse.net4j.util.transaction.TransactionException: org.eclipse.emf.cdo.util.DanglingIntegrityException: The object "org.eclipse.uml2.uml.internal.impl.ModelImpl@a55ed01 (eProxyURI: pathmap://UML_LIBRARIES/UMLPrimitiveTypes.library.uml#_0)(org.eclipse.uml2.uml.internal.impl.ModelImpl)" is not contained in a resource
Caused by: org.eclipse.emf.cdo.util.DanglingIntegrityException: The object "org.eclipse.uml2.uml.internal.impl.ModelImpl@a55ed01 (eProxyURI: pathmap://UML_LIBRARIES/UMLPrimitiveTypes.library.uml#_0)(org.eclipse.uml2.uml.internal.impl.ModelImpl)" is not contained in a resource
Caused by: org.eclipse.emf.cdo.util.DanglingReferenceException: The object "org.eclipse.uml2.uml.internal.impl.ModelImpl@a55ed01 (eProxyURI: pathmap://UML_LIBRARIES/UMLPrimitiveTypes.library.uml#_0)(org.eclipse.uml2.uml.internal.impl.ModelImpl)" is not contained in a resource

testGetEditorSite(org.eclipse.papyrus.cdo.internal.ui.editors.tests.DawnEditorAdapterTest)  Time elapsed: 0.236 s  <<< ERROR!
org.eclipse.net4j.util.transaction.TransactionException: org.eclipse.emf.cdo.util.DanglingIntegrityException: The object "org.eclipse.uml2.uml.internal.impl.PrimitiveTypeImpl@5f45d7db (eProxyURI: pathmap://UML_LIBRARIES/UMLPrimitiveTypes.library.uml#String)(org.eclipse.uml2.uml.internal.impl.PrimitiveTypeImpl)" is not contained in a resource
Caused by: org.eclipse.emf.cdo.util.DanglingIntegrityException: The object "org.eclipse.uml2.uml.internal.impl.PrimitiveTypeImpl@5f45d7db (eProxyURI: pathmap://UML_LIBRARIES/UMLPrimitiveTypes.library.uml#String)(org.eclipse.uml2.uml.internal.impl.PrimitiveTypeImpl)" is not contained in a resource
Caused by: org.eclipse.emf.cdo.util.DanglingReferenceException: The object "org.eclipse.uml2.uml.internal.impl.PrimitiveTypeImpl@5f45d7db (eProxyURI: pathmap://UML_LIBRARIES/UMLPrimitiveTypes.library.uml#String)(org.eclipse.uml2.uml.internal.impl.PrimitiveTypeImpl)" is not contained in a resource

testGetTitleToolTip(org.eclipse.papyrus.cdo.internal.ui.editors.tests.DawnEditorAdapterTest)  Time elapsed: 0.184 s  <<< ERROR!
org.eclipse.net4j.util.transaction.TransactionException: org.eclipse.emf.cdo.util.DanglingIntegrityException: The object "org.eclipse.uml2.uml.internal.impl.ModelImpl@651a4c4 (eProxyURI: pathmap://UML_LIBRARIES/UMLPrimitiveTypes.library.uml#_0)(org.eclipse.uml2.uml.internal.impl.ModelImpl)" is not contained in a resource
Caused by: org.eclipse.emf.cdo.util.DanglingIntegrityException: The object "org.eclipse.uml2.uml.internal.impl.ModelImpl@651a4c4 (eProxyURI: pathmap://UML_LIBRARIES/UMLPrimitiveTypes.library.uml#_0)(org.eclipse.uml2.uml.internal.impl.ModelImpl)" is not contained in a resource
Caused by: org.eclipse.emf.cdo.util.DanglingReferenceException: The object "org.eclipse.uml2.uml.internal.impl.ModelImpl@651a4c4 (eProxyURI: pathmap://UML_LIBRARIES/UMLPrimitiveTypes.library.uml#_0)(org.eclipse.uml2.uml.internal.impl.ModelImpl)" is not contained in a resource

testDoSave(org.eclipse.papyrus.cdo.internal.ui.editors.tests.DawnEditorAdapterTest)  Time elapsed: 0.174 s  <<< ERROR!
org.eclipse.net4j.util.transaction.TransactionException: org.eclipse.emf.cdo.util.DanglingIntegrityException: The object "org.eclipse.uml2.uml.internal.impl.PrimitiveTypeImpl@11c885a6 (eProxyURI: pathmap://UML_LIBRARIES/UMLPrimitiveTypes.library.uml#String)(org.eclipse.uml2.uml.internal.impl.PrimitiveTypeImpl)" is not contained in a resource
Caused by: org.eclipse.emf.cdo.util.DanglingIntegrityException: The object "org.eclipse.uml2.uml.internal.impl.PrimitiveTypeImpl@11c885a6 (eProxyURI: pathmap://UML_LIBRARIES/UMLPrimitiveTypes.library.uml#String)(org.eclipse.uml2.uml.internal.impl.PrimitiveTypeImpl)" is not contained in a resource
Caused by: org.eclipse.emf.cdo.util.DanglingReferenceException: The object "org.eclipse.uml2.uml.internal.impl.PrimitiveTypeImpl@11c885a6 (eProxyURI: pathmap://UML_LIBRARIES/UMLPrimitiveTypes.library.uml#String)(org.eclipse.uml2.uml.internal.impl.PrimitiveTypeImpl)" is not contained in a resource

testGetEditorInput(org.eclipse.papyrus.cdo.internal.ui.editors.tests.DawnEditorAdapterTest)  Time elapsed: 0.24 s  <<< ERROR!
org.eclipse.net4j.util.transaction.TransactionException: org.eclipse.emf.cdo.util.DanglingIntegrityException: The object "org.eclipse.uml2.uml.internal.impl.PrimitiveTypeImpl@62b92df8 (eProxyURI: pathmap://UML_LIBRARIES/UMLPrimitiveTypes.library.uml#String)(org.eclipse.uml2.uml.internal.impl.PrimitiveTypeImpl)" is not contained in a resource
Caused by: org.eclipse.emf.cdo.util.DanglingIntegrityException: The object "org.eclipse.uml2.uml.internal.impl.PrimitiveTypeImpl@62b92df8 (eProxyURI: pathmap://UML_LIBRARIES/UMLPrimitiveTypes.library.uml#String)(org.eclipse.uml2.uml.internal.impl.PrimitiveTypeImpl)" is not contained in a resource
Caused by: org.eclipse.emf.cdo.util.DanglingReferenceException: The object "org.eclipse.uml2.uml.internal.impl.PrimitiveTypeImpl@62b92df8 (eProxyURI: pathmap://UML_LIBRARIES/UMLPrimitiveTypes.library.uml#String)(org.eclipse.uml2.uml.internal.impl.PrimitiveTypeImpl)" is not contained in a resource

testGetDawnEditorSupport(org.eclipse.papyrus.cdo.internal.ui.editors.tests.DawnEditorAdapterTest)  Time elapsed: 11.055 s  <<< ERROR!
org.eclipse.net4j.util.transaction.TransactionException: org.eclipse.emf.cdo.util.DanglingIntegrityException: The object "org.eclipse.uml2.uml.internal.impl.ModelImpl@3bf1aba7 (eProxyURI: pathmap://UML_LIBRARIES/UMLPrimitiveTypes.library.uml#_0)(org.eclipse.uml2.uml.internal.impl.ModelImpl)" is not contained in a resource
Caused by: org.eclipse.emf.cdo.util.DanglingIntegrityException: The object "org.eclipse.uml2.uml.internal.impl.ModelImpl@3bf1aba7 (eProxyURI: pathmap://UML_LIBRARIES/UMLPrimitiveTypes.library.uml#_0)(org.eclipse.uml2.uml.internal.impl.ModelImpl)" is not contained in a resource
Caused by: org.eclipse.emf.cdo.util.DanglingReferenceException: The object "org.eclipse.uml2.uml.internal.impl.ModelImpl@3bf1aba7 (eProxyURI: pathmap://UML_LIBRARIES/UMLPrimitiveTypes.library.uml#_0)(org.eclipse.uml2.uml.internal.impl.ModelImpl)" is not contained in a resource

testIsDirty(org.eclipse.papyrus.cdo.internal.ui.editors.tests.DawnEditorAdapterTest)  Time elapsed: 11.072 s  <<< ERROR!
org.eclipse.net4j.util.transaction.TransactionException: org.eclipse.emf.cdo.util.DanglingIntegrityException: The object "org.eclipse.uml2.uml.internal.impl.PrimitiveTypeImpl@13e4287c (eProxyURI: pathmap://UML_LIBRARIES/UMLPrimitiveTypes.library.uml#String)(org.eclipse.uml2.uml.internal.impl.PrimitiveTypeImpl)" is not contained in a resource
Caused by: org.eclipse.emf.cdo.util.DanglingIntegrityException: The object "org.eclipse.uml2.uml.internal.impl.PrimitiveTypeImpl@13e4287c (eProxyURI: pathmap://UML_LIBRARIES/UMLPrimitiveTypes.library.uml#String)(org.eclipse.uml2.uml.internal.impl.PrimitiveTypeImpl)" is not contained in a resource
Caused by: org.eclipse.emf.cdo.util.DanglingReferenceException: The object "org.eclipse.uml2.uml.internal.impl.PrimitiveTypeImpl@13e4287c (eProxyURI: pathmap://UML_LIBRARIES/UMLPrimitiveTypes.library.uml#String)(org.eclipse.uml2.uml.internal.impl.PrimitiveTypeImpl)" is not contained in a resource

testGetContributorID(org.eclipse.papyrus.cdo.internal.ui.editors.tests.DawnEditorAdapterTest)  Time elapsed: 10.207 s  <<< ERROR!
org.eclipse.net4j.util.transaction.TransactionException: org.eclipse.emf.cdo.util.DanglingIntegrityException: The object "org.eclipse.uml2.uml.internal.impl.ModelImpl@5680639f (eProxyURI: pathmap://UML_LIBRARIES/UMLPrimitiveTypes.library.uml#_0)(org.eclipse.uml2.uml.internal.impl.ModelImpl)" is not contained in a resource
Caused by: org.eclipse.emf.cdo.util.DanglingIntegrityException: The object "org.eclipse.uml2.uml.internal.impl.ModelImpl@5680639f (eProxyURI: pathmap://UML_LIBRARIES/UMLPrimitiveTypes.library.uml#_0)(org.eclipse.uml2.uml.internal.impl.ModelImpl)" is not contained in a resource
Caused by: org.eclipse.emf.cdo.util.DanglingReferenceException: The object "org.eclipse.uml2.uml.internal.impl.ModelImpl@5680639f (eProxyURI: pathmap://UML_LIBRARIES/UMLPrimitiveTypes.library.uml#_0)(org.eclipse.uml2.uml.internal.impl.ModelImpl)" is not contained in a resource

testGetDawnEditor(org.eclipse.papyrus.cdo.internal.ui.editors.tests.DawnEditorAdapterTest)  Time elapsed: 11.523 s  <<< ERROR!
org.eclipse.net4j.util.transaction.TransactionException: org.eclipse.emf.cdo.util.DanglingIntegrityException: The object "org.eclipse.uml2.uml.internal.impl.ModelImpl@765e4ccc (eProxyURI: pathmap://UML_LIBRARIES/UMLPrimitiveTypes.library.uml#_0)(org.eclipse.uml2.uml.internal.impl.ModelImpl)" is not contained in a resource
Caused by: org.eclipse.emf.cdo.util.DanglingIntegrityException: The object "org.eclipse.uml2.uml.internal.impl.ModelImpl@765e4ccc (eProxyURI: pathmap://UML_LIBRARIES/UMLPrimitiveTypes.library.uml#_0)(org.eclipse.uml2.uml.internal.impl.ModelImpl)" is not contained in a resource
Caused by: org.eclipse.emf.cdo.util.DanglingReferenceException: The object "org.eclipse.uml2.uml.internal.impl.ModelImpl@765e4ccc (eProxyURI: pathmap://UML_LIBRARIES/UMLPrimitiveTypes.library.uml#_0)(org.eclipse.uml2.uml.internal.impl.ModelImpl)" is not contained in a resource

testSetDirty(org.eclipse.papyrus.cdo.internal.ui.editors.tests.DawnEditorAdapterTest)  Time elapsed: 10.235 s  <<< ERROR!
org.eclipse.net4j.util.transaction.TransactionException: org.eclipse.emf.cdo.util.DanglingIntegrityException: The object "org.eclipse.uml2.uml.internal.impl.ModelImpl@983983e (eProxyURI: pathmap://UML_LIBRARIES/UMLPrimitiveTypes.library.uml#_0)(org.eclipse.uml2.uml.internal.impl.ModelImpl)" is not contained in a resource
Caused by: org.eclipse.emf.cdo.util.DanglingIntegrityException: The object "org.eclipse.uml2.uml.internal.impl.ModelImpl@983983e (eProxyURI: pathmap://UML_LIBRARIES/UMLPrimitiveTypes.library.uml#_0)(org.eclipse.uml2.uml.internal.impl.ModelImpl)" is not contained in a resource
Caused by: org.eclipse.emf.cdo.util.DanglingReferenceException: The object "org.eclipse.uml2.uml.internal.impl.ModelImpl@983983e (eProxyURI: pathmap://UML_LIBRARIES/UMLPrimitiveTypes.library.uml#_0)(org.eclipse.uml2.uml.internal.impl.ModelImpl)" is not contained in a resource

testSetFocus(org.eclipse.papyrus.cdo.internal.ui.editors.tests.DawnEditorAdapterTest)  Time elapsed: 11.081 s  <<< ERROR!
org.eclipse.net4j.util.transaction.TransactionException: org.eclipse.emf.cdo.util.DanglingIntegrityException: The object "org.eclipse.uml2.uml.internal.impl.ModelImpl@3ce295f9 (eProxyURI: pathmap://UML_LIBRARIES/UMLPrimitiveTypes.library.uml#_0)(org.eclipse.uml2.uml.internal.impl.ModelImpl)" is not contained in a resource
Caused by: org.eclipse.emf.cdo.util.DanglingIntegrityException: The object "org.eclipse.uml2.uml.internal.impl.ModelImpl@3ce295f9 (eProxyURI: pathmap://UML_LIBRARIES/UMLPrimitiveTypes.library.uml#_0)(org.eclipse.uml2.uml.internal.impl.ModelImpl)" is not contained in a resource
Caused by: org.eclipse.emf.cdo.util.DanglingReferenceException: The object "org.eclipse.uml2.uml.internal.impl.ModelImpl@3ce295f9 (eProxyURI: pathmap://UML_LIBRARIES/UMLPrimitiveTypes.library.uml#_0)(org.eclipse.uml2.uml.internal.impl.ModelImpl)" is not contained in a resource


Results:

Errors: 
  BasicEditorTest>AbstractPapyrusCDOUITest.importTestModel:145->AbstractPapyrusCDOTest.commit:262 » Transaction
  BasicEditorTest>AbstractPapyrusCDOUITest.importTestModel:145->AbstractPapyrusCDOTest.commit:262 » Transaction
  BasicEditorTest>AbstractPapyrusCDOUITest.importTestModel:145->AbstractPapyrusCDOTest.commit:262 » Transaction
  BasicEditorTest>AbstractPapyrusCDOUITest.importTestModel:145->AbstractPapyrusCDOTest.commit:262 » Transaction
  BasicEditorTest>AbstractPapyrusCDOUITest.importTestModel:145->AbstractPapyrusCDOTest.commit:262 » Transaction
  BasicEditorTest>AbstractPapyrusCDOUITest.importTestModel:145->AbstractPapyrusCDOTest.commit:262 » Transaction
  DawnEditorAdapterTest>AbstractPapyrusCDOUITest.importTestModel:145->AbstractPapyrusCDOTest.commit:262 » Transaction
  DawnEditorAdapterTest>AbstractPapyrusCDOUITest.importTestModel:145->AbstractPapyrusCDOTest.commit:262 » Transaction
  DawnEditorAdapterTest>AbstractPapyrusCDOUITest.importTestModel:145->AbstractPapyrusCDOTest.commit:262 » Transaction
  DawnEditorAdapterTest>AbstractPapyrusCDOUITest.importTestModel:145->AbstractPapyrusCDOTest.commit:262 » Transaction
  DawnEditorAdapterTest>AbstractPapyrusCDOUITest.importTestModel:145->AbstractPapyrusCDOTest.commit:262 » Transaction
  DawnEditorAdapterTest>AbstractPapyrusCDOUITest.importTestModel:145->AbstractPapyrusCDOTest.commit:262 » Transaction
  DawnEditorAdapterTest>AbstractPapyrusCDOUITest.importTestModel:145->AbstractPapyrusCDOTest.commit:262 » Transaction
  DawnEditorAdapterTest>AbstractPapyrusCDOUITest.importTestModel:145->AbstractPapyrusCDOTest.commit:262 » Transaction
  DawnEditorAdapterTest>AbstractPapyrusCDOUITest.importTestModel:145->AbstractPapyrusCDOTest.commit:262 » Transaction
  DawnEditorAdapterTest>AbstractPapyrusCDOUITest.importTestModel:145->AbstractPapyrusCDOTest.commit:262 » Transaction
  DawnEditorAdapterTest>AbstractPapyrusCDOUITest.importTestModel:145->AbstractPapyrusCDOTest.commit:262 » Transaction
  DawnEditorAdapterTest>AbstractPapyrusCDOUITest.importTestModel:145->AbstractPapyrusCDOTest.commit:262 » Transaction
  DawnEditorAdapterTest>AbstractPapyrusCDOUITest.importTestModel:145->AbstractPapyrusCDOTest.commit:262 » Transaction
  DawnEditorAdapterTest>AbstractPapyrusCDOUITest.importTestModel:145->AbstractPapyrusCDOTest.commit:262 » Transaction
  DawnEditorAdapterTest>AbstractPapyrusCDOUITest.importTestModel:145->AbstractPapyrusCDOTest.commit:262 » Transaction
  DawnEditorAdapterTest>AbstractPapyrusCDOUITest.importTestModel:145->AbstractPapyrusCDOTest.commit:262 » Transaction
org.eclipse.papyrus.cdo.internal.ui.markers.tests.ModelValidationMarkersTest.testCreateMarkers(org.eclipse.papyrus.cdo.internal.ui.markers.tests.ModelValidationMarkersTest)
  Run 1: ModelValidationMarkersTest>AbstractPapyrusCDOUITest.importTestModel:145->AbstractPapyrusCDOTest.commit:262 » Transaction
  Run 2: ModelValidationMarkersTest.closeEditor:137->AbstractPapyrusCDOUITest.closeEditor:230->AbstractPapyrusCDOUITest.closeEditor:237 » NullPointer

org.eclipse.papyrus.cdo.internal.ui.markers.tests.ModelValidationMarkersTest.testDeleteMarkers(org.eclipse.papyrus.cdo.internal.ui.markers.tests.ModelValidationMarkersTest)
  Run 1: ModelValidationMarkersTest>AbstractPapyrusCDOUITest.importTestModel:145->AbstractPapyrusCDOTest.commit:262 » Transaction
  Run 2: ModelValidationMarkersTest.closeEditor:137->AbstractPapyrusCDOUITest.closeEditor:230->AbstractPapyrusCDOUITest.closeEditor:237 » NullPointer

org.eclipse.papyrus.cdo.internal.ui.markers.tests.ModelValidationMarkersTest.testMemoryLeaksInValidation(org.eclipse.papyrus.cdo.internal.ui.markers.tests.ModelValidationMarkersTest)
  Run 1: ModelValidationMarkersTest>AbstractPapyrusCDOUITest.importTestModel:145->AbstractPapyrusCDOTest.commit:262 » Transaction
  Run 2: ModelValidationMarkersTest.closeEditor:137->AbstractPapyrusCDOUITest.closeEditor:230->AbstractPapyrusCDOUITest.closeEditor:237 » NullPointer


Tests run: 36, Failures: 0, Errors: 25, Skipped: 0

[ERROR] There are test failures.

Please refer to /jobs/genie.papyrus/Papyrus-CDO/workspace/source/cdo/tests/org.eclipse.papyrus.cdo.ui.tests/target/surefire-reports for the individual test results.
[INFO] 
[INFO] --- jacoco-maven-plugin:0.8.2:report (default-report) @ org.eclipse.papyrus.cdo.ui.tests ---
[INFO] Loading execution data file /jobs/genie.papyrus/Papyrus-CDO/workspace/source/cdo/tests/org.eclipse.papyrus.cdo.ui.tests/target/jacoco.exec
[INFO] Analyzed bundle 'org.eclipse.papyrus.cdo.ui.tests' with 0 classes
[INFO] 
[INFO] --< org.eclipse.papyrus.cdo:org.eclipse.papyrus.cdo.validation.problems.tests >--
[INFO] Building org.eclipse.papyrus.cdo.validation.problems.tests 1.2.0-SNAPSHOT [30/34]
[INFO] ------------------------[ eclipse-test-plugin ]-------------------------
[INFO] 
[INFO] --- maven-clean-plugin:3.0.0:clean (default-clean) @ org.eclipse.papyrus.cdo.validation.problems.tests ---
[INFO] 
[INFO] --- tycho-packaging-plugin:1.3.0:build-qualifier (default-build-qualifier) @ org.eclipse.papyrus.cdo.validation.problems.tests ---
[INFO] The project's OSGi version is 1.2.0.201910160127
[INFO] 
[INFO] --- tycho-packaging-plugin:1.3.0:validate-id (default-validate-id) @ org.eclipse.papyrus.cdo.validation.problems.tests ---
[INFO] 
[INFO] --- tycho-packaging-plugin:1.3.0:validate-version (default-validate-version) @ org.eclipse.papyrus.cdo.validation.problems.tests ---
[INFO] 
[INFO] --- jacoco-maven-plugin:0.8.2:prepare-agent (default-prepare-agent) @ org.eclipse.papyrus.cdo.validation.problems.tests ---
[INFO] tycho.testArgLine set to -javaagent:/home/hudson/genie.papyrus/.jenkins/jobs/Papyrus-CDO/workspace/.repository/org/jacoco/org.jacoco.agent/0.8.2/org.jacoco.agent-0.8.2-runtime.jar=destfile=/jobs/genie.papyrus/Papyrus-CDO/workspace/source/cdo/tests/org.eclipse.papyrus.cdo.validation.problems.tests/target/jacoco.exec,includes=org.eclipse.papyrus.*,excludes=org.eclipse.uml2
[INFO] 
[INFO] --- maven-resources-plugin:2.7:resources (default-resources) @ org.eclipse.papyrus.cdo.validation.problems.tests ---
[INFO] Using 'UTF-8' encoding to copy filtered resources.
[INFO] skip non existing resourceDirectory /jobs/genie.papyrus/Papyrus-CDO/workspace/source/cdo/tests/org.eclipse.papyrus.cdo.validation.problems.tests/src/main/resources
[INFO] 
[INFO] --- tycho-compiler-plugin:1.3.0:compile (default-compile) @ org.eclipse.papyrus.cdo.validation.problems.tests ---
[WARNING] The effective compiler target level 1.8 is incompatible with the following OSGi execution environments: [JavaSE-1.6 (assumes 1.6)] @ MavenProject: org.eclipse.papyrus.cdo:org.eclipse.papyrus.cdo.validation.problems.tests:1.2.0-SNAPSHOT @ /jobs/genie.papyrus/Papyrus-CDO/workspace/source/cdo/tests/org.eclipse.papyrus.cdo.validation.problems.tests/pom.xml
[INFO] Compiling 9 source files to /jobs/genie.papyrus/Papyrus-CDO/workspace/source/cdo/tests/org.eclipse.papyrus.cdo.validation.problems.tests/target/classes
[INFO] 
[INFO] --- maven-resources-plugin:2.7:testResources (default-testResources) @ org.eclipse.papyrus.cdo.validation.problems.tests ---
[INFO] Using 'UTF-8' encoding to copy filtered resources.
[INFO] skip non existing resourceDirectory /jobs/genie.papyrus/Papyrus-CDO/workspace/source/cdo/tests/org.eclipse.papyrus.cdo.validation.problems.tests/src/test/resources
[INFO] 
[INFO] --- tycho-source-plugin:1.3.0:plugin-source (plugin-source) @ org.eclipse.papyrus.cdo.validation.problems.tests ---
[INFO] Building jar: /jobs/genie.papyrus/Papyrus-CDO/workspace/source/cdo/tests/org.eclipse.papyrus.cdo.validation.problems.tests/target/org.eclipse.papyrus.cdo.validation.problems.tests-1.2.0-SNAPSHOT-sources.jar
[INFO] 
[INFO] --- target-platform-configuration:1.3.0:target-platform (default-target-platform) @ org.eclipse.papyrus.cdo.validation.problems.tests ---
[INFO] 
[INFO] --- tycho-packaging-plugin:1.3.0:package-plugin (default-package-plugin) @ org.eclipse.papyrus.cdo.validation.problems.tests ---
[INFO] Building jar: /jobs/genie.papyrus/Papyrus-CDO/workspace/source/cdo/tests/org.eclipse.papyrus.cdo.validation.problems.tests/target/org.eclipse.papyrus.cdo.validation.problems.tests-1.2.0-SNAPSHOT.jar
[INFO] 
[INFO] --- tycho-p2-plugin:1.3.0:p2-metadata-default (default-p2-metadata-default) @ org.eclipse.papyrus.cdo.validation.problems.tests ---
[INFO] 
[INFO] --- tycho-source-feature-plugin:1.3.0:source-feature (source-feature) @ org.eclipse.papyrus.cdo.validation.problems.tests ---
[INFO] 
[INFO] --- tycho-p2-plugin:1.3.0:p2-metadata (attach-p2-metadata) @ org.eclipse.papyrus.cdo.validation.problems.tests ---
[INFO] 
[INFO] --- tycho-surefire-plugin:1.3.0:test (default-test) @ org.eclipse.papyrus.cdo.validation.problems.tests ---
[INFO] Expected eclipse log file: /jobs/genie.papyrus/Papyrus-CDO/workspace/source/cdo/tests/org.eclipse.papyrus.cdo.validation.problems.tests/target/work/data/.metadata/.log
[INFO] Command line:
	[/opt/public/common/java/oracle/jdk1.8.0_192_x64/jre/bin/java, -Dosgi.noShutdown=false, -Dosgi.os=linux, -Dosgi.ws=gtk, -Dosgi.arch=x86_64, -javaagent:/home/hudson/genie.papyrus/.jenkins/jobs/Papyrus-CDO/workspace/.repository/org/jacoco/org.jacoco.agent/0.8.2/org.jacoco.agent-0.8.2-runtime.jar=destfile=/jobs/genie.papyrus/Papyrus-CDO/workspace/source/cdo/tests/org.eclipse.papyrus.cdo.validation.problems.tests/target/jacoco.exec,includes=org.eclipse.papyrus.*,excludes=org.eclipse.uml2, -Xms512m, -Xmx2048m, -XX:SoftRefLRUPolicyMSPerMB=100, -Dosgi.clean=true, -jar, /jobs/genie.papyrus/Papyrus-CDO/workspace/.repository/p2/osgi/bundle/org.eclipse.equinox.launcher/1.5.400.v20190515-0925/org.eclipse.equinox.launcher-1.5.400.v20190515-0925.jar, -data, /jobs/genie.papyrus/Papyrus-CDO/workspace/source/cdo/tests/org.eclipse.papyrus.cdo.validation.problems.tests/target/work/data, -install, /jobs/genie.papyrus/Papyrus-CDO/workspace/source/cdo/tests/org.eclipse.papyrus.cdo.validation.problems.tests/target/work, -configuration, /jobs/genie.papyrus/Papyrus-CDO/workspace/source/cdo/tests/org.eclipse.papyrus.cdo.validation.problems.tests/target/work/configuration, -application, org.eclipse.tycho.surefire.osgibooter.uitest, -testproperties, /jobs/genie.papyrus/Papyrus-CDO/workspace/source/cdo/tests/org.eclipse.papyrus.cdo.validation.problems.tests/target/surefire.properties, -product, org.eclipse.sdk.ide, -testConfig=CI_TESTS_CONFIG]
Picked up JAVA_TOOL_OPTIONS: -Xmx2G -Djava.io.tmpdir=/tmp/genie.papyrus -DforkCount=1
Running org.eclipse.papyrus.cdo.validation.problems.tests.EProblemTest
Tests run: 1, Failures: 0, Errors: 0, Skipped: 0, Time elapsed: 0.053 s - in org.eclipse.papyrus.cdo.validation.problems.tests.EProblemTest
testToDiagnostic(org.eclipse.papyrus.cdo.validation.problems.tests.EProblemTest)  Time elapsed: 0.031 s
Running org.eclipse.papyrus.cdo.validation.problems.tests.EProblemsContainerTest
Tests run: 5, Failures: 0, Errors: 0, Skipped: 0, Time elapsed: 0.013 s - in org.eclipse.papyrus.cdo.validation.problems.tests.EProblemsContainerTest
testAllProblems(org.eclipse.papyrus.cdo.validation.problems.tests.EProblemsContainerTest)  Time elapsed: 0.007 s
testGetWorstProblem__EObject(org.eclipse.papyrus.cdo.validation.problems.tests.EProblemsContainerTest)  Time elapsed: 0.002 s
testAllDiagnostics__EObject(org.eclipse.papyrus.cdo.validation.problems.tests.EProblemsContainerTest)  Time elapsed: 0.001 s
testAllProblems__EObject(org.eclipse.papyrus.cdo.validation.problems.tests.EProblemsContainerTest)  Time elapsed: 0 s
testAllDiagnostics(org.eclipse.papyrus.cdo.validation.problems.tests.EProblemsContainerTest)  Time elapsed: 0.001 s
Running org.eclipse.papyrus.cdo.validation.problems.tests.AttributeTest
Tests run: 1, Failures: 1, Errors: 0, Skipped: 0, Time elapsed: 0.002 s <<< FAILURE! - in org.eclipse.papyrus.cdo.validation.problems.tests.AttributeTest
warning(junit.framework.TestSuite$1)  Time elapsed: 0.001 s  <<< FAILURE!
junit.framework.AssertionFailedError: No tests found in org.eclipse.papyrus.cdo.validation.problems.tests.AttributeTest
	at junit.framework.TestSuite$1.runTest(TestSuite.java:97)

Running org.eclipse.papyrus.cdo.validation.problems.util.tests.ProblemsManagerTest
Tests run: 11, Failures: 0, Errors: 0, Skipped: 0, Time elapsed: 3.418 s - in org.eclipse.papyrus.cdo.validation.problems.util.tests.ProblemsManagerTest
dispose_crossReferencerAddedAfter(org.eclipse.papyrus.cdo.validation.problems.util.tests.ProblemsManagerTest)  Time elapsed: 1.645 s
disposeProblemsManager(org.eclipse.papyrus.cdo.validation.problems.util.tests.ProblemsManagerTest)  Time elapsed: 1.124 s
allProblems(org.eclipse.papyrus.cdo.validation.problems.util.tests.ProblemsManagerTest)  Time elapsed: 0.129 s
allProblems_EObject_noCrossReferencer(org.eclipse.papyrus.cdo.validation.problems.util.tests.ProblemsManagerTest)  Time elapsed: 0.097 s
purge_noCrossReferencer(org.eclipse.papyrus.cdo.validation.problems.util.tests.ProblemsManagerTest)  Time elapsed: 0.058 s
purgeAll_noCrossReferencer(org.eclipse.papyrus.cdo.validation.problems.util.tests.ProblemsManagerTest)  Time elapsed: 0.045 s
customProblemClass(org.eclipse.papyrus.cdo.validation.problems.util.tests.ProblemsManagerTest)  Time elapsed: 0.044 s
allProblems_EObject_crossReferencer(org.eclipse.papyrus.cdo.validation.problems.util.tests.ProblemsManagerTest)  Time elapsed: 0.033 s
getProblemsAdapter(org.eclipse.papyrus.cdo.validation.problems.util.tests.ProblemsManagerTest)  Time elapsed: 0.031 s
purgeAll_crossReferencer(org.eclipse.papyrus.cdo.validation.problems.util.tests.ProblemsManagerTest)  Time elapsed: 0.035 s
purge_crossReferencer(org.eclipse.papyrus.cdo.validation.problems.util.tests.ProblemsManagerTest)  Time elapsed: 0.03 s
Running org.eclipse.papyrus.cdo.validation.problems.edit.tests.ProblemEditUtilTest
Tests run: 3, Failures: 0, Errors: 0, Skipped: 0, Time elapsed: 0.025 s - in org.eclipse.papyrus.cdo.validation.problems.edit.tests.ProblemEditUtilTest
testDefaultProblemType(org.eclipse.papyrus.cdo.validation.problems.edit.tests.ProblemEditUtilTest)  Time elapsed: 0.018 s
testProblemTypeProvider(org.eclipse.papyrus.cdo.validation.problems.edit.tests.ProblemEditUtilTest)  Time elapsed: 0.006 s
testDefaultProblemType_nullElement(org.eclipse.papyrus.cdo.validation.problems.edit.tests.ProblemEditUtilTest)  Time elapsed: 0 s

Results:

Failures: 
  TestSuite$1.warning No tests found in org.eclipse.papyrus.cdo.validation.problems.tests.AttributeTest

Tests run: 21, Failures: 1, Errors: 0, Skipped: 0

[ERROR] There are test failures.

Please refer to /jobs/genie.papyrus/Papyrus-CDO/workspace/source/cdo/tests/org.eclipse.papyrus.cdo.validation.problems.tests/target/surefire-reports for the individual test results.
[INFO] 
[INFO] --- jacoco-maven-plugin:0.8.2:report (default-report) @ org.eclipse.papyrus.cdo.validation.problems.tests ---
[INFO] Loading execution data file /jobs/genie.papyrus/Papyrus-CDO/workspace/source/cdo/tests/org.eclipse.papyrus.cdo.validation.problems.tests/target/jacoco.exec
[INFO] Analyzed bundle 'org.eclipse.papyrus.cdo.validation.problems.tests' with 0 classes
[INFO] 
[INFO] ----< org.eclipse.papyrus.cdo:org.eclipse.papyrus.cdo.uml.ui.tests >----
[INFO] Building org.eclipse.papyrus.cdo.uml.ui.tests 1.2.0-SNAPSHOT     [31/34]
[INFO] ------------------------[ eclipse-test-plugin ]-------------------------
[INFO] 
[INFO] --- maven-clean-plugin:3.0.0:clean (default-clean) @ org.eclipse.papyrus.cdo.uml.ui.tests ---
[INFO] 
[INFO] --- tycho-packaging-plugin:1.3.0:build-qualifier (default-build-qualifier) @ org.eclipse.papyrus.cdo.uml.ui.tests ---
[INFO] The project's OSGi version is 1.2.0.201910160127
[INFO] 
[INFO] --- tycho-packaging-plugin:1.3.0:validate-id (default-validate-id) @ org.eclipse.papyrus.cdo.uml.ui.tests ---
[INFO] 
[INFO] --- tycho-packaging-plugin:1.3.0:validate-version (default-validate-version) @ org.eclipse.papyrus.cdo.uml.ui.tests ---
[INFO] 
[INFO] --- jacoco-maven-plugin:0.8.2:prepare-agent (default-prepare-agent) @ org.eclipse.papyrus.cdo.uml.ui.tests ---
[INFO] tycho.testArgLine set to -javaagent:/home/hudson/genie.papyrus/.jenkins/jobs/Papyrus-CDO/workspace/.repository/org/jacoco/org.jacoco.agent/0.8.2/org.jacoco.agent-0.8.2-runtime.jar=destfile=/jobs/genie.papyrus/Papyrus-CDO/workspace/source/cdo/tests/org.eclipse.papyrus.cdo.uml.ui.tests/target/jacoco.exec,includes=org.eclipse.papyrus.*,excludes=org.eclipse.uml2
[INFO] 
[INFO] --- maven-resources-plugin:2.7:resources (default-resources) @ org.eclipse.papyrus.cdo.uml.ui.tests ---
[INFO] Using 'UTF-8' encoding to copy filtered resources.
[INFO] skip non existing resourceDirectory /jobs/genie.papyrus/Papyrus-CDO/workspace/source/cdo/tests/org.eclipse.papyrus.cdo.uml.ui.tests/src/main/resources
[INFO] 
[INFO] --- tycho-compiler-plugin:1.3.0:compile (default-compile) @ org.eclipse.papyrus.cdo.uml.ui.tests ---
[WARNING] The effective compiler target level 1.8 is incompatible with the following OSGi execution environments: [JavaSE-1.6 (assumes 1.6)] @ MavenProject: org.eclipse.papyrus.cdo:org.eclipse.papyrus.cdo.uml.ui.tests:1.2.0-SNAPSHOT @ /jobs/genie.papyrus/Papyrus-CDO/workspace/source/cdo/tests/org.eclipse.papyrus.cdo.uml.ui.tests/pom.xml
[INFO] Compiling 2 source files to /jobs/genie.papyrus/Papyrus-CDO/workspace/source/cdo/tests/org.eclipse.papyrus.cdo.uml.ui.tests/target/classes
[WARNING] /jobs/genie.papyrus/Papyrus-CDO/workspace/source/cdo/tests/org.eclipse.papyrus.cdo.uml.ui.tests/src/org/eclipse/papyrus/cdo/uml/internal/ui/importsources/tests/CDOPackageImportSourceTest.java:[96] 
	DIResourceQuery.waitFor(getInternalCheckout().getView(), 10, TimeUnit.SECONDS);
	                        ^^^^^^^^^^^^^^^^^^^^^^^^^^^^^^^
Discouraged access: The method 'CDOCheckoutImpl.getView()' is not API (restriction on classpath entry '/home/hudson/genie.papyrus/.jenkins/jobs/Papyrus-CDO/workspace/.repository/p2/osgi/bundle/org.eclipse.emf.cdo.explorer/4.5.200.v20180529-1130/org.eclipse.emf.cdo.explorer-4.5.200.v20180529-1130.jar')
1 problem (1 warning)
[INFO] 
[INFO] --- maven-resources-plugin:2.7:testResources (default-testResources) @ org.eclipse.papyrus.cdo.uml.ui.tests ---
[INFO] Using 'UTF-8' encoding to copy filtered resources.
[INFO] skip non existing resourceDirectory /jobs/genie.papyrus/Papyrus-CDO/workspace/source/cdo/tests/org.eclipse.papyrus.cdo.uml.ui.tests/src/test/resources
[INFO] 
[INFO] --- tycho-source-plugin:1.3.0:plugin-source (plugin-source) @ org.eclipse.papyrus.cdo.uml.ui.tests ---
[INFO] Building jar: /jobs/genie.papyrus/Papyrus-CDO/workspace/source/cdo/tests/org.eclipse.papyrus.cdo.uml.ui.tests/target/org.eclipse.papyrus.cdo.uml.ui.tests-1.2.0-SNAPSHOT-sources.jar
[INFO] 
[INFO] --- target-platform-configuration:1.3.0:target-platform (default-target-platform) @ org.eclipse.papyrus.cdo.uml.ui.tests ---
[INFO] 
[INFO] --- tycho-packaging-plugin:1.3.0:package-plugin (default-package-plugin) @ org.eclipse.papyrus.cdo.uml.ui.tests ---
[INFO] Building jar: /jobs/genie.papyrus/Papyrus-CDO/workspace/source/cdo/tests/org.eclipse.papyrus.cdo.uml.ui.tests/target/org.eclipse.papyrus.cdo.uml.ui.tests-1.2.0-SNAPSHOT.jar
[INFO] 
[INFO] --- tycho-p2-plugin:1.3.0:p2-metadata-default (default-p2-metadata-default) @ org.eclipse.papyrus.cdo.uml.ui.tests ---
[INFO] 
[INFO] --- tycho-source-feature-plugin:1.3.0:source-feature (source-feature) @ org.eclipse.papyrus.cdo.uml.ui.tests ---
[INFO] 
[INFO] --- tycho-p2-plugin:1.3.0:p2-metadata (attach-p2-metadata) @ org.eclipse.papyrus.cdo.uml.ui.tests ---
[INFO] 
[INFO] --- tycho-surefire-plugin:1.3.0:test (default-test) @ org.eclipse.papyrus.cdo.uml.ui.tests ---
[INFO] Expected eclipse log file: /jobs/genie.papyrus/Papyrus-CDO/workspace/source/cdo/tests/org.eclipse.papyrus.cdo.uml.ui.tests/target/work/data/.metadata/.log
[INFO] Command line:
	[/opt/public/common/java/oracle/jdk1.8.0_192_x64/jre/bin/java, -Dosgi.noShutdown=false, -Dosgi.os=linux, -Dosgi.ws=gtk, -Dosgi.arch=x86_64, -javaagent:/home/hudson/genie.papyrus/.jenkins/jobs/Papyrus-CDO/workspace/.repository/org/jacoco/org.jacoco.agent/0.8.2/org.jacoco.agent-0.8.2-runtime.jar=destfile=/jobs/genie.papyrus/Papyrus-CDO/workspace/source/cdo/tests/org.eclipse.papyrus.cdo.uml.ui.tests/target/jacoco.exec,includes=org.eclipse.papyrus.*,excludes=org.eclipse.uml2, -Xms512m, -Xmx2048m, -XX:SoftRefLRUPolicyMSPerMB=100, -Dosgi.clean=true, -jar, /jobs/genie.papyrus/Papyrus-CDO/workspace/.repository/p2/osgi/bundle/org.eclipse.equinox.launcher/1.5.400.v20190515-0925/org.eclipse.equinox.launcher-1.5.400.v20190515-0925.jar, -data, /jobs/genie.papyrus/Papyrus-CDO/workspace/source/cdo/tests/org.eclipse.papyrus.cdo.uml.ui.tests/target/work/data, -install, /jobs/genie.papyrus/Papyrus-CDO/workspace/source/cdo/tests/org.eclipse.papyrus.cdo.uml.ui.tests/target/work, -configuration, /jobs/genie.papyrus/Papyrus-CDO/workspace/source/cdo/tests/org.eclipse.papyrus.cdo.uml.ui.tests/target/work/configuration, -application, org.eclipse.tycho.surefire.osgibooter.uitest, -testproperties, /jobs/genie.papyrus/Papyrus-CDO/workspace/source/cdo/tests/org.eclipse.papyrus.cdo.uml.ui.tests/target/surefire.properties, -product, org.eclipse.sdk.ide, -testConfig=CI_TESTS_CONFIG]
Picked up JAVA_TOOL_OPTIONS: -Xmx2G -Djava.io.tmpdir=/tmp/genie.papyrus -DforkCount=1
Running org.eclipse.papyrus.cdo.uml.internal.ui.importsources.tests.CDOPackageImportSourceTest
Tests run: 12, Failures: 0, Errors: 12, Skipped: 0, Time elapsed: 63.267 s <<< FAILURE! - in org.eclipse.papyrus.cdo.uml.internal.ui.importsources.tests.CDOPackageImportSourceTest
testGetPackages(org.eclipse.papyrus.cdo.uml.internal.ui.importsources.tests.CDOPackageImportSourceTest)  Time elapsed: 18.001 s  <<< ERROR!
org.eclipse.net4j.util.transaction.TransactionException: org.eclipse.emf.cdo.util.DanglingIntegrityException: The object "org.eclipse.uml2.uml.internal.impl.PrimitiveTypeImpl@3846ba32 (eProxyURI: pathmap://UML_LIBRARIES/UMLPrimitiveTypes.library.uml#String)(org.eclipse.uml2.uml.internal.impl.PrimitiveTypeImpl)" is not contained in a resource
Caused by: org.eclipse.emf.cdo.util.DanglingIntegrityException: The object "org.eclipse.uml2.uml.internal.impl.PrimitiveTypeImpl@3846ba32 (eProxyURI: pathmap://UML_LIBRARIES/UMLPrimitiveTypes.library.uml#String)(org.eclipse.uml2.uml.internal.impl.PrimitiveTypeImpl)" is not contained in a resource
Caused by: org.eclipse.emf.cdo.util.DanglingReferenceException: The object "org.eclipse.uml2.uml.internal.impl.PrimitiveTypeImpl@3846ba32 (eProxyURI: pathmap://UML_LIBRARIES/UMLPrimitiveTypes.library.uml#String)(org.eclipse.uml2.uml.internal.impl.PrimitiveTypeImpl)" is not contained in a resource

testGetPackages(org.eclipse.papyrus.cdo.uml.internal.ui.importsources.tests.CDOPackageImportSourceTest)  Time elapsed: 18.002 s  <<< ERROR!
java.lang.NullPointerException
	at org.eclipse.papyrus.cdo.uml.internal.ui.importsources.tests.CDOPackageImportSourceTest.disposeTestFixture(CDOPackageImportSourceTest.java:159)

testCanImportInto(org.eclipse.papyrus.cdo.uml.internal.ui.importsources.tests.CDOPackageImportSourceTest)  Time elapsed: 11.178 s  <<< ERROR!
org.eclipse.net4j.util.transaction.TransactionException: org.eclipse.emf.cdo.util.DanglingIntegrityException: The object "org.eclipse.uml2.uml.internal.impl.ModelImpl@302ab67e (eProxyURI: pathmap://UML_LIBRARIES/UMLPrimitiveTypes.library.uml#_0)(org.eclipse.uml2.uml.internal.impl.ModelImpl)" is not contained in a resource
Caused by: org.eclipse.emf.cdo.util.DanglingIntegrityException: The object "org.eclipse.uml2.uml.internal.impl.ModelImpl@302ab67e (eProxyURI: pathmap://UML_LIBRARIES/UMLPrimitiveTypes.library.uml#_0)(org.eclipse.uml2.uml.internal.impl.ModelImpl)" is not contained in a resource
Caused by: org.eclipse.emf.cdo.util.DanglingReferenceException: The object "org.eclipse.uml2.uml.internal.impl.ModelImpl@302ab67e (eProxyURI: pathmap://UML_LIBRARIES/UMLPrimitiveTypes.library.uml#_0)(org.eclipse.uml2.uml.internal.impl.ModelImpl)" is not contained in a resource

testCanImportInto(org.eclipse.papyrus.cdo.uml.internal.ui.importsources.tests.CDOPackageImportSourceTest)  Time elapsed: 11.178 s  <<< ERROR!
java.lang.NullPointerException
	at org.eclipse.papyrus.cdo.uml.internal.ui.importsources.tests.CDOPackageImportSourceTest.disposeTestFixture(CDOPackageImportSourceTest.java:159)

testValidateSelection(org.eclipse.papyrus.cdo.uml.internal.ui.importsources.tests.CDOPackageImportSourceTest)  Time elapsed: 11.805 s  <<< ERROR!
org.eclipse.net4j.util.transaction.TransactionException: org.eclipse.emf.cdo.util.DanglingIntegrityException: The object "org.eclipse.uml2.uml.internal.impl.ModelImpl@4d2d0eda (eProxyURI: pathmap://UML_LIBRARIES/UMLPrimitiveTypes.library.uml#_0)(org.eclipse.uml2.uml.internal.impl.ModelImpl)" is not contained in a resource
Caused by: org.eclipse.emf.cdo.util.DanglingIntegrityException: The object "org.eclipse.uml2.uml.internal.impl.ModelImpl@4d2d0eda (eProxyURI: pathmap://UML_LIBRARIES/UMLPrimitiveTypes.library.uml#_0)(org.eclipse.uml2.uml.internal.impl.ModelImpl)" is not contained in a resource
Caused by: org.eclipse.emf.cdo.util.DanglingReferenceException: The object "org.eclipse.uml2.uml.internal.impl.ModelImpl@4d2d0eda (eProxyURI: pathmap://UML_LIBRARIES/UMLPrimitiveTypes.library.uml#_0)(org.eclipse.uml2.uml.internal.impl.ModelImpl)" is not contained in a resource

testValidateSelection(org.eclipse.papyrus.cdo.uml.internal.ui.importsources.tests.CDOPackageImportSourceTest)  Time elapsed: 11.806 s  <<< ERROR!
java.lang.NullPointerException
	at org.eclipse.papyrus.cdo.uml.internal.ui.importsources.tests.CDOPackageImportSourceTest.disposeTestFixture(CDOPackageImportSourceTest.java:159)

testCreateModelHierarchyContentProvider(org.eclipse.papyrus.cdo.uml.internal.ui.importsources.tests.CDOPackageImportSourceTest)  Time elapsed: 10.338 s  <<< ERROR!
org.eclipse.net4j.util.transaction.TransactionException: org.eclipse.emf.cdo.util.DanglingIntegrityException: The object "org.eclipse.uml2.uml.internal.impl.PrimitiveTypeImpl@367026f (eProxyURI: pathmap://UML_LIBRARIES/UMLPrimitiveTypes.library.uml#String)(org.eclipse.uml2.uml.internal.impl.PrimitiveTypeImpl)" is not contained in a resource
Caused by: org.eclipse.emf.cdo.util.DanglingIntegrityException: The object "org.eclipse.uml2.uml.internal.impl.PrimitiveTypeImpl@367026f (eProxyURI: pathmap://UML_LIBRARIES/UMLPrimitiveTypes.library.uml#String)(org.eclipse.uml2.uml.internal.impl.PrimitiveTypeImpl)" is not contained in a resource
Caused by: org.eclipse.emf.cdo.util.DanglingReferenceException: The object "org.eclipse.uml2.uml.internal.impl.PrimitiveTypeImpl@367026f (eProxyURI: pathmap://UML_LIBRARIES/UMLPrimitiveTypes.library.uml#String)(org.eclipse.uml2.uml.internal.impl.PrimitiveTypeImpl)" is not contained in a resource

testCreateModelHierarchyContentProvider(org.eclipse.papyrus.cdo.uml.internal.ui.importsources.tests.CDOPackageImportSourceTest)  Time elapsed: 10.338 s  <<< ERROR!
java.lang.NullPointerException
	at org.eclipse.papyrus.cdo.uml.internal.ui.importsources.tests.CDOPackageImportSourceTest.disposeTestFixture(CDOPackageImportSourceTest.java:159)

testGetCDOResource(org.eclipse.papyrus.cdo.uml.internal.ui.importsources.tests.CDOPackageImportSourceTest)  Time elapsed: 0.261 s  <<< ERROR!
org.eclipse.net4j.util.transaction.TransactionException: org.eclipse.emf.cdo.util.DanglingIntegrityException: The object "org.eclipse.uml2.uml.internal.impl.PrimitiveTypeImpl@6cd9cafb (eProxyURI: pathmap://UML_LIBRARIES/UMLPrimitiveTypes.library.uml#String)(org.eclipse.uml2.uml.internal.impl.PrimitiveTypeImpl)" is not contained in a resource
Caused by: org.eclipse.emf.cdo.util.DanglingIntegrityException: The object "org.eclipse.uml2.uml.internal.impl.PrimitiveTypeImpl@6cd9cafb (eProxyURI: pathmap://UML_LIBRARIES/UMLPrimitiveTypes.library.uml#String)(org.eclipse.uml2.uml.internal.impl.PrimitiveTypeImpl)" is not contained in a resource
Caused by: org.eclipse.emf.cdo.util.DanglingReferenceException: The object "org.eclipse.uml2.uml.internal.impl.PrimitiveTypeImpl@6cd9cafb (eProxyURI: pathmap://UML_LIBRARIES/UMLPrimitiveTypes.library.uml#String)(org.eclipse.uml2.uml.internal.impl.PrimitiveTypeImpl)" is not contained in a resource

testGetCDOResource(org.eclipse.papyrus.cdo.uml.internal.ui.importsources.tests.CDOPackageImportSourceTest)  Time elapsed: 0.261 s  <<< ERROR!
java.lang.NullPointerException
	at org.eclipse.papyrus.cdo.uml.internal.ui.importsources.tests.CDOPackageImportSourceTest.disposeTestFixture(CDOPackageImportSourceTest.java:159)

testCreateModelHierarchyLabelProvider(org.eclipse.papyrus.cdo.uml.internal.ui.importsources.tests.CDOPackageImportSourceTest)  Time elapsed: 11.06 s  <<< ERROR!
org.eclipse.net4j.util.transaction.TransactionException: org.eclipse.emf.cdo.util.DanglingIntegrityException: The object "org.eclipse.uml2.uml.internal.impl.ModelImpl@22876aea (eProxyURI: pathmap://UML_LIBRARIES/UMLPrimitiveTypes.library.uml#_0)(org.eclipse.uml2.uml.internal.impl.ModelImpl)" is not contained in a resource
Caused by: org.eclipse.emf.cdo.util.DanglingIntegrityException: The object "org.eclipse.uml2.uml.internal.impl.ModelImpl@22876aea (eProxyURI: pathmap://UML_LIBRARIES/UMLPrimitiveTypes.library.uml#_0)(org.eclipse.uml2.uml.internal.impl.ModelImpl)" is not contained in a resource
Caused by: org.eclipse.emf.cdo.util.DanglingReferenceException: The object "org.eclipse.uml2.uml.internal.impl.ModelImpl@22876aea (eProxyURI: pathmap://UML_LIBRARIES/UMLPrimitiveTypes.library.uml#_0)(org.eclipse.uml2.uml.internal.impl.ModelImpl)" is not contained in a resource

testCreateModelHierarchyLabelProvider(org.eclipse.papyrus.cdo.uml.internal.ui.importsources.tests.CDOPackageImportSourceTest)  Time elapsed: 11.06 s  <<< ERROR!
java.lang.NullPointerException
	at org.eclipse.papyrus.cdo.uml.internal.ui.importsources.tests.CDOPackageImportSourceTest.disposeTestFixture(CDOPackageImportSourceTest.java:159)


Results:

Errors: 
org.eclipse.papyrus.cdo.uml.internal.ui.importsources.tests.CDOPackageImportSourceTest.testCanImportInto(org.eclipse.papyrus.cdo.uml.internal.ui.importsources.tests.CDOPackageImportSourceTest)
  Run 1: CDOPackageImportSourceTest>AbstractPapyrusCDOUITest.importTestModel:145->AbstractPapyrusCDOTest.commit:262 » Transaction
  Run 2: CDOPackageImportSourceTest.disposeTestFixture:159 NullPointer

org.eclipse.papyrus.cdo.uml.internal.ui.importsources.tests.CDOPackageImportSourceTest.testCreateModelHierarchyContentProvider(org.eclipse.papyrus.cdo.uml.internal.ui.importsources.tests.CDOPackageImportSourceTest)
  Run 1: CDOPackageImportSourceTest>AbstractPapyrusCDOUITest.importTestModel:145->AbstractPapyrusCDOTest.commit:262 » Transaction
  Run 2: CDOPackageImportSourceTest.disposeTestFixture:159 NullPointer

org.eclipse.papyrus.cdo.uml.internal.ui.importsources.tests.CDOPackageImportSourceTest.testCreateModelHierarchyLabelProvider(org.eclipse.papyrus.cdo.uml.internal.ui.importsources.tests.CDOPackageImportSourceTest)
  Run 1: CDOPackageImportSourceTest>AbstractPapyrusCDOUITest.importTestModel:145->AbstractPapyrusCDOTest.commit:262 » Transaction
  Run 2: CDOPackageImportSourceTest.disposeTestFixture:159 NullPointer

org.eclipse.papyrus.cdo.uml.internal.ui.importsources.tests.CDOPackageImportSourceTest.testGetCDOResource(org.eclipse.papyrus.cdo.uml.internal.ui.importsources.tests.CDOPackageImportSourceTest)
  Run 1: CDOPackageImportSourceTest>AbstractPapyrusCDOUITest.importTestModel:145->AbstractPapyrusCDOTest.commit:262 » Transaction
  Run 2: CDOPackageImportSourceTest.disposeTestFixture:159 NullPointer

org.eclipse.papyrus.cdo.uml.internal.ui.importsources.tests.CDOPackageImportSourceTest.testGetPackages(org.eclipse.papyrus.cdo.uml.internal.ui.importsources.tests.CDOPackageImportSourceTest)
  Run 1: CDOPackageImportSourceTest>AbstractPapyrusCDOUITest.importTestModel:145->AbstractPapyrusCDOTest.commit:262 » Transaction
  Run 2: CDOPackageImportSourceTest.disposeTestFixture:159 NullPointer

org.eclipse.papyrus.cdo.uml.internal.ui.importsources.tests.CDOPackageImportSourceTest.testValidateSelection(org.eclipse.papyrus.cdo.uml.internal.ui.importsources.tests.CDOPackageImportSourceTest)
  Run 1: CDOPackageImportSourceTest>AbstractPapyrusCDOUITest.importTestModel:145->AbstractPapyrusCDOTest.commit:262 » Transaction
  Run 2: CDOPackageImportSourceTest.disposeTestFixture:159 NullPointer


Tests run: 6, Failures: 0, Errors: 6, Skipped: 0

[ERROR] There are test failures.

Please refer to /jobs/genie.papyrus/Papyrus-CDO/workspace/source/cdo/tests/org.eclipse.papyrus.cdo.uml.ui.tests/target/surefire-reports for the individual test results.
[INFO] 
[INFO] --- jacoco-maven-plugin:0.8.2:report (default-report) @ org.eclipse.papyrus.cdo.uml.ui.tests ---
[INFO] Loading execution data file /jobs/genie.papyrus/Papyrus-CDO/workspace/source/cdo/tests/org.eclipse.papyrus.cdo.uml.ui.tests/target/jacoco.exec
[INFO] Analyzed bundle 'org.eclipse.papyrus.cdo.uml.ui.tests' with 0 classes
[INFO] 
[INFO] --< org.eclipse.papyrus.cdo:org.eclipse.papyrus.cdo.uml.search.ui.tests >--
[INFO] Building org.eclipse.papyrus.cdo.uml.search.ui.tests 1.2.0-SNAPSHOT [32/34]
[INFO] ------------------------[ eclipse-test-plugin ]-------------------------
[INFO] 
[INFO] --- maven-clean-plugin:3.0.0:clean (default-clean) @ org.eclipse.papyrus.cdo.uml.search.ui.tests ---
[INFO] 
[INFO] --- tycho-packaging-plugin:1.3.0:build-qualifier (default-build-qualifier) @ org.eclipse.papyrus.cdo.uml.search.ui.tests ---
[INFO] The project's OSGi version is 1.2.0.201910160127
[INFO] 
[INFO] --- tycho-packaging-plugin:1.3.0:validate-id (default-validate-id) @ org.eclipse.papyrus.cdo.uml.search.ui.tests ---
[INFO] 
[INFO] --- tycho-packaging-plugin:1.3.0:validate-version (default-validate-version) @ org.eclipse.papyrus.cdo.uml.search.ui.tests ---
[INFO] 
[INFO] --- jacoco-maven-plugin:0.8.2:prepare-agent (default-prepare-agent) @ org.eclipse.papyrus.cdo.uml.search.ui.tests ---
[INFO] tycho.testArgLine set to -javaagent:/home/hudson/genie.papyrus/.jenkins/jobs/Papyrus-CDO/workspace/.repository/org/jacoco/org.jacoco.agent/0.8.2/org.jacoco.agent-0.8.2-runtime.jar=destfile=/jobs/genie.papyrus/Papyrus-CDO/workspace/source/cdo/tests/org.eclipse.papyrus.cdo.uml.search.ui.tests/target/jacoco.exec,includes=org.eclipse.papyrus.*,excludes=org.eclipse.uml2
[INFO] 
[INFO] --- maven-resources-plugin:2.7:resources (default-resources) @ org.eclipse.papyrus.cdo.uml.search.ui.tests ---
[INFO] Using 'UTF-8' encoding to copy filtered resources.
[INFO] skip non existing resourceDirectory /jobs/genie.papyrus/Papyrus-CDO/workspace/source/cdo/tests/org.eclipse.papyrus.cdo.uml.search.ui.tests/src/main/resources
[INFO] 
[INFO] --- tycho-compiler-plugin:1.3.0:compile (default-compile) @ org.eclipse.papyrus.cdo.uml.search.ui.tests ---
[WARNING] The effective compiler target level 1.8 is incompatible with the following OSGi execution environments: [JavaSE-1.6 (assumes 1.6)] @ MavenProject: org.eclipse.papyrus.cdo:org.eclipse.papyrus.cdo.uml.search.ui.tests:1.2.0-SNAPSHOT @ /jobs/genie.papyrus/Papyrus-CDO/workspace/source/cdo/tests/org.eclipse.papyrus.cdo.uml.search.ui.tests/pom.xml
[INFO] Compiling 5 source files to /jobs/genie.papyrus/Papyrus-CDO/workspace/source/cdo/tests/org.eclipse.papyrus.cdo.uml.search.ui.tests/target/classes
[WARNING] /jobs/genie.papyrus/Papyrus-CDO/workspace/source/cdo/tests/org.eclipse.papyrus.cdo.uml.search.ui.tests/src/org/eclipse/papyrus/cdo/uml/search/ui/tests/AbstractPapyrusCDOSearchTest.java:[81] 
	@SuppressWarnings("restriction")
	                  ^^^^^^^^^^^^^
Unnecessary @SuppressWarnings("restriction")
1 problem (1 warning)
[INFO] 
[INFO] --- maven-resources-plugin:2.7:testResources (default-testResources) @ org.eclipse.papyrus.cdo.uml.search.ui.tests ---
[INFO] Using 'UTF-8' encoding to copy filtered resources.
[INFO] skip non existing resourceDirectory /jobs/genie.papyrus/Papyrus-CDO/workspace/source/cdo/tests/org.eclipse.papyrus.cdo.uml.search.ui.tests/src/test/resources
[INFO] 
[INFO] --- tycho-source-plugin:1.3.0:plugin-source (plugin-source) @ org.eclipse.papyrus.cdo.uml.search.ui.tests ---
[INFO] Building jar: /jobs/genie.papyrus/Papyrus-CDO/workspace/source/cdo/tests/org.eclipse.papyrus.cdo.uml.search.ui.tests/target/org.eclipse.papyrus.cdo.uml.search.ui.tests-1.2.0-SNAPSHOT-sources.jar
[INFO] 
[INFO] --- target-platform-configuration:1.3.0:target-platform (default-target-platform) @ org.eclipse.papyrus.cdo.uml.search.ui.tests ---
[INFO] 
[INFO] --- tycho-packaging-plugin:1.3.0:package-plugin (default-package-plugin) @ org.eclipse.papyrus.cdo.uml.search.ui.tests ---
[INFO] Building jar: /jobs/genie.papyrus/Papyrus-CDO/workspace/source/cdo/tests/org.eclipse.papyrus.cdo.uml.search.ui.tests/target/org.eclipse.papyrus.cdo.uml.search.ui.tests-1.2.0-SNAPSHOT.jar
[INFO] 
[INFO] --- tycho-p2-plugin:1.3.0:p2-metadata-default (default-p2-metadata-default) @ org.eclipse.papyrus.cdo.uml.search.ui.tests ---
[INFO] 
[INFO] --- tycho-source-feature-plugin:1.3.0:source-feature (source-feature) @ org.eclipse.papyrus.cdo.uml.search.ui.tests ---
[INFO] 
[INFO] --- tycho-p2-plugin:1.3.0:p2-metadata (attach-p2-metadata) @ org.eclipse.papyrus.cdo.uml.search.ui.tests ---
[INFO] 
[INFO] --- tycho-surefire-plugin:1.3.0:test (default-test) @ org.eclipse.papyrus.cdo.uml.search.ui.tests ---
[INFO] Expected eclipse log file: /jobs/genie.papyrus/Papyrus-CDO/workspace/source/cdo/tests/org.eclipse.papyrus.cdo.uml.search.ui.tests/target/work/data/.metadata/.log
[INFO] Command line:
	[/opt/public/common/java/oracle/jdk1.8.0_192_x64/jre/bin/java, -Dosgi.noShutdown=false, -Dosgi.os=linux, -Dosgi.ws=gtk, -Dosgi.arch=x86_64, -javaagent:/home/hudson/genie.papyrus/.jenkins/jobs/Papyrus-CDO/workspace/.repository/org/jacoco/org.jacoco.agent/0.8.2/org.jacoco.agent-0.8.2-runtime.jar=destfile=/jobs/genie.papyrus/Papyrus-CDO/workspace/source/cdo/tests/org.eclipse.papyrus.cdo.uml.search.ui.tests/target/jacoco.exec,includes=org.eclipse.papyrus.*,excludes=org.eclipse.uml2, -Xms512m, -Xmx2048m, -XX:SoftRefLRUPolicyMSPerMB=100, -Dosgi.clean=true, -jar, /jobs/genie.papyrus/Papyrus-CDO/workspace/.repository/p2/osgi/bundle/org.eclipse.equinox.launcher/1.5.400.v20190515-0925/org.eclipse.equinox.launcher-1.5.400.v20190515-0925.jar, -data, /jobs/genie.papyrus/Papyrus-CDO/workspace/source/cdo/tests/org.eclipse.papyrus.cdo.uml.search.ui.tests/target/work/data, -install, /jobs/genie.papyrus/Papyrus-CDO/workspace/source/cdo/tests/org.eclipse.papyrus.cdo.uml.search.ui.tests/target/work, -configuration, /jobs/genie.papyrus/Papyrus-CDO/workspace/source/cdo/tests/org.eclipse.papyrus.cdo.uml.search.ui.tests/target/work/configuration, -application, org.eclipse.tycho.surefire.osgibooter.uitest, -testproperties, /jobs/genie.papyrus/Papyrus-CDO/workspace/source/cdo/tests/org.eclipse.papyrus.cdo.uml.search.ui.tests/target/surefire.properties, -product, org.eclipse.sdk.ide, -testConfig=CI_TESTS_CONFIG]
Picked up JAVA_TOOL_OPTIONS: -Xmx2G -Djava.io.tmpdir=/tmp/genie.papyrus -DforkCount=1
Running org.eclipse.papyrus.cdo.uml.search.ui.tests.AdvancedTextSearchTest
Tests run: 4, Failures: 0, Errors: 4, Skipped: 0, Time elapsed: 4.755 s <<< FAILURE! - in org.eclipse.papyrus.cdo.uml.search.ui.tests.AdvancedTextSearchTest
testSearchByOneAttributesOfTwoMetaclasses(org.eclipse.papyrus.cdo.uml.search.ui.tests.AdvancedTextSearchTest)  Time elapsed: 2.455 s  <<< ERROR!
java.lang.NullPointerException

testSearchByOneAttributeOfOneMetaclass(org.eclipse.papyrus.cdo.uml.search.ui.tests.AdvancedTextSearchTest)  Time elapsed: 0.749 s  <<< ERROR!
java.lang.NullPointerException

testSearchByAllAttributesOfAMetaclass(org.eclipse.papyrus.cdo.uml.search.ui.tests.AdvancedTextSearchTest)  Time elapsed: 0.672 s  <<< ERROR!
java.lang.NullPointerException

testSearchByNonStringAttribute(org.eclipse.papyrus.cdo.uml.search.ui.tests.AdvancedTextSearchTest)  Time elapsed: 0.633 s  <<< ERROR!
java.lang.NullPointerException

Running org.eclipse.papyrus.cdo.uml.search.ui.tests.BasicTextSearchTest
Tests run: 4, Failures: 0, Errors: 4, Skipped: 0, Time elapsed: 1.793 s <<< FAILURE! - in org.eclipse.papyrus.cdo.uml.search.ui.tests.BasicTextSearchTest
testSearchByNameCaseSensitive(org.eclipse.papyrus.cdo.uml.search.ui.tests.BasicTextSearchTest)  Time elapsed: 0.486 s  <<< ERROR!
java.lang.NullPointerException

testSearchByName(org.eclipse.papyrus.cdo.uml.search.ui.tests.BasicTextSearchTest)  Time elapsed: 0.539 s  <<< ERROR!
java.lang.NullPointerException

testSearchByNameRegex(org.eclipse.papyrus.cdo.uml.search.ui.tests.BasicTextSearchTest)  Time elapsed: 0.408 s  <<< ERROR!
java.lang.NullPointerException

testSearchByAnyString(org.eclipse.papyrus.cdo.uml.search.ui.tests.BasicTextSearchTest)  Time elapsed: 0.351 s  <<< ERROR!
java.lang.NullPointerException

Running org.eclipse.papyrus.cdo.uml.search.ui.tests.SearchScopingTest
Tests run: 3, Failures: 0, Errors: 3, Skipped: 0, Time elapsed: 0.965 s <<< FAILURE! - in org.eclipse.papyrus.cdo.uml.search.ui.tests.SearchScopingTest
testSearchModel(org.eclipse.papyrus.cdo.uml.search.ui.tests.SearchScopingTest)  Time elapsed: 0.351 s  <<< ERROR!
java.lang.NullPointerException

testSearchWholeFolder(org.eclipse.papyrus.cdo.uml.search.ui.tests.SearchScopingTest)  Time elapsed: 0.318 s  <<< ERROR!
java.lang.NullPointerException

testCanProvideFor(org.eclipse.papyrus.cdo.uml.search.ui.tests.SearchScopingTest)  Time elapsed: 0.293 s  <<< ERROR!
java.lang.NullPointerException


Results:

Errors: 
  AdvancedTextSearchTest>AbstractPapyrusCDOSearchTest.initWorkbench:68 » NullPointer
  AdvancedTextSearchTest>AbstractPapyrusCDOSearchTest.initWorkbench:68 » NullPointer
  AdvancedTextSearchTest>AbstractPapyrusCDOSearchTest.initWorkbench:68 » NullPointer
  AdvancedTextSearchTest>AbstractPapyrusCDOSearchTest.initWorkbench:68 » NullPointer
  BasicTextSearchTest>AbstractPapyrusCDOSearchTest.initWorkbench:68 » NullPointer
  BasicTextSearchTest>AbstractPapyrusCDOSearchTest.initWorkbench:68 » NullPointer
  BasicTextSearchTest>AbstractPapyrusCDOSearchTest.initWorkbench:68 » NullPointer
  BasicTextSearchTest>AbstractPapyrusCDOSearchTest.initWorkbench:68 » NullPointer
  SearchScopingTest>AbstractPapyrusCDOSearchTest.initWorkbench:68 » NullPointer
  SearchScopingTest>AbstractPapyrusCDOSearchTest.initWorkbench:68 » NullPointer
  SearchScopingTest>AbstractPapyrusCDOSearchTest.initWorkbench:68 » NullPointer

Tests run: 11, Failures: 0, Errors: 11, Skipped: 0

[ERROR] There are test failures.

Please refer to /jobs/genie.papyrus/Papyrus-CDO/workspace/source/cdo/tests/org.eclipse.papyrus.cdo.uml.search.ui.tests/target/surefire-reports for the individual test results.
[INFO] 
[INFO] --- jacoco-maven-plugin:0.8.2:report (default-report) @ org.eclipse.papyrus.cdo.uml.search.ui.tests ---
[INFO] Loading execution data file /jobs/genie.papyrus/Papyrus-CDO/workspace/source/cdo/tests/org.eclipse.papyrus.cdo.uml.search.ui.tests/target/jacoco.exec
[INFO] Analyzed bundle 'org.eclipse.papyrus.cdo.uml.search.ui.tests' with 0 classes
[INFO] 
[INFO] -------< org.eclipse.papyrus.cdo:org.eclipse.papyrus.cdo.tests >--------
[INFO] Building org.eclipse.papyrus.cdo.tests 1.2.0-SNAPSHOT            [33/34]
[INFO] ------------------------[ eclipse-test-plugin ]-------------------------
[INFO] 
[INFO] --- maven-clean-plugin:3.0.0:clean (default-clean) @ org.eclipse.papyrus.cdo.tests ---
[INFO] 
[INFO] --- tycho-packaging-plugin:1.3.0:build-qualifier (default-build-qualifier) @ org.eclipse.papyrus.cdo.tests ---
[INFO] The project's OSGi version is 1.2.0.201910160127
[INFO] 
[INFO] --- tycho-packaging-plugin:1.3.0:validate-id (default-validate-id) @ org.eclipse.papyrus.cdo.tests ---
[INFO] 
[INFO] --- tycho-packaging-plugin:1.3.0:validate-version (default-validate-version) @ org.eclipse.papyrus.cdo.tests ---
[INFO] 
[INFO] --- jacoco-maven-plugin:0.8.2:prepare-agent (default-prepare-agent) @ org.eclipse.papyrus.cdo.tests ---
[INFO] tycho.testArgLine set to -javaagent:/home/hudson/genie.papyrus/.jenkins/jobs/Papyrus-CDO/workspace/.repository/org/jacoco/org.jacoco.agent/0.8.2/org.jacoco.agent-0.8.2-runtime.jar=destfile=/jobs/genie.papyrus/Papyrus-CDO/workspace/source/cdo/tests/org.eclipse.papyrus.cdo.tests/target/jacoco.exec,includes=org.eclipse.papyrus.*,excludes=org.eclipse.uml2
[INFO] 
[INFO] --- maven-resources-plugin:2.7:resources (default-resources) @ org.eclipse.papyrus.cdo.tests ---
[INFO] Using 'UTF-8' encoding to copy filtered resources.
[INFO] skip non existing resourceDirectory /jobs/genie.papyrus/Papyrus-CDO/workspace/source/cdo/tests/org.eclipse.papyrus.cdo.tests/src/main/resources
[INFO] 
[INFO] --- tycho-compiler-plugin:1.3.0:compile (default-compile) @ org.eclipse.papyrus.cdo.tests ---
[WARNING] The effective compiler target level 1.8 is incompatible with the following OSGi execution environments: [JavaSE-1.6 (assumes 1.6)] @ MavenProject: org.eclipse.papyrus.cdo:org.eclipse.papyrus.cdo.tests:1.2.0-SNAPSHOT @ /jobs/genie.papyrus/Papyrus-CDO/workspace/source/cdo/tests/org.eclipse.papyrus.cdo.tests/pom.xml
[INFO] Compiling 1 source file to /jobs/genie.papyrus/Papyrus-CDO/workspace/source/cdo/tests/org.eclipse.papyrus.cdo.tests/target/classes
[INFO] 
[INFO] --- maven-resources-plugin:2.7:testResources (default-testResources) @ org.eclipse.papyrus.cdo.tests ---
[INFO] Using 'UTF-8' encoding to copy filtered resources.
[INFO] skip non existing resourceDirectory /jobs/genie.papyrus/Papyrus-CDO/workspace/source/cdo/tests/org.eclipse.papyrus.cdo.tests/src/test/resources
[INFO] 
[INFO] --- tycho-source-plugin:1.3.0:plugin-source (plugin-source) @ org.eclipse.papyrus.cdo.tests ---
[INFO] Building jar: /jobs/genie.papyrus/Papyrus-CDO/workspace/source/cdo/tests/org.eclipse.papyrus.cdo.tests/target/org.eclipse.papyrus.cdo.tests-1.2.0-SNAPSHOT-sources.jar
[INFO] 
[INFO] --- target-platform-configuration:1.3.0:target-platform (default-target-platform) @ org.eclipse.papyrus.cdo.tests ---
[INFO] 
[INFO] --- tycho-packaging-plugin:1.3.0:package-plugin (default-package-plugin) @ org.eclipse.papyrus.cdo.tests ---
[INFO] Building jar: /jobs/genie.papyrus/Papyrus-CDO/workspace/source/cdo/tests/org.eclipse.papyrus.cdo.tests/target/org.eclipse.papyrus.cdo.tests-1.2.0-SNAPSHOT.jar
[INFO] 
[INFO] --- tycho-p2-plugin:1.3.0:p2-metadata-default (default-p2-metadata-default) @ org.eclipse.papyrus.cdo.tests ---
[INFO] 
[INFO] --- tycho-source-feature-plugin:1.3.0:source-feature (source-feature) @ org.eclipse.papyrus.cdo.tests ---
[INFO] 
[INFO] --- tycho-p2-plugin:1.3.0:p2-metadata (attach-p2-metadata) @ org.eclipse.papyrus.cdo.tests ---
[INFO] 
[INFO] --- tycho-surefire-plugin:1.3.0:test (default-test) @ org.eclipse.papyrus.cdo.tests ---
[INFO] Expected eclipse log file: /jobs/genie.papyrus/Papyrus-CDO/workspace/source/cdo/tests/org.eclipse.papyrus.cdo.tests/target/work/data/.metadata/.log
[INFO] Command line:
	[/opt/public/common/java/oracle/jdk1.8.0_192_x64/jre/bin/java, -Dosgi.noShutdown=false, -Dosgi.os=linux, -Dosgi.ws=gtk, -Dosgi.arch=x86_64, -javaagent:/home/hudson/genie.papyrus/.jenkins/jobs/Papyrus-CDO/workspace/.repository/org/jacoco/org.jacoco.agent/0.8.2/org.jacoco.agent-0.8.2-runtime.jar=destfile=/jobs/genie.papyrus/Papyrus-CDO/workspace/source/cdo/tests/org.eclipse.papyrus.cdo.tests/target/jacoco.exec,includes=org.eclipse.papyrus.*,excludes=org.eclipse.uml2, -Xms512m, -Xmx2048m, -XX:SoftRefLRUPolicyMSPerMB=100, -Dosgi.clean=true, -jar, /jobs/genie.papyrus/Papyrus-CDO/workspace/.repository/p2/osgi/bundle/org.eclipse.equinox.launcher/1.5.400.v20190515-0925/org.eclipse.equinox.launcher-1.5.400.v20190515-0925.jar, -data, /jobs/genie.papyrus/Papyrus-CDO/workspace/source/cdo/tests/org.eclipse.papyrus.cdo.tests/target/work/data, -install, /jobs/genie.papyrus/Papyrus-CDO/workspace/source/cdo/tests/org.eclipse.papyrus.cdo.tests/target/work, -configuration, /jobs/genie.papyrus/Papyrus-CDO/workspace/source/cdo/tests/org.eclipse.papyrus.cdo.tests/target/work/configuration, -application, org.eclipse.tycho.surefire.osgibooter.uitest, -testproperties, /jobs/genie.papyrus/Papyrus-CDO/workspace/source/cdo/tests/org.eclipse.papyrus.cdo.tests/target/surefire.properties, -product, org.eclipse.sdk.ide, -testConfig=CI_TESTS_CONFIG]
Picked up JAVA_TOOL_OPTIONS: -Xmx2G -Djava.io.tmpdir=/tmp/genie.papyrus -DforkCount=1

Results:

Tests run: 0, Failures: 0, Errors: 0, Skipped: 0

[WARNING] No tests found.
[INFO] 
[INFO] --- jacoco-maven-plugin:0.8.2:report (default-report) @ org.eclipse.papyrus.cdo.tests ---
[INFO] Loading execution data file /jobs/genie.papyrus/Papyrus-CDO/workspace/source/cdo/tests/org.eclipse.papyrus.cdo.tests/target/jacoco.exec
[INFO] Analyzed bundle 'org.eclipse.papyrus.cdo.tests' with 0 classes
[INFO] 
[INFO] -----< org.eclipse.papyrus.cdo:org.eclipse.papyrus.uml.cdo-tests >------
[INFO] Building org.eclipse.papyrus.uml.cdo-tests 1.2.0-SNAPSHOT        [34/34]
[INFO] --------------------------------[ pom ]---------------------------------
[INFO] 
[INFO] --- maven-clean-plugin:3.0.0:clean (default-clean) @ org.eclipse.papyrus.uml.cdo-tests ---
[INFO] 
[INFO] --- jacoco-maven-plugin:0.8.2:prepare-agent (default-prepare-agent) @ org.eclipse.papyrus.uml.cdo-tests ---
[INFO] argLine set to -javaagent:/home/hudson/genie.papyrus/.jenkins/jobs/Papyrus-CDO/workspace/.repository/org/jacoco/org.jacoco.agent/0.8.2/org.jacoco.agent-0.8.2-runtime.jar=destfile=/jobs/genie.papyrus/Papyrus-CDO/workspace/source/cdo/tests/uml/target/jacoco.exec,includes=org.eclipse.papyrus.*,excludes=org.eclipse.uml2
[INFO] 
[INFO] --- tycho-source-plugin:1.3.0:plugin-source (plugin-source) @ org.eclipse.papyrus.uml.cdo-tests ---
[INFO] 
[INFO] --- tycho-source-feature-plugin:1.3.0:source-feature (source-feature) @ org.eclipse.papyrus.uml.cdo-tests ---
[INFO] 
[INFO] --- tycho-p2-plugin:1.3.0:p2-metadata (attach-p2-metadata) @ org.eclipse.papyrus.uml.cdo-tests ---
[INFO] 
[INFO] --- jacoco-maven-plugin:0.8.2:report (default-report) @ org.eclipse.papyrus.uml.cdo-tests ---
[INFO] Skipping JaCoCo execution due to missing execution data file.
[INFO] ------------------------------------------------------------------------
[INFO] Reactor Summary:
[INFO] 
[INFO] Collaborative Modeling - CDO 1.2.0-SNAPSHOT ........ SUCCESS [01:00 min]
[INFO] org.eclipse.papyrus.cdo-benchmarks 1.2.0-SNAPSHOT .. SUCCESS [  0.009 s]
[INFO] org.eclipse.papyrus.cdo-bundles 1.2.0-SNAPSHOT ..... SUCCESS [  0.007 s]
[INFO] org.eclipse.papyrus.cdo.core 2.0.1-SNAPSHOT ........ SUCCESS [ 21.892 s]
[INFO] org.eclipse.papyrus.cdo-tests 1.2.0-SNAPSHOT ....... SUCCESS [  0.006 s]
[INFO] org.eclipse.papyrus.cdo.core.tests 1.2.0-SNAPSHOT .. SUCCESS [01:27 min]
[INFO] org.eclipse.papyrus.cdo.benchmarks 1.0.0-SNAPSHOT .. SUCCESS [  0.658 s]
[INFO] org.eclipse.papyrus.cdo.security 1.0.0-SNAPSHOT .... SUCCESS [  0.313 s]
[INFO] org.eclipse.papyrus.cdo.security.properties 1.0.0-SNAPSHOT SUCCESS [  0.240 s]
[INFO] org.eclipse.papyrus.cdo.validation.problems 1.2.0-SNAPSHOT SUCCESS [  0.213 s]
[INFO] org.eclipse.papyrus.cdo.validation.problems.edit 1.2.0-SNAPSHOT SUCCESS [  0.139 s]
[INFO] org.eclipse.papyrus.cdo.ui 1.2.0-SNAPSHOT .......... SUCCESS [  0.924 s]
[INFO] org.eclipse.papyrus.cdo.ui.customization.properties 1.2.0-SNAPSHOT SUCCESS [  0.626 s]
[INFO] org.eclipse.papyrus.cdo.ui.hyperlink 1.2.0-SNAPSHOT  SUCCESS [  0.628 s]
[INFO] org.eclipse.papyrus.cdo.uml.diagram.ui 1.2.0-SNAPSHOT SUCCESS [  0.573 s]
[INFO] org.eclipse.papyrus.cdo.uml.search.ui 1.2.0-SNAPSHOT SUCCESS [  0.668 s]
[INFO] org.eclipse.papyrus.cdo.uml.ui 1.2.0-SNAPSHOT ...... SUCCESS [  0.525 s]
[INFO] org.eclipse.papyrus.infra.gmfdiag.css.cdo 2.2.100-SNAPSHOT SUCCESS [  0.708 s]
[INFO] org.eclipse.papyrus.infra.gmfdiag.style.cdo 2.0.0-SNAPSHOT SUCCESS [  0.439 s]
[INFO] uml 1.2.0-SNAPSHOT ................................. SUCCESS [  0.006 s]
[INFO] org.eclipse.uml2.uml.cdo 5.4.0-SNAPSHOT ............ SUCCESS [  2.136 s]
[INFO] org.eclipse.papyrus.cdo-features 1.2.0-SNAPSHOT .... SUCCESS [  0.004 s]
[INFO] org.eclipse.papyrus.cdo.feature 1.2.0-SNAPSHOT ..... SUCCESS [  0.565 s]
[INFO] org.eclipse.papyrus.cdo.models.feature 1.0.0-SNAPSHOT SUCCESS [  0.466 s]
[INFO] org.eclipse.papyrus.cdo-releng 1.2.0-SNAPSHOT ...... SUCCESS [  0.007 s]
[INFO] org.eclipse.papyrus.cdo.p2 1.2.0-SNAPSHOT .......... SUCCESS [  8.616 s]
[INFO] org.eclipse.papyrus.cdo-targetplatforms 1.2.0-SNAPSHOT SUCCESS [  0.006 s]
[INFO] org.eclipse.papyrus.cdo.targetplatform 1.2.0-SNAPSHOT SUCCESS [  0.006 s]
[INFO] org.eclipse.papyrus.cdo.ui.tests 1.2.0-SNAPSHOT .... SUCCESS [03:50 min]
[INFO] org.eclipse.papyrus.cdo.validation.problems.tests 1.2.0-SNAPSHOT SUCCESS [ 16.852 s]
[INFO] org.eclipse.papyrus.cdo.uml.ui.tests 1.2.0-SNAPSHOT  SUCCESS [01:15 min]
[INFO] org.eclipse.papyrus.cdo.uml.search.ui.tests 1.2.0-SNAPSHOT SUCCESS [ 20.272 s]
[INFO] org.eclipse.papyrus.cdo.tests 1.2.0-SNAPSHOT ....... SUCCESS [ 17.102 s]
[INFO] org.eclipse.papyrus.uml.cdo-tests 1.2.0-SNAPSHOT ... SUCCESS [  0.007 s]
[INFO] ------------------------------------------------------------------------
[INFO] BUILD SUCCESS
[INFO] ------------------------------------------------------------------------
[INFO] Total time:  19:27 min
[INFO] Finished at: 2019-10-15T21:46:51-04:00
[INFO] ------------------------------------------------------------------------
[workspace] $ /bin/sh -xe /tmp/genie.papyrus/jenkins6199602796358140959.sh
+ . source/cdo/releng/toolkit/server/build-after.sh
++ p2UpdateSiteDir=/home/hudson/genie.papyrus/.jenkins/jobs/Papyrus-CDO/workspace/source/cdo/releng/org.eclipse.papyrus.cdo.p2/target/repository/
++ updateSite=/home/hudson/genie.papyrus/.jenkins/jobs/Papyrus-CDO/workspace/repository
++ '[' -n '' ']'
++ buildType=N
++ COMPACT_BUILD_ID=201910152127
++ FULL_BUILD_ID=N201910152127
++ '[' -n '' ']'
++ updateZipName=Papyrus-CDO-N201910152127.zip
++ zipName=Papyrus-CDO.zip
++ rm -rf tmp
++ mkdir -p tmp/N201910152127
++ rm -rf /home/hudson/genie.papyrus/.jenkins/jobs/Papyrus-CDO/workspace/repository
++ mv /home/hudson/genie.papyrus/.jenkins/jobs/Papyrus-CDO/workspace/source/cdo/releng/org.eclipse.papyrus.cdo.p2/target/repository/ /home/hudson/genie.papyrus/.jenkins/jobs/Papyrus-CDO/workspace/repository
++ cd /home/hudson/genie.papyrus/.jenkins/jobs/Papyrus-CDO/workspace/repository
++ zip -r Papyrus-CDO-N201910152127.zip artifacts.jar artifacts.xml.xz content.jar content.xml.xz features p2.index plugins
  adding: artifacts.jar (stored 0%)
  adding: artifacts.xml.xz (stored 0%)
  adding: content.jar (deflated 7%)
  adding: content.xml.xz (stored 0%)
  adding: features/ (stored 0%)
  adding: features/org.eclipse.papyrus.cdo.feature.source_1.2.0.201910160127.jar (deflated 7%)
  adding: features/org.eclipse.papyrus.cdo.models.feature.source_1.0.0.201910160127.jar (deflated 7%)
  adding: features/org.eclipse.papyrus.cdo.feature_1.2.0.201910160127.jar (deflated 2%)
  adding: features/org.eclipse.papyrus.cdo.models.feature_1.0.0.201910160127.jar (deflated 2%)
  adding: p2.index (deflated 35%)
  adding: plugins/ (stored 0%)
  adding: plugins/org.eclipse.papyrus.cdo.ui.customization.properties.source_1.2.0.201910160127.jar (deflated 21%)
  adding: plugins/org.eclipse.uml2.uml.cdo.source_5.4.0.201910160127.jar (deflated 3%)
  adding: plugins/org.eclipse.papyrus.cdo.validation.problems.edit_1.2.0.201910160127.jar (deflated 22%)
  adding: plugins/org.eclipse.papyrus.infra.gmfdiag.style.cdo.source_2.0.0.201910160127.jar (deflated 24%)
  adding: plugins/org.eclipse.papyrus.infra.gmfdiag.css.cdo_2.2.100.201910160127.jar (deflated 11%)
  adding: plugins/org.eclipse.papyrus.cdo.validation.problems.edit.source_1.2.0.201910160127.jar (deflated 18%)
  adding: plugins/org.eclipse.papyrus.cdo.security.properties_1.0.0.201910160127.jar (deflated 49%)
  adding: plugins/org.eclipse.uml2.uml.cdo_5.4.0.201910160127.jar (deflated 3%)
  adding: plugins/org.eclipse.papyrus.cdo.core.source_2.0.1.201910160127.jar (deflated 15%)
  adding: plugins/org.eclipse.papyrus.cdo.core_2.0.1.201910160127.jar (deflated 15%)
  adding: plugins/org.eclipse.papyrus.cdo.ui_1.2.0.201910160127.jar (deflated 12%)
  adding: plugins/org.eclipse.papyrus.cdo.uml.ui.source_1.2.0.201910160127.jar (deflated 27%)
  adding: plugins/org.eclipse.papyrus.cdo.ui.hyperlink.source_1.2.0.201910160127.jar (deflated 19%)
  adding: plugins/org.eclipse.papyrus.cdo.ui.hyperlink_1.2.0.201910160127.jar (deflated 18%)
  adding: plugins/org.eclipse.papyrus.cdo.uml.search.ui.source_1.2.0.201910160127.jar (deflated 18%)
  adding: plugins/org.eclipse.papyrus.cdo.uml.search.ui_1.2.0.201910160127.jar (deflated 16%)
  adding: plugins/org.eclipse.papyrus.cdo.security.source_1.0.0.201910160127.jar (deflated 22%)
  adding: plugins/org.eclipse.papyrus.cdo.validation.problems.source_1.2.0.201910160127.jar (deflated 13%)
  adding: plugins/org.eclipse.papyrus.infra.gmfdiag.css.cdo.source_2.2.100.201910160127.jar (deflated 14%)
  adding: plugins/org.eclipse.papyrus.cdo.uml.diagram.ui_1.2.0.201910160127.jar (deflated 18%)
  adding: plugins/org.eclipse.papyrus.cdo.ui.customization.properties_1.2.0.201910160127.jar (deflated 18%)
  adding: plugins/org.eclipse.papyrus.cdo.security_1.0.0.201910160127.jar (deflated 22%)
  adding: plugins/org.eclipse.papyrus.infra.gmfdiag.style.cdo_2.0.0.201910160127.jar (deflated 29%)
  adding: plugins/org.eclipse.papyrus.cdo.ui.source_1.2.0.201910160127.jar (deflated 11%)
  adding: plugins/org.eclipse.papyrus.cdo.uml.diagram.ui.source_1.2.0.201910160127.jar (deflated 21%)
  adding: plugins/org.eclipse.papyrus.cdo.security.properties.source_1.0.0.201910160127.jar (deflated 36%)
  adding: plugins/org.eclipse.papyrus.cdo.uml.ui_1.2.0.201910160127.jar (deflated 25%)
  adding: plugins/org.eclipse.papyrus.cdo.validation.problems_1.2.0.201910160127.jar (deflated 14%)
++ mv /home/hudson/genie.papyrus/.jenkins/jobs/Papyrus-CDO/workspace/repository/Papyrus-CDO-N201910152127.zip tmp/N201910152127
++ cd tmp
++ zip -r Papyrus-CDO.zip N201910152127
  adding: N201910152127/ (stored 0%)
  adding: N201910152127/Papyrus-CDO-N201910152127.zip (stored 0%)
++ mv tmp/Papyrus-CDO.zip .
Terminating xvnc.
Sending e-mails to: quentin.lemenez@cea.fr
Recording test results
Build step 'Publish JUnit test result report' changed build result to UNSTABLE
Archiving artifacts
Started calculate disk usage of build
Finished Calculation of disk usage of build in 0 seconds
Started calculate disk usage of workspace
Finished Calculation of disk usage of workspace in 0 seconds
Finished: UNSTABLE