FailedConsole Output

Started by user james.sutton@uk.ibm.com
Checkout:workspace / /home/hudson/genie.paho/.hudson/jobs/paho-javascript-master/workspace - hudson.remoting.LocalChannel@61f1b2c8
Using strategy: Default
Git Exe: git
Last Built Revision: Revision 4d2530ebb6d274ab1a54ba2622d1f9eb6e68ef83 (origin/master)
Checkout:workspace / /home/hudson/genie.paho/.hudson/jobs/paho-javascript-master/workspace - hudson.remoting.LocalChannel@61f1b2c8
Fetching changes from the remote Git repository
Fetching upstream changes from https://github.com/eclipse/paho.mqtt.javascript.git
Commencing build of Revision 1fa2333485c3f928cbb6f9c6ea41a102c1990501 (origin/master)
Checking out Revision 1fa2333485c3f928cbb6f9c6ea41a102c1990501 (origin/master)
[workspace] $ /bin/sh -xe /tmp/hudson1598597927558425821.sh
+ npm config set proxy http://proxy.eclipse.org:9898
+ npm config set https-proxy http://proxy.eclipse.org:9898
[INFO] Using bundled Maven 3 installation
[INFO] Checking Maven 3 installation environment
[workspace] $ /home/hudson/genie.paho/.hudson/maven/slavebundle/bundled-maven/bin/mvn --help
[INFO] Checking Maven 3 installation version
[INFO] Detected Maven 3 installation version: 3.1.1
[workspace] $ /home/hudson/genie.paho/.hudson/maven/slavebundle/bundled-maven/bin/mvn clean deploy -V -B -DPATH=$PATH:/shared/common/node-latest/bin/ -Dtest.server=iot.eclipse.org -Dtest.interopPort=80 -Dtest.server.path=/ws -Dtest.interopServer=iot.eclipse.org -Dtest.server.port=80 -Dtest.interopPath=/ws -Dmaven.ext.class.path=/home/hudson/genie.paho/.hudson/maven/slavebundle/resources:/home/hudson/genie.paho/.hudson/maven/slavebundle/lib/maven3-eventspy-3.1.jar:/home/hudson/genie.paho/.hudson/war/webapp/WEB-INF/lib/hudson-remoting-3.0.3.jar -Dhudson.eventspy.port=42152 -Dmaven.repo.local=/home/hudson/genie.paho/.hudson/jobs/paho-javascript-master/workspace/.maven/repo -f pom.xml
[DEBUG] Waiting for connection on port: 42152
Apache Maven 3.1.1 (0728685237757ffbf44136acec0402957f723d9a; 2013-09-17 11:22:22-0400)
Maven home: /home/hudson/genie.paho/.hudson/maven/slavebundle/bundled-maven
Java version: 1.8.0_131, vendor: Oracle Corporation
Java home: /opt/public/common/jdk1.8.0_131.x64/jre
Default locale: en_US, platform encoding: UTF-8
OS name: "linux", version: "3.12.60-52.54-default", arch: "amd64", family: "unix"
SLF4J: Class path contains multiple SLF4J bindings.
SLF4J: Found binding in [jar:file:/home/hudson/genie.paho/.hudson/maven/slavebundle/lib/maven3-eventspy-runtime.jar!/org/slf4j/impl/StaticLoggerBinder.class]
SLF4J: Found binding in [jar:file:/home/hudson/genie.paho/.hudson/maven/slavebundle/bundled-maven/lib/slf4j-simple-1.7.5.jar!/org/slf4j/impl/StaticLoggerBinder.class]
SLF4J: See http://www.slf4j.org/codes.html#multiple_bindings for an explanation.
[DEBUG] Connected to remote
[INFO] Scanning for projects...
[WARNING] 
[WARNING] Some problems were encountered while building the effective model for org.eclipse.paho:paho.javascript:pom:1.0.3
[WARNING] 'version' contains an expression but should be a constant. @ org.eclipse.paho:paho.javascript:${paho.version}, /jobs/genie.paho/paho-javascript-master/workspace/pom.xml, line 7, column 11
[WARNING] 'build.plugins.plugin.(groupId:artifactId)' must be unique but found duplicate declaration of plugin org.codehaus.mojo:templating-maven-plugin @ org.eclipse.paho:paho.javascript:${paho.version}, /jobs/genie.paho/paho-javascript-master/workspace/pom.xml, line 114, column 12
[WARNING] 
[WARNING] It is highly recommended to fix these problems because they threaten the stability of your build.
[WARNING] 
[WARNING] For this reason, future Maven versions might no longer support building such malformed projects.
[WARNING] 
[INFO]                                                                         
[INFO] ------------------------------------------------------------------------
[INFO] Building paho.javascript 1.0.3
[INFO] ------------------------------------------------------------------------
Downloading: https://repo.eclipse.org/content/repositories/maven_central/org/codehaus/mojo/templating-maven-plugin/1.0-alpha-3/templating-maven-plugin-1.0-alpha-3.pom
Downloaded: https://repo.eclipse.org/content/repositories/maven_central/org/codehaus/mojo/templating-maven-plugin/1.0-alpha-3/templating-maven-plugin-1.0-alpha-3.pom (0 B at 0.0 KB/sec)
Downloading: https://repo.eclipse.org/content/repositories/maven_central/org/codehaus/mojo/mojo-parent/32/mojo-parent-32.pom
Downloaded: https://repo.eclipse.org/content/repositories/maven_central/org/codehaus/mojo/mojo-parent/32/mojo-parent-32.pom (0 B at 0.0 KB/sec)
Downloading: https://repo.eclipse.org/content/repositories/maven_central/org/codehaus/codehaus-parent/4/codehaus-parent-4.pom
Downloaded: https://repo.eclipse.org/content/repositories/maven_central/org/codehaus/codehaus-parent/4/codehaus-parent-4.pom (0 B at 0.0 KB/sec)
Downloading: https://repo.eclipse.org/content/repositories/maven_central/org/codehaus/mojo/templating-maven-plugin/1.0-alpha-3/templating-maven-plugin-1.0-alpha-3.jar
Downloaded: https://repo.eclipse.org/content/repositories/maven_central/org/codehaus/mojo/templating-maven-plugin/1.0-alpha-3/templating-maven-plugin-1.0-alpha-3.jar (0 B at 0.0 KB/sec)
Downloading: https://repo.eclipse.org/content/repositories/maven_central/org/apache/maven/plugins/maven-clean-plugin/2.5/maven-clean-plugin-2.5.pom
Downloaded: https://repo.eclipse.org/content/repositories/maven_central/org/apache/maven/plugins/maven-clean-plugin/2.5/maven-clean-plugin-2.5.pom (0 B at 0.0 KB/sec)
Downloading: https://repo.eclipse.org/content/repositories/maven_central/org/apache/maven/plugins/maven-plugins/22/maven-plugins-22.pom
Downloaded: https://repo.eclipse.org/content/repositories/maven_central/org/apache/maven/plugins/maven-plugins/22/maven-plugins-22.pom (0 B at 0.0 KB/sec)
Downloading: https://repo.eclipse.org/content/repositories/maven_central/org/apache/maven/maven-parent/21/maven-parent-21.pom
Downloaded: https://repo.eclipse.org/content/repositories/maven_central/org/apache/maven/maven-parent/21/maven-parent-21.pom (0 B at 0.0 KB/sec)
Downloading: https://repo.eclipse.org/content/repositories/maven_central/org/apache/apache/10/apache-10.pom
Downloaded: https://repo.eclipse.org/content/repositories/maven_central/org/apache/apache/10/apache-10.pom (0 B at 0.0 KB/sec)
Downloading: https://repo.eclipse.org/content/repositories/maven_central/org/apache/maven/plugins/maven-clean-plugin/2.5/maven-clean-plugin-2.5.jar
Downloaded: https://repo.eclipse.org/content/repositories/maven_central/org/apache/maven/plugins/maven-clean-plugin/2.5/maven-clean-plugin-2.5.jar (0 B at 0.0 KB/sec)
Downloading: https://repo.eclipse.org/content/repositories/maven_central/com/samaxes/maven/minify-maven-plugin/1.7.4/minify-maven-plugin-1.7.4.pom
Downloaded: https://repo.eclipse.org/content/repositories/maven_central/com/samaxes/maven/minify-maven-plugin/1.7.4/minify-maven-plugin-1.7.4.pom (0 B at 0.0 KB/sec)
Downloading: https://repo.eclipse.org/content/repositories/maven_central/org/sonatype/oss/oss-parent/9/oss-parent-9.pom
Downloaded: https://repo.eclipse.org/content/repositories/maven_central/org/sonatype/oss/oss-parent/9/oss-parent-9.pom (0 B at 0.0 KB/sec)
Downloading: https://repo.eclipse.org/content/repositories/maven_central/com/samaxes/maven/minify-maven-plugin/1.7.4/minify-maven-plugin-1.7.4.jar
Downloaded: https://repo.eclipse.org/content/repositories/maven_central/com/samaxes/maven/minify-maven-plugin/1.7.4/minify-maven-plugin-1.7.4.jar (0 B at 0.0 KB/sec)
Downloading: https://repo.eclipse.org/content/repositories/maven_central/org/apache/maven/plugins/maven-antrun-plugin/1.3/maven-antrun-plugin-1.3.pom
Downloaded: https://repo.eclipse.org/content/repositories/maven_central/org/apache/maven/plugins/maven-antrun-plugin/1.3/maven-antrun-plugin-1.3.pom (0 B at 0.0 KB/sec)
Downloading: https://repo.eclipse.org/content/repositories/maven_central/org/apache/maven/plugins/maven-plugins/12/maven-plugins-12.pom
Downloaded: https://repo.eclipse.org/content/repositories/maven_central/org/apache/maven/plugins/maven-plugins/12/maven-plugins-12.pom (0 B at 0.0 KB/sec)
Downloading: https://repo.eclipse.org/content/repositories/maven_central/org/apache/maven/maven-parent/9/maven-parent-9.pom
Downloaded: https://repo.eclipse.org/content/repositories/maven_central/org/apache/maven/maven-parent/9/maven-parent-9.pom (0 B at 0.0 KB/sec)
Downloading: https://repo.eclipse.org/content/repositories/maven_central/org/apache/apache/4/apache-4.pom
Downloaded: https://repo.eclipse.org/content/repositories/maven_central/org/apache/apache/4/apache-4.pom (0 B at 0.0 KB/sec)
Downloading: https://repo.eclipse.org/content/repositories/maven_central/org/apache/maven/plugins/maven-antrun-plugin/1.3/maven-antrun-plugin-1.3.jar
Downloaded: https://repo.eclipse.org/content/repositories/maven_central/org/apache/maven/plugins/maven-antrun-plugin/1.3/maven-antrun-plugin-1.3.jar (0 B at 0.0 KB/sec)
Downloading: https://repo.eclipse.org/content/repositories/maven_central/org/codehaus/mojo/exec-maven-plugin/1.2.1/exec-maven-plugin-1.2.1.pom
Downloaded: https://repo.eclipse.org/content/repositories/maven_central/org/codehaus/mojo/exec-maven-plugin/1.2.1/exec-maven-plugin-1.2.1.pom (0 B at 0.0 KB/sec)
Downloading: https://repo.eclipse.org/content/repositories/maven_central/org/codehaus/mojo/mojo-parent/28/mojo-parent-28.pom
Downloaded: https://repo.eclipse.org/content/repositories/maven_central/org/codehaus/mojo/mojo-parent/28/mojo-parent-28.pom (0 B at 0.0 KB/sec)
Downloading: https://repo.eclipse.org/content/repositories/maven_central/org/codehaus/codehaus-parent/3/codehaus-parent-3.pom
Downloaded: https://repo.eclipse.org/content/repositories/maven_central/org/codehaus/codehaus-parent/3/codehaus-parent-3.pom (0 B at 0.0 KB/sec)
Downloading: https://repo.eclipse.org/content/repositories/maven_central/org/codehaus/mojo/exec-maven-plugin/1.2.1/exec-maven-plugin-1.2.1.jar
Downloaded: https://repo.eclipse.org/content/repositories/maven_central/org/codehaus/mojo/exec-maven-plugin/1.2.1/exec-maven-plugin-1.2.1.jar (0 B at 0.0 KB/sec)
Downloading: https://repo.eclipse.org/content/repositories/maven_central/org/apache/maven/plugins/maven-assembly-plugin/2.4/maven-assembly-plugin-2.4.pom
Downloaded: https://repo.eclipse.org/content/repositories/maven_central/org/apache/maven/plugins/maven-assembly-plugin/2.4/maven-assembly-plugin-2.4.pom (0 B at 0.0 KB/sec)
Downloading: https://repo.eclipse.org/content/repositories/maven_central/org/apache/maven/plugins/maven-plugins/23/maven-plugins-23.pom
Downloaded: https://repo.eclipse.org/content/repositories/maven_central/org/apache/maven/plugins/maven-plugins/23/maven-plugins-23.pom (0 B at 0.0 KB/sec)
Downloading: https://repo.eclipse.org/content/repositories/maven_central/org/apache/maven/maven-parent/22/maven-parent-22.pom
Downloaded: https://repo.eclipse.org/content/repositories/maven_central/org/apache/maven/maven-parent/22/maven-parent-22.pom (0 B at 0.0 KB/sec)
Downloading: https://repo.eclipse.org/content/repositories/maven_central/org/apache/apache/11/apache-11.pom
Downloaded: https://repo.eclipse.org/content/repositories/maven_central/org/apache/apache/11/apache-11.pom (0 B at 0.0 KB/sec)
Downloading: https://repo.eclipse.org/content/repositories/maven_central/org/apache/maven/plugins/maven-assembly-plugin/2.4/maven-assembly-plugin-2.4.jar
Downloaded: https://repo.eclipse.org/content/repositories/maven_central/org/apache/maven/plugins/maven-assembly-plugin/2.4/maven-assembly-plugin-2.4.jar (0 B at 0.0 KB/sec)
Downloading: https://repo.eclipse.org/content/repositories/maven_central/org/apache/maven/plugins/maven-resources-plugin/2.6/maven-resources-plugin-2.6.pom
Downloaded: https://repo.eclipse.org/content/repositories/maven_central/org/apache/maven/plugins/maven-resources-plugin/2.6/maven-resources-plugin-2.6.pom (0 B at 0.0 KB/sec)
Downloading: https://repo.eclipse.org/content/repositories/maven_central/org/apache/maven/plugins/maven-resources-plugin/2.6/maven-resources-plugin-2.6.jar
Downloaded: https://repo.eclipse.org/content/repositories/maven_central/org/apache/maven/plugins/maven-resources-plugin/2.6/maven-resources-plugin-2.6.jar (0 B at 0.0 KB/sec)
[INFO] 
[INFO] --- maven-clean-plugin:2.5:clean (default-clean) @ paho.javascript ---
Downloading: https://repo.eclipse.org/content/repositories/maven_central/org/apache/maven/maven-plugin-api/2.0.6/maven-plugin-api-2.0.6.pom
Downloaded: https://repo.eclipse.org/content/repositories/maven_central/org/apache/maven/maven-plugin-api/2.0.6/maven-plugin-api-2.0.6.pom (0 B at 0.0 KB/sec)
Downloading: https://repo.eclipse.org/content/repositories/maven_central/org/apache/maven/maven/2.0.6/maven-2.0.6.pom
Downloaded: https://repo.eclipse.org/content/repositories/maven_central/org/apache/maven/maven/2.0.6/maven-2.0.6.pom (0 B at 0.0 KB/sec)
Downloading: https://repo.eclipse.org/content/repositories/maven_central/org/apache/maven/maven-parent/5/maven-parent-5.pom
Downloaded: https://repo.eclipse.org/content/repositories/maven_central/org/apache/maven/maven-parent/5/maven-parent-5.pom (0 B at 0.0 KB/sec)
Downloading: https://repo.eclipse.org/content/repositories/maven_central/org/apache/apache/3/apache-3.pom
Downloaded: https://repo.eclipse.org/content/repositories/maven_central/org/apache/apache/3/apache-3.pom (0 B at 0.0 KB/sec)
Downloading: https://repo.eclipse.org/content/repositories/maven_central/org/codehaus/plexus/plexus-utils/3.0/plexus-utils-3.0.pom
Downloaded: https://repo.eclipse.org/content/repositories/maven_central/org/codehaus/plexus/plexus-utils/3.0/plexus-utils-3.0.pom (0 B at 0.0 KB/sec)
Downloading: https://repo.eclipse.org/content/repositories/maven_central/org/sonatype/spice/spice-parent/16/spice-parent-16.pom
Downloaded: https://repo.eclipse.org/content/repositories/maven_central/org/sonatype/spice/spice-parent/16/spice-parent-16.pom (0 B at 0.0 KB/sec)
Downloading: https://repo.eclipse.org/content/repositories/maven_central/org/sonatype/forge/forge-parent/5/forge-parent-5.pom
Downloaded: https://repo.eclipse.org/content/repositories/maven_central/org/sonatype/forge/forge-parent/5/forge-parent-5.pom (0 B at 0.0 KB/sec)
Downloading: https://repo.eclipse.org/content/repositories/maven_central/org/codehaus/plexus/plexus-utils/3.0/plexus-utils-3.0.jar
Downloaded: https://repo.eclipse.org/content/repositories/maven_central/org/codehaus/plexus/plexus-utils/3.0/plexus-utils-3.0.jar (0 B at 0.0 KB/sec)
[INFO] Deleting /jobs/genie.paho/paho-javascript-master/workspace/target
[INFO] 
[INFO] --- minify-maven-plugin:1.7.4:minify (default-minify) @ paho.javascript ---
Downloading: https://repo.eclipse.org/content/repositories/maven_central/com/yahoo/platform/yui/yuicompressor/2.4.7/yuicompressor-2.4.7.pom
Downloaded: https://repo.eclipse.org/content/repositories/maven_central/com/yahoo/platform/yui/yuicompressor/2.4.7/yuicompressor-2.4.7.pom (0 B at 0.0 KB/sec)
Downloading: https://repo.eclipse.org/content/repositories/maven_central/rhino/js/1.6R7/js-1.6R7.pom
Downloaded: https://repo.eclipse.org/content/repositories/maven_central/rhino/js/1.6R7/js-1.6R7.pom (0 B at 0.0 KB/sec)
Downloading: https://repo.eclipse.org/content/repositories/maven_central/com/google/javascript/closure-compiler/v20140814/closure-compiler-v20140814.pom
Downloaded: https://repo.eclipse.org/content/repositories/maven_central/com/google/javascript/closure-compiler/v20140814/closure-compiler-v20140814.pom (0 B at 0.0 KB/sec)
Downloading: https://repo.eclipse.org/content/repositories/maven_central/com/google/javascript/closure-compiler-parent/v20140814/closure-compiler-parent-v20140814.pom
Downloaded: https://repo.eclipse.org/content/repositories/maven_central/com/google/javascript/closure-compiler-parent/v20140814/closure-compiler-parent-v20140814.pom (0 B at 0.0 KB/sec)
Downloading: https://repo.eclipse.org/content/repositories/maven_central/com/google/javascript/closure-compiler-externs/v20140814/closure-compiler-externs-v20140814.pom
Downloaded: https://repo.eclipse.org/content/repositories/maven_central/com/google/javascript/closure-compiler-externs/v20140814/closure-compiler-externs-v20140814.pom (0 B at 0.0 KB/sec)
Downloading: https://repo.eclipse.org/content/repositories/maven_central/args4j/args4j/2.0.26/args4j-2.0.26.pom
Downloaded: https://repo.eclipse.org/content/repositories/maven_central/args4j/args4j/2.0.26/args4j-2.0.26.pom (0 B at 0.0 KB/sec)
Downloading: https://repo.eclipse.org/content/repositories/maven_central/args4j/args4j-site/2.0.26/args4j-site-2.0.26.pom
Downloaded: https://repo.eclipse.org/content/repositories/maven_central/args4j/args4j-site/2.0.26/args4j-site-2.0.26.pom (0 B at 0.0 KB/sec)
Downloading: https://repo.eclipse.org/content/repositories/maven_central/org/kohsuke/pom/6/pom-6.pom
Downloaded: https://repo.eclipse.org/content/repositories/maven_central/org/kohsuke/pom/6/pom-6.pom (0 B at 0.0 KB/sec)
Downloading: https://repo.eclipse.org/content/repositories/maven_central/com/google/guava/guava/17.0/guava-17.0.pom
Downloaded: https://repo.eclipse.org/content/repositories/maven_central/com/google/guava/guava/17.0/guava-17.0.pom (0 B at 0.0 KB/sec)
Downloading: https://repo.eclipse.org/content/repositories/maven_central/com/google/guava/guava-parent/17.0/guava-parent-17.0.pom
Downloaded: https://repo.eclipse.org/content/repositories/maven_central/com/google/guava/guava-parent/17.0/guava-parent-17.0.pom (0 B at 0.0 KB/sec)
Downloading: https://repo.eclipse.org/content/repositories/maven_central/org/sonatype/oss/oss-parent/7/oss-parent-7.pom
Downloaded: https://repo.eclipse.org/content/repositories/maven_central/org/sonatype/oss/oss-parent/7/oss-parent-7.pom (0 B at 0.0 KB/sec)
Downloading: https://repo.eclipse.org/content/repositories/maven_central/com/google/protobuf/protobuf-java/2.5.0/protobuf-java-2.5.0.pom
Downloaded: https://repo.eclipse.org/content/repositories/maven_central/com/google/protobuf/protobuf-java/2.5.0/protobuf-java-2.5.0.pom (0 B at 0.0 KB/sec)
Downloading: https://repo.eclipse.org/content/repositories/maven_central/com/google/google/1/google-1.pom
Downloaded: https://repo.eclipse.org/content/repositories/maven_central/com/google/google/1/google-1.pom (0 B at 0.0 KB/sec)
Downloading: https://repo.eclipse.org/content/repositories/maven_central/org/json/json/20090211/json-20090211.pom
Downloaded: https://repo.eclipse.org/content/repositories/maven_central/org/json/json/20090211/json-20090211.pom (0 B at 0.0 KB/sec)
Downloading: https://repo.eclipse.org/content/repositories/maven_central/com/google/code/findbugs/jsr305/1.3.9/jsr305-1.3.9.pom
Downloaded: https://repo.eclipse.org/content/repositories/maven_central/com/google/code/findbugs/jsr305/1.3.9/jsr305-1.3.9.pom (0 B at 0.0 KB/sec)
Downloading: https://repo.eclipse.org/content/repositories/maven_central/com/yahoo/platform/yui/yuicompressor/2.4.7/yuicompressor-2.4.7.jar
Downloading: https://repo.eclipse.org/content/repositories/maven_central/rhino/js/1.6R7/js-1.6R7.jar
Downloading: https://repo.eclipse.org/content/repositories/maven_central/com/google/javascript/closure-compiler-externs/v20140814/closure-compiler-externs-v20140814.jar
Downloading: https://repo.eclipse.org/content/repositories/maven_central/args4j/args4j/2.0.26/args4j-2.0.26.jar
Downloading: https://repo.eclipse.org/content/repositories/maven_central/com/google/javascript/closure-compiler/v20140814/closure-compiler-v20140814.jar
Downloaded: https://repo.eclipse.org/content/repositories/maven_central/com/yahoo/platform/yui/yuicompressor/2.4.7/yuicompressor-2.4.7.jar (0 B at 0.0 KB/sec)
Downloading: https://repo.eclipse.org/content/repositories/maven_central/com/google/guava/guava/17.0/guava-17.0.jar
Downloaded: https://repo.eclipse.org/content/repositories/maven_central/rhino/js/1.6R7/js-1.6R7.jar (0 B at 0.0 KB/sec)
Downloading: https://repo.eclipse.org/content/repositories/maven_central/com/google/protobuf/protobuf-java/2.5.0/protobuf-java-2.5.0.jar
Downloaded: https://repo.eclipse.org/content/repositories/maven_central/com/google/guava/guava/17.0/guava-17.0.jar (0 B at 0.0 KB/sec)
Downloading: https://repo.eclipse.org/content/repositories/maven_central/org/json/json/20090211/json-20090211.jar
Downloaded: https://repo.eclipse.org/content/repositories/maven_central/args4j/args4j/2.0.26/args4j-2.0.26.jar (0 B at 0.0 KB/sec)
Downloading: https://repo.eclipse.org/content/repositories/maven_central/com/google/code/findbugs/jsr305/1.3.9/jsr305-1.3.9.jar
Downloaded: https://repo.eclipse.org/content/repositories/maven_central/com/google/javascript/closure-compiler-externs/v20140814/closure-compiler-externs-v20140814.jar (0 B at 0.0 KB/sec)
Downloading: https://repo.eclipse.org/content/repositories/maven_central/org/codehaus/plexus/plexus-utils/1.1/plexus-utils-1.1.jar
Downloaded: https://repo.eclipse.org/content/repositories/maven_central/com/google/protobuf/protobuf-java/2.5.0/protobuf-java-2.5.0.jar (0 B at 0.0 KB/sec)
Downloaded: https://repo.eclipse.org/content/repositories/maven_central/com/google/code/findbugs/jsr305/1.3.9/jsr305-1.3.9.jar (0 B at 0.0 KB/sec)
Downloaded: https://repo.eclipse.org/content/repositories/maven_central/org/codehaus/plexus/plexus-utils/1.1/plexus-utils-1.1.jar (0 B at 0.0 KB/sec)
Downloaded: https://repo.eclipse.org/content/repositories/maven_central/org/json/json/20090211/json-20090211.jar (0 B at 0.0 KB/sec)
Downloaded: https://repo.eclipse.org/content/repositories/maven_central/com/google/javascript/closure-compiler/v20140814/closure-compiler-v20140814.jar (0 B at 0.0 KB/sec)
[WARNING] The source file [paho-mqtt.js] has the same name as the final file.
[INFO] Starting CSS task:
[INFO] Starting JavaScript task:
[INFO] Processing source file [paho-mqtt.js].
[INFO] Creating the merged file [paho-mqtt.js].
[INFO] Creating the minified file [paho-mqtt.min.js].
Jul 25, 2017 10:00:51 AM com.google.javascript.jscomp.LoggerErrorManager println
WARNING: paho-mqtt.js:214: WARNING - Parse error. invalid param name "ERROR.KEY"
	 * @param {error} ERROR.KEY value above.
	                  ^

Jul 25, 2017 10:00:51 AM com.google.javascript.jscomp.LoggerErrorManager println
WARNING: paho-mqtt.js:752: WARNING - Parse error. Non-JSDoc comment has annotations. Did you mean to start it with '/**'?
	/*
	^

Jul 25, 2017 10:00:51 AM com.google.javascript.jscomp.LoggerErrorManager println
WARNING: paho-mqtt.js:1851: WARNING - Parse error. invalid param name "connectOptions.timeout"
		 * @param {number} connectOptions.timeout - If the connect has not succeeded within this
		                   ^

Jul 25, 2017 10:00:51 AM com.google.javascript.jscomp.LoggerErrorManager println
WARNING: paho-mqtt.js:1854: WARNING - Parse error. invalid param name "connectOptions.userName"
		 * @param {string} connectOptions.userName - Authentication username for this connection.
		                   ^

Jul 25, 2017 10:00:51 AM com.google.javascript.jscomp.LoggerErrorManager println
WARNING: paho-mqtt.js:1855: WARNING - Parse error. invalid param name "connectOptions.password"
		 * @param {string} connectOptions.password - Authentication password for this connection.
		                   ^

Jul 25, 2017 10:00:51 AM com.google.javascript.jscomp.LoggerErrorManager println
WARNING: paho-mqtt.js:1856: WARNING - Parse error. invalid param name "connectOptions.willMessage"
		 * @param {Paho.MQTT.Message} connectOptions.willMessage - sent by the server when the client
		                              ^

Jul 25, 2017 10:00:51 AM com.google.javascript.jscomp.LoggerErrorManager println
WARNING: paho-mqtt.js:1858: WARNING - Parse error. invalid param name "connectOptions.keepAliveInterval"
		 * @param {number} connectOptions.keepAliveInterval - the server disconnects this client if
		                   ^

Jul 25, 2017 10:00:51 AM com.google.javascript.jscomp.LoggerErrorManager println
WARNING: paho-mqtt.js:1861: WARNING - Parse error. invalid param name "connectOptions.cleanSession"
		 * @param {boolean} connectOptions.cleanSession - if true(default) the client and server
		                    ^

Jul 25, 2017 10:00:51 AM com.google.javascript.jscomp.LoggerErrorManager println
WARNING: paho-mqtt.js:1863: WARNING - Parse error. invalid param name "connectOptions.useSSL"
		 * @param {boolean} connectOptions.useSSL - if present and true, use an SSL Websocket connection.
		                    ^

Jul 25, 2017 10:00:51 AM com.google.javascript.jscomp.LoggerErrorManager println
WARNING: paho-mqtt.js:1864: WARNING - Parse error. invalid param name "connectOptions.invocationContext"
		 * @param {object} connectOptions.invocationContext - passed to the onSuccess callback or onFailure callback.
		                   ^

Jul 25, 2017 10:00:51 AM com.google.javascript.jscomp.LoggerErrorManager println
WARNING: paho-mqtt.js:1878: WARNING - Parse error. invalid param name "connectOptions.hosts"
     * @param {array} connectOptions.hosts - If present this contains either a set of hostnames or fully qualified
                      ^

Jul 25, 2017 10:00:51 AM com.google.javascript.jscomp.LoggerErrorManager println
WARNING: paho-mqtt.js:1882: WARNING - Parse error. invalid param name "connectOptions.ports"
     * @param {array} connectOptions.ports - If present the set of ports matching the hosts. If hosts contains URIs, this property
                      ^

Jul 25, 2017 10:00:51 AM com.google.javascript.jscomp.LoggerErrorManager println
WARNING: paho-mqtt.js:1884: WARNING - Parse error. invalid param name "connectOptions.reconnect"
     * @param {boolean} connectOptions.reconnect - Sets whether the client will automatically attempt to reconnect
                        ^

Jul 25, 2017 10:00:51 AM com.google.javascript.jscomp.LoggerErrorManager println
WARNING: paho-mqtt.js:1893: WARNING - Parse error. invalid param name "connectOptions.mqttVersion"
     * @param {number} connectOptions.mqttVersion - The version of MQTT to use to connect to the MQTT Broker.
                       ^

Jul 25, 2017 10:00:51 AM com.google.javascript.jscomp.LoggerErrorManager println
WARNING: paho-mqtt.js:1898: WARNING - Parse error. invalid param name "connectOptions.mqttVersionExplicit"
     * @param {boolean} connectOptions.mqttVersionExplicit - If set to true, will force the connection to use the
                        ^

Jul 25, 2017 10:00:51 AM com.google.javascript.jscomp.LoggerErrorManager println
WARNING: paho-mqtt.js:1900: WARNING - Parse error. invalid param name "connectOptions.uris"
     * @param {array} connectOptions.uris - If present, should contain a list of fully qualified WebSocket uris
                      ^

Jul 25, 2017 10:00:51 AM com.google.javascript.jscomp.LoggerErrorManager println
WARNING: paho-mqtt.js:2016: WARNING - Parse error. invalid param name "subscribeOptions.qos"
		 * @param {number} subscribeOptions.qos - the maiximum qos of any publications sent
		                   ^

Jul 25, 2017 10:00:51 AM com.google.javascript.jscomp.LoggerErrorManager println
WARNING: paho-mqtt.js:2018: WARNING - Parse error. invalid param name "subscribeOptions.invocationContext"
		 * @param {object} subscribeOptions.invocationContext - passed to the onSuccess callback
		                   ^

Jul 25, 2017 10:00:51 AM com.google.javascript.jscomp.LoggerErrorManager println
WARNING: paho-mqtt.js:2033: WARNING - Parse error. invalid param name "subscribeOptions.timeout"
		 * @param {number} subscribeOptions.timeout - which, if present, determines the number of
		                   ^

Jul 25, 2017 10:00:51 AM com.google.javascript.jscomp.LoggerErrorManager println
WARNING: paho-mqtt.js:2063: WARNING - Parse error. invalid param name "unsubscribeOptions.invocationContext"
		 * @param {object} unsubscribeOptions.invocationContext - passed to the onSuccess callback
		                   ^

Jul 25, 2017 10:00:51 AM com.google.javascript.jscomp.LoggerErrorManager println
WARNING: paho-mqtt.js:2078: WARNING - Parse error. invalid param name "unsubscribeOptions.timeout"
		 * @param {number} unsubscribeOptions.timeout - which, if present, determines the number of seconds
		                   ^

Jul 25, 2017 10:00:51 AM com.google.javascript.jscomp.LoggerErrorManager printSummary
WARNING: 0 error(s), 21 warning(s)
[INFO] Uncompressed size: 91436 bytes.
[INFO] Compressed size: 33427 bytes minified (8427 bytes gzipped).
[INFO] 
[INFO] 
[INFO] --- maven-antrun-plugin:1.3:run (generate-js-output) @ paho.javascript ---
Downloading: https://repo.eclipse.org/content/repositories/maven_central/org/apache/maven/maven-plugin-api/2.0.4/maven-plugin-api-2.0.4.pom
Downloaded: https://repo.eclipse.org/content/repositories/maven_central/org/apache/maven/maven-plugin-api/2.0.4/maven-plugin-api-2.0.4.pom (0 B at 0.0 KB/sec)
Downloading: https://repo.eclipse.org/content/repositories/maven_central/org/apache/maven/maven/2.0.4/maven-2.0.4.pom
Downloaded: https://repo.eclipse.org/content/repositories/maven_central/org/apache/maven/maven/2.0.4/maven-2.0.4.pom (0 B at 0.0 KB/sec)
Downloading: https://repo.eclipse.org/content/repositories/maven_central/org/apache/maven/maven-project/2.0.4/maven-project-2.0.4.pom
Downloaded: https://repo.eclipse.org/content/repositories/maven_central/org/apache/maven/maven-project/2.0.4/maven-project-2.0.4.pom (0 B at 0.0 KB/sec)
Downloading: https://repo.eclipse.org/content/repositories/maven_central/org/apache/maven/maven-settings/2.0.4/maven-settings-2.0.4.pom
Downloaded: https://repo.eclipse.org/content/repositories/maven_central/org/apache/maven/maven-settings/2.0.4/maven-settings-2.0.4.pom (0 B at 0.0 KB/sec)
Downloading: https://repo.eclipse.org/content/repositories/maven_central/org/apache/maven/maven-model/2.0.4/maven-model-2.0.4.pom
Downloaded: https://repo.eclipse.org/content/repositories/maven_central/org/apache/maven/maven-model/2.0.4/maven-model-2.0.4.pom (0 B at 0.0 KB/sec)
Downloading: https://repo.eclipse.org/content/repositories/maven_central/org/codehaus/plexus/plexus-utils/1.1/plexus-utils-1.1.pom
Downloaded: https://repo.eclipse.org/content/repositories/maven_central/org/codehaus/plexus/plexus-utils/1.1/plexus-utils-1.1.pom (0 B at 0.0 KB/sec)
Downloading: https://repo.eclipse.org/content/repositories/maven_central/org/codehaus/plexus/plexus/1.0.4/plexus-1.0.4.pom
Downloaded: https://repo.eclipse.org/content/repositories/maven_central/org/codehaus/plexus/plexus/1.0.4/plexus-1.0.4.pom (0 B at 0.0 KB/sec)
Downloading: https://repo.eclipse.org/content/repositories/maven_central/org/codehaus/plexus/plexus-container-default/1.0-alpha-9/plexus-container-default-1.0-alpha-9.pom
Downloaded: https://repo.eclipse.org/content/repositories/maven_central/org/codehaus/plexus/plexus-container-default/1.0-alpha-9/plexus-container-default-1.0-alpha-9.pom (0 B at 0.0 KB/sec)
Downloading: https://repo.eclipse.org/content/repositories/maven_central/org/codehaus/plexus/plexus-containers/1.0.3/plexus-containers-1.0.3.pom
Downloaded: https://repo.eclipse.org/content/repositories/maven_central/org/codehaus/plexus/plexus-containers/1.0.3/plexus-containers-1.0.3.pom (0 B at 0.0 KB/sec)
Downloading: https://repo.eclipse.org/content/repositories/maven_central/junit/junit/3.8.1/junit-3.8.1.pom
Downloaded: https://repo.eclipse.org/content/repositories/maven_central/junit/junit/3.8.1/junit-3.8.1.pom (0 B at 0.0 KB/sec)
Downloading: https://repo.eclipse.org/content/repositories/maven_central/org/codehaus/plexus/plexus-utils/1.0.4/plexus-utils-1.0.4.pom
Downloaded: https://repo.eclipse.org/content/repositories/maven_central/org/codehaus/plexus/plexus-utils/1.0.4/plexus-utils-1.0.4.pom (0 B at 0.0 KB/sec)
Downloading: https://repo.eclipse.org/content/repositories/maven_central/classworlds/classworlds/1.1-alpha-2/classworlds-1.1-alpha-2.pom
Downloaded: https://repo.eclipse.org/content/repositories/maven_central/classworlds/classworlds/1.1-alpha-2/classworlds-1.1-alpha-2.pom (0 B at 0.0 KB/sec)
Downloading: https://repo.eclipse.org/content/repositories/maven_central/org/apache/maven/maven-profile/2.0.4/maven-profile-2.0.4.pom
Downloaded: https://repo.eclipse.org/content/repositories/maven_central/org/apache/maven/maven-profile/2.0.4/maven-profile-2.0.4.pom (0 B at 0.0 KB/sec)
Downloading: https://repo.eclipse.org/content/repositories/maven_central/org/apache/maven/maven-artifact-manager/2.0.4/maven-artifact-manager-2.0.4.pom
Downloaded: https://repo.eclipse.org/content/repositories/maven_central/org/apache/maven/maven-artifact-manager/2.0.4/maven-artifact-manager-2.0.4.pom (0 B at 0.0 KB/sec)
Downloading: https://repo.eclipse.org/content/repositories/maven_central/org/apache/maven/maven-repository-metadata/2.0.4/maven-repository-metadata-2.0.4.pom
Downloaded: https://repo.eclipse.org/content/repositories/maven_central/org/apache/maven/maven-repository-metadata/2.0.4/maven-repository-metadata-2.0.4.pom (0 B at 0.0 KB/sec)
Downloading: https://repo.eclipse.org/content/repositories/maven_central/org/apache/maven/maven-artifact/2.0.4/maven-artifact-2.0.4.pom
Downloaded: https://repo.eclipse.org/content/repositories/maven_central/org/apache/maven/maven-artifact/2.0.4/maven-artifact-2.0.4.pom (0 B at 0.0 KB/sec)
Downloading: https://repo.eclipse.org/content/repositories/maven_central/org/codehaus/plexus/plexus-utils/1.5.6/plexus-utils-1.5.6.pom
Downloaded: https://repo.eclipse.org/content/repositories/maven_central/org/codehaus/plexus/plexus-utils/1.5.6/plexus-utils-1.5.6.pom (0 B at 0.0 KB/sec)
Downloading: https://repo.eclipse.org/content/repositories/maven_central/org/codehaus/plexus/plexus/1.0.12/plexus-1.0.12.pom
Downloaded: https://repo.eclipse.org/content/repositories/maven_central/org/codehaus/plexus/plexus/1.0.12/plexus-1.0.12.pom (0 B at 0.0 KB/sec)
Downloading: https://repo.eclipse.org/content/repositories/maven_central/org/apache/ant/ant-launcher/1.7.1/ant-launcher-1.7.1.pom
Downloaded: https://repo.eclipse.org/content/repositories/maven_central/org/apache/ant/ant-launcher/1.7.1/ant-launcher-1.7.1.pom (0 B at 0.0 KB/sec)
Downloading: https://repo.eclipse.org/content/repositories/maven_central/org/apache/ant/ant-parent/1.7.1/ant-parent-1.7.1.pom
Downloaded: https://repo.eclipse.org/content/repositories/maven_central/org/apache/ant/ant-parent/1.7.1/ant-parent-1.7.1.pom (0 B at 0.0 KB/sec)
Downloading: https://repo.eclipse.org/content/repositories/maven_central/org/apache/ant/ant/1.7.1/ant-1.7.1.pom
Downloaded: https://repo.eclipse.org/content/repositories/maven_central/org/apache/ant/ant/1.7.1/ant-1.7.1.pom (0 B at 0.0 KB/sec)
Downloading: https://repo.eclipse.org/content/repositories/maven_central/junit/junit/3.8.1/junit-3.8.1.jar
Downloading: https://repo.eclipse.org/content/repositories/maven_central/org/codehaus/plexus/plexus-utils/1.5.6/plexus-utils-1.5.6.jar
Downloading: https://repo.eclipse.org/content/repositories/maven_central/org/apache/ant/ant-launcher/1.7.1/ant-launcher-1.7.1.jar
Downloading: https://repo.eclipse.org/content/repositories/maven_central/org/apache/ant/ant/1.7.1/ant-1.7.1.jar
Downloaded: https://repo.eclipse.org/content/repositories/maven_central/junit/junit/3.8.1/junit-3.8.1.jar (0 B at 0.0 KB/sec)
Downloaded: https://repo.eclipse.org/content/repositories/maven_central/org/apache/ant/ant/1.7.1/ant-1.7.1.jar (0 B at 0.0 KB/sec)
Downloaded: https://repo.eclipse.org/content/repositories/maven_central/org/codehaus/plexus/plexus-utils/1.5.6/plexus-utils-1.5.6.jar (0 B at 0.0 KB/sec)
Downloaded: https://repo.eclipse.org/content/repositories/maven_central/org/apache/ant/ant-launcher/1.7.1/ant-launcher-1.7.1.jar (0 B at 0.0 KB/sec)
[INFO] Executing tasks
     [copy] Copying 1 file to /jobs/genie.paho/paho-javascript-master/workspace/target
   [delete] Deleting: /jobs/genie.paho/paho-javascript-master/workspace/target/paho-mqtt-min-2.js
   [delete] Deleting: /jobs/genie.paho/paho-javascript-master/workspace/target/paho-mqtt.min.js
[INFO] Executed tasks
[INFO] 
[INFO] --- exec-maven-plugin:1.2.1:exec (install-jsdoc-modules) @ paho.javascript ---
Downloading: https://repo.eclipse.org/content/repositories/maven_central/org/apache/maven/maven-toolchain/1.0/maven-toolchain-1.0.pom
Downloaded: https://repo.eclipse.org/content/repositories/maven_central/org/apache/maven/maven-toolchain/1.0/maven-toolchain-1.0.pom (0 B at 0.0 KB/sec)
Downloading: https://repo.eclipse.org/content/repositories/maven_central/org/apache/maven/maven-core/2.0.6/maven-core-2.0.6.pom
Downloaded: https://repo.eclipse.org/content/repositories/maven_central/org/apache/maven/maven-core/2.0.6/maven-core-2.0.6.pom (0 B at 0.0 KB/sec)
Downloading: https://repo.eclipse.org/content/repositories/maven_central/org/apache/maven/maven-settings/2.0.6/maven-settings-2.0.6.pom
Downloaded: https://repo.eclipse.org/content/repositories/maven_central/org/apache/maven/maven-settings/2.0.6/maven-settings-2.0.6.pom (0 B at 0.0 KB/sec)
Downloading: https://repo.eclipse.org/content/repositories/maven_central/org/apache/maven/maven-model/2.0.6/maven-model-2.0.6.pom
Downloaded: https://repo.eclipse.org/content/repositories/maven_central/org/apache/maven/maven-model/2.0.6/maven-model-2.0.6.pom (0 B at 0.0 KB/sec)
Downloading: https://repo.eclipse.org/content/repositories/maven_central/org/codehaus/plexus/plexus-utils/1.4.1/plexus-utils-1.4.1.pom
Downloaded: https://repo.eclipse.org/content/repositories/maven_central/org/codehaus/plexus/plexus-utils/1.4.1/plexus-utils-1.4.1.pom (0 B at 0.0 KB/sec)
Downloading: https://repo.eclipse.org/content/repositories/maven_central/org/codehaus/plexus/plexus/1.0.11/plexus-1.0.11.pom
Downloaded: https://repo.eclipse.org/content/repositories/maven_central/org/codehaus/plexus/plexus/1.0.11/plexus-1.0.11.pom (0 B at 0.0 KB/sec)
Downloading: https://repo.eclipse.org/content/repositories/maven_central/org/codehaus/plexus/plexus-container-default/1.0-alpha-9-stable-1/plexus-container-default-1.0-alpha-9-stable-1.pom
Downloaded: https://repo.eclipse.org/content/repositories/maven_central/org/codehaus/plexus/plexus-container-default/1.0-alpha-9-stable-1/plexus-container-default-1.0-alpha-9-stable-1.pom (0 B at 0.0 KB/sec)
Downloading: https://repo.eclipse.org/content/repositories/maven_central/junit/junit/3.8.2/junit-3.8.2.pom
Downloaded: https://repo.eclipse.org/content/repositories/maven_central/junit/junit/3.8.2/junit-3.8.2.pom (0 B at 0.0 KB/sec)
Downloading: https://repo.eclipse.org/content/repositories/maven_central/org/apache/maven/maven-plugin-parameter-documenter/2.0.6/maven-plugin-parameter-documenter-2.0.6.pom
Downloaded: https://repo.eclipse.org/content/repositories/maven_central/org/apache/maven/maven-plugin-parameter-documenter/2.0.6/maven-plugin-parameter-documenter-2.0.6.pom (0 B at 0.0 KB/sec)
Downloading: https://repo.eclipse.org/content/repositories/maven_central/org/apache/maven/reporting/maven-reporting-api/2.0.6/maven-reporting-api-2.0.6.pom
Downloaded: https://repo.eclipse.org/content/repositories/maven_central/org/apache/maven/reporting/maven-reporting-api/2.0.6/maven-reporting-api-2.0.6.pom (0 B at 0.0 KB/sec)
Downloading: https://repo.eclipse.org/content/repositories/maven_central/org/apache/maven/reporting/maven-reporting/2.0.6/maven-reporting-2.0.6.pom
Downloaded: https://repo.eclipse.org/content/repositories/maven_central/org/apache/maven/reporting/maven-reporting/2.0.6/maven-reporting-2.0.6.pom (0 B at 0.0 KB/sec)
Downloading: https://repo.eclipse.org/content/repositories/maven_central/org/apache/maven/doxia/doxia-sink-api/1.0-alpha-7/doxia-sink-api-1.0-alpha-7.pom
Downloaded: https://repo.eclipse.org/content/repositories/maven_central/org/apache/maven/doxia/doxia-sink-api/1.0-alpha-7/doxia-sink-api-1.0-alpha-7.pom (0 B at 0.0 KB/sec)
Downloading: https://repo.eclipse.org/content/repositories/maven_central/org/apache/maven/doxia/doxia/1.0-alpha-7/doxia-1.0-alpha-7.pom
Downloaded: https://repo.eclipse.org/content/repositories/maven_central/org/apache/maven/doxia/doxia/1.0-alpha-7/doxia-1.0-alpha-7.pom (0 B at 0.0 KB/sec)
Downloading: https://repo.eclipse.org/content/repositories/maven_central/org/apache/maven/maven-profile/2.0.6/maven-profile-2.0.6.pom
Downloaded: https://repo.eclipse.org/content/repositories/maven_central/org/apache/maven/maven-profile/2.0.6/maven-profile-2.0.6.pom (0 B at 0.0 KB/sec)
Downloading: https://repo.eclipse.org/content/repositories/maven_central/org/apache/maven/maven-artifact/2.0.6/maven-artifact-2.0.6.pom
Downloaded: https://repo.eclipse.org/content/repositories/maven_central/org/apache/maven/maven-artifact/2.0.6/maven-artifact-2.0.6.pom (0 B at 0.0 KB/sec)
Downloading: https://repo.eclipse.org/content/repositories/maven_central/org/apache/maven/maven-repository-metadata/2.0.6/maven-repository-metadata-2.0.6.pom
Downloaded: https://repo.eclipse.org/content/repositories/maven_central/org/apache/maven/maven-repository-metadata/2.0.6/maven-repository-metadata-2.0.6.pom (0 B at 0.0 KB/sec)
Downloading: https://repo.eclipse.org/content/repositories/maven_central/org/apache/maven/maven-error-diagnostics/2.0.6/maven-error-diagnostics-2.0.6.pom
Downloaded: https://repo.eclipse.org/content/repositories/maven_central/org/apache/maven/maven-error-diagnostics/2.0.6/maven-error-diagnostics-2.0.6.pom (0 B at 0.0 KB/sec)
Downloading: https://repo.eclipse.org/content/repositories/maven_central/org/apache/maven/maven-project/2.0.6/maven-project-2.0.6.pom
Downloaded: https://repo.eclipse.org/content/repositories/maven_central/org/apache/maven/maven-project/2.0.6/maven-project-2.0.6.pom (0 B at 0.0 KB/sec)
Downloading: https://repo.eclipse.org/content/repositories/maven_central/org/apache/maven/maven-artifact-manager/2.0.6/maven-artifact-manager-2.0.6.pom
Downloaded: https://repo.eclipse.org/content/repositories/maven_central/org/apache/maven/maven-artifact-manager/2.0.6/maven-artifact-manager-2.0.6.pom (0 B at 0.0 KB/sec)
Downloading: https://repo.eclipse.org/content/repositories/maven_central/org/apache/maven/maven-plugin-registry/2.0.6/maven-plugin-registry-2.0.6.pom
Downloaded: https://repo.eclipse.org/content/repositories/maven_central/org/apache/maven/maven-plugin-registry/2.0.6/maven-plugin-registry-2.0.6.pom (0 B at 0.0 KB/sec)
Downloading: https://repo.eclipse.org/content/repositories/maven_central/commons-cli/commons-cli/1.0/commons-cli-1.0.pom
Downloaded: https://repo.eclipse.org/content/repositories/maven_central/commons-cli/commons-cli/1.0/commons-cli-1.0.pom (0 B at 0.0 KB/sec)
Downloading: https://repo.eclipse.org/content/repositories/maven_central/org/apache/maven/maven-plugin-api/2.0/maven-plugin-api-2.0.pom
Downloaded: https://repo.eclipse.org/content/repositories/maven_central/org/apache/maven/maven-plugin-api/2.0/maven-plugin-api-2.0.pom (0 B at 0.0 KB/sec)
Downloading: https://repo.eclipse.org/content/repositories/maven_central/org/apache/maven/maven/2.0/maven-2.0.pom
Downloaded: https://repo.eclipse.org/content/repositories/maven_central/org/apache/maven/maven/2.0/maven-2.0.pom (0 B at 0.0 KB/sec)
Downloading: https://repo.eclipse.org/content/repositories/maven_central/org/apache/maven/maven-plugin-descriptor/2.0.6/maven-plugin-descriptor-2.0.6.pom
Downloaded: https://repo.eclipse.org/content/repositories/maven_central/org/apache/maven/maven-plugin-descriptor/2.0.6/maven-plugin-descriptor-2.0.6.pom (0 B at 0.0 KB/sec)
Downloading: https://repo.eclipse.org/content/repositories/maven_central/org/codehaus/plexus/plexus-interactivity-api/1.0-alpha-4/plexus-interactivity-api-1.0-alpha-4.pom
Downloaded: https://repo.eclipse.org/content/repositories/maven_central/org/codehaus/plexus/plexus-interactivity-api/1.0-alpha-4/plexus-interactivity-api-1.0-alpha-4.pom (0 B at 0.0 KB/sec)
Downloading: https://repo.eclipse.org/content/repositories/maven_central/org/apache/maven/maven-monitor/2.0.6/maven-monitor-2.0.6.pom
Downloaded: https://repo.eclipse.org/content/repositories/maven_central/org/apache/maven/maven-monitor/2.0.6/maven-monitor-2.0.6.pom (0 B at 0.0 KB/sec)
Downloading: https://repo.eclipse.org/content/repositories/maven_central/classworlds/classworlds/1.1/classworlds-1.1.pom
Downloaded: https://repo.eclipse.org/content/repositories/maven_central/classworlds/classworlds/1.1/classworlds-1.1.pom (0 B at 0.0 KB/sec)
Downloading: https://repo.eclipse.org/content/repositories/maven_central/org/codehaus/plexus/plexus-utils/2.0.5/plexus-utils-2.0.5.pom
Downloaded: https://repo.eclipse.org/content/repositories/maven_central/org/codehaus/plexus/plexus-utils/2.0.5/plexus-utils-2.0.5.pom (0 B at 0.0 KB/sec)
Downloading: https://repo.eclipse.org/content/repositories/maven_central/org/codehaus/plexus/plexus/2.0.6/plexus-2.0.6.pom
Downloaded: https://repo.eclipse.org/content/repositories/maven_central/org/codehaus/plexus/plexus/2.0.6/plexus-2.0.6.pom (0 B at 0.0 KB/sec)
Downloading: https://repo.eclipse.org/content/repositories/maven_central/org/apache/commons/commons-exec/1.1/commons-exec-1.1.pom
Downloaded: https://repo.eclipse.org/content/repositories/maven_central/org/apache/commons/commons-exec/1.1/commons-exec-1.1.pom (0 B at 0.0 KB/sec)
Downloading: https://repo.eclipse.org/content/repositories/maven_central/org/apache/commons/commons-parent/17/commons-parent-17.pom
Downloaded: https://repo.eclipse.org/content/repositories/maven_central/org/apache/commons/commons-parent/17/commons-parent-17.pom (0 B at 0.0 KB/sec)
Downloading: https://repo.eclipse.org/content/repositories/maven_central/org/apache/apache/7/apache-7.pom
Downloaded: https://repo.eclipse.org/content/repositories/maven_central/org/apache/apache/7/apache-7.pom (0 B at 0.0 KB/sec)
Downloading: https://repo.eclipse.org/content/repositories/maven_central/org/apache/maven/reporting/maven-reporting-api/2.0.6/maven-reporting-api-2.0.6.jar
Downloading: https://repo.eclipse.org/content/repositories/maven_central/org/apache/maven/doxia/doxia-sink-api/1.0-alpha-7/doxia-sink-api-1.0-alpha-7.jar
Downloading: https://repo.eclipse.org/content/repositories/maven_central/commons-cli/commons-cli/1.0/commons-cli-1.0.jar
Downloading: https://repo.eclipse.org/content/repositories/maven_central/org/codehaus/plexus/plexus-interactivity-api/1.0-alpha-4/plexus-interactivity-api-1.0-alpha-4.jar
Downloading: https://repo.eclipse.org/content/repositories/maven_central/org/codehaus/plexus/plexus-utils/2.0.5/plexus-utils-2.0.5.jar
Downloaded: https://repo.eclipse.org/content/repositories/maven_central/org/codehaus/plexus/plexus-utils/2.0.5/plexus-utils-2.0.5.jar (0 B at 0.0 KB/sec)
Downloaded: https://repo.eclipse.org/content/repositories/maven_central/org/apache/maven/doxia/doxia-sink-api/1.0-alpha-7/doxia-sink-api-1.0-alpha-7.jar (0 B at 0.0 KB/sec)
Downloading: https://repo.eclipse.org/content/repositories/maven_central/org/apache/commons/commons-exec/1.1/commons-exec-1.1.jar
Downloaded: https://repo.eclipse.org/content/repositories/maven_central/commons-cli/commons-cli/1.0/commons-cli-1.0.jar (0 B at 0.0 KB/sec)
Downloaded: https://repo.eclipse.org/content/repositories/maven_central/org/apache/maven/reporting/maven-reporting-api/2.0.6/maven-reporting-api-2.0.6.jar (0 B at 0.0 KB/sec)
Downloaded: https://repo.eclipse.org/content/repositories/maven_central/org/codehaus/plexus/plexus-interactivity-api/1.0-alpha-4/plexus-interactivity-api-1.0-alpha-4.jar (0 B at 0.0 KB/sec)
Downloaded: https://repo.eclipse.org/content/repositories/maven_central/org/apache/commons/commons-exec/1.1/commons-exec-1.1.jar (0 B at 0.0 KB/sec)
npm WARN prefer global marked@0.3.6 should be installed with -g
- async@1.4.2 node_modules/async
- espree@2.2.5 node_modules/espree
- wrench@1.5.9 node_modules/wrench
paho-client@ /jobs/genie.paho/paho-javascript-master/workspace
└── jsdoc@3.5.3  extraneous

npm WARN paho-client@ No repository field.
npm WARN paho-client@ No license field.
[INFO] 
[INFO] --- exec-maven-plugin:1.2.1:exec (jsdoc) @ paho.javascript ---
[INFO] 
[INFO] --- exec-maven-plugin:1.2.1:exec (set-cache) @ paho.javascript ---
[INFO] 
[INFO] --- exec-maven-plugin:1.2.1:exec (install-modules) @ paho.javascript ---
npm WARN deprecated minimatch@0.2.14: Please update to minimatch 3.0.2 or higher to avoid a RegExp DoS issue
npm WARN deprecated minimatch@0.3.0: Please update to minimatch 3.0.2 or higher to avoid a RegExp DoS issue
growl@1.7.0 node_modules/jasmine-node/node_modules/jasmine-growl-reporter/node_modules/growl -> node_modules/growl
jasmine-growl-reporter@0.0.3 node_modules/jasmine-node/node_modules/jasmine-growl-reporter -> node_modules/jasmine-growl-reporter
- coffee-script@1.7.1 node_modules/jasmine-node/node_modules/coffee-script
- fileset@0.1.5 node_modules/jasmine-node/node_modules/gaze/node_modules/fileset
- inherits@2.0.1 node_modules/jasmine-node/node_modules/gaze/node_modules/fileset/node_modules/glob/node_modules/inherits
- lru-cache@2.5.0 node_modules/jasmine-node/node_modules/gaze/node_modules/fileset/node_modules/glob/node_modules/minimatch/node_modules/lru-cache
- sigmund@1.0.0 node_modules/jasmine-node/node_modules/gaze/node_modules/fileset/node_modules/glob/node_modules/minimatch/node_modules/sigmund
- lru-cache@2.5.0 node_modules/jasmine-node/node_modules/gaze/node_modules/minimatch/node_modules/lru-cache
- sigmund@1.0.0 node_modules/jasmine-node/node_modules/gaze/node_modules/minimatch/node_modules/sigmund
- jasmine-reporters@0.4.1 node_modules/jasmine-node/node_modules/jasmine-reporters
- requirejs@2.1.11 node_modules/jasmine-node/node_modules/requirejs
- underscore@1.6.0 node_modules/jasmine-node/node_modules/underscore
- walkdir@0.0.7 node_modules/jasmine-node/node_modules/walkdir
minimatch@0.2.14 node_modules/jasmine-node/node_modules/gaze/node_modules/minimatch -> node_modules/minimatch
minimatch@0.3.0 node_modules/jasmine-node/node_modules/gaze/node_modules/fileset/node_modules/glob/node_modules/minimatch -> node_modules/glob/node_modules/minimatch
glob@3.2.11 node_modules/jasmine-node/node_modules/gaze/node_modules/fileset/node_modules/glob -> node_modules/glob
gaze@0.3.4 node_modules/jasmine-node/node_modules/gaze -> node_modules/gaze
paho-client@ /jobs/genie.paho/paho-javascript-master/workspace
├─┬ jasmine-node@1.14.5 
│ ├── coffee-script@1.12.7 
│ ├─┬ gaze@0.3.4
│ │ ├── fileset@0.1.8 
│ │ └─┬ minimatch@0.2.14
│ │   ├── lru-cache@2.7.3 
│ │   └── sigmund@1.0.1 
│ ├─┬ jasmine-reporters@1.0.2 
│ │ └── mkdirp@0.3.5 
│ ├── mkdirp@0.3.5 
│ ├── requirejs@2.3.4 
│ └── walkdir@0.0.11 
├── jsdoc@3.5.3  extraneous
├─┬ jshint@2.9.5 
│ ├─┬ cli@1.0.1 
│ │ └─┬ glob@7.1.2 
│ │   ├── fs.realpath@1.0.0 
│ │   ├─┬ inflight@1.0.6 
│ │   │ └── wrappy@1.0.2 
│ │   ├── inherits@2.0.3 
│ │   ├── minimatch@3.0.4 
│ │   ├── once@1.4.0 
│ │   └── path-is-absolute@1.0.1 
│ ├─┬ console-browserify@1.1.0 
│ │ └── date-now@0.1.4 
│ ├── exit@0.1.2 
│ ├─┬ htmlparser2@3.8.3 
│ │ ├── domelementtype@1.3.0 
│ │ ├── domhandler@2.3.0 
│ │ ├─┬ domutils@1.5.1 
│ │ │ └─┬ dom-serializer@0.1.0 
│ │ │   ├── domelementtype@1.1.3 
│ │ │   └── entities@1.1.1 
│ │ ├── entities@1.0.0 
│ │ └─┬ readable-stream@1.1.14 
│ │   ├── core-util-is@1.0.2 
│ │   ├── isarray@0.0.1 
│ │   └── string_decoder@0.10.31 
│ ├── lodash@3.7.0 
│ ├─┬ minimatch@3.0.4 
│ │ └─┬ brace-expansion@1.1.8 
│ │   ├── balanced-match@1.0.0 
│ │   └── concat-map@0.0.1 
│ ├── shelljs@0.3.0 
│ └── strip-json-comments@1.0.4 
└─┬ node-localstorage@1.3.0 
  └─┬ write-file-atomic@1.3.4 
    ├── imurmurhash@0.1.4 
    └── slide@1.1.6 

npm WARN paho-client@ No repository field.
npm WARN paho-client@ No license field.
[INFO] 
[INFO] --- exec-maven-plugin:1.2.1:exec (jshint) @ paho.javascript ---
[INFO] 
[INFO] --- templating-maven-plugin:1.0-alpha-3:filter-test-sources (filter-tests) @ paho.javascript ---
Downloading: https://repo.eclipse.org/content/repositories/maven_central/org/apache/maven/maven-model/2.2.1/maven-model-2.2.1.pom
Downloaded: https://repo.eclipse.org/content/repositories/maven_central/org/apache/maven/maven-model/2.2.1/maven-model-2.2.1.pom (0 B at 0.0 KB/sec)
Downloading: https://repo.eclipse.org/content/repositories/maven_central/org/apache/maven/maven/2.2.1/maven-2.2.1.pom
Downloaded: https://repo.eclipse.org/content/repositories/maven_central/org/apache/maven/maven/2.2.1/maven-2.2.1.pom (0 B at 0.0 KB/sec)
Downloading: https://repo.eclipse.org/content/repositories/maven_central/org/apache/maven/maven-parent/11/maven-parent-11.pom
Downloaded: https://repo.eclipse.org/content/repositories/maven_central/org/apache/maven/maven-parent/11/maven-parent-11.pom (0 B at 0.0 KB/sec)
Downloading: https://repo.eclipse.org/content/repositories/maven_central/org/apache/apache/5/apache-5.pom
Downloaded: https://repo.eclipse.org/content/repositories/maven_central/org/apache/apache/5/apache-5.pom (0 B at 0.0 KB/sec)
Downloading: https://repo.eclipse.org/content/repositories/maven_central/org/codehaus/plexus/plexus-utils/1.5.15/plexus-utils-1.5.15.pom
Downloaded: https://repo.eclipse.org/content/repositories/maven_central/org/codehaus/plexus/plexus-utils/1.5.15/plexus-utils-1.5.15.pom (0 B at 0.0 KB/sec)
Downloading: https://repo.eclipse.org/content/repositories/maven_central/org/codehaus/plexus/plexus/2.0.2/plexus-2.0.2.pom
Downloaded: https://repo.eclipse.org/content/repositories/maven_central/org/codehaus/plexus/plexus/2.0.2/plexus-2.0.2.pom (0 B at 0.0 KB/sec)
Downloading: https://repo.eclipse.org/content/repositories/maven_central/org/apache/maven/maven-project/2.2.1/maven-project-2.2.1.pom
Downloaded: https://repo.eclipse.org/content/repositories/maven_central/org/apache/maven/maven-project/2.2.1/maven-project-2.2.1.pom (0 B at 0.0 KB/sec)
Downloading: https://repo.eclipse.org/content/repositories/maven_central/org/apache/maven/maven-settings/2.2.1/maven-settings-2.2.1.pom
Downloaded: https://repo.eclipse.org/content/repositories/maven_central/org/apache/maven/maven-settings/2.2.1/maven-settings-2.2.1.pom (0 B at 0.0 KB/sec)
Downloading: https://repo.eclipse.org/content/repositories/maven_central/org/codehaus/plexus/plexus-interpolation/1.11/plexus-interpolation-1.11.pom
Downloaded: https://repo.eclipse.org/content/repositories/maven_central/org/codehaus/plexus/plexus-interpolation/1.11/plexus-interpolation-1.11.pom (0 B at 0.0 KB/sec)
Downloading: https://repo.eclipse.org/content/repositories/maven_central/org/codehaus/plexus/plexus-components/1.1.14/plexus-components-1.1.14.pom
Downloaded: https://repo.eclipse.org/content/repositories/maven_central/org/codehaus/plexus/plexus-components/1.1.14/plexus-components-1.1.14.pom (0 B at 0.0 KB/sec)
Downloading: https://repo.eclipse.org/content/repositories/maven_central/junit/junit/4.11/junit-4.11.pom
Downloaded: https://repo.eclipse.org/content/repositories/maven_central/junit/junit/4.11/junit-4.11.pom (0 B at 0.0 KB/sec)
Downloading: https://repo.eclipse.org/content/repositories/maven_central/org/hamcrest/hamcrest-core/1.3/hamcrest-core-1.3.pom
Downloaded: https://repo.eclipse.org/content/repositories/maven_central/org/hamcrest/hamcrest-core/1.3/hamcrest-core-1.3.pom (0 B at 0.0 KB/sec)
Downloading: https://repo.eclipse.org/content/repositories/maven_central/org/hamcrest/hamcrest-parent/1.3/hamcrest-parent-1.3.pom
Downloaded: https://repo.eclipse.org/content/repositories/maven_central/org/hamcrest/hamcrest-parent/1.3/hamcrest-parent-1.3.pom (0 B at 0.0 KB/sec)
Downloading: https://repo.eclipse.org/content/repositories/maven_central/org/apache/maven/maven-profile/2.2.1/maven-profile-2.2.1.pom
Downloaded: https://repo.eclipse.org/content/repositories/maven_central/org/apache/maven/maven-profile/2.2.1/maven-profile-2.2.1.pom (0 B at 0.0 KB/sec)
Downloading: https://repo.eclipse.org/content/repositories/maven_central/org/apache/maven/maven-artifact-manager/2.2.1/maven-artifact-manager-2.2.1.pom
Downloaded: https://repo.eclipse.org/content/repositories/maven_central/org/apache/maven/maven-artifact-manager/2.2.1/maven-artifact-manager-2.2.1.pom (0 B at 0.0 KB/sec)
Downloading: https://repo.eclipse.org/content/repositories/maven_central/org/apache/maven/maven-repository-metadata/2.2.1/maven-repository-metadata-2.2.1.pom
Downloaded: https://repo.eclipse.org/content/repositories/maven_central/org/apache/maven/maven-repository-metadata/2.2.1/maven-repository-metadata-2.2.1.pom (0 B at 0.0 KB/sec)
Downloading: https://repo.eclipse.org/content/repositories/maven_central/org/apache/maven/maven-artifact/2.2.1/maven-artifact-2.2.1.pom
Downloaded: https://repo.eclipse.org/content/repositories/maven_central/org/apache/maven/maven-artifact/2.2.1/maven-artifact-2.2.1.pom (0 B at 0.0 KB/sec)
Downloading: https://repo.eclipse.org/content/repositories/maven_central/backport-util-concurrent/backport-util-concurrent/3.1/backport-util-concurrent-3.1.pom
Downloaded: https://repo.eclipse.org/content/repositories/maven_central/backport-util-concurrent/backport-util-concurrent/3.1/backport-util-concurrent-3.1.pom (0 B at 0.0 KB/sec)
Downloading: https://repo.eclipse.org/content/repositories/maven_central/org/apache/maven/maven-plugin-registry/2.2.1/maven-plugin-registry-2.2.1.pom
Downloaded: https://repo.eclipse.org/content/repositories/maven_central/org/apache/maven/maven-plugin-registry/2.2.1/maven-plugin-registry-2.2.1.pom (0 B at 0.0 KB/sec)
Downloading: https://repo.eclipse.org/content/repositories/maven_central/org/apache/maven/maven-core/2.2.1/maven-core-2.2.1.pom
Downloaded: https://repo.eclipse.org/content/repositories/maven_central/org/apache/maven/maven-core/2.2.1/maven-core-2.2.1.pom (0 B at 0.0 KB/sec)
Downloading: https://repo.eclipse.org/content/repositories/maven_central/org/apache/maven/maven-plugin-parameter-documenter/2.2.1/maven-plugin-parameter-documenter-2.2.1.pom
Downloaded: https://repo.eclipse.org/content/repositories/maven_central/org/apache/maven/maven-plugin-parameter-documenter/2.2.1/maven-plugin-parameter-documenter-2.2.1.pom (0 B at 0.0 KB/sec)
Downloading: https://repo.eclipse.org/content/repositories/maven_central/org/slf4j/slf4j-jdk14/1.5.6/slf4j-jdk14-1.5.6.pom
Downloaded: https://repo.eclipse.org/content/repositories/maven_central/org/slf4j/slf4j-jdk14/1.5.6/slf4j-jdk14-1.5.6.pom (0 B at 0.0 KB/sec)
Downloading: https://repo.eclipse.org/content/repositories/maven_central/org/slf4j/slf4j-parent/1.5.6/slf4j-parent-1.5.6.pom
Downloaded: https://repo.eclipse.org/content/repositories/maven_central/org/slf4j/slf4j-parent/1.5.6/slf4j-parent-1.5.6.pom (0 B at 0.0 KB/sec)
Downloading: https://repo.eclipse.org/content/repositories/maven_central/org/slf4j/slf4j-api/1.5.6/slf4j-api-1.5.6.pom
Downloaded: https://repo.eclipse.org/content/repositories/maven_central/org/slf4j/slf4j-api/1.5.6/slf4j-api-1.5.6.pom (0 B at 0.0 KB/sec)
Downloading: https://repo.eclipse.org/content/repositories/maven_central/org/slf4j/jcl-over-slf4j/1.5.6/jcl-over-slf4j-1.5.6.pom
Downloaded: https://repo.eclipse.org/content/repositories/maven_central/org/slf4j/jcl-over-slf4j/1.5.6/jcl-over-slf4j-1.5.6.pom (0 B at 0.0 KB/sec)
Downloading: https://repo.eclipse.org/content/repositories/maven_central/org/apache/maven/reporting/maven-reporting-api/2.2.1/maven-reporting-api-2.2.1.pom
Downloaded: https://repo.eclipse.org/content/repositories/maven_central/org/apache/maven/reporting/maven-reporting-api/2.2.1/maven-reporting-api-2.2.1.pom (0 B at 0.0 KB/sec)
Downloading: https://repo.eclipse.org/content/repositories/maven_central/org/apache/maven/reporting/maven-reporting/2.2.1/maven-reporting-2.2.1.pom
Downloaded: https://repo.eclipse.org/content/repositories/maven_central/org/apache/maven/reporting/maven-reporting/2.2.1/maven-reporting-2.2.1.pom (0 B at 0.0 KB/sec)
Downloading: https://repo.eclipse.org/content/repositories/maven_central/org/apache/maven/doxia/doxia-sink-api/1.1/doxia-sink-api-1.1.pom
Downloaded: https://repo.eclipse.org/content/repositories/maven_central/org/apache/maven/doxia/doxia-sink-api/1.1/doxia-sink-api-1.1.pom (0 B at 0.0 KB/sec)
Downloading: https://repo.eclipse.org/content/repositories/maven_central/org/apache/maven/doxia/doxia/1.1/doxia-1.1.pom
Downloaded: https://repo.eclipse.org/content/repositories/maven_central/org/apache/maven/doxia/doxia/1.1/doxia-1.1.pom (0 B at 0.0 KB/sec)
Downloading: https://repo.eclipse.org/content/repositories/maven_central/org/apache/maven/doxia/doxia-logging-api/1.1/doxia-logging-api-1.1.pom
Downloaded: https://repo.eclipse.org/content/repositories/maven_central/org/apache/maven/doxia/doxia-logging-api/1.1/doxia-logging-api-1.1.pom (0 B at 0.0 KB/sec)
Downloading: https://repo.eclipse.org/content/repositories/maven_central/org/codehaus/plexus/plexus-container-default/1.0-alpha-30/plexus-container-default-1.0-alpha-30.pom
Downloaded: https://repo.eclipse.org/content/repositories/maven_central/org/codehaus/plexus/plexus-container-default/1.0-alpha-30/plexus-container-default-1.0-alpha-30.pom (0 B at 0.0 KB/sec)
Downloading: https://repo.eclipse.org/content/repositories/maven_central/org/codehaus/plexus/plexus-containers/1.0-alpha-30/plexus-containers-1.0-alpha-30.pom
Downloaded: https://repo.eclipse.org/content/repositories/maven_central/org/codehaus/plexus/plexus-containers/1.0-alpha-30/plexus-containers-1.0-alpha-30.pom (0 B at 0.0 KB/sec)
Downloading: https://repo.eclipse.org/content/repositories/maven_central/org/codehaus/plexus/plexus-utils/1.4.5/plexus-utils-1.4.5.pom
Downloaded: https://repo.eclipse.org/content/repositories/maven_central/org/codehaus/plexus/plexus-utils/1.4.5/plexus-utils-1.4.5.pom (0 B at 0.0 KB/sec)
Downloading: https://repo.eclipse.org/content/repositories/maven_central/org/codehaus/plexus/plexus-classworlds/1.2-alpha-9/plexus-classworlds-1.2-alpha-9.pom
Downloaded: https://repo.eclipse.org/content/repositories/maven_central/org/codehaus/plexus/plexus-classworlds/1.2-alpha-9/plexus-classworlds-1.2-alpha-9.pom (0 B at 0.0 KB/sec)
Downloading: https://repo.eclipse.org/content/repositories/maven_central/org/codehaus/plexus/plexus/1.0.10/plexus-1.0.10.pom
Downloaded: https://repo.eclipse.org/content/repositories/maven_central/org/codehaus/plexus/plexus/1.0.10/plexus-1.0.10.pom (0 B at 0.0 KB/sec)
Downloading: https://repo.eclipse.org/content/repositories/maven_central/org/apache/maven/maven-error-diagnostics/2.2.1/maven-error-diagnostics-2.2.1.pom
Downloaded: https://repo.eclipse.org/content/repositories/maven_central/org/apache/maven/maven-error-diagnostics/2.2.1/maven-error-diagnostics-2.2.1.pom (0 B at 0.0 KB/sec)
Downloading: https://repo.eclipse.org/content/repositories/maven_central/commons-cli/commons-cli/1.2/commons-cli-1.2.pom
Downloaded: https://repo.eclipse.org/content/repositories/maven_central/commons-cli/commons-cli/1.2/commons-cli-1.2.pom (0 B at 0.0 KB/sec)
Downloading: https://repo.eclipse.org/content/repositories/maven_central/org/apache/commons/commons-parent/11/commons-parent-11.pom
Downloaded: https://repo.eclipse.org/content/repositories/maven_central/org/apache/commons/commons-parent/11/commons-parent-11.pom (0 B at 0.0 KB/sec)
Downloading: https://repo.eclipse.org/content/repositories/maven_central/org/apache/maven/maven-plugin-api/2.0.1/maven-plugin-api-2.0.1.pom
Downloaded: https://repo.eclipse.org/content/repositories/maven_central/org/apache/maven/maven-plugin-api/2.0.1/maven-plugin-api-2.0.1.pom (0 B at 0.0 KB/sec)
Downloading: https://repo.eclipse.org/content/repositories/maven_central/org/apache/maven/maven/2.0.1/maven-2.0.1.pom
Downloaded: https://repo.eclipse.org/content/repositories/maven_central/org/apache/maven/maven/2.0.1/maven-2.0.1.pom (0 B at 0.0 KB/sec)
Downloading: https://repo.eclipse.org/content/repositories/maven_central/org/apache/maven/maven-plugin-descriptor/2.2.1/maven-plugin-descriptor-2.2.1.pom
Downloaded: https://repo.eclipse.org/content/repositories/maven_central/org/apache/maven/maven-plugin-descriptor/2.2.1/maven-plugin-descriptor-2.2.1.pom (0 B at 0.0 KB/sec)
Downloading: https://repo.eclipse.org/content/repositories/maven_central/org/apache/maven/maven-monitor/2.2.1/maven-monitor-2.2.1.pom
Downloaded: https://repo.eclipse.org/content/repositories/maven_central/org/apache/maven/maven-monitor/2.2.1/maven-monitor-2.2.1.pom (0 B at 0.0 KB/sec)
Downloading: https://repo.eclipse.org/content/repositories/maven_central/org/sonatype/plexus/plexus-sec-dispatcher/1.3/plexus-sec-dispatcher-1.3.pom
Downloaded: https://repo.eclipse.org/content/repositories/maven_central/org/sonatype/plexus/plexus-sec-dispatcher/1.3/plexus-sec-dispatcher-1.3.pom (0 B at 0.0 KB/sec)
Downloading: https://repo.eclipse.org/content/repositories/maven_central/org/sonatype/spice/spice-parent/12/spice-parent-12.pom
Downloaded: https://repo.eclipse.org/content/repositories/maven_central/org/sonatype/spice/spice-parent/12/spice-parent-12.pom (0 B at 0.0 KB/sec)
Downloading: https://repo.eclipse.org/content/repositories/maven_central/org/sonatype/forge/forge-parent/4/forge-parent-4.pom
Downloaded: https://repo.eclipse.org/content/repositories/maven_central/org/sonatype/forge/forge-parent/4/forge-parent-4.pom (0 B at 0.0 KB/sec)
Downloading: https://repo.eclipse.org/content/repositories/maven_central/org/codehaus/plexus/plexus-utils/1.5.5/plexus-utils-1.5.5.pom
Downloaded: https://repo.eclipse.org/content/repositories/maven_central/org/codehaus/plexus/plexus-utils/1.5.5/plexus-utils-1.5.5.pom (0 B at 0.0 KB/sec)
Downloading: https://repo.eclipse.org/content/repositories/maven_central/org/sonatype/plexus/plexus-cipher/1.4/plexus-cipher-1.4.pom
Downloaded: https://repo.eclipse.org/content/repositories/maven_central/org/sonatype/plexus/plexus-cipher/1.4/plexus-cipher-1.4.pom (0 B at 0.0 KB/sec)
Downloading: https://repo.eclipse.org/content/repositories/maven_central/org/codehaus/plexus/plexus-interpolation/1.13/plexus-interpolation-1.13.pom
Downloaded: https://repo.eclipse.org/content/repositories/maven_central/org/codehaus/plexus/plexus-interpolation/1.13/plexus-interpolation-1.13.pom (0 B at 0.0 KB/sec)
Downloading: https://repo.eclipse.org/content/repositories/maven_central/org/codehaus/plexus/plexus-components/1.1.15/plexus-components-1.1.15.pom
Downloaded: https://repo.eclipse.org/content/repositories/maven_central/org/codehaus/plexus/plexus-components/1.1.15/plexus-components-1.1.15.pom (0 B at 0.0 KB/sec)
Downloading: https://repo.eclipse.org/content/repositories/maven_central/org/codehaus/plexus/plexus/2.0.3/plexus-2.0.3.pom
Downloaded: https://repo.eclipse.org/content/repositories/maven_central/org/codehaus/plexus/plexus/2.0.3/plexus-2.0.3.pom (0 B at 0.0 KB/sec)
Downloading: https://repo.eclipse.org/content/repositories/maven_central/org/apache/maven/shared/maven-filtering/1.1/maven-filtering-1.1.pom
Downloaded: https://repo.eclipse.org/content/repositories/maven_central/org/apache/maven/shared/maven-filtering/1.1/maven-filtering-1.1.pom (0 B at 0.0 KB/sec)
Downloading: https://repo.eclipse.org/content/repositories/maven_central/org/apache/maven/shared/maven-shared-components/17/maven-shared-components-17.pom
Downloaded: https://repo.eclipse.org/content/repositories/maven_central/org/apache/maven/shared/maven-shared-components/17/maven-shared-components-17.pom (0 B at 0.0 KB/sec)
Downloading: https://repo.eclipse.org/content/repositories/maven_central/org/codehaus/plexus/plexus-interpolation/1.12/plexus-interpolation-1.12.pom
Downloaded: https://repo.eclipse.org/content/repositories/maven_central/org/codehaus/plexus/plexus-interpolation/1.12/plexus-interpolation-1.12.pom (0 B at 0.0 KB/sec)
Downloading: https://repo.eclipse.org/content/repositories/maven_central/org/sonatype/plexus/plexus-build-api/0.0.4/plexus-build-api-0.0.4.pom
Downloaded: https://repo.eclipse.org/content/repositories/maven_central/org/sonatype/plexus/plexus-build-api/0.0.4/plexus-build-api-0.0.4.pom (0 B at 0.0 KB/sec)
Downloading: https://repo.eclipse.org/content/repositories/maven_central/org/sonatype/spice/spice-parent/10/spice-parent-10.pom
Downloaded: https://repo.eclipse.org/content/repositories/maven_central/org/sonatype/spice/spice-parent/10/spice-parent-10.pom (0 B at 0.0 KB/sec)
Downloading: https://repo.eclipse.org/content/repositories/maven_central/org/sonatype/forge/forge-parent/3/forge-parent-3.pom
Downloaded: https://repo.eclipse.org/content/repositories/maven_central/org/sonatype/forge/forge-parent/3/forge-parent-3.pom (0 B at 0.0 KB/sec)
Downloading: https://repo.eclipse.org/content/repositories/maven_central/org/codehaus/plexus/plexus-utils/1.5.8/plexus-utils-1.5.8.pom
Downloaded: https://repo.eclipse.org/content/repositories/maven_central/org/codehaus/plexus/plexus-utils/1.5.8/plexus-utils-1.5.8.pom (0 B at 0.0 KB/sec)
Downloading: https://repo.eclipse.org/content/repositories/maven_central/backport-util-concurrent/backport-util-concurrent/3.1/backport-util-concurrent-3.1.jar
Downloading: https://repo.eclipse.org/content/repositories/maven_central/org/slf4j/slf4j-jdk14/1.5.6/slf4j-jdk14-1.5.6.jar
Downloading: https://repo.eclipse.org/content/repositories/maven_central/org/slf4j/slf4j-api/1.5.6/slf4j-api-1.5.6.jar
Downloading: https://repo.eclipse.org/content/repositories/maven_central/org/slf4j/jcl-over-slf4j/1.5.6/jcl-over-slf4j-1.5.6.jar
Downloading: https://repo.eclipse.org/content/repositories/maven_central/org/apache/maven/reporting/maven-reporting-api/2.2.1/maven-reporting-api-2.2.1.jar
Downloaded: https://repo.eclipse.org/content/repositories/maven_central/backport-util-concurrent/backport-util-concurrent/3.1/backport-util-concurrent-3.1.jar (0 B at 0.0 KB/sec)
Downloading: https://repo.eclipse.org/content/repositories/maven_central/org/apache/maven/doxia/doxia-sink-api/1.1/doxia-sink-api-1.1.jar
Downloaded: https://repo.eclipse.org/content/repositories/maven_central/org/slf4j/slf4j-jdk14/1.5.6/slf4j-jdk14-1.5.6.jar (0 B at 0.0 KB/sec)
Downloading: https://repo.eclipse.org/content/repositories/maven_central/org/apache/maven/doxia/doxia-logging-api/1.1/doxia-logging-api-1.1.jar
Downloaded: https://repo.eclipse.org/content/repositories/maven_central/org/slf4j/jcl-over-slf4j/1.5.6/jcl-over-slf4j-1.5.6.jar (0 B at 0.0 KB/sec)
Downloading: https://repo.eclipse.org/content/repositories/maven_central/commons-cli/commons-cli/1.2/commons-cli-1.2.jar
Downloaded: https://repo.eclipse.org/content/repositories/maven_central/org/apache/maven/reporting/maven-reporting-api/2.2.1/maven-reporting-api-2.2.1.jar (0 B at 0.0 KB/sec)
Downloading: https://repo.eclipse.org/content/repositories/maven_central/org/sonatype/plexus/plexus-sec-dispatcher/1.3/plexus-sec-dispatcher-1.3.jar
Downloaded: https://repo.eclipse.org/content/repositories/maven_central/org/slf4j/slf4j-api/1.5.6/slf4j-api-1.5.6.jar (0 B at 0.0 KB/sec)
Downloading: https://repo.eclipse.org/content/repositories/maven_central/org/sonatype/plexus/plexus-cipher/1.4/plexus-cipher-1.4.jar
Downloaded: https://repo.eclipse.org/content/repositories/maven_central/org/apache/maven/doxia/doxia-sink-api/1.1/doxia-sink-api-1.1.jar (0 B at 0.0 KB/sec)
Downloading: https://repo.eclipse.org/content/repositories/maven_central/org/codehaus/plexus/plexus-interpolation/1.13/plexus-interpolation-1.13.jar
Downloaded: https://repo.eclipse.org/content/repositories/maven_central/org/apache/maven/doxia/doxia-logging-api/1.1/doxia-logging-api-1.1.jar (0 B at 0.0 KB/sec)
Downloading: https://repo.eclipse.org/content/repositories/maven_central/org/apache/maven/shared/maven-filtering/1.1/maven-filtering-1.1.jar
Downloaded: https://repo.eclipse.org/content/repositories/maven_central/commons-cli/commons-cli/1.2/commons-cli-1.2.jar (0 B at 0.0 KB/sec)
Downloading: https://repo.eclipse.org/content/repositories/maven_central/org/sonatype/plexus/plexus-build-api/0.0.4/plexus-build-api-0.0.4.jar
Downloaded: https://repo.eclipse.org/content/repositories/maven_central/org/sonatype/plexus/plexus-sec-dispatcher/1.3/plexus-sec-dispatcher-1.3.jar (0 B at 0.0 KB/sec)
Downloaded: https://repo.eclipse.org/content/repositories/maven_central/org/sonatype/plexus/plexus-cipher/1.4/plexus-cipher-1.4.jar (0 B at 0.0 KB/sec)
Downloaded: https://repo.eclipse.org/content/repositories/maven_central/org/codehaus/plexus/plexus-interpolation/1.13/plexus-interpolation-1.13.jar (0 B at 0.0 KB/sec)
Downloaded: https://repo.eclipse.org/content/repositories/maven_central/org/apache/maven/shared/maven-filtering/1.1/maven-filtering-1.1.jar (0 B at 0.0 KB/sec)
Downloaded: https://repo.eclipse.org/content/repositories/maven_central/org/sonatype/plexus/plexus-build-api/0.0.4/plexus-build-api-0.0.4.jar (0 B at 0.0 KB/sec)
[INFO] Using 'UTF-8' encoding to copy filtered resources.
[INFO] Copying 7 resources
[INFO] Source directory: /jobs/genie.paho/paho-javascript-master/workspace/target/test added.
[INFO] 
[INFO] --- exec-maven-plugin:1.2.1:exec (test) @ paho.javascript ---
Warning: Native modules not compiled.  XOR performance will be degraded.
Warning: Native modules not compiled.  UTF-8 validation disabled.
Connect Error: Error: socket hang up
Connecting...
Disconnecting...
Re-Connecting...
Connect Error: Error: socket hang up
Connect fail. ErrorCode: undefined, ErrorMsg: AMQJS0007E Socket error:undefined.
Connecting...
Disconnecting...
Connect Error: Error: socket hang up
Connect Error: Error: socket hang up
Connect fail. ErrorCode: undefined, ErrorMsg: AMQJS0007E Socket error:undefined.
should connect to a available server from list
Connect Error: Error: connect ECONNREFUSED 127.0.0.1:2000
Connect Error: Error: socket hang up
Connect fail. ErrorCode: undefined, ErrorMsg: AMQJS0007E Socket error:undefined.
Subscribe a topic...
Send and receive message...
Unsubscribe a topic...
Connect Error: Error: socket hang up
Connect fail. ErrorCode: undefined, ErrorMsg: AMQJS0007E Socket error:undefined.
Check default for message with payload.
Check empty msg to throw error
Check message qos
Check payload
not allowed to set payload
Check retained
Check duplicate
Connect Error: Error: socket hang up
Connect Error: Error: socket hang up
Connect Error: Error: socket hang up
Connect Error: Error: socket hang up
Connect Error: Error: socket hang up
Connect Error: Error: socket hang up
Connect Error: Error: socket hang up
Connect Error: Error: socket hang up
Connect Error: Error: socket hang up
Connect Error: Error: socket hang up
Connect Error: Error: socket hang up

client - 14322 ms
    should create a new client - 5 ms
    should connect to a server - 10239 ms
    should subscribe to a topic - 2042 ms
    should send and receive a message - 2035 ms

BasicTest - 13346 ms
    it should create and connect and disconnect to a server. - 2037 ms
    it should fallback from MQTTv3.1.1 to v3.1 - 4078 ms
    it should connect to a list of server(HA connection). - 2087 ms
    it should publish and subscribe. - 5140 ms
    check message properties. - 4 ms

client-uris - 10242 ms
    should create a new client with a default path - 0 ms
    should create a new client with a path - 0 ms
    should create a new client with a uri - 1 ms
    should fail to create a new client with an invalid ws uri - 0 ms
    should connect and disconnect to a server using connectoptions hosts - 10240 ms

InteropsTests - 15338 ms
    should connect, disconnect, subscribe, publish and receive messages - 5074 ms
    should connect, attempt to connect again and fail - 5136 ms
    should connect successfully with a 0 length clientid with cleansession true - 5114 ms
    should fail to connect successfully with a 0 length clientid with cleansession false - 14 ms

LiveTakeOver - 10197 ms
    should be taken over by another client for the actively doing work. - 10197 ms

SendReceive - 50902 ms
    should connect to a server and disconnect from a server - 10172 ms
    should pub/sub using largish messages - 10181 ms
    should preserve QOS values between publishers and subscribers - 10189 ms
    should work using multiple publishers and subscribers. - 10181 ms
    should clean up before re-connecting if cleanSession flag is set. - 10179 ms

Failures:

  1) client should connect to a server
   Message:
     timeout: timed out after 10000 msec waiting for the client should connect
   Stacktrace:
     undefined

  2) client should subscribe to a topic
   Message:
     Error: AMQJS0011E Invalid state not connected.
   Stacktrace:
     Error: AMQJS0011E Invalid state not connected.
    at LibraryFactory.ClientImpl.subscribe (/jobs/genie.paho/paho-javascript-master/workspace/target/paho-mqtt.js:890:10)
    at Object.subscribe (/jobs/genie.paho/paho-javascript-master/workspace/target/paho-mqtt.js:2053:11)
    at null.<anonymous> (/jobs/genie.paho/paho-javascript-master/workspace/target/test/base-spec.js:55:11)

  3) client should subscribe to a topic
   Message:
     timeout: timed out after 2000 msec waiting for the client should subscribe
   Stacktrace:
     undefined

  4) client should send and receive a message
   Message:
     Error: AMQJS0011E Invalid state not connected.
   Stacktrace:
     Error: AMQJS0011E Invalid state not connected.
    at LibraryFactory.ClientImpl.send (/jobs/genie.paho/paho-javascript-master/workspace/target/paho-mqtt.js:978:11)
    at Object.send (/jobs/genie.paho/paho-javascript-master/workspace/target/paho-mqtt.js:2134:12)
    at null.<anonymous> (/jobs/genie.paho/paho-javascript-master/workspace/target/test/base-spec.js:71:11)

  5) client should send and receive a message
   Message:
     timeout: timed out after 2000 msec waiting for the client should send and receive a message
   Stacktrace:
     undefined

  6) BasicTest it should create and connect and disconnect to a server.
   Message:
     timeout: timed out after 2000 msec waiting for the client should connect
   Stacktrace:
     undefined

  7) BasicTest it should fallback from MQTTv3.1.1 to v3.1
   Message:
     timeout: timed out after 4000 msec waiting for the client should connect
   Stacktrace:
     undefined

  8) BasicTest it should connect to a list of server(HA connection).
   Message:
     timeout: timed out after 2000 msec waiting for the client should connect
   Stacktrace:
     undefined

  9) BasicTest it should publish and subscribe.
   Message:
     timeout: timed out after 5000 msec waiting for the client should connect
   Stacktrace:
     undefined

  10) client-uris should connect and disconnect to a server using connectoptions hosts
   Message:
     timeout: timed out after 10000 msec waiting for the client should connect
   Stacktrace:
     undefined

  11) InteropsTests should connect, disconnect, subscribe, publish and receive messages
   Message:
     timeout: timed out after 5000 msec waiting for the client should connect
   Stacktrace:
     undefined

  12) InteropsTests should connect, attempt to connect again and fail
   Message:
     timeout: timed out after 5000 msec waiting for the client should connect
   Stacktrace:
     undefined

  13) InteropsTests should connect successfully with a 0 length clientid with cleansession true
   Message:
     timeout: timed out after 5000 msec waiting for the client should connect
   Stacktrace:
     undefined

  14) LiveTakeOver should be taken over by another client for the actively doing work.
   Message:
     timeout: timed out after 10000 msec waiting for the client should connect
   Stacktrace:
     undefined

  15) SendReceive should connect to a server and disconnect from a server
   Message:
     timeout: timed out after 10000 msec waiting for the client should connect
   Stacktrace:
     undefined

  16) SendReceive should pub/sub using largish messages
   Message:
     timeout: timed out after 10000 msec waiting for the client should connect
   Stacktrace:
     undefined

  17) SendReceive should preserve QOS values between publishers and subscribers
   Message:
     timeout: timed out after 10000 msec waiting for the client should connect
   Stacktrace:
     undefined

  18) SendReceive should work using multiple publishers and subscribers.
   Message:
     timeout: timed out after 10000 msec waiting for the client should connect
   Stacktrace:
     undefined

  19) SendReceive should clean up before re-connecting if cleanSession flag is set.
   Message:
     timeout: timed out after 10000 msec waiting for the client should connect
   Stacktrace:
     undefined

Finished in 114.358 seconds
24 tests, 63 assertions, 19 failures, 0 skipped


[INFO] ------------------------------------------------------------------------
[INFO] BUILD FAILURE
[INFO] ------------------------------------------------------------------------
[INFO] Total time: 3:35.144s
[INFO] Finished at: Tue Jul 25 10:04:19 EDT 2017
[INFO] Final Memory: 25M/1469M
[INFO] ------------------------------------------------------------------------
[INFO] o.h.m.e.h.MavenExecutionResultHandler - Build failed with exception(s)
[INFO] o.h.m.e.h.MavenExecutionResultHandler - [1] org.apache.maven.lifecycle.LifecycleExecutionException: Failed to execute goal org.codehaus.mojo:exec-maven-plugin:1.2.1:exec (test) on project paho.javascript: Command execution failed.
[DEBUG] Closing connection to remote
[ERROR] Failed to execute goal org.codehaus.mojo:exec-maven-plugin:1.2.1:exec (test) on project paho.javascript: Command execution failed. Process exited with an error: 1 (Exit value: 1) -> [Help 1]
[ERROR] 
[ERROR] To see the full stack trace of the errors, re-run Maven with the -e switch.
[ERROR] Re-run Maven using the -X switch to enable full debug logging.
[ERROR] 
[ERROR] For more information about the errors and possible solutions, please read the following articles:
[ERROR] [Help 1] http://cwiki.apache.org/confluence/display/MAVEN/MojoExecutionException
[DEBUG] Waiting for process to finish
[DEBUG] Result: 1
Finished: FAILURE