FailedConsole Output

Started by user icraggs@uk.ibm.com
Building in workspace /home/hudson/genie.paho/.jenkins/jobs/paho-java-master-release-03/workspace
[WS-CLEANUP] Deleting project workspace...
[WS-CLEANUP] Deferred wipeout is used...
No credentials specified
Wiping out workspace first.
Cloning the remote Git repository
Cloning repository https://github.com/eclipse/paho.mqtt.java.git
 > /usr/local/bin/git init /home/hudson/genie.paho/.jenkins/jobs/paho-java-master-release-03/workspace # timeout=10
Fetching upstream changes from https://github.com/eclipse/paho.mqtt.java.git
 > /usr/local/bin/git --version # timeout=10
 > /usr/local/bin/git fetch --tags --progress https://github.com/eclipse/paho.mqtt.java.git +refs/heads/*:refs/remotes/origin/*
 > /usr/local/bin/git config remote.origin.url https://github.com/eclipse/paho.mqtt.java.git # timeout=10
 > /usr/local/bin/git config --add remote.origin.fetch +refs/heads/*:refs/remotes/origin/* # timeout=10
 > /usr/local/bin/git config remote.origin.url https://github.com/eclipse/paho.mqtt.java.git # timeout=10
Fetching upstream changes from https://github.com/eclipse/paho.mqtt.java.git
 > /usr/local/bin/git fetch --tags --progress https://github.com/eclipse/paho.mqtt.java.git +refs/heads/*:refs/remotes/origin/*
 > /usr/local/bin/git rev-parse origin/master^{commit} # timeout=10
Checking out Revision 33ff80394da6985af9afc1db643f442bb645446c (origin/master)
 > /usr/local/bin/git config core.sparsecheckout # timeout=10
 > /usr/local/bin/git checkout -f 33ff80394da6985af9afc1db643f442bb645446c
Commit message: " Remove 'qualifier' level for 1.2.2 release"
First time build. Skipping changelog.
[workspace] $ /shared/common/apache-maven-latest/bin/mvn -f pom.xml -s /opt/public/hipp/homes/genie.paho/.m2/settings-deploy-ossrh.xml -Dmaven.javadoc.skip=true clean package deploy:deploy -Peclipse-sign -e -DskipTests -DskipNexusStagingDeployMojo=true -pl org.eclipse.paho.client.mqttv3 -Dmaven.javadoc.skip=true
Picked up JAVA_TOOL_OPTIONS: -Xmx2G -Djava.io.tmpdir=/tmp/genie.paho
[INFO] Error stacktraces are turned on.
[INFO] Scanning for projects...
[WARNING] No explicit target runtime environment configuration. Build is platform dependent.
[INFO] Computing target platform for MavenProject: org.eclipse.paho:org.eclipse.paho.client.mqttv3:1.2.2 @ /jobs/genie.paho/paho-java-master-release-03/workspace/org.eclipse.paho.client.mqttv3/pom.xml
[INFO] Resolving dependencies of MavenProject: org.eclipse.paho:org.eclipse.paho.client.mqttv3:1.2.2 @ /jobs/genie.paho/paho-java-master-release-03/workspace/org.eclipse.paho.client.mqttv3/pom.xml
[WARNING] The following locally built units have been used to resolve project dependencies:
[WARNING]   org.eclipse.paho.client.mqttv3.source/1.2.2
[WARNING]   org.eclipse.paho.client.mqttv3/1.2.2
[INFO] Resolving class path of MavenProject: org.eclipse.paho:org.eclipse.paho.client.mqttv3:1.2.2 @ /jobs/genie.paho/paho-java-master-release-03/workspace/org.eclipse.paho.client.mqttv3/pom.xml
[INFO] Inspecting build with total of 1 modules...
[INFO] Installing Nexus Staging features:
[INFO]   ... total of 1 executions of maven-deploy-plugin replaced with nexus-staging-maven-plugin
[INFO] 
[INFO] ----------< org.eclipse.paho:org.eclipse.paho.client.mqttv3 >-----------
[INFO] Building org.eclipse.paho.client.mqttv3 1.2.2
[INFO] ---------------------------[ eclipse-plugin ]---------------------------
[INFO] 
[INFO] --- maven-clean-plugin:2.5:clean (default-clean) @ org.eclipse.paho.client.mqttv3 ---
[INFO] 
[INFO] --- tycho-packaging-plugin:1.1.0:build-qualifier (default-build-qualifier) @ org.eclipse.paho.client.mqttv3 ---
[INFO] The project's OSGi version is 1.2.2
[INFO] 
[INFO] --- tycho-packaging-plugin:1.1.0:validate-id (default-validate-id) @ org.eclipse.paho.client.mqttv3 ---
[INFO] 
[INFO] --- tycho-packaging-plugin:1.1.0:validate-version (default-validate-version) @ org.eclipse.paho.client.mqttv3 ---
[INFO] 
[INFO] --- jacoco-maven-plugin:0.8.2:prepare-agent (default) @ org.eclipse.paho.client.mqttv3 ---
[INFO] argLine set to -javaagent:/opt/public/hipp/homes/genie.paho/.m2/repository/org/jacoco/org.jacoco.agent/0.8.2/org.jacoco.agent-0.8.2-runtime.jar=destfile=/jobs/genie.paho/paho-java-master-release-03/workspace/org.eclipse.paho.client.mqttv3/target/jacoco.exec
[INFO] 
[INFO] --- templating-maven-plugin:1.0.0:filter-sources (filter-src) @ org.eclipse.paho.client.mqttv3 ---
[INFO] Coping files with filtering to temporary directory.
[INFO] Using 'UTF-8' encoding to copy filtered resources.
[INFO] Copying 1 resource
[INFO] Copied 1 files to output directory: /jobs/genie.paho/paho-java-master-release-03/workspace/org.eclipse.paho.client.mqttv3/target/generated-sources/java-templates
[INFO] Source directory: /jobs/genie.paho/paho-java-master-release-03/workspace/org.eclipse.paho.client.mqttv3/target/generated-sources/java-templates added.
[INFO] 
[INFO] --- maven-resources-plugin:3.0.2:resources (default-resources) @ org.eclipse.paho.client.mqttv3 ---
[INFO] Using 'UTF-8' encoding to copy filtered resources.
[INFO] Copying 17 resources
[INFO] 
[INFO] --- maven-resources-plugin:3.0.2:copy-resources (default-copy-resources) @ org.eclipse.paho.client.mqttv3 ---
[INFO] Using 'UTF-8' encoding to copy filtered resources.
[INFO] Copying 1 resource
[INFO] 
[INFO] --- tycho-compiler-plugin:1.1.0:compile (default-compile) @ org.eclipse.paho.client.mqttv3 ---
[INFO] Compiling 94 source files to /jobs/genie.paho/paho-java-master-release-03/workspace/org.eclipse.paho.client.mqttv3/target/classes
[INFO] 
[INFO] --- maven-resources-plugin:3.0.2:testResources (default-testResources) @ org.eclipse.paho.client.mqttv3 ---
[INFO] Using 'UTF-8' encoding to copy filtered resources.
[INFO] skip non existing resourceDirectory /jobs/genie.paho/paho-java-master-release-03/workspace/org.eclipse.paho.client.mqttv3/src/test/resources
[INFO] 
[INFO] --- tycho-source-plugin:1.1.0:plugin-source (plugin-source) @ org.eclipse.paho.client.mqttv3 ---
[WARNING] bundle localization file /jobs/genie.paho/paho-java-master-release-03/workspace/org.eclipse.paho.client.mqttv3/plugin.properties not found
[WARNING] Bundle-Name header not found in /jobs/genie.paho/paho-java-master-release-03/workspace/org.eclipse.paho.client.mqttv3/META-INF/MANIFEST.MF, fallback to Bundle-SymbolicName for source bundle
[WARNING] Bundle-Vendor header not found in /jobs/genie.paho/paho-java-master-release-03/workspace/org.eclipse.paho.client.mqttv3/META-INF/MANIFEST.MF, fallback to 'unknown' for source bundle
[INFO] Building jar: /jobs/genie.paho/paho-java-master-release-03/workspace/org.eclipse.paho.client.mqttv3/target/org.eclipse.paho.client.mqttv3-1.2.2-sources.jar
[INFO] 
[INFO] --- target-platform-configuration:1.1.0:target-platform (default-target-platform) @ org.eclipse.paho.client.mqttv3 ---
[INFO] 
[INFO] --- tycho-packaging-plugin:1.1.0:package-plugin (default-package-plugin) @ org.eclipse.paho.client.mqttv3 ---
[INFO] Building jar: /jobs/genie.paho/paho-java-master-release-03/workspace/org.eclipse.paho.client.mqttv3/target/org.eclipse.paho.client.mqttv3-1.2.2.jar
[INFO] 
[INFO] --- tycho-p2-plugin:1.1.0:p2-metadata-default (default-p2-metadata-default) @ org.eclipse.paho.client.mqttv3 ---
[INFO] 
[INFO] --- maven-javadoc-plugin:3.0.1:jar (attach-javadocs) @ org.eclipse.paho.client.mqttv3 ---
[INFO] Skipping javadoc generation
[INFO] 
[INFO] --- maven-deploy-plugin:2.8.2:deploy (default-cli) @ org.eclipse.paho.client.mqttv3 ---
Uploading to repo.eclipse.org: https://repo.eclipse.org/content/repositories/paho-releases/org/eclipse/paho/org.eclipse.paho.client.mqttv3/1.2.2/org.eclipse.paho.client.mqttv3-1.2.2.jar
Progress (1): 2.0/223 kB
Progress (1): 4.1/223 kB
Progress (1): 6.1/223 kB
Progress (1): 8.2/223 kB
Progress (1): 10/223 kB 
Progress (1): 12/223 kB
Progress (1): 14/223 kB
Progress (1): 16/223 kB
Progress (1): 18/223 kB
Progress (1): 20/223 kB
Progress (1): 23/223 kB
Progress (1): 25/223 kB
Progress (1): 27/223 kB
Progress (1): 29/223 kB
Progress (1): 31/223 kB
Progress (1): 33/223 kB
Progress (1): 35/223 kB
Progress (1): 37/223 kB
Progress (1): 39/223 kB
Progress (1): 41/223 kB
Progress (1): 43/223 kB
Progress (1): 45/223 kB
Progress (1): 47/223 kB
Progress (1): 49/223 kB
Progress (1): 51/223 kB
Progress (1): 53/223 kB
Progress (1): 55/223 kB
Progress (1): 57/223 kB
Progress (1): 59/223 kB
Progress (1): 61/223 kB
Progress (1): 63/223 kB
Progress (1): 66/223 kB
Progress (1): 68/223 kB
Progress (1): 70/223 kB
Progress (1): 72/223 kB
Progress (1): 74/223 kB
Progress (1): 76/223 kB
Progress (1): 78/223 kB
Progress (1): 80/223 kB
Progress (1): 82/223 kB
Progress (1): 84/223 kB
Progress (1): 86/223 kB
Progress (1): 88/223 kB
Progress (1): 90/223 kB
Progress (1): 92/223 kB
Progress (1): 94/223 kB
Progress (1): 96/223 kB
Progress (1): 98/223 kB
Progress (1): 100/223 kB
Progress (1): 102/223 kB
Progress (1): 104/223 kB
Progress (1): 106/223 kB
Progress (1): 109/223 kB
Progress (1): 111/223 kB
Progress (1): 113/223 kB
Progress (1): 115/223 kB
Progress (1): 117/223 kB
Progress (1): 119/223 kB
Progress (1): 121/223 kB
Progress (1): 123/223 kB
Progress (1): 125/223 kB
Progress (1): 127/223 kB
Progress (1): 129/223 kB
Progress (1): 131/223 kB
Progress (1): 133/223 kB
Progress (1): 135/223 kB
Progress (1): 137/223 kB
Progress (1): 139/223 kB
Progress (1): 141/223 kB
Progress (1): 143/223 kB
Progress (1): 145/223 kB
Progress (1): 147/223 kB
Progress (1): 150/223 kB
Progress (1): 152/223 kB
Progress (1): 154/223 kB
Progress (1): 156/223 kB
Progress (1): 158/223 kB
Progress (1): 160/223 kB
Progress (1): 162/223 kB
Progress (1): 164/223 kB
Progress (1): 166/223 kB
Progress (1): 168/223 kB
Progress (1): 170/223 kB
Progress (1): 172/223 kB
Progress (1): 174/223 kB
Progress (1): 176/223 kB
Progress (1): 178/223 kB
Progress (1): 180/223 kB
Progress (1): 182/223 kB
Progress (1): 184/223 kB
Progress (1): 186/223 kB
Progress (1): 188/223 kB
Progress (1): 190/223 kB
Progress (1): 193/223 kB
Progress (1): 195/223 kB
Progress (1): 197/223 kB
Progress (1): 199/223 kB
Progress (1): 201/223 kB
Progress (1): 203/223 kB
Progress (1): 205/223 kB
Progress (1): 207/223 kB
Progress (1): 209/223 kB
Progress (1): 211/223 kB
Progress (1): 213/223 kB
Progress (1): 215/223 kB
Progress (1): 217/223 kB
Progress (1): 219/223 kB
Progress (1): 221/223 kB
Progress (1): 223 kB    
                    
Uploading to repo.eclipse.org: https://repo.eclipse.org/content/repositories/paho-releases/org/eclipse/paho/org.eclipse.paho.client.mqttv3/1.2.2/org.eclipse.paho.client.mqttv3-1.2.2.pom
Progress (1): 2.0/3.9 kB
Progress (1): 3.9 kB    
                    
[INFO] ------------------------------------------------------------------------
[INFO] BUILD FAILURE
[INFO] ------------------------------------------------------------------------
[INFO] Total time:  7.387 s
[INFO] Finished at: 2019-09-23T11:33:56-04:00
[INFO] ------------------------------------------------------------------------
[ERROR] Failed to execute goal org.apache.maven.plugins:maven-deploy-plugin:2.8.2:deploy (default-cli) on project org.eclipse.paho.client.mqttv3: Failed to deploy artifacts: Could not transfer artifact org.eclipse.paho:org.eclipse.paho.client.mqttv3:jar:1.2.2 from/to repo.eclipse.org (https://repo.eclipse.org/content/repositories/paho-releases/): Failed to transfer file https://repo.eclipse.org/content/repositories/paho-releases/org/eclipse/paho/org.eclipse.paho.client.mqttv3/1.2.2/org.eclipse.paho.client.mqttv3-1.2.2.jar with status code 401 -> [Help 1]
org.apache.maven.lifecycle.LifecycleExecutionException: Failed to execute goal org.apache.maven.plugins:maven-deploy-plugin:2.8.2:deploy (default-cli) on project org.eclipse.paho.client.mqttv3: Failed to deploy artifacts: Could not transfer artifact org.eclipse.paho:org.eclipse.paho.client.mqttv3:jar:1.2.2 from/to repo.eclipse.org (https://repo.eclipse.org/content/repositories/paho-releases/): Failed to transfer file https://repo.eclipse.org/content/repositories/paho-releases/org/eclipse/paho/org.eclipse.paho.client.mqttv3/1.2.2/org.eclipse.paho.client.mqttv3-1.2.2.jar with status code 401
    at org.apache.maven.lifecycle.internal.MojoExecutor.execute (MojoExecutor.java:215)
    at org.apache.maven.lifecycle.internal.MojoExecutor.execute (MojoExecutor.java:156)
    at org.apache.maven.lifecycle.internal.MojoExecutor.execute (MojoExecutor.java:148)
    at org.apache.maven.lifecycle.internal.LifecycleModuleBuilder.buildProject (LifecycleModuleBuilder.java:117)
    at org.apache.maven.lifecycle.internal.LifecycleModuleBuilder.buildProject (LifecycleModuleBuilder.java:81)
    at org.apache.maven.lifecycle.internal.builder.singlethreaded.SingleThreadedBuilder.build (SingleThreadedBuilder.java:56)
    at org.apache.maven.lifecycle.internal.LifecycleStarter.execute (LifecycleStarter.java:128)
    at org.apache.maven.DefaultMaven.doExecute (DefaultMaven.java:305)
    at org.apache.maven.DefaultMaven.doExecute (DefaultMaven.java:192)
    at org.apache.maven.DefaultMaven.execute (DefaultMaven.java:105)
    at org.apache.maven.cli.MavenCli.execute (MavenCli.java:956)
    at org.apache.maven.cli.MavenCli.doMain (MavenCli.java:288)
    at org.apache.maven.cli.MavenCli.main (MavenCli.java:192)
    at sun.reflect.NativeMethodAccessorImpl.invoke0 (Native Method)
    at sun.reflect.NativeMethodAccessorImpl.invoke (NativeMethodAccessorImpl.java:62)
    at sun.reflect.DelegatingMethodAccessorImpl.invoke (DelegatingMethodAccessorImpl.java:43)
    at java.lang.reflect.Method.invoke (Method.java:498)
    at org.codehaus.plexus.classworlds.launcher.Launcher.launchEnhanced (Launcher.java:289)
    at org.codehaus.plexus.classworlds.launcher.Launcher.launch (Launcher.java:229)
    at org.codehaus.plexus.classworlds.launcher.Launcher.mainWithExitCode (Launcher.java:415)
    at org.codehaus.plexus.classworlds.launcher.Launcher.main (Launcher.java:356)
Caused by: org.apache.maven.plugin.MojoExecutionException: Failed to deploy artifacts: Could not transfer artifact org.eclipse.paho:org.eclipse.paho.client.mqttv3:jar:1.2.2 from/to repo.eclipse.org (https://repo.eclipse.org/content/repositories/paho-releases/): Failed to transfer file https://repo.eclipse.org/content/repositories/paho-releases/org/eclipse/paho/org.eclipse.paho.client.mqttv3/1.2.2/org.eclipse.paho.client.mqttv3-1.2.2.jar with status code 401
    at org.apache.maven.plugin.deploy.DeployMojo.deployProject (DeployMojo.java:284)
    at org.apache.maven.plugin.deploy.DeployMojo.execute (DeployMojo.java:185)
    at org.apache.maven.plugin.DefaultBuildPluginManager.executeMojo (DefaultBuildPluginManager.java:137)
    at org.apache.maven.lifecycle.internal.MojoExecutor.execute (MojoExecutor.java:210)
    at org.apache.maven.lifecycle.internal.MojoExecutor.execute (MojoExecutor.java:156)
    at org.apache.maven.lifecycle.internal.MojoExecutor.execute (MojoExecutor.java:148)
    at org.apache.maven.lifecycle.internal.LifecycleModuleBuilder.buildProject (LifecycleModuleBuilder.java:117)
    at org.apache.maven.lifecycle.internal.LifecycleModuleBuilder.buildProject (LifecycleModuleBuilder.java:81)
    at org.apache.maven.lifecycle.internal.builder.singlethreaded.SingleThreadedBuilder.build (SingleThreadedBuilder.java:56)
    at org.apache.maven.lifecycle.internal.LifecycleStarter.execute (LifecycleStarter.java:128)
    at org.apache.maven.DefaultMaven.doExecute (DefaultMaven.java:305)
    at org.apache.maven.DefaultMaven.doExecute (DefaultMaven.java:192)
    at org.apache.maven.DefaultMaven.execute (DefaultMaven.java:105)
    at org.apache.maven.cli.MavenCli.execute (MavenCli.java:956)
    at org.apache.maven.cli.MavenCli.doMain (MavenCli.java:288)
    at org.apache.maven.cli.MavenCli.main (MavenCli.java:192)
    at sun.reflect.NativeMethodAccessorImpl.invoke0 (Native Method)
    at sun.reflect.NativeMethodAccessorImpl.invoke (NativeMethodAccessorImpl.java:62)
    at sun.reflect.DelegatingMethodAccessorImpl.invoke (DelegatingMethodAccessorImpl.java:43)
    at java.lang.reflect.Method.invoke (Method.java:498)
    at org.codehaus.plexus.classworlds.launcher.Launcher.launchEnhanced (Launcher.java:289)
    at org.codehaus.plexus.classworlds.launcher.Launcher.launch (Launcher.java:229)
    at org.codehaus.plexus.classworlds.launcher.Launcher.mainWithExitCode (Launcher.java:415)
    at org.codehaus.plexus.classworlds.launcher.Launcher.main (Launcher.java:356)
Caused by: org.apache.maven.artifact.deployer.ArtifactDeploymentException: Failed to deploy artifacts: Could not transfer artifact org.eclipse.paho:org.eclipse.paho.client.mqttv3:jar:1.2.2 from/to repo.eclipse.org (https://repo.eclipse.org/content/repositories/paho-releases/): Failed to transfer file https://repo.eclipse.org/content/repositories/paho-releases/org/eclipse/paho/org.eclipse.paho.client.mqttv3/1.2.2/org.eclipse.paho.client.mqttv3-1.2.2.jar with status code 401
    at org.apache.maven.artifact.deployer.DefaultArtifactDeployer.deploy (DefaultArtifactDeployer.java:146)
    at org.apache.maven.plugin.deploy.AbstractDeployMojo.deploy (AbstractDeployMojo.java:171)
    at org.apache.maven.plugin.deploy.DeployMojo.deployProject (DeployMojo.java:250)
    at org.apache.maven.plugin.deploy.DeployMojo.execute (DeployMojo.java:185)
    at org.apache.maven.plugin.DefaultBuildPluginManager.executeMojo (DefaultBuildPluginManager.java:137)
    at org.apache.maven.lifecycle.internal.MojoExecutor.execute (MojoExecutor.java:210)
    at org.apache.maven.lifecycle.internal.MojoExecutor.execute (MojoExecutor.java:156)
    at org.apache.maven.lifecycle.internal.MojoExecutor.execute (MojoExecutor.java:148)
    at org.apache.maven.lifecycle.internal.LifecycleModuleBuilder.buildProject (LifecycleModuleBuilder.java:117)
    at org.apache.maven.lifecycle.internal.LifecycleModuleBuilder.buildProject (LifecycleModuleBuilder.java:81)
    at org.apache.maven.lifecycle.internal.builder.singlethreaded.SingleThreadedBuilder.build (SingleThreadedBuilder.java:56)
    at org.apache.maven.lifecycle.internal.LifecycleStarter.execute (LifecycleStarter.java:128)
    at org.apache.maven.DefaultMaven.doExecute (DefaultMaven.java:305)
    at org.apache.maven.DefaultMaven.doExecute (DefaultMaven.java:192)
    at org.apache.maven.DefaultMaven.execute (DefaultMaven.java:105)
    at org.apache.maven.cli.MavenCli.execute (MavenCli.java:956)
    at org.apache.maven.cli.MavenCli.doMain (MavenCli.java:288)
    at org.apache.maven.cli.MavenCli.main (MavenCli.java:192)
    at sun.reflect.NativeMethodAccessorImpl.invoke0 (Native Method)
    at sun.reflect.NativeMethodAccessorImpl.invoke (NativeMethodAccessorImpl.java:62)
    at sun.reflect.DelegatingMethodAccessorImpl.invoke (DelegatingMethodAccessorImpl.java:43)
    at java.lang.reflect.Method.invoke (Method.java:498)
    at org.codehaus.plexus.classworlds.launcher.Launcher.launchEnhanced (Launcher.java:289)
    at org.codehaus.plexus.classworlds.launcher.Launcher.launch (Launcher.java:229)
    at org.codehaus.plexus.classworlds.launcher.Launcher.mainWithExitCode (Launcher.java:415)
    at org.codehaus.plexus.classworlds.launcher.Launcher.main (Launcher.java:356)
Caused by: org.eclipse.aether.deployment.DeploymentException: Failed to deploy artifacts: Could not transfer artifact org.eclipse.paho:org.eclipse.paho.client.mqttv3:jar:1.2.2 from/to repo.eclipse.org (https://repo.eclipse.org/content/repositories/paho-releases/): Failed to transfer file https://repo.eclipse.org/content/repositories/paho-releases/org/eclipse/paho/org.eclipse.paho.client.mqttv3/1.2.2/org.eclipse.paho.client.mqttv3-1.2.2.jar with status code 401
    at org.eclipse.aether.internal.impl.DefaultDeployer.deploy (DefaultDeployer.java:301)
    at org.eclipse.aether.internal.impl.DefaultDeployer.deploy (DefaultDeployer.java:211)
    at org.eclipse.aether.internal.impl.DefaultRepositorySystem.deploy (DefaultRepositorySystem.java:371)
    at org.apache.maven.artifact.deployer.DefaultArtifactDeployer.deploy (DefaultArtifactDeployer.java:142)
    at org.apache.maven.plugin.deploy.AbstractDeployMojo.deploy (AbstractDeployMojo.java:171)
    at org.apache.maven.plugin.deploy.DeployMojo.deployProject (DeployMojo.java:250)
    at org.apache.maven.plugin.deploy.DeployMojo.execute (DeployMojo.java:185)
    at org.apache.maven.plugin.DefaultBuildPluginManager.executeMojo (DefaultBuildPluginManager.java:137)
    at org.apache.maven.lifecycle.internal.MojoExecutor.execute (MojoExecutor.java:210)
    at org.apache.maven.lifecycle.internal.MojoExecutor.execute (MojoExecutor.java:156)
    at org.apache.maven.lifecycle.internal.MojoExecutor.execute (MojoExecutor.java:148)
    at org.apache.maven.lifecycle.internal.LifecycleModuleBuilder.buildProject (LifecycleModuleBuilder.java:117)
    at org.apache.maven.lifecycle.internal.LifecycleModuleBuilder.buildProject (LifecycleModuleBuilder.java:81)
    at org.apache.maven.lifecycle.internal.builder.singlethreaded.SingleThreadedBuilder.build (SingleThreadedBuilder.java:56)
    at org.apache.maven.lifecycle.internal.LifecycleStarter.execute (LifecycleStarter.java:128)
    at org.apache.maven.DefaultMaven.doExecute (DefaultMaven.java:305)
    at org.apache.maven.DefaultMaven.doExecute (DefaultMaven.java:192)
    at org.apache.maven.DefaultMaven.execute (DefaultMaven.java:105)
    at org.apache.maven.cli.MavenCli.execute (MavenCli.java:956)
    at org.apache.maven.cli.MavenCli.doMain (MavenCli.java:288)
    at org.apache.maven.cli.MavenCli.main (MavenCli.java:192)
    at sun.reflect.NativeMethodAccessorImpl.invoke0 (Native Method)
    at sun.reflect.NativeMethodAccessorImpl.invoke (NativeMethodAccessorImpl.java:62)
    at sun.reflect.DelegatingMethodAccessorImpl.invoke (DelegatingMethodAccessorImpl.java:43)
    at java.lang.reflect.Method.invoke (Method.java:498)
    at org.codehaus.plexus.classworlds.launcher.Launcher.launchEnhanced (Launcher.java:289)
    at org.codehaus.plexus.classworlds.launcher.Launcher.launch (Launcher.java:229)
    at org.codehaus.plexus.classworlds.launcher.Launcher.mainWithExitCode (Launcher.java:415)
    at org.codehaus.plexus.classworlds.launcher.Launcher.main (Launcher.java:356)
Caused by: org.eclipse.aether.transfer.ArtifactTransferException: Could not transfer artifact org.eclipse.paho:org.eclipse.paho.client.mqttv3:jar:1.2.2 from/to repo.eclipse.org (https://repo.eclipse.org/content/repositories/paho-releases/): Failed to transfer file https://repo.eclipse.org/content/repositories/paho-releases/org/eclipse/paho/org.eclipse.paho.client.mqttv3/1.2.2/org.eclipse.paho.client.mqttv3-1.2.2.jar with status code 401
    at org.eclipse.aether.connector.basic.ArtifactTransportListener.transferFailed (ArtifactTransportListener.java:52)
    at org.eclipse.aether.connector.basic.BasicRepositoryConnector$TaskRunner.run (BasicRepositoryConnector.java:368)
    at org.eclipse.aether.connector.basic.BasicRepositoryConnector.put (BasicRepositoryConnector.java:287)
    at org.eclipse.aether.internal.impl.DefaultDeployer.deploy (DefaultDeployer.java:295)
    at org.eclipse.aether.internal.impl.DefaultDeployer.deploy (DefaultDeployer.java:211)
    at org.eclipse.aether.internal.impl.DefaultRepositorySystem.deploy (DefaultRepositorySystem.java:371)
    at org.apache.maven.artifact.deployer.DefaultArtifactDeployer.deploy (DefaultArtifactDeployer.java:142)
    at org.apache.maven.plugin.deploy.AbstractDeployMojo.deploy (AbstractDeployMojo.java:171)
    at org.apache.maven.plugin.deploy.DeployMojo.deployProject (DeployMojo.java:250)
    at org.apache.maven.plugin.deploy.DeployMojo.execute (DeployMojo.java:185)
    at org.apache.maven.plugin.DefaultBuildPluginManager.executeMojo (DefaultBuildPluginManager.java:137)
    at org.apache.maven.lifecycle.internal.MojoExecutor.execute (MojoExecutor.java:210)
    at org.apache.maven.lifecycle.internal.MojoExecutor.execute (MojoExecutor.java:156)
    at org.apache.maven.lifecycle.internal.MojoExecutor.execute (MojoExecutor.java:148)
    at org.apache.maven.lifecycle.internal.LifecycleModuleBuilder.buildProject (LifecycleModuleBuilder.java:117)
    at org.apache.maven.lifecycle.internal.LifecycleModuleBuilder.buildProject (LifecycleModuleBuilder.java:81)
    at org.apache.maven.lifecycle.internal.builder.singlethreaded.SingleThreadedBuilder.build (SingleThreadedBuilder.java:56)
    at org.apache.maven.lifecycle.internal.LifecycleStarter.execute (LifecycleStarter.java:128)
    at org.apache.maven.DefaultMaven.doExecute (DefaultMaven.java:305)
    at org.apache.maven.DefaultMaven.doExecute (DefaultMaven.java:192)
    at org.apache.maven.DefaultMaven.execute (DefaultMaven.java:105)
    at org.apache.maven.cli.MavenCli.execute (MavenCli.java:956)
    at org.apache.maven.cli.MavenCli.doMain (MavenCli.java:288)
    at org.apache.maven.cli.MavenCli.main (MavenCli.java:192)
    at sun.reflect.NativeMethodAccessorImpl.invoke0 (Native Method)
    at sun.reflect.NativeMethodAccessorImpl.invoke (NativeMethodAccessorImpl.java:62)
    at sun.reflect.DelegatingMethodAccessorImpl.invoke (DelegatingMethodAccessorImpl.java:43)
    at java.lang.reflect.Method.invoke (Method.java:498)
    at org.codehaus.plexus.classworlds.launcher.Launcher.launchEnhanced (Launcher.java:289)
    at org.codehaus.plexus.classworlds.launcher.Launcher.launch (Launcher.java:229)
    at org.codehaus.plexus.classworlds.launcher.Launcher.mainWithExitCode (Launcher.java:415)
    at org.codehaus.plexus.classworlds.launcher.Launcher.main (Launcher.java:356)
Caused by: org.apache.maven.wagon.TransferFailedException: Failed to transfer file https://repo.eclipse.org/content/repositories/paho-releases/org/eclipse/paho/org.eclipse.paho.client.mqttv3/1.2.2/org.eclipse.paho.client.mqttv3-1.2.2.jar with status code 401
    at org.apache.maven.wagon.providers.http.wagon.shared.AbstractHttpClientWagon.put (AbstractHttpClientWagon.java:734)
    at org.apache.maven.wagon.providers.http.wagon.shared.AbstractHttpClientWagon.put (AbstractHttpClientWagon.java:648)
    at org.apache.maven.wagon.providers.http.wagon.shared.AbstractHttpClientWagon.put (AbstractHttpClientWagon.java:630)
    at org.apache.maven.wagon.providers.http.wagon.shared.AbstractHttpClientWagon.put (AbstractHttpClientWagon.java:624)
    at org.apache.maven.wagon.providers.http.wagon.shared.AbstractHttpClientWagon.put (AbstractHttpClientWagon.java:604)
    at org.eclipse.aether.transport.wagon.WagonTransporter$PutTaskRunner.run (WagonTransporter.java:686)
    at org.eclipse.aether.transport.wagon.WagonTransporter.execute (WagonTransporter.java:435)
    at org.eclipse.aether.transport.wagon.WagonTransporter.put (WagonTransporter.java:418)
    at org.eclipse.aether.connector.basic.BasicRepositoryConnector$PutTaskRunner.runTask (BasicRepositoryConnector.java:554)
    at org.eclipse.aether.connector.basic.BasicRepositoryConnector$TaskRunner.run (BasicRepositoryConnector.java:363)
    at org.eclipse.aether.connector.basic.BasicRepositoryConnector.put (BasicRepositoryConnector.java:287)
    at org.eclipse.aether.internal.impl.DefaultDeployer.deploy (DefaultDeployer.java:295)
    at org.eclipse.aether.internal.impl.DefaultDeployer.deploy (DefaultDeployer.java:211)
    at org.eclipse.aether.internal.impl.DefaultRepositorySystem.deploy (DefaultRepositorySystem.java:371)
    at org.apache.maven.artifact.deployer.DefaultArtifactDeployer.deploy (DefaultArtifactDeployer.java:142)
    at org.apache.maven.plugin.deploy.AbstractDeployMojo.deploy (AbstractDeployMojo.java:171)
    at org.apache.maven.plugin.deploy.DeployMojo.deployProject (DeployMojo.java:250)
    at org.apache.maven.plugin.deploy.DeployMojo.execute (DeployMojo.java:185)
    at org.apache.maven.plugin.DefaultBuildPluginManager.executeMojo (DefaultBuildPluginManager.java:137)
    at org.apache.maven.lifecycle.internal.MojoExecutor.execute (MojoExecutor.java:210)
    at org.apache.maven.lifecycle.internal.MojoExecutor.execute (MojoExecutor.java:156)
    at org.apache.maven.lifecycle.internal.MojoExecutor.execute (MojoExecutor.java:148)
    at org.apache.maven.lifecycle.internal.LifecycleModuleBuilder.buildProject (LifecycleModuleBuilder.java:117)
    at org.apache.maven.lifecycle.internal.LifecycleModuleBuilder.buildProject (LifecycleModuleBuilder.java:81)
    at org.apache.maven.lifecycle.internal.builder.singlethreaded.SingleThreadedBuilder.build (SingleThreadedBuilder.java:56)
    at org.apache.maven.lifecycle.internal.LifecycleStarter.execute (LifecycleStarter.java:128)
    at org.apache.maven.DefaultMaven.doExecute (DefaultMaven.java:305)
    at org.apache.maven.DefaultMaven.doExecute (DefaultMaven.java:192)
    at org.apache.maven.DefaultMaven.execute (DefaultMaven.java:105)
    at org.apache.maven.cli.MavenCli.execute (MavenCli.java:956)
    at org.apache.maven.cli.MavenCli.doMain (MavenCli.java:288)
    at org.apache.maven.cli.MavenCli.main (MavenCli.java:192)
    at sun.reflect.NativeMethodAccessorImpl.invoke0 (Native Method)
    at sun.reflect.NativeMethodAccessorImpl.invoke (NativeMethodAccessorImpl.java:62)
    at sun.reflect.DelegatingMethodAccessorImpl.invoke (DelegatingMethodAccessorImpl.java:43)
    at java.lang.reflect.Method.invoke (Method.java:498)
    at org.codehaus.plexus.classworlds.launcher.Launcher.launchEnhanced (Launcher.java:289)
    at org.codehaus.plexus.classworlds.launcher.Launcher.launch (Launcher.java:229)
    at org.codehaus.plexus.classworlds.launcher.Launcher.mainWithExitCode (Launcher.java:415)
    at org.codehaus.plexus.classworlds.launcher.Launcher.main (Launcher.java:356)
[ERROR] 
[ERROR] Re-run Maven using the -X switch to enable full debug logging.
[ERROR] 
[ERROR] For more information about the errors and possible solutions, please read the following articles:
[ERROR] [Help 1] http://cwiki.apache.org/confluence/display/MAVEN/MojoExecutionException
Build step 'Invoke top-level Maven targets' marked build as failure
Started calculate disk usage of build
Finished Calculation of disk usage of build in 0 seconds
Started calculate disk usage of workspace
Finished Calculation of disk usage of workspace in 0 seconds
Finished: FAILURE