FailedConsole Output

Started by user icraggs@uk.ibm.com
Building in workspace /home/hudson/genie.paho/.jenkins/jobs/paho-java-master-release/workspace
[WS-CLEANUP] Deleting project workspace...
[WS-CLEANUP] Deferred wipeout is used...
[WS-CLEANUP] Done
Wiping out workspace first.
Cloning the remote Git repository
Cloning repository https://github.com/eclipse/paho.mqtt.java.git
 > /usr/local/bin/git init /home/hudson/genie.paho/.jenkins/jobs/paho-java-master-release/workspace # timeout=10
Fetching upstream changes from https://github.com/eclipse/paho.mqtt.java.git
 > /usr/local/bin/git --version # timeout=10
 > /usr/local/bin/git fetch --tags --progress https://github.com/eclipse/paho.mqtt.java.git +refs/heads/*:refs/remotes/origin/*
 > /usr/local/bin/git config remote.origin.url https://github.com/eclipse/paho.mqtt.java.git # timeout=10
 > /usr/local/bin/git config --add remote.origin.fetch +refs/heads/*:refs/remotes/origin/* # timeout=10
 > /usr/local/bin/git config remote.origin.url https://github.com/eclipse/paho.mqtt.java.git # timeout=10
Fetching upstream changes from https://github.com/eclipse/paho.mqtt.java.git
 > /usr/local/bin/git fetch --tags --progress https://github.com/eclipse/paho.mqtt.java.git +refs/heads/*:refs/remotes/origin/*
 > /usr/local/bin/git rev-parse origin/master^{commit} # timeout=10
Checking out Revision 72f3a23274bcd4468e90ba43a11d54ef63a6b955 (origin/master)
 > /usr/local/bin/git config core.sparsecheckout # timeout=10
 > /usr/local/bin/git checkout -f 72f3a23274bcd4468e90ba43a11d54ef63a6b955
Commit message: "Update version of jarsigner plugin"
 > /usr/local/bin/git rev-list --no-walk 72f3a23274bcd4468e90ba43a11d54ef63a6b955 # timeout=10
[workspace] $ /shared/common/apache-maven-latest/bin/mvn -f pom.xml -Dmaven.javadoc.skip=true clean -Peclipse-sign -Pcreate_gpg_signature deploy -e -pl org.eclipse.paho.client.mqttv3,org.eclipse.paho.client.mqttv3.repository -am
Picked up JAVA_TOOL_OPTIONS: -Xmx2G -Djava.io.tmpdir=/tmp/genie.paho
[INFO] Error stacktraces are turned on.
[INFO] Scanning for projects...
[INFO] Inspecting build with total of 3 modules...
[INFO] Installing Nexus Staging features:
[INFO]   ... total of 3 executions of maven-deploy-plugin replaced with nexus-staging-maven-plugin
[WARNING] No explicit target runtime environment configuration. Build is platform dependent.
[WARNING] No explicit target runtime environment configuration. Build is platform dependent.
[INFO] Computing target platform for MavenProject: org.eclipse.paho:org.eclipse.paho.client.mqttv3:1.2.1 @ /jobs/genie.paho/paho-java-master-release/workspace/org.eclipse.paho.client.mqttv3/pom.xml
[INFO] Resolving dependencies of MavenProject: org.eclipse.paho:org.eclipse.paho.client.mqttv3:1.2.1 @ /jobs/genie.paho/paho-java-master-release/workspace/org.eclipse.paho.client.mqttv3/pom.xml
[WARNING] The following locally built units have been used to resolve project dependencies:
[WARNING]   org.eclipse.paho.client.mqttv3.source/1.2.1
[WARNING]   org.eclipse.paho.client.mqttv3/1.2.1
[INFO] Resolving class path of MavenProject: org.eclipse.paho:org.eclipse.paho.client.mqttv3:1.2.1 @ /jobs/genie.paho/paho-java-master-release/workspace/org.eclipse.paho.client.mqttv3/pom.xml
[INFO] Computing target platform for MavenProject: org.eclipse.paho:org.eclipse.paho.client.mqttv3.repository:1.2.1 @ /jobs/genie.paho/paho-java-master-release/workspace/org.eclipse.paho.client.mqttv3.repository/pom.xml
[INFO] Resolving dependencies of MavenProject: org.eclipse.paho:org.eclipse.paho.client.mqttv3.repository:1.2.1 @ /jobs/genie.paho/paho-java-master-release/workspace/org.eclipse.paho.client.mqttv3.repository/pom.xml
[WARNING] The following locally built units have been used to resolve project dependencies:
[WARNING]   org.eclipse.paho.client.mqttv3/1.2.1
[INFO] Resolving class path of MavenProject: org.eclipse.paho:org.eclipse.paho.client.mqttv3.repository:1.2.1 @ /jobs/genie.paho/paho-java-master-release/workspace/org.eclipse.paho.client.mqttv3.repository/pom.xml
[INFO] ------------------------------------------------------------------------
[INFO] Reactor Build Order:
[INFO] 
[INFO] Eclipse Paho                                                       [pom]
[INFO] org.eclipse.paho.client.mqttv3                          [eclipse-plugin]
[INFO] Paho P2 Repository                                  [eclipse-repository]
[INFO] 
[INFO] --------------------< org.eclipse.paho:java-parent >--------------------
[INFO] Building Eclipse Paho 1.2.1                                        [1/3]
[INFO] --------------------------------[ pom ]---------------------------------
[INFO] 
[INFO] --- maven-clean-plugin:2.5:clean (default-clean) @ java-parent ---
[INFO] 
[INFO] --- tycho-source-plugin:1.1.0:plugin-source (plugin-source) @ java-parent ---
[INFO] 
[INFO] --- tycho-pack200a-plugin:1.1.0:normalize (pack200-normalize) @ java-parent ---
[INFO] 
[INFO] --- eclipse-jarsigner-plugin:1.1.5:sign (sign) @ java-parent ---
[INFO] 
[INFO] --- tycho-pack200b-plugin:1.1.0:pack (pack200-pack) @ java-parent ---
[INFO] 
[INFO] --- tycho-p2-plugin:1.1.0:p2-metadata (p2-metadata) @ java-parent ---
[INFO] 
[INFO] --- maven-gpg-plugin:1.6:sign (sign-artifacts) @ java-parent ---
gpg: cannot open `/dev/tty': No such device or address
[INFO] ------------------------------------------------------------------------
[INFO] Reactor Summary:
[INFO] 
[INFO] Eclipse Paho 1.2.1 ................................. FAILURE [  1.689 s]
[INFO] org.eclipse.paho.client.mqttv3 ..................... SKIPPED
[INFO] Paho P2 Repository 1.2.1 ........................... SKIPPED
[INFO] ------------------------------------------------------------------------
[INFO] BUILD FAILURE
[INFO] ------------------------------------------------------------------------
[INFO] Total time: 5.944 s
[INFO] Finished at: 2019-02-20T18:28:53-05:00
[INFO] ------------------------------------------------------------------------
[ERROR] Failed to execute goal org.apache.maven.plugins:maven-gpg-plugin:1.6:sign (sign-artifacts) on project java-parent: Exit code: 2 -> [Help 1]
org.apache.maven.lifecycle.LifecycleExecutionException: Failed to execute goal org.apache.maven.plugins:maven-gpg-plugin:1.6:sign (sign-artifacts) on project java-parent: Exit code: 2
    at org.apache.maven.lifecycle.internal.MojoExecutor.execute (MojoExecutor.java:213)
    at org.apache.maven.lifecycle.internal.MojoExecutor.execute (MojoExecutor.java:154)
    at org.apache.maven.lifecycle.internal.MojoExecutor.execute (MojoExecutor.java:146)
    at org.apache.maven.lifecycle.internal.LifecycleModuleBuilder.buildProject (LifecycleModuleBuilder.java:117)
    at org.apache.maven.lifecycle.internal.LifecycleModuleBuilder.buildProject (LifecycleModuleBuilder.java:81)
    at org.apache.maven.lifecycle.internal.builder.singlethreaded.SingleThreadedBuilder.build (SingleThreadedBuilder.java:56)
    at org.apache.maven.lifecycle.internal.LifecycleStarter.execute (LifecycleStarter.java:128)
    at org.apache.maven.DefaultMaven.doExecute (DefaultMaven.java:305)
    at org.apache.maven.DefaultMaven.doExecute (DefaultMaven.java:192)
    at org.apache.maven.DefaultMaven.execute (DefaultMaven.java:105)
    at org.apache.maven.cli.MavenCli.execute (MavenCli.java:954)
    at org.apache.maven.cli.MavenCli.doMain (MavenCli.java:288)
    at org.apache.maven.cli.MavenCli.main (MavenCli.java:192)
    at sun.reflect.NativeMethodAccessorImpl.invoke0 (Native Method)
    at sun.reflect.NativeMethodAccessorImpl.invoke (NativeMethodAccessorImpl.java:62)
    at sun.reflect.DelegatingMethodAccessorImpl.invoke (DelegatingMethodAccessorImpl.java:43)
    at java.lang.reflect.Method.invoke (Method.java:498)
    at org.codehaus.plexus.classworlds.launcher.Launcher.launchEnhanced (Launcher.java:289)
    at org.codehaus.plexus.classworlds.launcher.Launcher.launch (Launcher.java:229)
    at org.codehaus.plexus.classworlds.launcher.Launcher.mainWithExitCode (Launcher.java:415)
    at org.codehaus.plexus.classworlds.launcher.Launcher.main (Launcher.java:356)
Caused by: org.apache.maven.plugin.MojoExecutionException: Exit code: 2
    at org.apache.maven.plugin.gpg.GpgSigner.generateSignatureForFile (GpgSigner.java:167)
    at org.apache.maven.plugin.gpg.AbstractGpgSigner.generateSignatureForArtifact (AbstractGpgSigner.java:205)
    at org.apache.maven.plugin.gpg.GpgSignAttachedMojo.execute (GpgSignAttachedMojo.java:176)
    at org.apache.maven.plugin.DefaultBuildPluginManager.executeMojo (DefaultBuildPluginManager.java:137)
    at org.apache.maven.lifecycle.internal.MojoExecutor.execute (MojoExecutor.java:208)
    at org.apache.maven.lifecycle.internal.MojoExecutor.execute (MojoExecutor.java:154)
    at org.apache.maven.lifecycle.internal.MojoExecutor.execute (MojoExecutor.java:146)
    at org.apache.maven.lifecycle.internal.LifecycleModuleBuilder.buildProject (LifecycleModuleBuilder.java:117)
    at org.apache.maven.lifecycle.internal.LifecycleModuleBuilder.buildProject (LifecycleModuleBuilder.java:81)
    at org.apache.maven.lifecycle.internal.builder.singlethreaded.SingleThreadedBuilder.build (SingleThreadedBuilder.java:56)
    at org.apache.maven.lifecycle.internal.LifecycleStarter.execute (LifecycleStarter.java:128)
    at org.apache.maven.DefaultMaven.doExecute (DefaultMaven.java:305)
    at org.apache.maven.DefaultMaven.doExecute (DefaultMaven.java:192)
    at org.apache.maven.DefaultMaven.execute (DefaultMaven.java:105)
    at org.apache.maven.cli.MavenCli.execute (MavenCli.java:954)
    at org.apache.maven.cli.MavenCli.doMain (MavenCli.java:288)
    at org.apache.maven.cli.MavenCli.main (MavenCli.java:192)
    at sun.reflect.NativeMethodAccessorImpl.invoke0 (Native Method)
    at sun.reflect.NativeMethodAccessorImpl.invoke (NativeMethodAccessorImpl.java:62)
    at sun.reflect.DelegatingMethodAccessorImpl.invoke (DelegatingMethodAccessorImpl.java:43)
    at java.lang.reflect.Method.invoke (Method.java:498)
    at org.codehaus.plexus.classworlds.launcher.Launcher.launchEnhanced (Launcher.java:289)
    at org.codehaus.plexus.classworlds.launcher.Launcher.launch (Launcher.java:229)
    at org.codehaus.plexus.classworlds.launcher.Launcher.mainWithExitCode (Launcher.java:415)
    at org.codehaus.plexus.classworlds.launcher.Launcher.main (Launcher.java:356)
[ERROR] 
[ERROR] Re-run Maven using the -X switch to enable full debug logging.
[ERROR] 
[ERROR] For more information about the errors and possible solutions, please read the following articles:
[ERROR] [Help 1] http://cwiki.apache.org/confluence/display/MAVEN/MojoExecutionException
Build step 'Invoke top-level Maven targets' marked build as failure
Started calculate disk usage of build
Finished Calculation of disk usage of build in 0 seconds
Started calculate disk usage of workspace
Finished Calculation of disk usage of workspace in 0 seconds
Finished: FAILURE