FailedConsole Output

Started by user icraggs@uk.ibm.com
Building in workspace /home/hudson/genie.paho/.jenkins/jobs/paho-java-master-release/workspace
[WS-CLEANUP] Deleting project workspace...
[WS-CLEANUP] Deferred wipeout is used...
[WS-CLEANUP] Done
Wiping out workspace first.
Cloning the remote Git repository
Cloning repository https://github.com/eclipse/paho.mqtt.java.git
 > /usr/local/bin/git init /home/hudson/genie.paho/.jenkins/jobs/paho-java-master-release/workspace # timeout=10
Fetching upstream changes from https://github.com/eclipse/paho.mqtt.java.git
 > /usr/local/bin/git --version # timeout=10
 > /usr/local/bin/git fetch --tags --progress https://github.com/eclipse/paho.mqtt.java.git +refs/heads/*:refs/remotes/origin/*
 > /usr/local/bin/git config remote.origin.url https://github.com/eclipse/paho.mqtt.java.git # timeout=10
 > /usr/local/bin/git config --add remote.origin.fetch +refs/heads/*:refs/remotes/origin/* # timeout=10
 > /usr/local/bin/git config remote.origin.url https://github.com/eclipse/paho.mqtt.java.git # timeout=10
Fetching upstream changes from https://github.com/eclipse/paho.mqtt.java.git
 > /usr/local/bin/git fetch --tags --progress https://github.com/eclipse/paho.mqtt.java.git +refs/heads/*:refs/remotes/origin/*
 > /usr/local/bin/git rev-parse origin/master^{commit} # timeout=10
Checking out Revision 72f3a23274bcd4468e90ba43a11d54ef63a6b955 (origin/master)
 > /usr/local/bin/git config core.sparsecheckout # timeout=10
 > /usr/local/bin/git checkout -f 72f3a23274bcd4468e90ba43a11d54ef63a6b955
Commit message: "Update version of jarsigner plugin"
 > /usr/local/bin/git rev-list --no-walk 72f3a23274bcd4468e90ba43a11d54ef63a6b955 # timeout=10
[workspace] $ /shared/common/apache-maven-latest/bin/mvn -f pom.xml -Dmaven.javadoc.skip=true clean package deploy:deploy -Peclipse-sign -e -DskipTests -DskipNexusStagingDeployMojo=true -pl org.eclipse.paho.client.mqttv3,org.eclipse.paho.client.mqttv3.repository -V -B
Picked up JAVA_TOOL_OPTIONS: -Xmx2G -Djava.io.tmpdir=/tmp/genie.paho
Apache Maven 3.5.4 (1edded0938998edf8bf061f1ceb3cfdeccf443fe; 2018-06-17T14:33:14-04:00)
Maven home: /shared/common/apache-maven-latest
Java version: 1.8.0_192, vendor: Oracle Corporation, runtime: /opt/public/common/java/oracle/jdk1.8.0_192_x64/jre
Default locale: en_US, platform encoding: UTF-8
OS name: "linux", version: "3.12.60-52.54-default", arch: "amd64", family: "unix"
[INFO] Error stacktraces are turned on.
[INFO] Scanning for projects...
[WARNING] No explicit target runtime environment configuration. Build is platform dependent.
[WARNING] No explicit target runtime environment configuration. Build is platform dependent.
[INFO] Computing target platform for MavenProject: org.eclipse.paho:org.eclipse.paho.client.mqttv3:1.2.1 @ /jobs/genie.paho/paho-java-master-release/workspace/org.eclipse.paho.client.mqttv3/pom.xml
[INFO] Resolving dependencies of MavenProject: org.eclipse.paho:org.eclipse.paho.client.mqttv3:1.2.1 @ /jobs/genie.paho/paho-java-master-release/workspace/org.eclipse.paho.client.mqttv3/pom.xml
[WARNING] The following locally built units have been used to resolve project dependencies:
[WARNING]   org.eclipse.paho.client.mqttv3.source/1.2.1
[WARNING]   org.eclipse.paho.client.mqttv3/1.2.1
[INFO] Resolving class path of MavenProject: org.eclipse.paho:org.eclipse.paho.client.mqttv3:1.2.1 @ /jobs/genie.paho/paho-java-master-release/workspace/org.eclipse.paho.client.mqttv3/pom.xml
[INFO] Computing target platform for MavenProject: org.eclipse.paho:org.eclipse.paho.client.mqttv3.repository:1.2.1 @ /jobs/genie.paho/paho-java-master-release/workspace/org.eclipse.paho.client.mqttv3.repository/pom.xml
[INFO] Resolving dependencies of MavenProject: org.eclipse.paho:org.eclipse.paho.client.mqttv3.repository:1.2.1 @ /jobs/genie.paho/paho-java-master-release/workspace/org.eclipse.paho.client.mqttv3.repository/pom.xml
[WARNING] The following locally built units have been used to resolve project dependencies:
[WARNING]   org.eclipse.paho.client.mqttv3/1.2.1
[INFO] Resolving class path of MavenProject: org.eclipse.paho:org.eclipse.paho.client.mqttv3.repository:1.2.1 @ /jobs/genie.paho/paho-java-master-release/workspace/org.eclipse.paho.client.mqttv3.repository/pom.xml
[INFO] Inspecting build with total of 2 modules...
[INFO] Installing Nexus Staging features:
[INFO]   ... total of 2 executions of maven-deploy-plugin replaced with nexus-staging-maven-plugin
[INFO] ------------------------------------------------------------------------
[INFO] Reactor Build Order:
[INFO] 
[INFO] org.eclipse.paho.client.mqttv3                          [eclipse-plugin]
[INFO] Paho P2 Repository                                  [eclipse-repository]
[INFO] 
[INFO] ----------< org.eclipse.paho:org.eclipse.paho.client.mqttv3 >-----------
[INFO] Building org.eclipse.paho.client.mqttv3 1.2.1                      [1/2]
[INFO] ---------------------------[ eclipse-plugin ]---------------------------
[INFO] 
[INFO] --- maven-clean-plugin:2.5:clean (default-clean) @ org.eclipse.paho.client.mqttv3 ---
[INFO] 
[INFO] --- tycho-packaging-plugin:1.1.0:build-qualifier (default-build-qualifier) @ org.eclipse.paho.client.mqttv3 ---
[INFO] The project's OSGi version is 1.2.1
[INFO] 
[INFO] --- tycho-packaging-plugin:1.1.0:validate-id (default-validate-id) @ org.eclipse.paho.client.mqttv3 ---
[INFO] 
[INFO] --- tycho-packaging-plugin:1.1.0:validate-version (default-validate-version) @ org.eclipse.paho.client.mqttv3 ---
[INFO] 
[INFO] --- jacoco-maven-plugin:0.8.2:prepare-agent (default) @ org.eclipse.paho.client.mqttv3 ---
[INFO] argLine set to -javaagent:/opt/public/hipp/homes/genie.paho/.m2/repository/org/jacoco/org.jacoco.agent/0.8.2/org.jacoco.agent-0.8.2-runtime.jar=destfile=/jobs/genie.paho/paho-java-master-release/workspace/org.eclipse.paho.client.mqttv3/target/jacoco.exec
[INFO] 
[INFO] --- templating-maven-plugin:1.0.0:filter-sources (filter-src) @ org.eclipse.paho.client.mqttv3 ---
[INFO] Coping files with filtering to temporary directory.
[INFO] Using 'UTF-8' encoding to copy filtered resources.
[INFO] Copying 1 resource
[INFO] Copied 1 files to output directory: /jobs/genie.paho/paho-java-master-release/workspace/org.eclipse.paho.client.mqttv3/target/generated-sources/java-templates
[INFO] Source directory: /jobs/genie.paho/paho-java-master-release/workspace/org.eclipse.paho.client.mqttv3/target/generated-sources/java-templates added.
[INFO] 
[INFO] --- maven-resources-plugin:3.0.2:resources (default-resources) @ org.eclipse.paho.client.mqttv3 ---
[INFO] Using 'UTF-8' encoding to copy filtered resources.
[INFO] Copying 17 resources
[INFO] 
[INFO] --- maven-resources-plugin:3.0.2:copy-resources (default-copy-resources) @ org.eclipse.paho.client.mqttv3 ---
[INFO] Using 'UTF-8' encoding to copy filtered resources.
[INFO] Copying 1 resource
[INFO] 
[INFO] --- tycho-compiler-plugin:1.1.0:compile (default-compile) @ org.eclipse.paho.client.mqttv3 ---
[INFO] Compiling 94 source files to /jobs/genie.paho/paho-java-master-release/workspace/org.eclipse.paho.client.mqttv3/target/classes
[INFO] 
[INFO] --- maven-resources-plugin:3.0.2:testResources (default-testResources) @ org.eclipse.paho.client.mqttv3 ---
[INFO] Using 'UTF-8' encoding to copy filtered resources.
[INFO] skip non existing resourceDirectory /jobs/genie.paho/paho-java-master-release/workspace/org.eclipse.paho.client.mqttv3/src/test/resources
[INFO] 
[INFO] --- tycho-source-plugin:1.1.0:plugin-source (plugin-source) @ org.eclipse.paho.client.mqttv3 ---
[WARNING] bundle localization file /jobs/genie.paho/paho-java-master-release/workspace/org.eclipse.paho.client.mqttv3/plugin.properties not found
[WARNING] Bundle-Name header not found in /jobs/genie.paho/paho-java-master-release/workspace/org.eclipse.paho.client.mqttv3/META-INF/MANIFEST.MF, fallback to Bundle-SymbolicName for source bundle
[WARNING] Bundle-Vendor header not found in /jobs/genie.paho/paho-java-master-release/workspace/org.eclipse.paho.client.mqttv3/META-INF/MANIFEST.MF, fallback to 'unknown' for source bundle
[INFO] Building jar: /jobs/genie.paho/paho-java-master-release/workspace/org.eclipse.paho.client.mqttv3/target/org.eclipse.paho.client.mqttv3-1.2.1-sources.jar
[INFO] 
[INFO] --- target-platform-configuration:1.1.0:target-platform (default-target-platform) @ org.eclipse.paho.client.mqttv3 ---
[INFO] 
[INFO] --- tycho-packaging-plugin:1.1.0:package-plugin (default-package-plugin) @ org.eclipse.paho.client.mqttv3 ---
[INFO] Building jar: /jobs/genie.paho/paho-java-master-release/workspace/org.eclipse.paho.client.mqttv3/target/org.eclipse.paho.client.mqttv3-1.2.1.jar
[INFO] 
[INFO] --- tycho-p2-plugin:1.1.0:p2-metadata-default (default-p2-metadata-default) @ org.eclipse.paho.client.mqttv3 ---
[INFO] 
[INFO] --- maven-javadoc-plugin:3.0.1:jar (attach-javadocs) @ org.eclipse.paho.client.mqttv3 ---
[INFO] Skipping javadoc generation
[INFO] 
[INFO] --- maven-deploy-plugin:2.8.2:deploy (default-cli) @ org.eclipse.paho.client.mqttv3 ---
[INFO] Deploying org.eclipse.paho:org.eclipse.paho.client.mqttv3:1.2.1 at end
[INFO] 
[INFO] -----< org.eclipse.paho:org.eclipse.paho.client.mqttv3.repository >-----
[INFO] Building Paho P2 Repository 1.2.1                                  [2/2]
[INFO] -------------------------[ eclipse-repository ]-------------------------
[INFO] 
[INFO] --- maven-clean-plugin:2.5:clean (default-clean) @ org.eclipse.paho.client.mqttv3.repository ---
[INFO] 
[INFO] --- tycho-packaging-plugin:1.1.0:build-qualifier-aggregator (default-build-qualifier-aggregator) @ org.eclipse.paho.client.mqttv3.repository ---
[INFO] The project's OSGi version is 1.2.1
[INFO] 
[INFO] --- maven-clean-plugin:2.5:clean (default-clean-1) @ org.eclipse.paho.client.mqttv3.repository ---
[INFO] 
[INFO] --- maven-resources-plugin:3.0.2:resources (default-resources) @ org.eclipse.paho.client.mqttv3.repository ---
[INFO] Using 'UTF-8' encoding to copy filtered resources.
[INFO] skip non existing resourceDirectory /jobs/genie.paho/paho-java-master-release/workspace/org.eclipse.paho.client.mqttv3.repository/src/main/resources
[INFO] 
[INFO] --- tycho-source-plugin:1.1.0:plugin-source (plugin-source) @ org.eclipse.paho.client.mqttv3.repository ---
[INFO] 
[INFO] --- target-platform-configuration:1.1.0:target-platform (default-target-platform) @ org.eclipse.paho.client.mqttv3.repository ---
[INFO] 
[INFO] --- tycho-p2-publisher-plugin:1.1.0:publish-products (default-publish-products) @ org.eclipse.paho.client.mqttv3.repository ---
[INFO] 
[INFO] --- tycho-p2-publisher-plugin:1.1.0:publish-categories (default-publish-categories) @ org.eclipse.paho.client.mqttv3.repository ---
[INFO] 
[INFO] --- tycho-p2-publisher-plugin:1.1.0:attach-artifacts (default-attach-artifacts) @ org.eclipse.paho.client.mqttv3.repository ---
[INFO] 
[INFO] --- tycho-p2-repository-plugin:1.1.0:assemble-repository (default-assemble-repository) @ org.eclipse.paho.client.mqttv3.repository ---
[INFO] ------------------------------------------------------------------------
[INFO] Reactor Summary:
[INFO] 
[INFO] org.eclipse.paho.client.mqttv3 1.2.1 ............... SUCCESS [  3.715 s]
[INFO] Paho P2 Repository 1.2.1 ........................... FAILURE [  0.274 s]
[INFO] ------------------------------------------------------------------------
[INFO] BUILD FAILURE
[INFO] ------------------------------------------------------------------------
[INFO] Total time: 8.455 s
[INFO] Finished at: 2019-02-20T13:37:06-05:00
[INFO] ------------------------------------------------------------------------
[ERROR] Failed to execute goal org.eclipse.tycho:tycho-p2-repository-plugin:1.1.0:assemble-repository (default-assemble-repository) on project org.eclipse.paho.client.mqttv3.repository: No content specified for p2 repository -> [Help 1]
org.apache.maven.lifecycle.LifecycleExecutionException: Failed to execute goal org.eclipse.tycho:tycho-p2-repository-plugin:1.1.0:assemble-repository (default-assemble-repository) on project org.eclipse.paho.client.mqttv3.repository: No content specified for p2 repository
    at org.apache.maven.lifecycle.internal.MojoExecutor.execute (MojoExecutor.java:213)
    at org.apache.maven.lifecycle.internal.MojoExecutor.execute (MojoExecutor.java:154)
    at org.apache.maven.lifecycle.internal.MojoExecutor.execute (MojoExecutor.java:146)
    at org.apache.maven.lifecycle.internal.LifecycleModuleBuilder.buildProject (LifecycleModuleBuilder.java:117)
    at org.apache.maven.lifecycle.internal.LifecycleModuleBuilder.buildProject (LifecycleModuleBuilder.java:81)
    at org.apache.maven.lifecycle.internal.builder.singlethreaded.SingleThreadedBuilder.build (SingleThreadedBuilder.java:56)
    at org.apache.maven.lifecycle.internal.LifecycleStarter.execute (LifecycleStarter.java:128)
    at org.apache.maven.DefaultMaven.doExecute (DefaultMaven.java:305)
    at org.apache.maven.DefaultMaven.doExecute (DefaultMaven.java:192)
    at org.apache.maven.DefaultMaven.execute (DefaultMaven.java:105)
    at org.apache.maven.cli.MavenCli.execute (MavenCli.java:954)
    at org.apache.maven.cli.MavenCli.doMain (MavenCli.java:288)
    at org.apache.maven.cli.MavenCli.main (MavenCli.java:192)
    at sun.reflect.NativeMethodAccessorImpl.invoke0 (Native Method)
    at sun.reflect.NativeMethodAccessorImpl.invoke (NativeMethodAccessorImpl.java:62)
    at sun.reflect.DelegatingMethodAccessorImpl.invoke (DelegatingMethodAccessorImpl.java:43)
    at java.lang.reflect.Method.invoke (Method.java:498)
    at org.codehaus.plexus.classworlds.launcher.Launcher.launchEnhanced (Launcher.java:289)
    at org.codehaus.plexus.classworlds.launcher.Launcher.launch (Launcher.java:229)
    at org.codehaus.plexus.classworlds.launcher.Launcher.mainWithExitCode (Launcher.java:415)
    at org.codehaus.plexus.classworlds.launcher.Launcher.main (Launcher.java:356)
Caused by: org.apache.maven.plugin.MojoFailureException: No content specified for p2 repository
    at org.eclipse.tycho.plugins.p2.repository.AssembleRepositoryMojo.execute (AssembleRepositoryMojo.java:134)
    at org.apache.maven.plugin.DefaultBuildPluginManager.executeMojo (DefaultBuildPluginManager.java:137)
    at org.apache.maven.lifecycle.internal.MojoExecutor.execute (MojoExecutor.java:208)
    at org.apache.maven.lifecycle.internal.MojoExecutor.execute (MojoExecutor.java:154)
    at org.apache.maven.lifecycle.internal.MojoExecutor.execute (MojoExecutor.java:146)
    at org.apache.maven.lifecycle.internal.LifecycleModuleBuilder.buildProject (LifecycleModuleBuilder.java:117)
    at org.apache.maven.lifecycle.internal.LifecycleModuleBuilder.buildProject (LifecycleModuleBuilder.java:81)
    at org.apache.maven.lifecycle.internal.builder.singlethreaded.SingleThreadedBuilder.build (SingleThreadedBuilder.java:56)
    at org.apache.maven.lifecycle.internal.LifecycleStarter.execute (LifecycleStarter.java:128)
    at org.apache.maven.DefaultMaven.doExecute (DefaultMaven.java:305)
    at org.apache.maven.DefaultMaven.doExecute (DefaultMaven.java:192)
    at org.apache.maven.DefaultMaven.execute (DefaultMaven.java:105)
    at org.apache.maven.cli.MavenCli.execute (MavenCli.java:954)
    at org.apache.maven.cli.MavenCli.doMain (MavenCli.java:288)
    at org.apache.maven.cli.MavenCli.main (MavenCli.java:192)
    at sun.reflect.NativeMethodAccessorImpl.invoke0 (Native Method)
    at sun.reflect.NativeMethodAccessorImpl.invoke (NativeMethodAccessorImpl.java:62)
    at sun.reflect.DelegatingMethodAccessorImpl.invoke (DelegatingMethodAccessorImpl.java:43)
    at java.lang.reflect.Method.invoke (Method.java:498)
    at org.codehaus.plexus.classworlds.launcher.Launcher.launchEnhanced (Launcher.java:289)
    at org.codehaus.plexus.classworlds.launcher.Launcher.launch (Launcher.java:229)
    at org.codehaus.plexus.classworlds.launcher.Launcher.mainWithExitCode (Launcher.java:415)
    at org.codehaus.plexus.classworlds.launcher.Launcher.main (Launcher.java:356)
[ERROR] 
[ERROR] Re-run Maven using the -X switch to enable full debug logging.
[ERROR] 
[ERROR] For more information about the errors and possible solutions, please read the following articles:
[ERROR] [Help 1] http://cwiki.apache.org/confluence/display/MAVEN/MojoFailureException
[ERROR] 
[ERROR] After correcting the problems, you can resume the build with the command
[ERROR]   mvn <goals> -rf :org.eclipse.paho.client.mqttv3.repository
Build step 'Invoke top-level Maven targets' marked build as failure
Started calculate disk usage of build
Finished Calculation of disk usage of build in 0 seconds
Started calculate disk usage of workspace
Finished Calculation of disk usage of workspace in 0 seconds
Finished: FAILURE