FailedConsole Output

Started by user icraggs@uk.ibm.com
Building in workspace /home/hudson/genie.paho/.jenkins/jobs/paho-java-master-release-01/workspace
[WS-CLEANUP] Deleting project workspace...
[WS-CLEANUP] Deferred wipeout is used...
[WS-CLEANUP] Done
No credentials specified
Wiping out workspace first.
Cloning the remote Git repository
Cloning repository https://github.com/eclipse/paho.mqtt.java.git
 > /usr/local/bin/git init /home/hudson/genie.paho/.jenkins/jobs/paho-java-master-release-01/workspace # timeout=10
Fetching upstream changes from https://github.com/eclipse/paho.mqtt.java.git
 > /usr/local/bin/git --version # timeout=10
 > /usr/local/bin/git fetch --tags --progress https://github.com/eclipse/paho.mqtt.java.git +refs/heads/*:refs/remotes/origin/*
 > /usr/local/bin/git config remote.origin.url https://github.com/eclipse/paho.mqtt.java.git # timeout=10
 > /usr/local/bin/git config --add remote.origin.fetch +refs/heads/*:refs/remotes/origin/* # timeout=10
 > /usr/local/bin/git config remote.origin.url https://github.com/eclipse/paho.mqtt.java.git # timeout=10
Fetching upstream changes from https://github.com/eclipse/paho.mqtt.java.git
 > /usr/local/bin/git fetch --tags --progress https://github.com/eclipse/paho.mqtt.java.git +refs/heads/*:refs/remotes/origin/*
 > /usr/local/bin/git rev-parse origin/master^{commit} # timeout=10
Checking out Revision 07fbd7569cbf4c4074555bbfd554b245fa3cc7fe (origin/master)
 > /usr/local/bin/git config core.sparsecheckout # timeout=10
 > /usr/local/bin/git checkout -f 07fbd7569cbf4c4074555bbfd554b245fa3cc7fe
Commit message: "Update release versions to 1.2.2"
 > /usr/local/bin/git rev-list --no-walk 07fbd7569cbf4c4074555bbfd554b245fa3cc7fe # timeout=10
[workspace] $ /shared/common/apache-maven-latest/bin/mvn -f pom.xml -s /opt/public/hipp/homes/genie.paho/.m2/settings-deploy-ossrh.xml -Dmaven.javadoc.skip=true clean -Peclipse-sign -Pcreate_gpg_signature deploy -e -pl org.eclipse.paho.client.mqttv3,org.eclipse.paho.client.mqttv3.repository -am
Picked up JAVA_TOOL_OPTIONS: -Xmx2G -Djava.io.tmpdir=/tmp/genie.paho
[INFO] Error stacktraces are turned on.
[INFO] Scanning for projects...
[INFO] Inspecting build with total of 3 modules...
[INFO] Installing Nexus Staging features:
[INFO]   ... total of 3 executions of maven-deploy-plugin replaced with nexus-staging-maven-plugin
[WARNING] No explicit target runtime environment configuration. Build is platform dependent.
[WARNING] No explicit target runtime environment configuration. Build is platform dependent.
[INFO] Computing target platform for MavenProject: org.eclipse.paho:org.eclipse.paho.client.mqttv3:1.2.2 @ /jobs/genie.paho/paho-java-master-release-01/workspace/org.eclipse.paho.client.mqttv3/pom.xml
[INFO] Resolving dependencies of MavenProject: org.eclipse.paho:org.eclipse.paho.client.mqttv3:1.2.2 @ /jobs/genie.paho/paho-java-master-release-01/workspace/org.eclipse.paho.client.mqttv3/pom.xml
[INFO] Resolving class path of MavenProject: org.eclipse.paho:org.eclipse.paho.client.mqttv3:1.2.2 @ /jobs/genie.paho/paho-java-master-release-01/workspace/org.eclipse.paho.client.mqttv3/pom.xml
[INFO] Computing target platform for MavenProject: org.eclipse.paho:org.eclipse.paho.client.mqttv3.repository:1.2.2 @ /jobs/genie.paho/paho-java-master-release-01/workspace/org.eclipse.paho.client.mqttv3.repository/pom.xml
[INFO] Resolving dependencies of MavenProject: org.eclipse.paho:org.eclipse.paho.client.mqttv3.repository:1.2.2 @ /jobs/genie.paho/paho-java-master-release-01/workspace/org.eclipse.paho.client.mqttv3.repository/pom.xml
[INFO] Resolving class path of MavenProject: org.eclipse.paho:org.eclipse.paho.client.mqttv3.repository:1.2.2 @ /jobs/genie.paho/paho-java-master-release-01/workspace/org.eclipse.paho.client.mqttv3.repository/pom.xml
[INFO] ------------------------------------------------------------------------
[INFO] Reactor Build Order:
[INFO] 
[INFO] Eclipse Paho                                                       [pom]
[INFO] org.eclipse.paho.client.mqttv3                          [eclipse-plugin]
[INFO] Paho P2 Repository                                  [eclipse-repository]
[INFO] 
[INFO] --------------------< org.eclipse.paho:java-parent >--------------------
[INFO] Building Eclipse Paho 1.2.2                                        [1/3]
[INFO] --------------------------------[ pom ]---------------------------------
[INFO] 
[INFO] --- maven-clean-plugin:2.5:clean (default-clean) @ java-parent ---
[INFO] 
[INFO] --- tycho-source-plugin:1.1.0:plugin-source (plugin-source) @ java-parent ---
[INFO] 
[INFO] --- tycho-pack200a-plugin:1.1.0:normalize (pack200-normalize) @ java-parent ---
[INFO] 
[INFO] --- eclipse-jarsigner-plugin:1.1.5:sign (sign) @ java-parent ---
[INFO] 
[INFO] --- tycho-pack200b-plugin:1.1.0:pack (pack200-pack) @ java-parent ---
[INFO] 
[INFO] --- tycho-p2-plugin:1.1.0:p2-metadata (p2-metadata) @ java-parent ---
[INFO] 
[INFO] --- maven-gpg-plugin:1.6:sign (sign-artifacts) @ java-parent ---
[INFO] 
[INFO] --- maven-install-plugin:2.4:install (default-install) @ java-parent ---
[INFO] Installing /jobs/genie.paho/paho-java-master-release-01/workspace/pom.xml to /opt/public/hipp/homes/genie.paho/.m2/repository/org/eclipse/paho/java-parent/1.2.2/java-parent-1.2.2.pom
[INFO] Installing /jobs/genie.paho/paho-java-master-release-01/workspace/target/java-parent-1.2.2.pom.asc to /opt/public/hipp/homes/genie.paho/.m2/repository/org/eclipse/paho/java-parent/1.2.2/java-parent-1.2.2.pom.asc
[INFO] 
[INFO] --- nexus-staging-maven-plugin:1.6.5:deploy (injected-nexus-deploy) @ java-parent ---
[INFO] Performing local staging (local stagingDirectory="/jobs/genie.paho/paho-java-master-release-01/workspace/target/nexus-staging/staging")...
[INFO]  + Using server credentials "ossrh" from Maven settings.
[INFO]  * Connected to Nexus at https://oss.sonatype.org:443/, is version 2.14.14-01 and edition "Professional"
[INFO]  * Using staging profile ID "3e4bc7c08ea566" (matched by Nexus).
[INFO] Installing /jobs/genie.paho/paho-java-master-release-01/workspace/pom.xml to /jobs/genie.paho/paho-java-master-release-01/workspace/target/nexus-staging/staging/3e4bc7c08ea566/org/eclipse/paho/java-parent/1.2.2/java-parent-1.2.2.pom
[INFO] Installing /jobs/genie.paho/paho-java-master-release-01/workspace/target/java-parent-1.2.2.pom.asc to /jobs/genie.paho/paho-java-master-release-01/workspace/target/nexus-staging/staging/3e4bc7c08ea566/org/eclipse/paho/java-parent/1.2.2/java-parent-1.2.2.pom.asc
[INFO] Execution skipped to the last project...
[INFO] 
[INFO] ----------< org.eclipse.paho:org.eclipse.paho.client.mqttv3 >-----------
[INFO] Building org.eclipse.paho.client.mqttv3 1.2.2                      [2/3]
[INFO] ---------------------------[ eclipse-plugin ]---------------------------
[INFO] 
[INFO] --- maven-clean-plugin:2.5:clean (default-clean) @ org.eclipse.paho.client.mqttv3 ---
[INFO] 
[INFO] --- tycho-packaging-plugin:1.1.0:build-qualifier (default-build-qualifier) @ org.eclipse.paho.client.mqttv3 ---
[INFO] The project's OSGi version is 1.2.2.201909231408
[INFO] 
[INFO] --- tycho-packaging-plugin:1.1.0:validate-id (default-validate-id) @ org.eclipse.paho.client.mqttv3 ---
[INFO] 
[INFO] --- tycho-packaging-plugin:1.1.0:validate-version (default-validate-version) @ org.eclipse.paho.client.mqttv3 ---
[INFO] ------------------------------------------------------------------------
[INFO] Reactor Summary for Eclipse Paho 1.2.2:
[INFO] 
[INFO] Eclipse Paho ....................................... SUCCESS [ 18.868 s]
[INFO] org.eclipse.paho.client.mqttv3 ..................... FAILURE [  0.198 s]
[INFO] Paho P2 Repository ................................. SKIPPED
[INFO] ------------------------------------------------------------------------
[INFO] BUILD FAILURE
[INFO] ------------------------------------------------------------------------
[INFO] Total time:  23.059 s
[INFO] Finished at: 2019-09-23T10:08:59-04:00
[INFO] ------------------------------------------------------------------------
[ERROR] Failed to execute goal org.eclipse.tycho:tycho-packaging-plugin:1.1.0:validate-version (default-validate-version) on project org.eclipse.paho.client.mqttv3: Maven version 1.2.2 must have -SNAPSHOT qualifier for SNAPSHOT builds -> [Help 1]
org.apache.maven.lifecycle.LifecycleExecutionException: Failed to execute goal org.eclipse.tycho:tycho-packaging-plugin:1.1.0:validate-version (default-validate-version) on project org.eclipse.paho.client.mqttv3: Maven version 1.2.2 must have -SNAPSHOT qualifier for SNAPSHOT builds
    at org.apache.maven.lifecycle.internal.MojoExecutor.execute (MojoExecutor.java:215)
    at org.apache.maven.lifecycle.internal.MojoExecutor.execute (MojoExecutor.java:156)
    at org.apache.maven.lifecycle.internal.MojoExecutor.execute (MojoExecutor.java:148)
    at org.apache.maven.lifecycle.internal.LifecycleModuleBuilder.buildProject (LifecycleModuleBuilder.java:117)
    at org.apache.maven.lifecycle.internal.LifecycleModuleBuilder.buildProject (LifecycleModuleBuilder.java:81)
    at org.apache.maven.lifecycle.internal.builder.singlethreaded.SingleThreadedBuilder.build (SingleThreadedBuilder.java:56)
    at org.apache.maven.lifecycle.internal.LifecycleStarter.execute (LifecycleStarter.java:128)
    at org.apache.maven.DefaultMaven.doExecute (DefaultMaven.java:305)
    at org.apache.maven.DefaultMaven.doExecute (DefaultMaven.java:192)
    at org.apache.maven.DefaultMaven.execute (DefaultMaven.java:105)
    at org.apache.maven.cli.MavenCli.execute (MavenCli.java:956)
    at org.apache.maven.cli.MavenCli.doMain (MavenCli.java:288)
    at org.apache.maven.cli.MavenCli.main (MavenCli.java:192)
    at sun.reflect.NativeMethodAccessorImpl.invoke0 (Native Method)
    at sun.reflect.NativeMethodAccessorImpl.invoke (NativeMethodAccessorImpl.java:62)
    at sun.reflect.DelegatingMethodAccessorImpl.invoke (DelegatingMethodAccessorImpl.java:43)
    at java.lang.reflect.Method.invoke (Method.java:498)
    at org.codehaus.plexus.classworlds.launcher.Launcher.launchEnhanced (Launcher.java:289)
    at org.codehaus.plexus.classworlds.launcher.Launcher.launch (Launcher.java:229)
    at org.codehaus.plexus.classworlds.launcher.Launcher.mainWithExitCode (Launcher.java:415)
    at org.codehaus.plexus.classworlds.launcher.Launcher.main (Launcher.java:356)
Caused by: org.apache.maven.plugin.MojoExecutionException: Maven version 1.2.2 must have -SNAPSHOT qualifier for SNAPSHOT builds
    at org.eclipse.tycho.buildversion.ValidateVersionMojo.fail (ValidateVersionMojo.java:103)
    at org.eclipse.tycho.buildversion.ValidateVersionMojo.validateSnapshotVersion (ValidateVersionMojo.java:82)
    at org.eclipse.tycho.buildversion.ValidateVersionMojo.execute (ValidateVersionMojo.java:49)
    at org.apache.maven.plugin.DefaultBuildPluginManager.executeMojo (DefaultBuildPluginManager.java:137)
    at org.apache.maven.lifecycle.internal.MojoExecutor.execute (MojoExecutor.java:210)
    at org.apache.maven.lifecycle.internal.MojoExecutor.execute (MojoExecutor.java:156)
    at org.apache.maven.lifecycle.internal.MojoExecutor.execute (MojoExecutor.java:148)
    at org.apache.maven.lifecycle.internal.LifecycleModuleBuilder.buildProject (LifecycleModuleBuilder.java:117)
    at org.apache.maven.lifecycle.internal.LifecycleModuleBuilder.buildProject (LifecycleModuleBuilder.java:81)
    at org.apache.maven.lifecycle.internal.builder.singlethreaded.SingleThreadedBuilder.build (SingleThreadedBuilder.java:56)
    at org.apache.maven.lifecycle.internal.LifecycleStarter.execute (LifecycleStarter.java:128)
    at org.apache.maven.DefaultMaven.doExecute (DefaultMaven.java:305)
    at org.apache.maven.DefaultMaven.doExecute (DefaultMaven.java:192)
    at org.apache.maven.DefaultMaven.execute (DefaultMaven.java:105)
    at org.apache.maven.cli.MavenCli.execute (MavenCli.java:956)
    at org.apache.maven.cli.MavenCli.doMain (MavenCli.java:288)
    at org.apache.maven.cli.MavenCli.main (MavenCli.java:192)
    at sun.reflect.NativeMethodAccessorImpl.invoke0 (Native Method)
    at sun.reflect.NativeMethodAccessorImpl.invoke (NativeMethodAccessorImpl.java:62)
    at sun.reflect.DelegatingMethodAccessorImpl.invoke (DelegatingMethodAccessorImpl.java:43)
    at java.lang.reflect.Method.invoke (Method.java:498)
    at org.codehaus.plexus.classworlds.launcher.Launcher.launchEnhanced (Launcher.java:289)
    at org.codehaus.plexus.classworlds.launcher.Launcher.launch (Launcher.java:229)
    at org.codehaus.plexus.classworlds.launcher.Launcher.mainWithExitCode (Launcher.java:415)
    at org.codehaus.plexus.classworlds.launcher.Launcher.main (Launcher.java:356)
[ERROR] 
[ERROR] Re-run Maven using the -X switch to enable full debug logging.
[ERROR] 
[ERROR] For more information about the errors and possible solutions, please read the following articles:
[ERROR] [Help 1] http://cwiki.apache.org/confluence/display/MAVEN/MojoExecutionException
[ERROR] 
[ERROR] After correcting the problems, you can resume the build with the command
[ERROR]   mvn <goals> -rf :org.eclipse.paho.client.mqttv3
Build step 'Invoke top-level Maven targets' marked build as failure
Started calculate disk usage of build
Finished Calculation of disk usage of build in 0 seconds
Started calculate disk usage of workspace
Finished Calculation of disk usage of workspace in 0 seconds
Finished: FAILURE