Console Output

Started by user icraggs@uk.ibm.com
Building in workspace /home/hudson/genie.paho/.jenkins/jobs/paho-1.2-build/workspace
[WS-CLEANUP] Deleting project workspace...
[WS-CLEANUP] Done
Wiping out workspace first.
Cloning the remote Git repository
Cloning repository https://github.com/eclipse/paho.mqtt.java.git
 > /usr/local/bin/git init /home/hudson/genie.paho/.jenkins/jobs/paho-1.2-build/workspace # timeout=10
Fetching upstream changes from https://github.com/eclipse/paho.mqtt.java.git
 > /usr/local/bin/git --version # timeout=10
 > /usr/local/bin/git fetch --tags --progress https://github.com/eclipse/paho.mqtt.java.git +refs/heads/*:refs/remotes/origin/*
 > /usr/local/bin/git config remote.origin.url https://github.com/eclipse/paho.mqtt.java.git # timeout=10
 > /usr/local/bin/git config --add remote.origin.fetch +refs/heads/*:refs/remotes/origin/* # timeout=10
 > /usr/local/bin/git config remote.origin.url https://github.com/eclipse/paho.mqtt.java.git # timeout=10
Fetching upstream changes from https://github.com/eclipse/paho.mqtt.java.git
 > /usr/local/bin/git fetch --tags --progress https://github.com/eclipse/paho.mqtt.java.git +refs/heads/*:refs/remotes/origin/*
 > /usr/local/bin/git rev-parse origin/master^{commit} # timeout=10
Checking out Revision 6d7aafddb3a70d7c1eab69e1f9619af8f7ece47c (origin/master)
 > /usr/local/bin/git config core.sparsecheckout # timeout=10
 > /usr/local/bin/git checkout -f 6d7aafddb3a70d7c1eab69e1f9619af8f7ece47c
Commit message: "Updating Issue Template"
 > /usr/local/bin/git rev-list --no-walk 6d7aafddb3a70d7c1eab69e1f9619af8f7ece47c # timeout=10
[workspace] $ /shared/common/apache-maven-latest/bin/mvn -f pom.xml -Dmaven.javadoc.skip=true clean package deploy -pl org.eclipse.paho.client.eclipse.view -Pcreate_gpg_signature -Peclipse-sign -e -DskipTests
Picked up JAVA_TOOL_OPTIONS: -Xmx2G -Djava.io.tmpdir=/tmp/genie.paho
[INFO] Error stacktraces are turned on.
[INFO] Scanning for projects...
[WARNING] No explicit target runtime environment configuration. Build is platform dependent.
[INFO] Computing target platform for MavenProject: org.eclipse.paho:org.eclipse.paho.client.eclipse.view:1.2.0 @ /jobs/genie.paho/paho-1.2-build/workspace/org.eclipse.paho.client.eclipse.view/pom.xml
[INFO] Fetching p2.index from http://download.eclipse.org/releases/kepler/ (0B at 0B/s)
[INFO] Adding repository http://download.eclipse.org/releases/kepler
[INFO] Fetching p2.index from http://download.eclipse.org/releases/kepler/201402280900/ (0B at 0B/s)
[INFO] Fetching p2.index from http://download.eclipse.org/releases/kepler/201309270900/ (0B at 0B/s)
[INFO] Fetching p2.index from http://download.eclipse.org/releases/kepler/201306260900/ (0B at 0B/s)
[INFO] Fetching p2.index from http://download.eclipse.org/technology/epp/packages/kepler/ (0B at 0B/s)
[INFO] Resolving dependencies of MavenProject: org.eclipse.paho:org.eclipse.paho.client.eclipse.view:1.2.0 @ /jobs/genie.paho/paho-1.2-build/workspace/org.eclipse.paho.client.eclipse.view/pom.xml
[WARNING] The following locally built units have been used to resolve project dependencies:
[WARNING]   org.eclipse.paho.client.mqttv3/1.2.1.201811210505
[INFO] Resolving class path of MavenProject: org.eclipse.paho:org.eclipse.paho.client.eclipse.view:1.2.0 @ /jobs/genie.paho/paho-1.2-build/workspace/org.eclipse.paho.client.eclipse.view/pom.xml
[INFO] Inspecting build with total of 1 modules...
[INFO] Installing Nexus Staging features:
[INFO]   ... total of 1 executions of maven-deploy-plugin replaced with nexus-staging-maven-plugin
[INFO] 
[INFO] -------< org.eclipse.paho:org.eclipse.paho.client.eclipse.view >--------
[INFO] Building org.eclipse.paho.client.eclipse.view 1.2.0
[INFO] ---------------------------[ eclipse-plugin ]---------------------------
[INFO] 
[INFO] --- maven-clean-plugin:2.5:clean (default-clean) @ org.eclipse.paho.client.eclipse.view ---
[INFO] 
[INFO] --- tycho-packaging-plugin:0.20.0:build-qualifier (default-build-qualifier) @ org.eclipse.paho.client.eclipse.view ---
[INFO] The project's OSGi version is 1.2.0
[INFO] 
[INFO] --- tycho-packaging-plugin:0.20.0:validate-id (default-validate-id) @ org.eclipse.paho.client.eclipse.view ---
[INFO] 
[INFO] --- tycho-packaging-plugin:0.20.0:validate-version (default-validate-version) @ org.eclipse.paho.client.eclipse.view ---
[INFO] 
[INFO] --- maven-resources-plugin:2.4.2:resources (default-resources) @ org.eclipse.paho.client.eclipse.view ---
[INFO] Using 'UTF-8' encoding to copy filtered resources.
[INFO] skip non existing resourceDirectory /jobs/genie.paho/paho-1.2-build/workspace/org.eclipse.paho.client.eclipse.view/src/main/resources
[INFO] 
[INFO] --- maven-resources-plugin:2.4.2:copy-resources (default-copy-resources) @ org.eclipse.paho.client.eclipse.view ---
[INFO] Using 'UTF-8' encoding to copy filtered resources.
[INFO] Copying 1 resource
[INFO] 
[INFO] --- tycho-compiler-plugin:0.20.0:compile (default-compile) @ org.eclipse.paho.client.eclipse.view ---
[WARNING] Effective compiler target 1.7 is incompatible with OSGi profile 'JavaSE-1.6' { source level: 1.6, target level: 1.6} @ MavenProject: org.eclipse.paho:org.eclipse.paho.client.eclipse.view:1.2.0 @ /jobs/genie.paho/paho-1.2-build/workspace/org.eclipse.paho.client.eclipse.view/pom.xml
[INFO] Compiling 4 source files to /jobs/genie.paho/paho-1.2-build/workspace/org.eclipse.paho.client.eclipse.view/target/classes
[INFO] 
[INFO] --- maven-resources-plugin:2.4.2:testResources (default-testResources) @ org.eclipse.paho.client.eclipse.view ---
[INFO] Using 'UTF-8' encoding to copy filtered resources.
[INFO] skip non existing resourceDirectory /jobs/genie.paho/paho-1.2-build/workspace/org.eclipse.paho.client.eclipse.view/src/test/resources
[INFO] 
[INFO] --- tycho-source-plugin:0.20.0:plugin-source (plugin-source) @ org.eclipse.paho.client.eclipse.view ---
[INFO] Building jar: /jobs/genie.paho/paho-1.2-build/workspace/org.eclipse.paho.client.eclipse.view/target/org.eclipse.paho.client.eclipse.view-1.2.0-sources.jar
[INFO] 
[INFO] --- tycho-packaging-plugin:0.20.0:package-plugin (default-package-plugin) @ org.eclipse.paho.client.eclipse.view ---
[INFO] Building jar: /jobs/genie.paho/paho-1.2-build/workspace/org.eclipse.paho.client.eclipse.view/target/org.eclipse.paho.client.eclipse.view-1.2.0.jar
[INFO] 
[INFO] --- tycho-p2-plugin:0.20.0:p2-metadata-default (default-p2-metadata-default) @ org.eclipse.paho.client.eclipse.view ---
[INFO] 
[INFO] --- tycho-packaging-plugin:0.20.0:build-qualifier (default-build-qualifier) @ org.eclipse.paho.client.eclipse.view ---
[INFO] The project's OSGi version is 1.2.0
[INFO] 
[INFO] --- tycho-packaging-plugin:0.20.0:validate-id (default-validate-id) @ org.eclipse.paho.client.eclipse.view ---
[INFO] 
[INFO] --- tycho-packaging-plugin:0.20.0:validate-version (default-validate-version) @ org.eclipse.paho.client.eclipse.view ---
[INFO] 
[INFO] --- maven-resources-plugin:2.4.2:resources (default-resources) @ org.eclipse.paho.client.eclipse.view ---
[INFO] Using 'UTF-8' encoding to copy filtered resources.
[INFO] skip non existing resourceDirectory /jobs/genie.paho/paho-1.2-build/workspace/org.eclipse.paho.client.eclipse.view/src/main/resources
[INFO] 
[INFO] --- maven-resources-plugin:2.4.2:copy-resources (default-copy-resources) @ org.eclipse.paho.client.eclipse.view ---
[INFO] Using 'UTF-8' encoding to copy filtered resources.
[INFO] Copying 1 resource
[INFO] 
[INFO] --- tycho-compiler-plugin:0.20.0:compile (default-compile) @ org.eclipse.paho.client.eclipse.view ---
[WARNING] Effective compiler target 1.7 is incompatible with OSGi profile 'JavaSE-1.6' { source level: 1.6, target level: 1.6} @ MavenProject: org.eclipse.paho:org.eclipse.paho.client.eclipse.view:1.2.0 @ /jobs/genie.paho/paho-1.2-build/workspace/org.eclipse.paho.client.eclipse.view/pom.xml
[INFO] Nothing to compile - all classes are up to date
[INFO] 
[INFO] --- maven-resources-plugin:2.4.2:testResources (default-testResources) @ org.eclipse.paho.client.eclipse.view ---
[INFO] Using 'UTF-8' encoding to copy filtered resources.
[INFO] skip non existing resourceDirectory /jobs/genie.paho/paho-1.2-build/workspace/org.eclipse.paho.client.eclipse.view/src/test/resources
[INFO] 
[INFO] --- tycho-source-plugin:0.20.0:plugin-source (plugin-source) @ org.eclipse.paho.client.eclipse.view ---
[INFO] Building jar: /jobs/genie.paho/paho-1.2-build/workspace/org.eclipse.paho.client.eclipse.view/target/org.eclipse.paho.client.eclipse.view-1.2.0-sources.jar
[INFO] 
[INFO] --- tycho-packaging-plugin:0.20.0:package-plugin (default-package-plugin) @ org.eclipse.paho.client.eclipse.view ---
[INFO] Building jar: /jobs/genie.paho/paho-1.2-build/workspace/org.eclipse.paho.client.eclipse.view/target/org.eclipse.paho.client.eclipse.view-1.2.0.jar
[INFO] 
[INFO] --- tycho-p2-plugin:0.20.0:p2-metadata-default (default-p2-metadata-default) @ org.eclipse.paho.client.eclipse.view ---
[INFO] 
[INFO] --- tycho-pack200a-plugin:0.20.0:normalize (pack200-normalize) @ org.eclipse.paho.client.eclipse.view ---
[INFO] Pack200 normalizing jar /jobs/genie.paho/paho-1.2-build/workspace/org.eclipse.paho.client.eclipse.view/target/org.eclipse.paho.client.eclipse.view-1.2.0.jar
[INFO] 
[INFO] --- eclipse-jarsigner-plugin:1.0.5:sign (sign) @ org.eclipse.paho.client.eclipse.view ---
[INFO] Searching org.eclipse.paho.client.eclipse.view-1.2.0.jar for inner jars...
[INFO] Signed org.eclipse.paho:org.eclipse.paho.client.eclipse.view:eclipse-plugin:1.2.0 in 0 seconds.
[INFO] Searching org.eclipse.paho.client.eclipse.view-1.2.0-sources.jar for inner jars...
[INFO] Signed org.eclipse.paho:org.eclipse.paho.client.eclipse.view:java-source:sources:1.2.0 in 0 seconds.
[INFO] Searching org.eclipse.paho.client.eclipse.view-1.2.0-sources.jar for inner jars...
[INFO] Signed org.eclipse.paho:org.eclipse.paho.client.eclipse.view:java-source:sources:1.2.0 in 0 seconds.
[INFO] 
[INFO] --- tycho-pack200b-plugin:0.20.0:pack (pack200-pack) @ org.eclipse.paho.client.eclipse.view ---
[INFO] Pack200 packing jar /jobs/genie.paho/paho-1.2-build/workspace/org.eclipse.paho.client.eclipse.view/target/org.eclipse.paho.client.eclipse.view-1.2.0.jar
[INFO] 
[INFO] --- tycho-p2-plugin:0.20.0:p2-metadata (p2-metadata) @ org.eclipse.paho.client.eclipse.view ---
[INFO] 
[INFO] --- maven-gpg-plugin:1.6:sign (sign-artifacts) @ org.eclipse.paho.client.eclipse.view ---
gpg: cannot open `/dev/tty': No such device or address
[INFO] ------------------------------------------------------------------------
[INFO] BUILD FAILURE
[INFO] ------------------------------------------------------------------------
[INFO] Total time: 13.303 s
[INFO] Finished at: 2018-11-29T09:34:32-05:00
[INFO] ------------------------------------------------------------------------
[ERROR] Failed to execute goal org.apache.maven.plugins:maven-gpg-plugin:1.6:sign (sign-artifacts) on project org.eclipse.paho.client.eclipse.view: Exit code: 2 -> [Help 1]
org.apache.maven.lifecycle.LifecycleExecutionException: Failed to execute goal org.apache.maven.plugins:maven-gpg-plugin:1.6:sign (sign-artifacts) on project org.eclipse.paho.client.eclipse.view: Exit code: 2
    at org.apache.maven.lifecycle.internal.MojoExecutor.execute (MojoExecutor.java:213)
    at org.apache.maven.lifecycle.internal.MojoExecutor.execute (MojoExecutor.java:154)
    at org.apache.maven.lifecycle.internal.MojoExecutor.execute (MojoExecutor.java:146)
    at org.apache.maven.lifecycle.internal.LifecycleModuleBuilder.buildProject (LifecycleModuleBuilder.java:117)
    at org.apache.maven.lifecycle.internal.LifecycleModuleBuilder.buildProject (LifecycleModuleBuilder.java:81)
    at org.apache.maven.lifecycle.internal.builder.singlethreaded.SingleThreadedBuilder.build (SingleThreadedBuilder.java:56)
    at org.apache.maven.lifecycle.internal.LifecycleStarter.execute (LifecycleStarter.java:128)
    at org.apache.maven.DefaultMaven.doExecute (DefaultMaven.java:305)
    at org.apache.maven.DefaultMaven.doExecute (DefaultMaven.java:192)
    at org.apache.maven.DefaultMaven.execute (DefaultMaven.java:105)
    at org.apache.maven.cli.MavenCli.execute (MavenCli.java:954)
    at org.apache.maven.cli.MavenCli.doMain (MavenCli.java:288)
    at org.apache.maven.cli.MavenCli.main (MavenCli.java:192)
    at sun.reflect.NativeMethodAccessorImpl.invoke0 (Native Method)
    at sun.reflect.NativeMethodAccessorImpl.invoke (NativeMethodAccessorImpl.java:62)
    at sun.reflect.DelegatingMethodAccessorImpl.invoke (DelegatingMethodAccessorImpl.java:43)
    at java.lang.reflect.Method.invoke (Method.java:498)
    at org.codehaus.plexus.classworlds.launcher.Launcher.launchEnhanced (Launcher.java:289)
    at org.codehaus.plexus.classworlds.launcher.Launcher.launch (Launcher.java:229)
    at org.codehaus.plexus.classworlds.launcher.Launcher.mainWithExitCode (Launcher.java:415)
    at org.codehaus.plexus.classworlds.launcher.Launcher.main (Launcher.java:356)
Caused by: org.apache.maven.plugin.MojoExecutionException: Exit code: 2
    at org.apache.maven.plugin.gpg.GpgSigner.generateSignatureForFile (GpgSigner.java:167)
    at org.apache.maven.plugin.gpg.AbstractGpgSigner.generateSignatureForArtifact (AbstractGpgSigner.java:205)
    at org.apache.maven.plugin.gpg.GpgSignAttachedMojo.execute (GpgSignAttachedMojo.java:140)
    at org.apache.maven.plugin.DefaultBuildPluginManager.executeMojo (DefaultBuildPluginManager.java:137)
    at org.apache.maven.lifecycle.internal.MojoExecutor.execute (MojoExecutor.java:208)
    at org.apache.maven.lifecycle.internal.MojoExecutor.execute (MojoExecutor.java:154)
    at org.apache.maven.lifecycle.internal.MojoExecutor.execute (MojoExecutor.java:146)
    at org.apache.maven.lifecycle.internal.LifecycleModuleBuilder.buildProject (LifecycleModuleBuilder.java:117)
    at org.apache.maven.lifecycle.internal.LifecycleModuleBuilder.buildProject (LifecycleModuleBuilder.java:81)
    at org.apache.maven.lifecycle.internal.builder.singlethreaded.SingleThreadedBuilder.build (SingleThreadedBuilder.java:56)
    at org.apache.maven.lifecycle.internal.LifecycleStarter.execute (LifecycleStarter.java:128)
    at org.apache.maven.DefaultMaven.doExecute (DefaultMaven.java:305)
    at org.apache.maven.DefaultMaven.doExecute (DefaultMaven.java:192)
    at org.apache.maven.DefaultMaven.execute (DefaultMaven.java:105)
    at org.apache.maven.cli.MavenCli.execute (MavenCli.java:954)
    at org.apache.maven.cli.MavenCli.doMain (MavenCli.java:288)
    at org.apache.maven.cli.MavenCli.main (MavenCli.java:192)
    at sun.reflect.NativeMethodAccessorImpl.invoke0 (Native Method)
    at sun.reflect.NativeMethodAccessorImpl.invoke (NativeMethodAccessorImpl.java:62)
    at sun.reflect.DelegatingMethodAccessorImpl.invoke (DelegatingMethodAccessorImpl.java:43)
    at java.lang.reflect.Method.invoke (Method.java:498)
    at org.codehaus.plexus.classworlds.launcher.Launcher.launchEnhanced (Launcher.java:289)
    at org.codehaus.plexus.classworlds.launcher.Launcher.launch (Launcher.java:229)
    at org.codehaus.plexus.classworlds.launcher.Launcher.mainWithExitCode (Launcher.java:415)
    at org.codehaus.plexus.classworlds.launcher.Launcher.main (Launcher.java:356)
[ERROR] 
[ERROR] Re-run Maven using the -X switch to enable full debug logging.
[ERROR] 
[ERROR] For more information about the errors and possible solutions, please read the following articles:
[ERROR] [Help 1] http://cwiki.apache.org/confluence/display/MAVEN/MojoExecutionException
Build step 'Invoke top-level Maven targets' marked build as failure
Started calculate disk usage of build
Finished Calculation of disk usage of build in 0 seconds
Started calculate disk usage of workspace
Finished Calculation of disk usage of workspace in 0 seconds
Finished: FAILURE