FailedConsole Output

Started by user james.sutton@uk.ibm.com
Checkout:workspace / /home/hudson/genie.paho/.hudson/jobs/AndroidNightlyFixTest/workspace - hudson.remoting.LocalChannel@18880085
Using strategy: Default
Git Exe: git
Last Built Revision: Revision fef8373b928a132e3a6cbfa68c76690ef43e581c (origin/develop)
Checkout:workspace / /home/hudson/genie.paho/.hudson/jobs/AndroidNightlyFixTest/workspace - hudson.remoting.LocalChannel@18880085
Wiping out workspace first.
Cloning the remote Git repository
Cloning repository origin
Fetching upstream changes from https://github.com/jpwsutton/paho.mqtt.android.git
Commencing build of Revision fef8373b928a132e3a6cbfa68c76690ef43e581c (origin/develop)
Checking out Revision fef8373b928a132e3a6cbfa68c76690ef43e581c (origin/develop)
[workspace] $ /bin/bash /tmp/genie.paho/hudson978326482825843965.sh
total 20
-rw-rw-r-- 1 genie.paho iot.paho 7760 Oct 10 10:17 config.xml
-rw-rw-r-- 1 genie.paho iot.paho    3 Oct 10 10:17 nextBuildNumber
drwxrwsr-x 8 genie.paho iot.paho 4096 Oct 10 10:17 builds
drwxrwsr-x 9 genie.paho iot.paho 4096 Oct 10 10:17 workspace
Error: Directory /home/hudson/genie.paho/.hudson/jobs/AndroidNightlyFixTest/workspace/../.android-sdk-dir does not exist. Preparing...
[Gradle] - Launching build.
[workspace] $ /home/hudson/genie.paho/.hudson/jobs/AndroidNightlyFixTest/workspace/gradlew -Dhttp.proxyHost=proxy.eclipse.org -Dhttp.proxyPort=9898 -Dhttps.proxyHost=proxy.eclipse.org -Dhttps.proxyPort=9898 -Dhttp.nonProxyHosts=*.eclipse.org -Dhttps.nonProxyHosts=*.eclipse.org clean
SDK dir: /home/hudson/genie.paho/.hudson/jobs/AndroidNightlyFixTest/workspace/../.android-sdk-dir
File /opt/public/hipp/homes/genie.paho/.android/repositories.cfg could not be loaded.
Preparing "Install Android SDK Build-Tools 23.0.3".
"Install Android SDK Build-Tools 23.0.3" ready.
Finishing "Install Android SDK Build-Tools 23.0.3"
Installing Android SDK Build-Tools 23.0.3 in /home/hudson/genie.paho/.hudson/jobs/AndroidNightlyFixTest/workspace/../.android-sdk-dir/build-tools/23.0.3
"Install Android SDK Build-Tools 23.0.3" complete.
Preparing "Install Android SDK Platform 24".
"Install Android SDK Platform 24" ready.
Finishing "Install Android SDK Platform 24"
Installing Android SDK Platform 24 in /home/hudson/genie.paho/.hudson/jobs/AndroidNightlyFixTest/workspace/../.android-sdk-dir/platforms/android-24
"Install Android SDK Platform 24" complete.
Copying MQTT Jar into libs directory
Preparing "Install Android Support Repository".
"Install Android Support Repository" ready.
Finishing "Install Android Support Repository"
Installing Android Support Repository in /home/hudson/genie.paho/.hudson/jobs/AndroidNightlyFixTest/workspace/../.android-sdk-dir/extras/android/m2repository
"Install Android Support Repository" complete.
Incremental java compilation is an incubating feature.

FAILURE: Build failed with an exception.

* What went wrong:
A problem occurred configuring project ':org.eclipse.paho.android.sample'.
> Could not resolve all dependencies for configuration ':org.eclipse.paho.android.sample:_debugApkCopy'.
   > Could not find com.android.support:support-v4:24.2.1.
     Required by:
         org.eclipse.paho:org.eclipse.paho.android.sample:1.1.1-SNAPSHOT > com.android.support:appcompat-v7:24.2.1
         org.eclipse.paho:org.eclipse.paho.android.sample:1.1.1-SNAPSHOT > org.eclipse.paho:org.eclipse.paho.android.service:1.1.1-SNAPSHOT

* Try:
Run with --stacktrace option to get the stack trace. Run with --info or --debug option to get more log output.

BUILD FAILED

Total time: 42.629 secs
Finished: FAILURE