Not builtConsole Output

[INFO] ------------------------------------------------------------------------
[INFO] Reactor Summary for OS.bee Release Engineering Maven - Master Parent POM 0.9.0-SNAPSHOT:
[INFO] 
[INFO] OS.bee Release Engineering Maven - Master Parent POM FAILURE [ 37.379 s]
[INFO] org.eclipse.osbp.releng.maven.parent.mbp ........... SKIPPED
[INFO] org.eclipse.osbp.releng.maven.parent.mbp2 .......... SKIPPED
[INFO] org.eclipse.osbp.releng.maven.licenses ............. SKIPPED
[INFO] org.eclipse.osbp.releng.maven.parent.tycho ......... SKIPPED
[INFO] org.eclipse.osbp.releng.maven.runtime.target ....... SKIPPED
[INFO] org.eclipse.osbp.license ........................... SKIPPED
[INFO] org.eclipse.osbp.license.full ...................... SKIPPED
[INFO] org.eclipse.osbp.license.feature ................... SKIPPED
[INFO] ------------------------------------------------------------------------
[INFO] BUILD FAILURE
[INFO] ------------------------------------------------------------------------
[INFO] Total time:  01:47 min
[INFO] Finished at: 2019-10-30T09:14:44Z
[INFO] ------------------------------------------------------------------------
Waiting for Jenkins to finish collecting data
[ERROR] Failed to execute goal org.apache.maven.plugins:maven-deploy-plugin:2.8.2:deploy (default-deploy) on project org.eclipse.osbp.releng.maven: Failed to deploy artifacts: Could not transfer artifact org.eclipse.osbp.releng.maven:org.eclipse.osbp.releng.maven:pom:0.9.0-20191030.091442-14 from/to repo.eclipse.org (https://repo.eclipse.org/content/repositories/osbp-snapshots/): Failed to transfer file https://repo.eclipse.org/content/repositories/osbp-snapshots/org/eclipse/osbp/releng/maven/org.eclipse.osbp.releng.maven/0.9.0-SNAPSHOT/org.eclipse.osbp.releng.maven-0.9.0-20191030.091442-14.pom with status code 401 -> [Help 1]
[ERROR] 
[ERROR] To see the full stack trace of the errors, re-run Maven with the -e switch.
[ERROR] Re-run Maven using the -X switch to enable full debug logging.
[ERROR] 
[ERROR] For more information about the errors and possible solutions, please read the following articles:
[ERROR] [Help 1] http://cwiki.apache.org/confluence/display/MAVEN/MojoExecutionException
Started
Running as Ralf Mollik
Build failed before it gets to this module
Finished: NOT_BUILT