FailedConsole Output

Started by user rgrunber@redhat.com
Building in workspace /home/hudson/genie.orbit/.jenkins/jobs/upload-approved-artifacts/workspace
[WS-CLEANUP] Deleting project workspace...
[WS-CLEANUP] Done
Copying file to artifact.jar
Copying file to artifact-source.jar
[workspace] $ /bin/sh -x /tmp/genie.orbit/jenkins8896267945062731173.sh
+ pomFile=pom.xml
+ propFile=dev.properties
+ jarFile=artifact.jar
+ srcJarFile=artifact-source.jar
++ find -name '*.jar'
++ wc -l
+ num=2
+ '[' 2 -eq 0 ']'
+ '[' 2 -gt 2 ']'
+ '[' '!' -e artifact.jar ']'
+ cat
+ cat
+ '[' -n artifact-source.jar ']'
+ '[' -e artifact-source.jar ']'
+ echo sources=artifact-source.jar
[workspace] $ /shared/common/apache-maven-latest/bin/mvn -f pom.xml -Dartifact.jar=java-cup-11b-runtime.jar -DGID=org.eclipse.orbit.java-cup -Dartifact-source.jar=java-cup-11b-runtime-src.jar -DVERSION=0.11.20150326 -DAID=java-cup-runtime initialize deploy:deploy-file
Picked up JAVA_TOOL_OPTIONS: -Xmx2G -Djava.io.tmpdir=/tmp/genie.orbit
[INFO] Scanning for projects...
[INFO] 
[INFO] ------------------------------------------------------------------------
[INFO] Building java-cup-runtime 0.11.20150326
[INFO] ------------------------------------------------------------------------
[INFO] 
[INFO] --- properties-maven-plugin:1.0.0:read-project-properties (default) @ java-cup-runtime ---
[INFO] 
[INFO] ------------------------------------------------------------------------
[INFO] Building java-cup-runtime 0.11.20150326
[INFO] ------------------------------------------------------------------------
[INFO] 
[INFO] --- maven-deploy-plugin:2.7:deploy-file (default-cli) @ java-cup-runtime ---
Uploading to repo.eclipse.org: https://repo.eclipse.org/content/repositories/orbit-approved-artifacts/org/eclipse/orbit/java-cup/java-cup-runtime/0.11.20150326/java-cup-runtime-0.11.20150326.jar
Progress (1): 2.0/23 kB
Progress (1): 4.1/23 kB
Progress (1): 6.1/23 kB
Progress (1): 8.2/23 kB
Progress (1): 10/23 kB 
Progress (1): 12/23 kB
Progress (1): 14/23 kB
Progress (1): 16/23 kB
Progress (1): 18/23 kB
Progress (1): 20/23 kB
Progress (1): 23/23 kB
Progress (1): 23 kB   
                   
Uploading to repo.eclipse.org: https://repo.eclipse.org/content/repositories/orbit-approved-artifacts/org/eclipse/orbit/java-cup/java-cup-runtime/0.11.20150326/java-cup-runtime-0.11.20150326.pom
Progress (1): 423 B
                   
[INFO] ------------------------------------------------------------------------
[INFO] BUILD FAILURE
[INFO] ------------------------------------------------------------------------
[INFO] Total time: 2.318 s
[INFO] Finished at: 2018-03-20T16:51:39-04:00
[INFO] Final Memory: 20M/1457M
[INFO] ------------------------------------------------------------------------
[ERROR] Failed to execute goal org.apache.maven.plugins:maven-deploy-plugin:2.7:deploy-file (default-cli) on project java-cup-runtime: Failed to deploy artifacts: Could not transfer artifact org.eclipse.orbit.java-cup:java-cup-runtime:jar:0.11.20150326 from/to repo.eclipse.org (https://repo.eclipse.org/content/repositories/orbit-approved-artifacts): Failed to transfer file: https://repo.eclipse.org/content/repositories/orbit-approved-artifacts/org/eclipse/orbit/java-cup/java-cup-runtime/0.11.20150326/java-cup-runtime-0.11.20150326.jar. Return code is: 401, ReasonPhrase: Unauthorized. -> [Help 1]
[ERROR] 
[ERROR] To see the full stack trace of the errors, re-run Maven with the -e switch.
[ERROR] Re-run Maven using the -X switch to enable full debug logging.
[ERROR] 
[ERROR] For more information about the errors and possible solutions, please read the following articles:
[ERROR] [Help 1] http://cwiki.apache.org/confluence/display/MAVEN/MojoExecutionException
Build step 'Invoke top-level Maven targets' marked build as failure
Started calculate disk usage of build
Finished Calculation of disk usage of build in 0 seconds
Started calculate disk usage of workspace
Finished Calculation of disk usage of workspace in 0 seconds
Finished: FAILURE