FailedConsole Output

Skipping 112 KB.. Full Log
jitbuilder/CMakeFiles/jitbuilder.dir/__/compiler/control/OMRRecompilation.cpp.o
16:25:03 [2019-11-01T20:25:03.180Z] [ 54%] Building CXX object fvtest/compilertest/CMakeFiles/testcompiler.dir/__/__/compiler/ilgen/OMRVirtualMachineState.cpp.o
16:25:03 [2019-11-01T20:25:03.180Z] [ 54%] Building CXX object jitbuilder/CMakeFiles/jitbuilder.dir/__/compiler/control/CompilationController.cpp.o
16:25:03 [2019-11-01T20:25:03.180Z] [ 54%] Building CXX object fvtest/compilertest/CMakeFiles/testcompiler.dir/__/__/compiler/infra/Assert.cpp.o
16:25:03 [2019-11-01T20:25:03.180Z] [ 54%] Building CXX object jitbuilder/CMakeFiles/jitbuilder.dir/__/compiler/control/CompileMethod.cpp.o
16:25:03 [2019-11-01T20:25:03.180Z] Scanning dependencies of target TestIntrusiveList
16:25:03 [2019-11-01T20:25:03.180Z] [ 54%] Building CXX object fvtest/coretest/CMakeFiles/TestIntrusiveList.dir/TestIntrusiveList.cpp.o
16:25:03 [2019-11-01T20:25:03.180Z] [ 54%] Building CXX object fvtest/compilertest/CMakeFiles/testcompiler.dir/__/__/compiler/infra/BitVector.cpp.o
16:25:03 [2019-11-01T20:25:03.180Z] [ 54%] Building CXX object fvtest/coretest/CMakeFiles/TestIntrusiveList.dir/main.cpp.o
16:25:04 [2019-11-01T20:25:04.012Z] [ 54%] Building CXX object fvtest/coretest/CMakeFiles/TestIntrusiveList.dir/__/__/util/main_function/main_function.cpp.o
16:25:04 [2019-11-01T20:25:04.012Z] [ 54%] Linking CXX executable TestIntrusiveList
16:25:04 [2019-11-01T20:25:04.012Z] [ 54%] Building CXX object jitbuilder/CMakeFiles/jitbuilder.dir/__/compiler/env/ExceptionTable.cpp.o
16:25:04 [2019-11-01T20:25:04.012Z] [ 54%] Built target TestIntrusiveList
16:25:04 [2019-11-01T20:25:04.012Z] [ 54%] Building CXX object fvtest/porttest/CMakeFiles/omrporttest.dir/si.cpp.o
16:25:04 [2019-11-01T20:25:04.012Z] /Users/jenkins/workspace/PullRequest-osx_x86-64/compiler/infra/BitVector.cpp:201:43: warning: format specifies type 'unsigned long' but the argument has type 'chunk_t' (aka 'unsigned long long') [-Wformat]
16:25:04 [2019-11-01T20:25:04.012Z]       sprintf(pos, "%0*lX", chunk_hexlen, _chunks[i]);
16:25:04 [2019-11-01T20:25:04.012Z]                     ~~~~~                 ^~~~~~~~~~
16:25:04 [2019-11-01T20:25:04.012Z]                     %0*llX
16:25:04 [2019-11-01T20:25:04.012Z] 1 warning generated.
16:25:04 [2019-11-01T20:25:04.012Z] [ 54%] Building CXX object fvtest/compilertest/CMakeFiles/testcompiler.dir/__/__/compiler/infra/Checklist.cpp.o
16:25:04 [2019-11-01T20:25:04.012Z] [ 54%] Building CXX object jitbuilder/CMakeFiles/jitbuilder.dir/__/compiler/env/OMRCPU.cpp.o
16:25:04 [2019-11-01T20:25:04.012Z] [ 54%] Building CXX object jitbuilder/CMakeFiles/jitbuilder.dir/__/compiler/env/OMRObjectModel.cpp.o
16:25:04 [2019-11-01T20:25:04.012Z] [ 54%] Building CXX object fvtest/compilertest/CMakeFiles/testcompiler.dir/__/__/compiler/infra/HashTab.cpp.o
16:25:04 [2019-11-01T20:25:04.012Z] Scanning dependencies of target TestBytes
16:25:04 [2019-11-01T20:25:04.012Z] [ 54%] Building CXX object fvtest/coretest/CMakeFiles/TestBytes.dir/TestBytes.cpp.o
16:25:04 [2019-11-01T20:25:04.012Z] [ 54%] Building CXX object fvtest/coretest/CMakeFiles/TestBytes.dir/main.cpp.o
16:25:04 [2019-11-01T20:25:04.863Z] [ 54%] Building CXX object fvtest/coretest/CMakeFiles/TestBytes.dir/__/__/util/main_function/main_function.cpp.o
16:25:04 [2019-11-01T20:25:04.863Z] [ 54%] Linking CXX executable TestBytes
16:25:04 [2019-11-01T20:25:04.863Z] [ 54%] Building CXX object jitbuilder/CMakeFiles/jitbuilder.dir/__/compiler/env/OMRArithEnv.cpp.o
16:25:04 [2019-11-01T20:25:04.863Z] [ 54%] Building CXX object fvtest/compilertest/CMakeFiles/testcompiler.dir/__/__/compiler/infra/IGBase.cpp.o
16:25:04 [2019-11-01T20:25:04.863Z] [ 54%] Building CXX object jitbuilder/CMakeFiles/jitbuilder.dir/__/compiler/env/OMRClassEnv.cpp.o
16:25:04 [2019-11-01T20:25:04.863Z] [ 54%] Built target TestBytes
16:25:04 [2019-11-01T20:25:04.863Z] [ 54%] Building CXX object fvtest/compilertest/CMakeFiles/testcompiler.dir/__/__/compiler/infra/IGNode.cpp.o
16:25:04 [2019-11-01T20:25:04.863Z] [ 55%] Building CXX object fvtest/porttest/CMakeFiles/omrporttest.dir/si_numcpusTest.cpp.o
16:25:04 [2019-11-01T20:25:04.863Z] [ 55%] Building CXX object jitbuilder/CMakeFiles/jitbuilder.dir/__/compiler/env/OMRDebugEnv.cpp.o
16:25:04 [2019-11-01T20:25:04.863Z] [ 56%] Building CXX object fvtest/compilertest/CMakeFiles/testcompiler.dir/__/__/compiler/infra/ILWalk.cpp.o
16:25:04 [2019-11-01T20:25:04.863Z] [ 57%] Building CXX object jitbuilder/CMakeFiles/jitbuilder.dir/__/compiler/env/OMRVMEnv.cpp.o
16:25:05 [2019-11-01T20:25:05.752Z] [ 57%] Building CXX object fvtest/compilertest/CMakeFiles/testcompiler.dir/__/__/compiler/infra/InterferenceGraph.cpp.o
16:25:05 [2019-11-01T20:25:05.752Z] [ 57%] Building CXX object jitbuilder/CMakeFiles/jitbuilder.dir/__/compiler/env/OMRVMMethodEnv.cpp.o
16:25:05 [2019-11-01T20:25:05.752Z] [ 57%] Building CXX object jitbuilder/CMakeFiles/jitbuilder.dir/__/compiler/env/SegmentAllocator.cpp.o
16:25:05 [2019-11-01T20:25:05.752Z] [ 57%] Building CXX object jitbuilder/CMakeFiles/jitbuilder.dir/__/compiler/env/SegmentProvider.cpp.o
16:25:05 [2019-11-01T20:25:05.752Z] [ 57%] Building CXX object jitbuilder/CMakeFiles/jitbuilder.dir/__/compiler/env/SystemSegmentProvider.cpp.o
16:25:05 [2019-11-01T20:25:05.752Z] Scanning dependencies of target omrtraceoptiontest
16:25:05 [2019-11-01T20:25:05.752Z] [ 57%] Building CXX object jitbuilder/CMakeFiles/jitbuilder.dir/__/compiler/env/DebugSegmentProvider.cpp.o
16:25:05 [2019-11-01T20:25:05.752Z] [ 57%] Building CXX object fvtest/rastest/CMakeFiles/omrtraceoptiontest.dir/main.cpp.o
16:25:05 [2019-11-01T20:25:05.752Z] [ 57%] Building CXX object jitbuilder/CMakeFiles/jitbuilder.dir/__/compiler/env/Region.cpp.o
16:25:05 [2019-11-01T20:25:05.752Z] [ 57%] Building CXX object jitbuilder/CMakeFiles/jitbuilder.dir/__/compiler/env/StackMemoryRegion.cpp.o
16:25:05 [2019-11-01T20:25:05.752Z] [ 57%] Building CXX object fvtest/compilertest/CMakeFiles/testcompiler.dir/__/__/compiler/infra/OMRMonitor.cpp.o
16:25:05 [2019-11-01T20:25:05.752Z] [ 57%] Building CXX object jitbuilder/CMakeFiles/jitbuilder.dir/__/compiler/env/OMRPersistentInfo.cpp.o
16:25:05 [2019-11-01T20:25:05.752Z] [ 57%] Building CXX object jitbuilder/CMakeFiles/jitbuilder.dir/__/compiler/env/TRMemory.cpp.o
16:25:05 [2019-11-01T20:25:05.752Z] [ 57%] Building CXX object fvtest/compilertest/CMakeFiles/testcompiler.dir/__/__/compiler/infra/OMRMonitorTable.cpp.o
16:25:05 [2019-11-01T20:25:05.752Z] [ 57%] Building CXX object fvtest/compilertest/CMakeFiles/testcompiler.dir/__/__/compiler/infra/Random.cpp.o
16:25:05 [2019-11-01T20:25:05.752Z] [ 57%] Building CXX object jitbuilder/CMakeFiles/jitbuilder.dir/__/compiler/env/TRPersistentMemory.cpp.o
16:25:05 [2019-11-01T20:25:05.752Z] [ 57%] Building CXX object fvtest/porttest/CMakeFiles/omrporttest.dir/testHelpers.cpp.o
16:25:06 [2019-11-01T20:25:06.700Z] [ 57%] Building CXX object fvtest/compilertest/CMakeFiles/testcompiler.dir/__/__/compiler/infra/SimpleRegex.cpp.o
16:25:06 [2019-11-01T20:25:06.700Z] [ 57%] Building CXX object jitbuilder/CMakeFiles/jitbuilder.dir/__/compiler/env/VerboseLog.cpp.o
16:25:06 [2019-11-01T20:25:06.700Z] [ 57%] Building CXX object jitbuilder/CMakeFiles/jitbuilder.dir/__/compiler/env/FEBase.cpp.o
16:25:06 [2019-11-01T20:25:06.700Z] [ 57%] Building CXX object fvtest/compilertest/CMakeFiles/testcompiler.dir/__/__/compiler/infra/STLUtils.cpp.o
16:25:06 [2019-11-01T20:25:06.700Z] [ 57%] Building CXX object fvtest/compilertest/CMakeFiles/testcompiler.dir/__/__/compiler/infra/Timer.cpp.o
16:25:06 [2019-11-01T20:25:06.700Z] /Users/jenkins/workspace/PullRequest-osx_x86-64/compiler/env/FEBase.cpp:101:46: warning: offset of on non-standard-layout type 'OMR::FrontEnd::JitConfig' (aka 'JitBuilder::JitConfig') [-Winvalid-offsetof]
16:25:06 [2019-11-01T20:25:06.700Z]     TR::Options::set32BitNumericInJitConfig, offsetof(OMR::FrontEnd::JitConfig, options.codeCacheKB), 0, " %d (KB)"},
16:25:06 [2019-11-01T20:25:06.700Z]                                              ^                                  ~~~~~~~
16:25:06 [2019-11-01T20:25:06.700Z] /Library/Developer/CommandLineTools/usr/lib/clang/9.1.0/include/stddef.h:120:24: note: expanded from macro 'offsetof'
16:25:06 [2019-11-01T20:25:06.700Z] #define offsetof(t, d) __builtin_offsetof(t, d)
16:25:06 [2019-11-01T20:25:06.700Z]                        ^                     ~
16:25:06 [2019-11-01T20:25:06.700Z] /Users/jenkins/workspace/PullRequest-osx_x86-64/compiler/env/FEBase.cpp:107:34: warning: offset of on non-standard-layout type 'TR::JitConfig' [-Winvalid-offsetof]
16:25:06 [2019-11-01T20:25:06.700Z]     TR::Options::setVerboseBits, offsetof(TR::JitConfig, options.verboseFlags), (1<<TR_VerboseCompileStart)|(1<<TR_VerboseCompileEnd), "F=1"},
16:25:06 [2019-11-01T20:25:06.700Z]                                  ^                       ~~~~~~~
16:25:06 [2019-11-01T20:25:06.700Z] /Library/Developer/CommandLineTools/usr/lib/clang/9.1.0/include/stddef.h:120:24: note: expanded from macro 'offsetof'
16:25:06 [2019-11-01T20:25:06.700Z] #define offsetof(t, d) __builtin_offsetof(t, d)
16:25:06 [2019-11-01T20:25:06.700Z]                        ^                     ~
16:25:06 [2019-11-01T20:25:06.700Z] /Users/jenkins/workspace/PullRequest-osx_x86-64/compiler/env/FEBase.cpp:109:34: warning: offset of on non-standard-layout type 'TR::JitConfig' [-Winvalid-offsetof]
16:25:06 [2019-11-01T20:25:06.700Z]     TR::Options::setVerboseBits, offsetof(TR::JitConfig, options.verboseFlags), 0, "F"},
16:25:06 [2019-11-01T20:25:06.700Z]                                  ^                       ~~~~~~~
16:25:06 [2019-11-01T20:25:06.700Z] /Library/Developer/CommandLineTools/usr/lib/clang/9.1.0/include/stddef.h:120:24: note: expanded from macro 'offsetof'
16:25:06 [2019-11-01T20:25:06.700Z] #define offsetof(t, d) __builtin_offsetof(t, d)
16:25:06 [2019-11-01T20:25:06.700Z]                        ^                     ~
16:25:06 [2019-11-01T20:25:06.700Z] /Users/jenkins/workspace/PullRequest-osx_x86-64/compiler/env/FEBase.cpp:112:40: warning: offset of on non-standard-layout type 'TR::JitConfig' [-Winvalid-offsetof]
16:25:06 [2019-11-01T20:25:06.700Z]     TR::Options::setStringInJitConfig, offsetof(TR::JitConfig, options.vLogFileName), 0, "P%s"},
16:25:06 [2019-11-01T20:25:06.700Z]                                        ^                       ~~~~~~~
16:25:06 [2019-11-01T20:25:06.700Z] /Library/Developer/CommandLineTools/usr/lib/clang/9.1.0/include/stddef.h:120:24: note: expanded from macro 'offsetof'
16:25:06 [2019-11-01T20:25:06.700Z] #define offsetof(t, d) __builtin_offsetof(t, d)
16:25:06 [2019-11-01T20:25:06.700Z]                        ^                     ~
16:25:06 [2019-11-01T20:25:06.700Z] 4 warnings generated.
16:25:06 [2019-11-01T20:25:06.700Z] [ 58%] Building CXX object jitbuilder/CMakeFiles/jitbuilder.dir/__/compiler/env/JitConfig.cpp.o
16:25:06 [2019-11-01T20:25:06.700Z] [ 58%] Building CXX object fvtest/rastest/CMakeFiles/omrtraceoptiontest.dir/rasTestHelpers.cpp.o
16:25:06 [2019-11-01T20:25:06.700Z] [ 58%] Building CXX object fvtest/compilertest/CMakeFiles/testcompiler.dir/__/__/compiler/infra/TreeServices.cpp.o
16:25:06 [2019-11-01T20:25:06.700Z] [ 58%] Building CXX object jitbuilder/CMakeFiles/jitbuilder.dir/__/compiler/env/OMRIO.cpp.o
16:25:06 [2019-11-01T20:25:06.700Z] [ 58%] Building CXX object jitbuilder/CMakeFiles/jitbuilder.dir/__/compiler/env/OMRKnownObjectTable.cpp.o
16:25:07 [2019-11-01T20:25:07.603Z] [ 58%] Building CXX object fvtest/compilertest/CMakeFiles/testcompiler.dir/__/__/compiler/infra/OMRCfg.cpp.o
16:25:07 [2019-11-01T20:25:07.603Z] [ 58%] Building CXX object jitbuilder/CMakeFiles/jitbuilder.dir/__/compiler/env/Globals.cpp.o
16:25:07 [2019-11-01T20:25:07.603Z] [ 58%] Building CXX object jitbuilder/CMakeFiles/jitbuilder.dir/__/compiler/env/OMRCompilerEnv.cpp.o
16:25:07 [2019-11-01T20:25:07.603Z] [ 58%] Building CXX object jitbuilder/CMakeFiles/jitbuilder.dir/__/compiler/env/PersistentAllocator.cpp.o
16:25:07 [2019-11-01T20:25:07.603Z] [ 58%] Building CXX object jitbuilder/CMakeFiles/jitbuilder.dir/__/compiler/il/OMRSymbol.cpp.o
16:25:07 [2019-11-01T20:25:07.603Z] [ 58%] Building CXX object fvtest/porttest/CMakeFiles/omrporttest.dir/testProcessHelpers.cpp.o
16:25:07 [2019-11-01T20:25:07.603Z] [ 58%] Building CXX object fvtest/compilertest/CMakeFiles/testcompiler.dir/__/__/compiler/optimizer/AsyncCheckInsertion.cpp.o
16:25:07 [2019-11-01T20:25:07.603Z] [ 58%] Building CXX object jitbuilder/CMakeFiles/jitbuilder.dir/__/compiler/il/OMRAutomaticSymbol.cpp.o
16:25:07 [2019-11-01T20:25:07.603Z] [ 58%] Building CXX object fvtest/compilertest/CMakeFiles/testcompiler.dir/__/__/compiler/optimizer/BackwardBitVectorAnalysis.cpp.o
16:25:08 [2019-11-01T20:25:08.522Z] [ 58%] Building CXX object jitbuilder/CMakeFiles/jitbuilder.dir/__/compiler/il/OMRLabelSymbol.cpp.o
16:25:08 [2019-11-01T20:25:08.522Z] [ 59%] Building CXX object fvtest/compilertest/CMakeFiles/testcompiler.dir/__/__/compiler/optimizer/BackwardIntersectionBitVectorAnalysis.cpp.o
16:25:08 [2019-11-01T20:25:08.522Z] [ 59%] Building CXX object fvtest/rastest/CMakeFiles/omrtraceoptiontest.dir/traceOptionTest.cpp.o
16:25:08 [2019-11-01T20:25:08.522Z] [ 59%] Building CXX object jitbuilder/CMakeFiles/jitbuilder.dir/__/compiler/il/OMRMethodSymbol.cpp.o
16:25:08 [2019-11-01T20:25:08.522Z] [ 59%] Building CXX object jitbuilder/CMakeFiles/jitbuilder.dir/__/compiler/il/OMRParameterSymbol.cpp.o
16:25:08 [2019-11-01T20:25:08.522Z] [ 59%] Building CXX object fvtest/compilertest/CMakeFiles/testcompiler.dir/__/__/compiler/optimizer/BackwardUnionBitVectorAnalysis.cpp.o
16:25:08 [2019-11-01T20:25:08.522Z] [ 59%] Building CXX object jitbuilder/CMakeFiles/jitbuilder.dir/__/compiler/il/OMRRegisterMappedSymbol.cpp.o
16:25:09 [2019-11-01T20:25:09.458Z] [ 59%] Building CXX object fvtest/porttest/CMakeFiles/omrporttest.dir/__/__/util/main_function/main_function.cpp.o
16:25:09 [2019-11-01T20:25:09.458Z] [ 59%] Building CXX object fvtest/compilertest/CMakeFiles/testcompiler.dir/__/__/compiler/optimizer/BitVectorAnalysis.cpp.o
16:25:09 [2019-11-01T20:25:09.458Z] [ 59%] Building CXX object jitbuilder/CMakeFiles/jitbuilder.dir/__/compiler/il/OMRResolvedMethodSymbol.cpp.o
16:25:09 [2019-11-01T20:25:09.458Z] [ 59%] Linking CXX executable omrporttest
16:25:09 [2019-11-01T20:25:09.458Z] [ 59%] Built target omrporttest
16:25:09 [2019-11-01T20:25:09.458Z] [ 59%] Building CXX object fvtest/compilertest/CMakeFiles/testcompiler.dir/__/__/compiler/optimizer/CatchBlockRemover.cpp.o
16:25:09 [2019-11-01T20:25:09.458Z] Scanning dependencies of target omrsubscribertest
16:25:09 [2019-11-01T20:25:09.458Z] [ 60%] Building CXX object jitbuilder/CMakeFiles/jitbuilder.dir/__/compiler/il/OMRStaticSymbol.cpp.o
16:25:09 [2019-11-01T20:25:09.458Z] [ 60%] Building CXX object fvtest/rastest/CMakeFiles/omrsubscribertest.dir/main.cpp.o
16:25:09 [2019-11-01T20:25:09.458Z] [ 60%] Building CXX object jitbuilder/CMakeFiles/jitbuilder.dir/__/compiler/il/Aliases.cpp.o
16:25:09 [2019-11-01T20:25:09.458Z] [ 60%] Building CXX object fvtest/rastest/CMakeFiles/omrsubscribertest.dir/rasTestHelpers.cpp.o
16:25:09 [2019-11-01T20:25:09.458Z] [ 60%] Building CXX object fvtest/rastest/CMakeFiles/omrsubscribertest.dir/subscriberTest.cpp.o
16:25:09 [2019-11-01T20:25:09.458Z] [ 60%] Building CXX object fvtest/compilertest/CMakeFiles/testcompiler.dir/__/__/compiler/optimizer/OMRCFGSimplifier.cpp.o
16:25:09 [2019-11-01T20:25:09.458Z] [ 60%] Building CXX object jitbuilder/CMakeFiles/jitbuilder.dir/__/compiler/il/OMRBlock.cpp.o
16:25:10 [2019-11-01T20:25:10.333Z] [ 60%] Building C object fvtest/rastest/CMakeFiles/omrtraceoptiontest.dir/ut_omr_test.c.o
16:25:10 [2019-11-01T20:25:10.333Z] [ 60%] Building CXX object fvtest/rastest/CMakeFiles/omrtraceoptiontest.dir/__/__/util/main_function/main_function.cpp.o
16:25:10 [2019-11-01T20:25:10.333Z] [ 61%] Linking CXX executable omrtraceoptiontest
16:25:10 [2019-11-01T20:25:10.333Z] [ 61%] Building CXX object fvtest/compilertest/CMakeFiles/testcompiler.dir/__/__/compiler/optimizer/CompactLocals.cpp.o
16:25:10 [2019-11-01T20:25:10.333Z] [ 61%] Building CXX object jitbuilder/CMakeFiles/jitbuilder.dir/__/compiler/il/OMRDataTypes.cpp.o
16:25:10 [2019-11-01T20:25:10.333Z] [ 61%] Building CXX object jitbuilder/CMakeFiles/jitbuilder.dir/__/compiler/il/OMRIL.cpp.o
16:25:10 [2019-11-01T20:25:10.333Z] [ 61%] Built target omrtraceoptiontest
16:25:10 [2019-11-01T20:25:10.333Z] [ 61%] Building C object fvtest/rastest/CMakeFiles/omrsubscribertest.dir/ut_omr_test.c.o
16:25:10 [2019-11-01T20:25:10.333Z] [ 61%] Building CXX object jitbuilder/CMakeFiles/jitbuilder.dir/__/compiler/il/OMRILOps.cpp.o
16:25:10 [2019-11-01T20:25:10.333Z] [ 61%] Building CXX object jitbuilder/CMakeFiles/jitbuilder.dir/__/compiler/il/OMRNode.cpp.o
16:25:10 [2019-11-01T20:25:10.333Z] Scanning dependencies of target omrrastest
16:25:10 [2019-11-01T20:25:10.333Z] [ 61%] Building CXX object fvtest/rastest/CMakeFiles/omrrastest.dir/agentNegativeTest.cpp.o
16:25:10 [2019-11-01T20:25:10.333Z] [ 61%] Building CXX object fvtest/compilertest/CMakeFiles/testcompiler.dir/__/__/compiler/optimizer/CopyPropagation.cpp.o
16:25:10 [2019-11-01T20:25:10.333Z] [ 61%] Building CXX object jitbuilder/CMakeFiles/jitbuilder.dir/__/compiler/il/OMRSymbolReference.cpp.o
16:25:11 [2019-11-01T20:25:11.254Z] [ 61%] Building CXX object fvtest/compilertest/CMakeFiles/testcompiler.dir/__/__/compiler/optimizer/DataFlowAnalysis.cpp.o
16:25:11 [2019-11-01T20:25:11.254Z] [ 61%] Building CXX object jitbuilder/CMakeFiles/jitbuilder.dir/__/compiler/il/OMRTreeTop.cpp.o
16:25:11 [2019-11-01T20:25:11.254Z] [ 61%] Building CXX object fvtest/rastest/CMakeFiles/omrsubscribertest.dir/subscriberForkTest.cpp.o
16:25:11 [2019-11-01T20:25:11.254Z] [ 61%] Building CXX object fvtest/compilertest/CMakeFiles/testcompiler.dir/__/__/compiler/optimizer/DeadStoreElimination.cpp.o
16:25:11 [2019-11-01T20:25:11.254Z] [ 61%] Building CXX object jitbuilder/CMakeFiles/jitbuilder.dir/__/compiler/il/NodePool.cpp.o
16:25:11 [2019-11-01T20:25:11.254Z] [ 61%] Building CXX object fvtest/compilertest/CMakeFiles/testcompiler.dir/__/__/compiler/optimizer/DeadTreesElimination.cpp.o
16:25:12 [2019-11-01T20:25:12.153Z] [ 61%] Building CXX object jitbuilder/CMakeFiles/jitbuilder.dir/__/compiler/il/NodeUtils.cpp.o
16:25:12 [2019-11-01T20:25:12.153Z] [ 61%] Building CXX object fvtest/compilertest/CMakeFiles/testcompiler.dir/__/__/compiler/optimizer/DebuggingCounters.cpp.o
16:25:12 [2019-11-01T20:25:12.153Z] [ 61%] Building CXX object jitbuilder/CMakeFiles/jitbuilder.dir/__/compiler/ilgen/IlGenRequest.cpp.o
16:25:12 [2019-11-01T20:25:12.153Z] [ 61%] Building CXX object jitbuilder/CMakeFiles/jitbuilder.dir/__/compiler/ilgen/IlInjector.cpp.o
16:25:12 [2019-11-01T20:25:12.153Z] /Users/jenkins/workspace/PullRequest-osx_x86-64/compiler/optimizer/DebuggingCounters.cpp:242:20: warning: format specifies type 'unsigned long' but the argument has type 'uint64_t' (aka 'unsigned long long') [-Wformat]
16:25:12 [2019-11-01T20:25:12.153Z]                    counterInfo->totalCount);
16:25:12 [2019-11-01T20:25:12.153Z]                    ^~~~~~~~~~~~~~~~~~~~~~~
16:25:12 [2019-11-01T20:25:12.153Z] /Users/jenkins/workspace/PullRequest-osx_x86-64/compiler/optimizer/DebuggingCounters.cpp:255:87: warning: format specifies type 'unsigned long' but the argument has type 'uint64_t' (aka 'unsigned long long') [-Wformat]
16:25:12 [2019-11-01T20:25:12.153Z]    fprintf(output, "Compilation sum %d Dynamic sum %lu \n", (int32_t) compilationSum, dynamicSum);
16:25:12 [2019-11-01T20:25:12.153Z]                                                    ~~~                                ^~~~~~~~~~
16:25:12 [2019-11-01T20:25:12.153Z]                                                    %llu
16:25:12 [2019-11-01T20:25:12.153Z] 2 warnings generated.
16:25:12 [2019-11-01T20:25:12.153Z] [ 61%] Building CXX object fvtest/compilertest/CMakeFiles/testcompiler.dir/__/__/compiler/optimizer/Delayedness.cpp.o
16:25:12 [2019-11-01T20:25:12.153Z] [ 61%] Building CXX object fvtest/rastest/CMakeFiles/omrrastest.dir/agentTest.cpp.o
16:25:13 [2019-11-01T20:25:13.036Z] [ 61%] Building CXX object fvtest/rastest/CMakeFiles/omrsubscribertest.dir/__/__/util/main_function/main_function.cpp.o
16:25:13 [2019-11-01T20:25:13.036Z] [ 61%] Building CXX object fvtest/compilertest/CMakeFiles/testcompiler.dir/__/__/compiler/optimizer/Dominators.cpp.o
16:25:13 [2019-11-01T20:25:13.036Z] [ 61%] Linking CXX executable omrsubscribertest
16:25:13 [2019-11-01T20:25:13.036Z] [ 62%] Building CXX object jitbuilder/CMakeFiles/jitbuilder.dir/__/compiler/ilgen/OMRBytecodeBuilder.cpp.o
16:25:13 [2019-11-01T20:25:13.036Z] [ 63%] Built target omrsubscribertest
16:25:13 [2019-11-01T20:25:13.036Z] [ 63%] Building CXX object fvtest/rastest/CMakeFiles/omrrastest.dir/main.cpp.o
16:25:13 [2019-11-01T20:25:13.036Z] [ 64%] Building CXX object fvtest/compilertest/CMakeFiles/testcompiler.dir/__/__/compiler/optimizer/DominatorVerifier.cpp.o
16:25:13 [2019-11-01T20:25:13.036Z] [ 64%] Building CXX object fvtest/compilertest/CMakeFiles/testcompiler.dir/__/__/compiler/optimizer/DominatorsChk.cpp.o
16:25:13 [2019-11-01T20:25:13.036Z] [ 64%] Building CXX object jitbuilder/CMakeFiles/jitbuilder.dir/__/compiler/ilgen/OMRIlBuilder.cpp.o
16:25:13 [2019-11-01T20:25:13.036Z] [ 64%] Building CXX object fvtest/compilertest/CMakeFiles/testcompiler.dir/__/__/compiler/optimizer/Earliestness.cpp.o
16:25:13 [2019-11-01T20:25:13.036Z] [ 64%] Building CXX object fvtest/rastest/CMakeFiles/omrrastest.dir/memoryCategoriesTest.cpp.o
16:25:13 [2019-11-01T20:25:13.036Z] [ 64%] Building CXX object fvtest/compilertest/CMakeFiles/testcompiler.dir/__/__/compiler/optimizer/ExpressionsSimplification.cpp.o
16:25:13 [2019-11-01T20:25:13.036Z] [ 64%] Building CXX object jitbuilder/CMakeFiles/jitbuilder.dir/__/compiler/ilgen/OMRIlType.cpp.o
16:25:13 [2019-11-01T20:25:13.910Z] [ 64%] Building CXX object fvtest/compilertest/CMakeFiles/testcompiler.dir/__/__/compiler/optimizer/FieldPrivatizer.cpp.o
16:25:13 [2019-11-01T20:25:13.910Z] [ 64%] Building CXX object jitbuilder/CMakeFiles/jitbuilder.dir/__/compiler/ilgen/OMRIlValue.cpp.o
16:25:13 [2019-11-01T20:25:13.910Z] [ 64%] Building CXX object fvtest/compilertest/CMakeFiles/testcompiler.dir/__/__/compiler/optimizer/GeneralLoopUnroller.cpp.o
16:25:13 [2019-11-01T20:25:13.910Z] Scanning dependencies of target omrsigtest
16:25:13 [2019-11-01T20:25:13.910Z] [ 64%] Building CXX object jitbuilder/CMakeFiles/jitbuilder.dir/__/compiler/ilgen/OMRJitBuilderRecorder.cpp.o
16:25:13 [2019-11-01T20:25:13.910Z] [ 64%] Building CXX object fvtest/sigtest/CMakeFiles/omrsigtest.dir/sigTest.cpp.o
16:25:13 [2019-11-01T20:25:13.910Z] [ 64%] Building CXX object jitbuilder/CMakeFiles/jitbuilder.dir/__/compiler/ilgen/OMRJitBuilderRecorderBinaryBuffer.cpp.o
16:25:13 [2019-11-01T20:25:13.910Z] [ 64%] Building CXX object jitbuilder/CMakeFiles/jitbuilder.dir/__/compiler/ilgen/OMRJitBuilderRecorderBinaryFile.cpp.o
16:25:14 [2019-11-01T20:25:14.788Z] [ 64%] Building CXX object jitbuilder/CMakeFiles/jitbuilder.dir/__/compiler/ilgen/OMRJitBuilderRecorderTextFile.cpp.o
16:25:14 [2019-11-01T20:25:14.788Z] [ 64%] Building CXX object jitbuilder/CMakeFiles/jitbuilder.dir/__/compiler/ilgen/OMRMethodBuilder.cpp.o
16:25:14 [2019-11-01T20:25:14.788Z] [ 64%] Building CXX object fvtest/rastest/CMakeFiles/omrrastest.dir/methodDictionaryTest.cpp.o
16:25:14 [2019-11-01T20:25:14.788Z] [ 64%] Building CXX object fvtest/compilertest/CMakeFiles/testcompiler.dir/__/__/compiler/optimizer/GlobalAnticipatability.cpp.o
16:25:14 [2019-11-01T20:25:14.788Z] [ 64%] Building CXX object fvtest/compilertest/CMakeFiles/testcompiler.dir/__/__/compiler/optimizer/GlobalRegisterAllocator.cpp.o
16:25:14 [2019-11-01T20:25:14.788Z] [ 64%] Building CXX object jitbuilder/CMakeFiles/jitbuilder.dir/__/compiler/ilgen/OMRThunkBuilder.cpp.o
16:25:15 [2019-11-01T20:25:15.674Z] [ 64%] Building CXX object jitbuilder/CMakeFiles/jitbuilder.dir/__/compiler/ilgen/OMRTypeDictionary.cpp.o
16:25:15 [2019-11-01T20:25:15.674Z] [ 64%] Building CXX object fvtest/compilertest/CMakeFiles/testcompiler.dir/__/__/compiler/optimizer/Inliner.cpp.o
16:25:15 [2019-11-01T20:25:15.674Z] [ 64%] Building CXX object jitbuilder/CMakeFiles/jitbuilder.dir/__/compiler/ilgen/OMRVirtualMachineOperandArray.cpp.o
16:25:15 [2019-11-01T20:25:15.674Z] [ 64%] Building CXX object fvtest/compilertest/CMakeFiles/testcompiler.dir/__/__/compiler/optimizer/RematTools.cpp.o
16:25:15 [2019-11-01T20:25:15.674Z] [ 64%] Building CXX object fvtest/sigtest/CMakeFiles/omrsigtest.dir/sigTestHelpers.cpp.o
16:25:15 [2019-11-01T20:25:15.674Z] [ 64%] Building CXX object jitbuilder/CMakeFiles/jitbuilder.dir/__/compiler/ilgen/OMRVirtualMachineOperandStack.cpp.o
16:25:15 [2019-11-01T20:25:15.674Z] [ 64%] Building CXX object fvtest/compilertest/CMakeFiles/testcompiler.dir/__/__/compiler/optimizer/InductionVariable.cpp.o
16:25:16 [2019-11-01T20:25:16.561Z] [ 64%] Building CXX object fvtest/rastest/CMakeFiles/omrrastest.dir/rasTestHelpers.cpp.o
16:25:16 [2019-11-01T20:25:16.561Z] [ 64%] Building CXX object fvtest/rastest/CMakeFiles/omrrastest.dir/traceLifecycleTest.cpp.o
16:25:16 [2019-11-01T20:25:16.561Z] [ 65%] Building CXX object jitbuilder/CMakeFiles/jitbuilder.dir/__/compiler/ilgen/OMRVirtualMachineRegister.cpp.o
16:25:16 [2019-11-01T20:25:16.561Z] [ 65%] Building CXX object fvtest/compilertest/CMakeFiles/testcompiler.dir/__/__/compiler/optimizer/IntersectionBitVectorAnalysis.cpp.o
16:25:16 [2019-11-01T20:25:16.561Z] [ 65%] Building CXX object fvtest/compilertest/CMakeFiles/testcompiler.dir/__/__/compiler/optimizer/Isolatedness.cpp.o
16:25:16 [2019-11-01T20:25:16.561Z] [ 65%] Building CXX object jitbuilder/CMakeFiles/jitbuilder.dir/__/compiler/ilgen/OMRVirtualMachineRegisterInStruct.cpp.o
16:25:17 [2019-11-01T20:25:17.472Z] [ 66%] Building CXX object fvtest/compilertest/CMakeFiles/testcompiler.dir/__/__/compiler/optimizer/IsolatedStoreElimination.cpp.o
16:25:17 [2019-11-01T20:25:17.472Z] [ 66%] Building CXX object jitbuilder/CMakeFiles/jitbuilder.dir/__/compiler/ilgen/OMRVirtualMachineState.cpp.o
16:25:17 [2019-11-01T20:25:17.472Z] [ 66%] Building CXX object fvtest/sigtest/CMakeFiles/omrsigtest.dir/main.cpp.o
16:25:17 [2019-11-01T20:25:17.472Z] [ 66%] Building CXX object fvtest/compilertest/CMakeFiles/testcompiler.dir/__/__/compiler/optimizer/Latestness.cpp.o
16:25:17 [2019-11-01T20:25:17.472Z] [ 66%] Building CXX object jitbuilder/CMakeFiles/jitbuilder.dir/__/compiler/infra/Assert.cpp.o
16:25:17 [2019-11-01T20:25:17.472Z] [ 66%] Building CXX object fvtest/compilertest/CMakeFiles/testcompiler.dir/__/__/compiler/optimizer/LiveOnAllPaths.cpp.o
16:25:17 [2019-11-01T20:25:17.472Z] [ 66%] Building CXX object jitbuilder/CMakeFiles/jitbuilder.dir/__/compiler/infra/BitVector.cpp.o
16:25:18 [2019-11-01T20:25:18.377Z] [ 67%] Building CXX object fvtest/rastest/CMakeFiles/omrrastest.dir/traceLogTest.cpp.o
16:25:18 [2019-11-01T20:25:18.377Z] /Users/jenkins/workspace/PullRequest-osx_x86-64/compiler/infra/BitVector.cpp:201:43: warning: format specifies type 'unsigned long' but the argument has type 'chunk_t' (aka 'unsigned long long') [-Wformat]
16:25:18 [2019-11-01T20:25:18.377Z]       sprintf(pos, "%0*lX", chunk_hexlen, _chunks[i]);
16:25:18 [2019-11-01T20:25:18.377Z]                     ~~~~~                 ^~~~~~~~~~
16:25:18 [2019-11-01T20:25:18.377Z]                     %0*llX
16:25:18 [2019-11-01T20:25:18.377Z] 1 warning generated.
16:25:18 [2019-11-01T20:25:18.377Z] [ 67%] Building CXX object fvtest/compilertest/CMakeFiles/testcompiler.dir/__/__/compiler/optimizer/LiveVariableInformation.cpp.o
16:25:18 [2019-11-01T20:25:18.377Z] [ 67%] Building CXX object jitbuilder/CMakeFiles/jitbuilder.dir/__/compiler/infra/Checklist.cpp.o
16:25:18 [2019-11-01T20:25:18.377Z] [ 67%] Building CXX object jitbuilder/CMakeFiles/jitbuilder.dir/__/compiler/infra/HashTab.cpp.o
16:25:18 [2019-11-01T20:25:18.377Z] [ 67%] Building CXX object fvtest/compilertest/CMakeFiles/testcompiler.dir/__/__/compiler/optimizer/Liveness.cpp.o
16:25:18 [2019-11-01T20:25:18.377Z] [ 67%] Building CXX object fvtest/sigtest/CMakeFiles/omrsigtest.dir/__/__/util/main_function/main_function.cpp.o
16:25:18 [2019-11-01T20:25:18.377Z] [ 67%] Linking CXX executable omrsigtest
16:25:18 [2019-11-01T20:25:18.377Z] [ 67%] Built target omrsigtest
16:25:18 [2019-11-01T20:25:18.377Z] [ 67%] Building CXX object fvtest/rastest/CMakeFiles/omrrastest.dir/traceRecordHelpers.cpp.o
16:25:19 [2019-11-01T20:25:19.218Z] [ 67%] Building CXX object jitbuilder/CMakeFiles/jitbuilder.dir/__/compiler/infra/IGBase.cpp.o
16:25:19 [2019-11-01T20:25:19.218Z] [ 67%] Building CXX object fvtest/compilertest/CMakeFiles/testcompiler.dir/__/__/compiler/optimizer/LoadExtensions.cpp.o
16:25:19 [2019-11-01T20:25:19.218Z] [ 67%] Building CXX object jitbuilder/CMakeFiles/jitbuilder.dir/__/compiler/infra/IGNode.cpp.o
16:25:19 [2019-11-01T20:25:19.218Z] [ 67%] Building CXX object jitbuilder/CMakeFiles/jitbuilder.dir/__/compiler/infra/ILWalk.cpp.o
16:25:19 [2019-11-01T20:25:19.218Z] [ 67%] Building CXX object fvtest/compilertest/CMakeFiles/testcompiler.dir/__/__/compiler/optimizer/LocalAnalysis.cpp.o
16:25:19 [2019-11-01T20:25:19.218Z] [ 67%] Building CXX object jitbuilder/CMakeFiles/jitbuilder.dir/__/compiler/infra/InterferenceGraph.cpp.o
16:25:19 [2019-11-01T20:25:19.218Z] [ 67%] Building CXX object fvtest/compilertest/CMakeFiles/testcompiler.dir/__/__/compiler/optimizer/LocalAnticipatability.cpp.o
16:25:19 [2019-11-01T20:25:19.218Z] Scanning dependencies of target omrthreadextendedtest
16:25:19 [2019-11-01T20:25:19.218Z] [ 67%] Building CXX object fvtest/threadextendedtest/CMakeFiles/omrthreadextendedtest.dir/processTimeTest.cpp.o
16:25:20 [2019-11-01T20:25:20.100Z] [ 67%] Building CXX object jitbuilder/CMakeFiles/jitbuilder.dir/__/compiler/infra/OMRMonitor.cpp.o
16:25:20 [2019-11-01T20:25:20.100Z] [ 67%] Building CXX object fvtest/compilertest/CMakeFiles/testcompiler.dir/__/__/compiler/optimizer/LocalLiveRangeReducer.cpp.o
16:25:20 [2019-11-01T20:25:20.100Z] [ 67%] Building CXX object jitbuilder/CMakeFiles/jitbuilder.dir/__/compiler/infra/OMRMonitorTable.cpp.o
16:25:20 [2019-11-01T20:25:20.100Z] [ 67%] Building CXX object fvtest/rastest/CMakeFiles/omrrastest.dir/traceTest.cpp.o
16:25:20 [2019-11-01T20:25:20.100Z] [ 68%] Building CXX object jitbuilder/CMakeFiles/jitbuilder.dir/__/compiler/infra/Random.cpp.o
16:25:20 [2019-11-01T20:25:20.100Z] [ 68%] Building CXX object fvtest/compilertest/CMakeFiles/testcompiler.dir/__/__/compiler/optimizer/LocalReordering.cpp.o
16:25:20 [2019-11-01T20:25:20.100Z] [ 68%] Building CXX object jitbuilder/CMakeFiles/jitbuilder.dir/__/compiler/infra/SimpleRegex.cpp.o
16:25:20 [2019-11-01T20:25:20.984Z] [ 68%] Building CXX object fvtest/compilertest/CMakeFiles/testcompiler.dir/__/__/compiler/optimizer/LocalTransparency.cpp.o
16:25:20 [2019-11-01T20:25:20.984Z] [ 68%] Building CXX object jitbuilder/CMakeFiles/jitbuilder.dir/__/compiler/infra/STLUtils.cpp.o
16:25:20 [2019-11-01T20:25:20.984Z] [ 68%] Building CXX object jitbuilder/CMakeFiles/jitbuilder.dir/__/compiler/infra/Timer.cpp.o
16:25:20 [2019-11-01T20:25:20.984Z] [ 68%] Building CXX object fvtest/compilertest/CMakeFiles/testcompiler.dir/__/__/compiler/optimizer/LoopCanonicalizer.cpp.o
16:25:20 [2019-11-01T20:25:20.984Z] [ 68%] Building CXX object jitbuilder/CMakeFiles/jitbuilder.dir/__/compiler/infra/TreeServices.cpp.o
16:25:20 [2019-11-01T20:25:20.984Z] [ 68%] Building CXX object fvtest/threadextendedtest/CMakeFiles/omrthreadextendedtest.dir/threadCpuTimeTest.cpp.o
16:25:21 [2019-11-01T20:25:21.888Z] [ 68%] Building CXX object fvtest/compilertest/CMakeFiles/testcompiler.dir/__/__/compiler/optimizer/LoopReducer.cpp.o
16:25:21 [2019-11-01T20:25:21.888Z] [ 68%] Building CXX object jitbuilder/CMakeFiles/jitbuilder.dir/__/compiler/infra/OMRCfg.cpp.o
16:25:21 [2019-11-01T20:25:21.888Z] [ 68%] Building C object fvtest/rastest/CMakeFiles/omrrastest.dir/ut_omr_test.c.o
16:25:21 [2019-11-01T20:25:21.888Z] [ 68%] Building CXX object fvtest/rastest/CMakeFiles/omrrastest.dir/__/__/util/main_function/main_function.cpp.o
16:25:21 [2019-11-01T20:25:21.888Z] [ 68%] Linking CXX executable omrrastest
16:25:21 [2019-11-01T20:25:21.888Z] [ 69%] Building CXX object fvtest/compilertest/CMakeFiles/testcompiler.dir/__/__/compiler/optimizer/LoopReplicator.cpp.o
16:25:21 [2019-11-01T20:25:21.888Z] [ 69%] Building CXX object jitbuilder/CMakeFiles/jitbuilder.dir/__/compiler/optimizer/AsyncCheckInsertion.cpp.o
16:25:21 [2019-11-01T20:25:21.888Z] [ 69%] Built target omrrastest
16:25:21 [2019-11-01T20:25:21.888Z] [ 70%] Building CXX object fvtest/threadextendedtest/CMakeFiles/omrthreadextendedtest.dir/threadExtendedTestHelpers.cpp.o
16:25:21 [2019-11-01T20:25:21.888Z] [ 70%] Building CXX object fvtest/compilertest/CMakeFiles/testcompiler.dir/__/__/compiler/optimizer/LoopVersioner.cpp.o
16:25:21 [2019-11-01T20:25:21.888Z] [ 70%] Building CXX object jitbuilder/CMakeFiles/jitbuilder.dir/__/compiler/optimizer/BackwardBitVectorAnalysis.cpp.o
16:25:22 [2019-11-01T20:25:22.744Z] In file included from /Users/jenkins/workspace/PullRequest-osx_x86-64/compiler/optimizer/LoopVersioner.cpp:22:
16:25:22 [2019-11-01T20:25:22.744Z] /Users/jenkins/workspace/PullRequest-osx_x86-64/compiler/optimizer/LoopVersioner.hpp:260:59: warning: '/*' within block comment [-Wcomment]
16:25:22 [2019-11-01T20:25:22.744Z]  * - \c staticDebugCounters={loopVersioner.unrepresentable/*}
16:25:22 [2019-11-01T20:25:22.744Z]                                                           ^
16:25:22 [2019-11-01T20:25:22.744Z] /Users/jenkins/workspace/PullRequest-osx_x86-64/compiler/optimizer/LoopVersioner.hpp:323:61: warning: '/*' within block comment [-Wcomment]
16:25:22 [2019-11-01T20:25:22.744Z]     * <tt>staticDebugCounters={loopVersioner.unrepresentable/*}</tt>.
16:25:22 [2019-11-01T20:25:22.744Z]                                                             ^
16:25:22 [2019-11-01T20:25:22.744Z] /Users/jenkins/workspace/PullRequest-osx_x86-64/compiler/optimizer/LoopVersioner.cpp:8091:50: warning: '&&' within '||' [-Wlogical-op-parentheses]
16:25:22 [2019-11-01T20:25:22.744Z]          divisor->getOpCodeValue() == TR::lconst && divisor->getLongInt() != 0
16:25:22 [2019-11-01T20:25:22.744Z]          ~~~~~~~~~~~~~~~~~~~~~~~~~~~~~~~~~~~~~~~~^~~~~~~~~~~~~~~~~~~~~~~~~~~~~
16:25:22 [2019-11-01T20:25:22.744Z] /Users/jenkins/workspace/PullRequest-osx_x86-64/compiler/optimizer/LoopVersioner.cpp:8091:50: note: place parentheses around the '&&' expression to silence this warning
16:25:22 [2019-11-01T20:25:22.744Z]          divisor->getOpCodeValue() == TR::lconst && divisor->getLongInt() != 0
16:25:22 [2019-11-01T20:25:22.744Z]                                                  ^
16:25:22 [2019-11-01T20:25:22.744Z]          (                                                                    )
16:25:22 [2019-11-01T20:25:22.744Z] /Users/jenkins/workspace/PullRequest-osx_x86-64/compiler/optimizer/LoopVersioner.cpp:8092:53: warning: '&&' within '||' [-Wlogical-op-parentheses]
16:25:22 [2019-11-01T20:25:22.744Z]          || divisor->getOpCodeValue() == TR::iconst && divisor->getInt() != 0;
16:25:22 [2019-11-01T20:25:22.744Z]          ~~ ~~~~~~~~~~~~~~~~~~~~~~~~~~~~~~~~~~~~~~~~^~~~~~~~~~~~~~~~~~~~~~~~~
16:25:22 [2019-11-01T20:25:22.744Z] /Users/jenkins/workspace/PullRequest-osx_x86-64/compiler/optimizer/LoopVersioner.cpp:8092:53: note: place parentheses around the '&&' expression to silence this warning
16:25:22 [2019-11-01T20:25:22.744Z]          || divisor->getOpCodeValue() == TR::iconst && divisor->getInt() != 0;
16:25:22 [2019-11-01T20:25:22.744Z]                                                     ^
16:25:22 [2019-11-01T20:25:22.745Z]             (                                                                )
16:25:22 [2019-11-01T20:25:22.745Z] /Users/jenkins/workspace/PullRequest-osx_x86-64/compiler/optimizer/LoopVersioner.cpp:9166:55: warning: '/*' within block comment [-Wcomment]
16:25:22 [2019-11-01T20:25:22.745Z]  * counter matching <tt>{loopVersioner.unrepresentable/*}</tt>, and optionally
16:25:22 [2019-11-01T20:25:22.745Z]                                                       ^
16:25:22 [2019-11-01T20:25:22.745Z] 5 warnings generated.
16:25:22 [2019-11-01T20:25:22.745Z] [ 70%] Building CXX object jitbuilder/CMakeFiles/jitbuilder.dir/__/compiler/optimizer/BackwardIntersectionBitVectorAnalysis.cpp.o
16:25:22 [2019-11-01T20:25:22.745Z] [ 70%] Building CXX object fvtest/compilertest/CMakeFiles/testcompiler.dir/__/__/compiler/optimizer/OMRLocalCSE.cpp.o
16:25:22 [2019-11-01T20:25:22.745Z] Scanning dependencies of target omrthreadtest
16:25:22 [2019-11-01T20:25:22.745Z] [ 70%] Building CXX object fvtest/threadtest/CMakeFiles/omrthreadtest.dir/abortTest.cpp.o
16:25:22 [2019-11-01T20:25:22.745Z] [ 70%] Building CXX object jitbuilder/CMakeFiles/jitbuilder.dir/__/compiler/optimizer/BackwardUnionBitVectorAnalysis.cpp.o
16:25:22 [2019-11-01T20:25:22.745Z] [ 70%] Building CXX object fvtest/compilertest/CMakeFiles/testcompiler.dir/__/__/compiler/optimizer/LocalDeadStoreElimination.cpp.o
16:25:23 [2019-11-01T20:25:23.678Z] [ 70%] Building CXX object jitbuilder/CMakeFiles/jitbuilder.dir/__/compiler/optimizer/BitVectorAnalysis.cpp.o
16:25:23 [2019-11-01T20:25:23.678Z] [ 70%] Building CXX object fvtest/compilertest/CMakeFiles/testcompiler.dir/__/__/compiler/optimizer/LocalOpts.cpp.o
16:25:23 [2019-11-01T20:25:23.678Z] [ 70%] Building CXX object fvtest/threadextendedtest/CMakeFiles/omrthreadextendedtest.dir/threadExtendedTestMain.cpp.o
16:25:23 [2019-11-01T20:25:23.678Z] [ 70%] Building CXX object jitbuilder/CMakeFiles/jitbuilder.dir/__/compiler/optimizer/CatchBlockRemover.cpp.o
16:25:23 [2019-11-01T20:25:23.678Z] [ 70%] Building CXX object fvtest/compilertest/CMakeFiles/testcompiler.dir/__/__/compiler/optimizer/OMROptimization.cpp.o
16:25:23 [2019-11-01T20:25:23.678Z] [ 71%] Building CXX object jitbuilder/CMakeFiles/jitbuilder.dir/__/compiler/optimizer/OMRCFGSimplifier.cpp.o
16:25:24 [2019-11-01T20:25:24.524Z] [ 71%] Building CXX object fvtest/compilertest/CMakeFiles/testcompiler.dir/__/__/compiler/optimizer/OMROptimizationManager.cpp.o
16:25:24 [2019-11-01T20:25:24.524Z] [ 71%] Building CXX object fvtest/threadtest/CMakeFiles/omrthreadtest.dir/CEnterExit.cpp.o
16:25:24 [2019-11-01T20:25:24.524Z] [ 71%] Building CXX object jitbuilder/CMakeFiles/jitbuilder.dir/__/compiler/optimizer/CompactLocals.cpp.o
16:25:24 [2019-11-01T20:25:24.524Z] [ 71%] Building CXX object fvtest/compilertest/CMakeFiles/testcompiler.dir/__/__/compiler/optimizer/OMRTransformUtil.cpp.o
16:25:24 [2019-11-01T20:25:24.524Z] [ 71%] Building CXX object jitbuilder/CMakeFiles/jitbuilder.dir/__/compiler/optimizer/CopyPropagation.cpp.o
16:25:24 [2019-11-01T20:25:24.524Z] [ 71%] Building CXX object fvtest/threadextendedtest/CMakeFiles/omrthreadextendedtest.dir/timeBaseTest.cpp.o
16:25:24 [2019-11-01T20:25:24.524Z] [ 71%] Building CXX object fvtest/compilertest/CMakeFiles/testcompiler.dir/__/__/compiler/optimizer/OMROptimizer.cpp.o
16:25:25 [2019-11-01T20:25:25.407Z] [ 71%] Building CXX object jitbuilder/CMakeFiles/jitbuilder.dir/__/compiler/optimizer/DataFlowAnalysis.cpp.o
16:25:25 [2019-11-01T20:25:25.407Z] In file included from /Users/jenkins/workspace/PullRequest-osx_x86-64/compiler/optimizer/OMROptimizer.cpp:92:
16:25:25 [2019-11-01T20:25:25.407Z] /Users/jenkins/workspace/PullRequest-osx_x86-64/compiler/optimizer/LoopVersioner.hpp:260:59: warning: '/*' within block comment [-Wcomment]
16:25:25 [2019-11-01T20:25:25.407Z]  * - \c staticDebugCounters={loopVersioner.unrepresentable/*}
16:25:25 [2019-11-01T20:25:25.407Z]                                                           ^
16:25:25 [2019-11-01T20:25:25.407Z] /Users/jenkins/workspace/PullRequest-osx_x86-64/compiler/optimizer/LoopVersioner.hpp:323:61: warning: '/*' within block comment [-Wcomment]
16:25:25 [2019-11-01T20:25:25.407Z]     * <tt>staticDebugCounters={loopVersioner.unrepresentable/*}</tt>.
16:25:25 [2019-11-01T20:25:25.407Z]                                                             ^
16:25:25 [2019-11-01T20:25:25.407Z] 2 warnings generated.
16:25:25 [2019-11-01T20:25:25.407Z] [ 71%] Building CXX object fvtest/compilertest/CMakeFiles/testcompiler.dir/__/__/compiler/optimizer/OrderBlocks.cpp.o
16:25:25 [2019-11-01T20:25:25.407Z] [ 71%] Building CXX object jitbuilder/CMakeFiles/jitbuilder.dir/__/compiler/optimizer/DeadStoreElimination.cpp.o
16:25:25 [2019-11-01T20:25:25.407Z] [ 71%] Building CXX object fvtest/compilertest/CMakeFiles/testcompiler.dir/__/__/compiler/optimizer/OSRDefAnalysis.cpp.o
16:25:25 [2019-11-01T20:25:25.407Z] [ 71%] Building CXX object fvtest/threadtest/CMakeFiles/omrthreadtest.dir/CMonitor.cpp.o
16:25:25 [2019-11-01T20:25:25.407Z] [ 71%] Building CXX object jitbuilder/CMakeFiles/jitbuilder.dir/__/compiler/optimizer/DeadTreesElimination.cpp.o
16:25:26 [2019-11-01T20:25:26.319Z] [ 71%] Building CXX object fvtest/compilertest/CMakeFiles/testcompiler.dir/__/__/compiler/optimizer/PartialRedundancy.cpp.o
16:25:26 [2019-11-01T20:25:26.319Z] [ 71%] Building CXX object jitbuilder/CMakeFiles/jitbuilder.dir/__/compiler/optimizer/DebuggingCounters.cpp.o
16:25:26 [2019-11-01T20:25:26.319Z] [ 71%] Building CXX object fvtest/threadextendedtest/CMakeFiles/omrthreadextendedtest.dir/__/__/util/main_function/main_function.cpp.o
16:25:26 [2019-11-01T20:25:26.319Z] [ 71%] Linking CXX executable omrthreadextendedtest
16:25:26 [2019-11-01T20:25:26.319Z] [ 71%] Building CXX object fvtest/compilertest/CMakeFiles/testcompiler.dir/__/__/compiler/optimizer/PreExistence.cpp.o
16:25:26 [2019-11-01T20:25:26.319Z] /Users/jenkins/workspace/PullRequest-osx_x86-64/compiler/optimizer/DebuggingCounters.cpp:242:20: warning: format specifies type 'unsigned long' but the argument has type 'uint64_t' (aka 'unsigned long long') [-Wformat]
16:25:26 [2019-11-01T20:25:26.319Z]                    counterInfo->totalCount);
16:25:26 [2019-11-01T20:25:26.319Z]                    ^~~~~~~~~~~~~~~~~~~~~~~
16:25:26 [2019-11-01T20:25:26.319Z] /Users/jenkins/workspace/PullRequest-osx_x86-64/compiler/optimizer/DebuggingCounters.cpp:255:87: warning: format specifies type 'unsigned long' but the argument has type 'uint64_t' (aka 'unsigned long long') [-Wformat]
16:25:26 [2019-11-01T20:25:26.319Z]    fprintf(output, "Compilation sum %d Dynamic sum %lu \n", (int32_t) compilationSum, dynamicSum);
16:25:26 [2019-11-01T20:25:26.319Z]                                                    ~~~                                ^~~~~~~~~~
16:25:26 [2019-11-01T20:25:26.319Z]                                                    %llu
16:25:26 [2019-11-01T20:25:26.319Z] 2 warnings generated.
16:25:26 [2019-11-01T20:25:26.319Z] [ 71%] Built target omrthreadextendedtest
16:25:26 [2019-11-01T20:25:26.319Z] [ 71%] Building CXX object fvtest/threadtest/CMakeFiles/omrthreadtest.dir/createTest.cpp.o
16:25:26 [2019-11-01T20:25:26.319Z] [ 71%] Building CXX object jitbuilder/CMakeFiles/jitbuilder.dir/__/compiler/optimizer/Delayedness.cpp.o
16:25:27 [2019-11-01T20:25:27.203Z] [ 72%] Building CXX object fvtest/compilertest/CMakeFiles/testcompiler.dir/__/__/compiler/optimizer/PrefetchInsertion.cpp.o
16:25:27 [2019-11-01T20:25:27.203Z] [ 72%] Building CXX object jitbuilder/CMakeFiles/jitbuilder.dir/__/compiler/optimizer/Dominators.cpp.o
16:25:27 [2019-11-01T20:25:27.203Z] [ 72%] Building CXX object jitbuilder/CMakeFiles/jitbuilder.dir/__/compiler/optimizer/DominatorVerifier.cpp.o
16:25:27 [2019-11-01T20:25:27.203Z] [ 72%] Building CXX object fvtest/compilertest/CMakeFiles/testcompiler.dir/__/__/compiler/optimizer/Reachability.cpp.o
16:25:27 [2019-11-01T20:25:27.203Z] [ 72%] Building CXX object jitbuilder/CMakeFiles/jitbuilder.dir/__/compiler/optimizer/DominatorsChk.cpp.o
16:25:27 [2019-11-01T20:25:27.203Z] [ 72%] Building CXX object jitbuilder/CMakeFiles/jitbuilder.dir/__/compiler/optimizer/Earliestness.cpp.o
16:25:27 [2019-11-01T20:25:27.203Z] Scanning dependencies of target omrvmtest
16:25:27 [2019-11-01T20:25:27.203Z] [ 72%] Building CXX object fvtest/vmtest/CMakeFiles/omrvmtest.dir/main.cpp.o
16:25:27 [2019-11-01T20:25:27.203Z] [ 72%] Building CXX object fvtest/compilertest/CMakeFiles/testcompiler.dir/__/__/compiler/optimizer/ReachingDefinitions.cpp.o
16:25:27 [2019-11-01T20:25:27.203Z] [ 72%] Building CXX object jitbuilder/CMakeFiles/jitbuilder.dir/__/compiler/optimizer/ExpressionsSimplification.cpp.o
16:25:28 [2019-11-01T20:25:28.092Z] [ 72%] Building CXX object fvtest/compilertest/CMakeFiles/testcompiler.dir/__/__/compiler/optimizer/OMRRecognizedCallTransformer.cpp.o
16:25:28 [2019-11-01T20:25:28.092Z] [ 73%] Building CXX object jitbuilder/CMakeFiles/jitbuilder.dir/__/compiler/optimizer/FieldPrivatizer.cpp.o
16:25:28 [2019-11-01T20:25:28.092Z] [ 73%] Building CXX object fvtest/threadtest/CMakeFiles/omrthreadtest.dir/CThread.cpp.o
16:25:28 [2019-11-01T20:25:28.092Z] [ 73%] Building CXX object fvtest/compilertest/CMakeFiles/testcompiler.dir/__/__/compiler/optimizer/RedundantAsyncCheckRemoval.cpp.o
16:25:28 [2019-11-01T20:25:28.092Z] [ 73%] Building CXX object jitbuilder/CMakeFiles/jitbuilder.dir/__/compiler/optimizer/GeneralLoopUnroller.cpp.o
16:25:29 [2019-11-01T20:25:29.023Z] [ 73%] Building CXX object fvtest/compilertest/CMakeFiles/testcompiler.dir/__/__/compiler/optimizer/RegisterCandidate.cpp.o
16:25:29 [2019-11-01T20:25:29.023Z] [ 73%] Building CXX object jitbuilder/CMakeFiles/jitbuilder.dir/__/compiler/optimizer/GlobalAnticipatability.cpp.o
16:25:29 [2019-11-01T20:25:29.023Z] [ 73%] Building CXX object fvtest/vmtest/CMakeFiles/omrvmtest.dir/vmForkTest.cpp.o
16:25:29 [2019-11-01T20:25:29.023Z] [ 73%] Building CXX object fvtest/compilertest/CMakeFiles/testcompiler.dir/__/__/compiler/optimizer/OMRSimplifier.cpp.o
16:25:29 [2019-11-01T20:25:29.023Z] [ 73%] Building CXX object jitbuilder/CMakeFiles/jitbuilder.dir/__/compiler/optimizer/GlobalRegisterAllocator.cpp.o
16:25:29 [2019-11-01T20:25:29.023Z] [ 73%] Building CXX object fvtest/compilertest/CMakeFiles/testcompiler.dir/__/__/compiler/optimizer/OMRSimplifierHelpers.cpp.o
16:25:29 [2019-11-01T20:25:29.023Z] [ 73%] Building CXX object jitbuilder/CMakeFiles/jitbuilder.dir/__/compiler/optimizer/Inliner.cpp.o
16:25:29 [2019-11-01T20:25:29.924Z] [ 73%] Building CXX object fvtest/threadtest/CMakeFiles/omrthreadtest.dir/joinTest.cpp.o
16:25:29 [2019-11-01T20:25:29.924Z] [ 73%] Building CXX object fvtest/compilertest/CMakeFiles/testcompiler.dir/__/__/compiler/optimizer/OMRSimplifierHandlers.cpp.o
16:25:29 [2019-11-01T20:25:29.924Z] [ 73%] Building CXX object jitbuilder/CMakeFiles/jitbuilder.dir/__/compiler/optimizer/RematTools.cpp.o
16:25:29 [2019-11-01T20:25:29.924Z] [ 73%] Building CXX object jitbuilder/CMakeFiles/jitbuilder.dir/__/compiler/optimizer/InductionVariable.cpp.o
16:25:29 [2019-11-01T20:25:29.924Z] [ 73%] Building CXX object fvtest/compilertest/CMakeFiles/testcompiler.dir/__/__/compiler/optimizer/StructuralAnalysis.cpp.o
16:25:29 [2019-11-01T20:25:29.924Z] [ 73%] Building CXX object fvtest/vmtest/CMakeFiles/omrvmtest.dir/__/__/util/main_function/main_function.cpp.o
16:25:29 [2019-11-01T20:25:29.924Z] [ 73%] Linking CXX executable omrvmtest
16:25:30 [2019-11-01T20:25:30.816Z] [ 73%] Building CXX object fvtest/compilertest/CMakeFiles/testcompiler.dir/__/__/compiler/optimizer/Structure.cpp.o
16:25:30 [2019-11-01T20:25:30.816Z] [ 73%] Built target omrvmtest
16:25:30 [2019-11-01T20:25:30.816Z] [ 73%] Building CXX object fvtest/threadtest/CMakeFiles/omrthreadtest.dir/keyDestructorTest.cpp.o
16:25:30 [2019-11-01T20:25:30.816Z] [ 73%] Building CXX object jitbuilder/CMakeFiles/jitbuilder.dir/__/compiler/optimizer/IntersectionBitVectorAnalysis.cpp.o
16:25:30 [2019-11-01T20:25:30.816Z] [ 73%] Building CXX object fvtest/compilertest/CMakeFiles/testcompiler.dir/__/__/compiler/optimizer/SwitchAnalyzer.cpp.o
16:25:30 [2019-11-01T20:25:30.816Z] [ 73%] Building CXX object jitbuilder/CMakeFiles/jitbuilder.dir/__/compiler/optimizer/Isolatedness.cpp.o
16:25:30 [2019-11-01T20:25:30.816Z] [ 74%] Building CXX object fvtest/compilertest/CMakeFiles/testcompiler.dir/__/__/compiler/optimizer/TranslateTable.cpp.o
16:25:30 [2019-11-01T20:25:30.816Z] [ 74%] Building CXX object jitbuilder/CMakeFiles/jitbuilder.dir/__/compiler/optimizer/IsolatedStoreElimination.cpp.o
16:25:31 [2019-11-01T20:25:31.683Z] Scanning dependencies of target omrgctest
16:25:31 [2019-11-01T20:25:31.683Z] [ 74%] Building CXX object fvtest/gctest/CMakeFiles/omrgctest.dir/GCConfigObjectTable.cpp.o
16:25:31 [2019-11-01T20:25:31.683Z] [ 74%] Building CXX object fvtest/compilertest/CMakeFiles/testcompiler.dir/__/__/compiler/optimizer/UnionBitVectorAnalysis.cpp.o
16:25:31 [2019-11-01T20:25:31.683Z] [ 74%] Building CXX object jitbuilder/CMakeFiles/jitbuilder.dir/__/compiler/optimizer/Latestness.cpp.o
16:25:31 [2019-11-01T20:25:31.683Z] [ 74%] Building CXX object fvtest/compilertest/CMakeFiles/testcompiler.dir/__/__/compiler/optimizer/UseDefInfo.cpp.o
16:25:31 [2019-11-01T20:25:31.683Z] [ 74%] Building CXX object jitbuilder/CMakeFiles/jitbuilder.dir/__/compiler/optimizer/LiveOnAllPaths.cpp.o
16:25:32 [2019-11-01T20:25:32.608Z] [ 75%] Building CXX object fvtest/threadtest/CMakeFiles/omrthreadtest.dir/lockedMonitorCountTest.cpp.o
16:25:32 [2019-11-01T20:25:32.608Z] [ 75%] Building CXX object fvtest/compilertest/CMakeFiles/testcompiler.dir/__/__/compiler/optimizer/ValueNumberInfo.cpp.o
16:25:32 [2019-11-01T20:25:32.608Z] [ 75%] Building CXX object jitbuilder/CMakeFiles/jitbuilder.dir/__/compiler/optimizer/LiveVariableInformation.cpp.o
16:25:32 [2019-11-01T20:25:32.608Z] [ 75%] Building CXX object fvtest/compilertest/CMakeFiles/testcompiler.dir/__/__/compiler/optimizer/VirtualGuardCoalescer.cpp.o
16:25:32 [2019-11-01T20:25:32.608Z] [ 76%] Building CXX object jitbuilder/CMakeFiles/jitbuilder.dir/__/compiler/optimizer/Liveness.cpp.o
16:25:32 [2019-11-01T20:25:32.608Z] [ 76%] Building CXX object fvtest/gctest/CMakeFiles/omrgctest.dir/GCConfigTest.cpp.o
16:25:32 [2019-11-01T20:25:32.608Z] [ 76%] Building CXX object fvtest/compilertest/CMakeFiles/testcompiler.dir/__/__/compiler/optimizer/VirtualGuardHeadMerger.cpp.o
16:25:32 [2019-11-01T20:25:32.608Z] [ 76%] Building CXX object jitbuilder/CMakeFiles/jitbuilder.dir/__/compiler/optimizer/LoadExtensions.cpp.o
16:25:33 [2019-11-01T20:25:33.518Z] [ 76%] Building CXX object fvtest/compilertest/CMakeFiles/testcompiler.dir/__/__/compiler/optimizer/RegDepCopyRemoval.cpp.o
16:25:33 [2019-11-01T20:25:33.518Z] [ 76%] Building CXX object jitbuilder/CMakeFiles/jitbuilder.dir/__/compiler/optimizer/LocalAnalysis.cpp.o
16:25:33 [2019-11-01T20:25:33.518Z] [ 76%] Building CXX object fvtest/compilertest/CMakeFiles/testcompiler.dir/__/__/compiler/optimizer/ReorderIndexExpr.cpp.o
16:25:33 [2019-11-01T20:25:33.518Z] [ 76%] Building CXX object jitbuilder/CMakeFiles/jitbuilder.dir/__/compiler/optimizer/LocalAnticipatability.cpp.o
16:25:33 [2019-11-01T20:25:33.518Z] [ 76%] Building CXX object fvtest/threadtest/CMakeFiles/omrthreadtest.dir/main.cpp.o
16:25:33 [2019-11-01T20:25:33.518Z] [ 76%] Building CXX object fvtest/compilertest/CMakeFiles/testcompiler.dir/__/__/compiler/optimizer/SinkStores.cpp.o
16:25:34 [2019-11-01T20:25:34.439Z] [ 76%] Building CXX object jitbuilder/CMakeFiles/jitbuilder.dir/__/compiler/optimizer/LocalLiveRangeReducer.cpp.o
16:25:34 [2019-11-01T20:25:34.439Z] [ 76%] Building CXX object fvtest/compilertest/CMakeFiles/testcompiler.dir/__/__/compiler/optimizer/StripMiner.cpp.o
16:25:34 [2019-11-01T20:25:34.439Z] [ 76%] Building CXX object jitbuilder/CMakeFiles/jitbuilder.dir/__/compiler/optimizer/LocalReordering.cpp.o
16:25:34 [2019-11-01T20:25:34.439Z] [ 76%] Building CXX object fvtest/compilertest/CMakeFiles/testcompiler.dir/__/__/compiler/optimizer/VPConstraint.cpp.o
16:25:34 [2019-11-01T20:25:34.439Z] [ 76%] Building CXX object fvtest/gctest/CMakeFiles/omrgctest.dir/gcTestHelpers.cpp.o
16:25:34 [2019-11-01T20:25:34.439Z] [ 76%] Building CXX object jitbuilder/CMakeFiles/jitbuilder.dir/__/compiler/optimizer/LocalTransparency.cpp.o
16:25:35 [2019-11-01T20:25:35.440Z] [ 76%] Building CXX object fvtest/compilertest/CMakeFiles/testcompiler.dir/__/__/compiler/optimizer/VPHandlers.cpp.o
16:25:35 [2019-11-01T20:25:35.440Z] [ 76%] Building CXX object fvtest/threadtest/CMakeFiles/omrthreadtest.dir/ospriority.cpp.o
16:25:35 [2019-11-01T20:25:35.440Z] [ 76%] Building CXX object jitbuilder/CMakeFiles/jitbuilder.dir/__/compiler/optimizer/LoopCanonicalizer.cpp.o
16:25:35 [2019-11-01T20:25:35.440Z] [ 76%] Building CXX object fvtest/compilertest/CMakeFiles/testcompiler.dir/__/__/compiler/optimizer/VPHandlersCommon.cpp.o
16:25:35 [2019-11-01T20:25:35.440Z] [ 76%] Building CXX object jitbuilder/CMakeFiles/jitbuilder.dir/__/compiler/optimizer/LoopReducer.cpp.o
16:25:35 [2019-11-01T20:25:35.440Z] [ 77%] Building CXX object fvtest/compilertest/CMakeFiles/testcompiler.dir/__/__/compiler/optimizer/OMRValuePropagation.cpp.o
16:25:36 [2019-11-01T20:25:36.470Z] [ 77%] Building CXX object jitbuilder/CMakeFiles/jitbuilder.dir/__/compiler/optimizer/LoopReplicator.cpp.o
16:25:36 [2019-11-01T20:25:36.470Z] [ 77%] Building CXX object fvtest/compilertest/CMakeFiles/testcompiler.dir/__/__/compiler/optimizer/ValuePropagationCommon.cpp.o
16:25:36 [2019-11-01T20:25:36.470Z] [ 77%] Building CXX object fvtest/gctest/CMakeFiles/omrgctest.dir/main.cpp.o
16:25:36 [2019-11-01T20:25:36.470Z] [ 77%] Building CXX object jitbuilder/CMakeFiles/jitbuilder.dir/__/compiler/optimizer/LoopVersioner.cpp.o
16:25:36 [2019-11-01T20:25:36.470Z] [ 77%] Building CXX object fvtest/compilertest/CMakeFiles/testcompiler.dir/__/__/compiler/optimizer/TrivialDeadBlockRemover.cpp.o
16:25:36 [2019-11-01T20:25:36.470Z] [ 77%] Building CXX object fvtest/threadtest/CMakeFiles/omrthreadtest.dir/priorityInterruptTest.cpp.o
16:25:36 [2019-11-01T20:25:36.470Z] In file included from /Users/jenkins/workspace/PullRequest-osx_x86-64/compiler/optimizer/LoopVersioner.cpp:22:
16:25:36 [2019-11-01T20:25:36.470Z] /Users/jenkins/workspace/PullRequest-osx_x86-64/compiler/optimizer/LoopVersioner.hpp:260:59: warning: '/*' within block comment [-Wcomment]
16:25:36 [2019-11-01T20:25:36.470Z]  * - \c staticDebugCounters={loopVersioner.unrepresentable/*}
16:25:36 [2019-11-01T20:25:36.470Z]                                                           ^
16:25:36 [2019-11-01T20:25:36.470Z] /Users/jenkins/workspace/PullRequest-osx_x86-64/compiler/optimizer/LoopVersioner.hpp:323:61: warning: '/*' within block comment [-Wcomment]
16:25:36 [2019-11-01T20:25:36.470Z]     * <tt>staticDebugCounters={loopVersioner.unrepresentable/*}</tt>.
16:25:36 [2019-11-01T20:25:36.470Z]                                                             ^
16:25:36 [2019-11-01T20:25:36.470Z] /Users/jenkins/workspace/PullRequest-osx_x86-64/compiler/optimizer/LoopVersioner.cpp:8091:50: warning: '&&' within '||' [-Wlogical-op-parentheses]
16:25:36 [2019-11-01T20:25:36.470Z]          divisor->getOpCodeValue() == TR::lconst && divisor->getLongInt() != 0
16:25:36 [2019-11-01T20:25:36.470Z]          ~~~~~~~~~~~~~~~~~~~~~~~~~~~~~~~~~~~~~~~~^~~~~~~~~~~~~~~~~~~~~~~~~~~~~
16:25:36 [2019-11-01T20:25:36.470Z] /Users/jenkins/workspace/PullRequest-osx_x86-64/compiler/optimizer/LoopVersioner.cpp:8091:50: note: place parentheses around the '&&' expression to silence this warning
16:25:36 [2019-11-01T20:25:36.470Z]          divisor->getOpCodeValue() == TR::lconst && divisor->getLongInt() != 0
16:25:36 [2019-11-01T20:25:36.470Z]                                                  ^
16:25:36 [2019-11-01T20:25:36.470Z]          (                                                                    )
16:25:36 [2019-11-01T20:25:36.470Z] /Users/jenkins/workspace/PullRequest-osx_x86-64/compiler/optimizer/LoopVersioner.cpp:8092:53: warning: '&&' within '||' [-Wlogical-op-parentheses]
16:25:36 [2019-11-01T20:25:36.470Z]          || divisor->getOpCodeValue() == TR::iconst && divisor->getInt() != 0;
16:25:36 [2019-11-01T20:25:36.470Z]          ~~ ~~~~~~~~~~~~~~~~~~~~~~~~~~~~~~~~~~~~~~~~^~~~~~~~~~~~~~~~~~~~~~~~~
16:25:36 [2019-11-01T20:25:36.470Z] /Users/jenkins/workspace/PullRequest-osx_x86-64/compiler/optimizer/LoopVersioner.cpp:8092:53: note: place parentheses around the '&&' expression to silence this warning
16:25:36 [2019-11-01T20:25:36.470Z]          || divisor->getOpCodeValue() == TR::iconst && divisor->getInt() != 0;
16:25:36 [2019-11-01T20:25:36.470Z]                                                     ^
16:25:36 [2019-11-01T20:25:36.470Z]             (                                                                )
16:25:36 [2019-11-01T20:25:36.470Z] /Users/jenkins/workspace/PullRequest-osx_x86-64/compiler/optimizer/LoopVersioner.cpp:9166:55: warning: '/*' within block comment [-Wcomment]
16:25:36 [2019-11-01T20:25:36.470Z]  * counter matching <tt>{loopVersioner.unrepresentable/*}</tt>, and optionally
16:25:36 [2019-11-01T20:25:36.470Z]                                                       ^
16:25:36 [2019-11-01T20:25:36.470Z] 5 warnings generated.
16:25:36 [2019-11-01T20:25:36.470Z] [ 77%] Building CXX object jitbuilder/CMakeFiles/jitbuilder.dir/__/compiler/optimizer/OMRLocalCSE.cpp.o
16:25:36 [2019-11-01T20:25:36.470Z] [ 77%] Building CXX object fvtest/compilertest/CMakeFiles/testcompiler.dir/__/__/compiler/optimizer/FEInliner.cpp.o
16:25:37 [2019-11-01T20:25:37.367Z] [ 77%] Building CXX object jitbuilder/CMakeFiles/jitbuilder.dir/__/compiler/optimizer/LocalDeadStoreElimination.cpp.o
16:25:37 [2019-11-01T20:25:37.367Z] [ 77%] Building CXX object fvtest/compilertest/CMakeFiles/testcompiler.dir/__/__/compiler/ras/CallStack.cpp.o
16:25:37 [2019-11-01T20:25:37.367Z] [ 78%] Building CXX object jitbuilder/CMakeFiles/jitbuilder.dir/__/compiler/optimizer/LocalOpts.cpp.o
16:25:37 [2019-11-01T20:25:37.367Z] [ 78%] Building CXX object fvtest/compilertest/CMakeFiles/testcompiler.dir/__/__/compiler/ras/CFGChecker.cpp.o
16:25:37 [2019-11-01T20:25:37.367Z] [ 78%] Building CXX object fvtest/gctest/CMakeFiles/omrgctest.dir/StartupManagerTestExample.cpp.o
16:25:38 [2019-11-01T20:25:38.276Z] [ 78%] Building CXX object fvtest/compilertest/CMakeFiles/testcompiler.dir/__/__/compiler/ras/Debug.cpp.o
16:25:38 [2019-11-01T20:25:38.276Z] [ 78%] Building CXX object jitbuilder/CMakeFiles/jitbuilder.dir/__/compiler/optimizer/OMROptimization.cpp.o
16:25:38 [2019-11-01T20:25:38.276Z] [ 78%] Building CXX object fvtest/threadtest/CMakeFiles/omrthreadtest.dir/rwMutexTest.cpp.o
16:25:38 [2019-11-01T20:25:38.276Z] [ 78%] Building CXX object jitbuilder/CMakeFiles/jitbuilder.dir/__/compiler/optimizer/OMROptimizationManager.cpp.o
16:25:38 [2019-11-01T20:25:38.276Z] [ 78%] Building CXX object fvtest/compilertest/CMakeFiles/testcompiler.dir/__/__/compiler/ras/DebugCounter.cpp.o
16:25:38 [2019-11-01T20:25:38.276Z] [ 78%] Building CXX object jitbuilder/CMakeFiles/jitbuilder.dir/__/compiler/optimizer/OMRTransformUtil.cpp.o
16:25:38 [2019-11-01T20:25:38.276Z] [ 78%] Building CXX object fvtest/compilertest/CMakeFiles/testcompiler.dir/__/__/compiler/ras/ILValidationRules.cpp.o
16:25:39 [2019-11-01T20:25:39.180Z] [ 78%] Building CXX object fvtest/compilertest/CMakeFiles/testcompiler.dir/__/__/compiler/ras/ILValidationUtils.cpp.o
16:25:39 [2019-11-01T20:25:39.180Z] [ 78%] Building CXX object jitbuilder/CMakeFiles/jitbuilder.dir/__/compiler/optimizer/OMROptimizer.cpp.o
16:25:39 [2019-11-01T20:25:39.180Z] [ 78%] Building CXX object fvtest/compilertest/CMakeFiles/testcompiler.dir/__/__/compiler/ras/ILValidator.cpp.o
16:25:39 [2019-11-01T20:25:39.180Z] [ 78%] Building CXX object fvtest/gctest/CMakeFiles/omrgctest.dir/TestHeapRegionStateTable.cpp.o
16:25:39 [2019-11-01T20:25:39.180Z] In file included from /Users/jenkins/workspace/PullRequest-osx_x86-64/compiler/optimizer/OMROptimizer.cpp:92:
16:25:39 [2019-11-01T20:25:39.180Z] /Users/jenkins/workspace/PullRequest-osx_x86-64/compiler/optimizer/LoopVersioner.hpp:260:59: warning: '/*' within block comment [-Wcomment]
16:25:39 [2019-11-01T20:25:39.180Z]  * - \c staticDebugCounters={loopVersioner.unrepresentable/*}
16:25:39 [2019-11-01T20:25:39.180Z]                                                           ^
16:25:39 [2019-11-01T20:25:39.180Z] /Users/jenkins/workspace/PullRequest-osx_x86-64/compiler/optimizer/LoopVersioner.hpp:323:61: warning: '/*' within block comment [-Wcomment]
16:25:39 [2019-11-01T20:25:39.180Z]     * <tt>staticDebugCounters={loopVersioner.unrepresentable/*}</tt>.
16:25:39 [2019-11-01T20:25:39.180Z]                                                             ^
16:25:39 [2019-11-01T20:25:39.180Z] 2 warnings generated.
16:25:39 [2019-11-01T20:25:39.180Z] [ 78%] Building CXX object jitbuilder/CMakeFiles/jitbuilder.dir/__/compiler/optimizer/OrderBlocks.cpp.o
16:25:40 [2019-11-01T20:25:40.064Z] [ 78%] Building CXX object fvtest/compilertest/CMakeFiles/testcompiler.dir/__/__/compiler/ras/IgnoreLocale.cpp.o
16:25:40 [2019-11-01T20:25:40.064Z] [ 78%] Building CXX object fvtest/compilertest/CMakeFiles/testcompiler.dir/__/__/compiler/ras/LimitFile.cpp.o
16:25:40 [2019-11-01T20:25:40.064Z] [ 78%] Building CXX object jitbuilder/CMakeFiles/jitbuilder.dir/__/compiler/optimizer/OSRDefAnalysis.cpp.o
16:25:40 [2019-11-01T20:25:40.064Z] [ 78%] Building CXX object fvtest/threadtest/CMakeFiles/omrthreadtest.dir/sanityTest.cpp.o
16:25:40 [2019-11-01T20:25:40.064Z] [ 79%] Building CXX object fvtest/compilertest/CMakeFiles/testcompiler.dir/__/__/compiler/ras/LogTracer.cpp.o
16:25:40 [2019-11-01T20:25:40.064Z] [ 79%] Building CXX object jitbuilder/CMakeFiles/jitbuilder.dir/__/compiler/optimizer/PartialRedundancy.cpp.o
16:25:40 [2019-11-01T20:25:40.064Z] [ 79%] Building CXX object fvtest/compilertest/CMakeFiles/testcompiler.dir/__/__/compiler/ras/OptionsDebug.cpp.o
16:25:40 [2019-11-01T20:25:40.943Z] [ 79%] Building CXX object jitbuilder/CMakeFiles/jitbuilder.dir/__/compiler/optimizer/PreExistence.cpp.o
16:25:40 [2019-11-01T20:25:40.943Z] [ 79%] Building CXX object fvtest/compilertest/CMakeFiles/testcompiler.dir/__/__/compiler/ras/Tree.cpp.o
16:25:40 [2019-11-01T20:25:40.943Z] [ 79%] Building CXX object fvtest/gctest/CMakeFiles/omrgctest.dir/__/__/util/main_function/main_function.cpp.o
16:25:40 [2019-11-01T20:25:40.943Z] [ 79%] Linking CXX executable omrgctest
16:25:40 [2019-11-01T20:25:40.943Z] [ 79%] Building CXX object jitbuilder/CMakeFiles/jitbuilder.dir/__/compiler/optimizer/PrefetchInsertion.cpp.o
16:25:40 [2019-11-01T20:25:40.943Z] [ 79%] Building CXX object fvtest/compilertest/CMakeFiles/testcompiler.dir/__/__/compiler/runtime/Runtime.cpp.o
16:25:40 [2019-11-01T20:25:40.943Z] [ 79%] Built target omrgctest
16:25:40 [2019-11-01T20:25:40.943Z] [ 79%] Building CXX object fvtest/threadtest/CMakeFiles/omrthreadtest.dir/sanityTestHelper.cpp.o
16:25:40 [2019-11-01T20:25:40.943Z] [ 79%] Building CXX object fvtest/compilertest/CMakeFiles/testcompiler.dir/__/__/compiler/runtime/Trampoline.cpp.o
16:25:40 [2019-11-01T20:25:40.943Z] [ 79%] Building CXX object jitbuilder/CMakeFiles/jitbuilder.dir/__/compiler/optimizer/Reachability.cpp.o
16:25:40 [2019-11-01T20:25:40.943Z] [ 79%] Building CXX object fvtest/compilertest/CMakeFiles/testcompiler.dir/__/__/compiler/runtime/Alignment.cpp.o
16:25:40 [2019-11-01T20:25:40.943Z] [ 79%] Building CXX object fvtest/threadtest/CMakeFiles/omrthreadtest.dir/threadTestHelp.cpp.o
16:25:41 [2019-11-01T20:25:41.818Z] [ 79%] Building CXX object fvtest/compilertest/CMakeFiles/testcompiler.dir/__/__/compiler/runtime/CodeCacheTypes.cpp.o
16:25:41 [2019-11-01T20:25:41.818Z] [ 79%] Building CXX object jitbuilder/CMakeFiles/jitbuilder.dir/__/compiler/optimizer/ReachingDefinitions.cpp.o
16:25:41 [2019-11-01T20:25:41.818Z] [ 79%] Building CXX object fvtest/compilertest/CMakeFiles/testcompiler.dir/__/__/compiler/runtime/OMRCodeCache.cpp.o
16:25:41 [2019-11-01T20:25:41.818Z] [ 79%] Building CXX object fvtest/compilertest/CMakeFiles/testcompiler.dir/__/__/compiler/runtime/OMRCodeCacheManager.cpp.o
16:25:41 [2019-11-01T20:25:41.818Z] [ 79%] Building CXX object jitbuilder/CMakeFiles/jitbuilder.dir/__/compiler/optimizer/OMRRecognizedCallTransformer.cpp.o
16:25:41 [2019-11-01T20:25:41.818Z] [ 79%] Building CXX object fvtest/compilertest/CMakeFiles/testcompiler.dir/__/__/compiler/runtime/OMRCodeCacheMemorySegment.cpp.o
16:25:42 [2019-11-01T20:25:42.699Z] [ 80%] Building CXX object jitbuilder/CMakeFiles/jitbuilder.dir/__/compiler/optimizer/RedundantAsyncCheckRemoval.cpp.o
16:25:42 [2019-11-01T20:25:42.699Z] [ 80%] Building CXX object fvtest/compilertest/CMakeFiles/testcompiler.dir/__/__/compiler/runtime/OMRCodeCacheConfig.cpp.o
16:25:42 [2019-11-01T20:25:42.699Z] [ 80%] Building CXX object fvtest/compilertest/CMakeFiles/testcompiler.dir/__/__/compiler/x/codegen/BinaryCommutativeAnalyser.cpp.o
16:25:42 [2019-11-01T20:25:42.699Z] [ 80%] Building CXX object jitbuilder/CMakeFiles/jitbuilder.dir/__/compiler/optimizer/RegisterCandidate.cpp.o
16:25:42 [2019-11-01T20:25:42.699Z] [ 80%] Building CXX object fvtest/compilertest/CMakeFiles/testcompiler.dir/__/__/compiler/x/codegen/BinaryEvaluator.cpp.o
16:25:42 [2019-11-01T20:25:42.699Z] [ 80%] Building CXX object fvtest/threadtest/CMakeFiles/omrthreadtest.dir/__/__/util/main_function/main_function.cpp.o
16:25:42 [2019-11-01T20:25:42.699Z] [ 80%] Building CXX object jitbuilder/CMakeFiles/jitbuilder.dir/__/compiler/optimizer/OMRSimplifier.cpp.o
16:25:42 [2019-11-01T20:25:42.699Z] [ 80%] Linking CXX executable omrthreadtest
16:25:42 [2019-11-01T20:25:42.699Z] [ 81%] Building CXX object fvtest/compilertest/CMakeFiles/testcompiler.dir/__/__/compiler/x/codegen/CompareAnalyser.cpp.o
16:25:42 [2019-11-01T20:25:42.699Z] [ 81%] Built target omrthreadtest
16:25:42 [2019-11-01T20:25:42.699Z] [ 81%] Building CXX object jitbuilder/CMakeFiles/jitbuilder.dir/__/compiler/optimizer/OMRSimplifierHelpers.cpp.o
16:25:42 [2019-11-01T20:25:42.699Z] [ 81%] Building CXX object jitbuilder/CMakeFiles/jitbuilder.dir/__/compiler/optimizer/OMRSimplifierHandlers.cpp.o
16:25:43 [2019-11-01T20:25:43.615Z] [ 81%] Building CXX object fvtest/compilertest/CMakeFiles/testcompiler.dir/__/__/compiler/x/codegen/ControlFlowEvaluator.cpp.o
16:25:43 [2019-11-01T20:25:43.615Z] [ 81%] Building CXX object jitbuilder/CMakeFiles/jitbuilder.dir/__/compiler/optimizer/StructuralAnalysis.cpp.o
16:25:43 [2019-11-01T20:25:43.615Z] [ 81%] Building CXX object fvtest/compilertest/CMakeFiles/testcompiler.dir/__/__/compiler/x/codegen/DataSnippet.cpp.o
16:25:43 [2019-11-01T20:25:43.615Z] [ 81%] Building CXX object fvtest/compilertest/CMakeFiles/testcompiler.dir/__/__/compiler/x/codegen/DivideCheckSnippet.cpp.o
16:25:43 [2019-11-01T20:25:43.615Z] [ 81%] Building CXX object jitbuilder/CMakeFiles/jitbuilder.dir/__/compiler/optimizer/Structure.cpp.o
16:25:43 [2019-11-01T20:25:43.615Z] [ 81%] Building CXX object fvtest/compilertest/CMakeFiles/testcompiler.dir/__/__/compiler/x/codegen/FPBinaryArithmeticAnalyser.cpp.o
16:25:43 [2019-11-01T20:25:43.615Z] /Users/jenkins/workspace/PullRequest-osx_x86-64/compiler/x/codegen/DataSnippet.cpp:103:61: warning: shifting a negative signed value is undefined [-Wshift-negative-value]
16:25:43 [2019-11-01T20:25:43.615Z]       cursor = (uint8_t*)(((intptrj_t)(cursor + 15)) & ((-1)<<4));
16:25:43 [2019-11-01T20:25:43.615Z]                                                         ~~~~^
16:25:43 [2019-11-01T20:25:43.615Z] 1 warning generated.
16:25:43 [2019-11-01T20:25:43.615Z] [ 81%] Building CXX object jitbuilder/CMakeFiles/jitbuilder.dir/__/compiler/optimizer/SwitchAnalyzer.cpp.o
16:25:43 [2019-11-01T20:25:43.615Z] [ 81%] Building CXX object jitbuilder/CMakeFiles/jitbuilder.dir/__/compiler/optimizer/TranslateTable.cpp.o
16:25:43 [2019-11-01T20:25:43.615Z] [ 81%] Building CXX object fvtest/compilertest/CMakeFiles/testcompiler.dir/__/__/compiler/x/codegen/FPCompareAnalyser.cpp.o
16:25:43 [2019-11-01T20:25:43.615Z] [ 81%] Building CXX object jitbuilder/CMakeFiles/jitbuilder.dir/__/compiler/optimizer/UnionBitVectorAnalysis.cpp.o
16:25:44 [2019-11-01T20:25:44.485Z] [ 81%] Building CXX object jitbuilder/CMakeFiles/jitbuilder.dir/__/compiler/optimizer/UseDefInfo.cpp.o
16:25:44 [2019-11-01T20:25:44.485Z] [ 81%] Building CXX object fvtest/compilertest/CMakeFiles/testcompiler.dir/__/__/compiler/x/codegen/FPTreeEvaluator.cpp.o
16:25:44 [2019-11-01T20:25:44.485Z] [ 81%] Building CXX object jitbuilder/CMakeFiles/jitbuilder.dir/__/compiler/optimizer/ValueNumberInfo.cpp.o
16:25:44 [2019-11-01T20:25:44.485Z] [ 81%] Building CXX object fvtest/compilertest/CMakeFiles/testcompiler.dir/__/__/compiler/x/codegen/SIMDTreeEvaluator.cpp.o
16:25:44 [2019-11-01T20:25:44.485Z] [ 81%] Building CXX object fvtest/compilertest/CMakeFiles/testcompiler.dir/__/__/compiler/x/codegen/HelperCallSnippet.cpp.o
16:25:44 [2019-11-01T20:25:44.485Z] [ 82%] Building CXX object jitbuilder/CMakeFiles/jitbuilder.dir/__/compiler/optimizer/VirtualGuardCoalescer.cpp.o
16:25:44 [2019-11-01T20:25:44.485Z] [ 82%] Building CXX object fvtest/compilertest/CMakeFiles/testcompiler.dir/__/__/compiler/x/codegen/IA32LinkageUtils.cpp.o
16:25:44 [2019-11-01T20:25:44.485Z] [ 82%] Building CXX object jitbuilder/CMakeFiles/jitbuilder.dir/__/compiler/optimizer/VirtualGuardHeadMerger.cpp.o
16:25:44 [2019-11-01T20:25:44.485Z] [ 82%] Building CXX object jitbuilder/CMakeFiles/jitbuilder.dir/__/compiler/optimizer/RegDepCopyRemoval.cpp.o
16:25:44 [2019-11-01T20:25:44.485Z] [ 82%] Building CXX object fvtest/compilertest/CMakeFiles/testcompiler.dir/__/__/compiler/x/codegen/IntegerMultiplyDecomposer.cpp.o
16:25:45 [2019-11-01T20:25:45.360Z] [ 82%] Building CXX object jitbuilder/CMakeFiles/jitbuilder.dir/__/compiler/optimizer/ReorderIndexExpr.cpp.o
16:25:45 [2019-11-01T20:25:45.360Z] [ 82%] Building CXX object fvtest/compilertest/CMakeFiles/testcompiler.dir/__/__/compiler/x/codegen/OMRMemoryReference.cpp.o
16:25:45 [2019-11-01T20:25:45.360Z] [ 82%] Building CXX object fvtest/compilertest/CMakeFiles/testcompiler.dir/__/__/compiler/x/codegen/OpBinary.cpp.o
16:25:45 [2019-11-01T20:25:45.360Z] [ 82%] Building CXX object jitbuilder/CMakeFiles/jitbuilder.dir/__/compiler/optimizer/SinkStores.cpp.o
16:25:45 [2019-11-01T20:25:45.360Z] [ 83%] Building CXX object fvtest/compilertest/CMakeFiles/testcompiler.dir/__/__/compiler/x/codegen/OpNames.cpp.o
16:25:45 [2019-11-01T20:25:45.360Z] [ 83%] Building CXX object jitbuilder/CMakeFiles/jitbuilder.dir/__/compiler/optimizer/StripMiner.cpp.o
16:25:45 [2019-11-01T20:25:45.360Z] [ 83%] Building CXX object jitbuilder/CMakeFiles/jitbuilder.dir/__/compiler/optimizer/VPConstraint.cpp.o
16:25:45 [2019-11-01T20:25:45.360Z] [ 83%] Building CXX object fvtest/compilertest/CMakeFiles/testcompiler.dir/__/__/compiler/x/codegen/OutlinedInstructions.cpp.o
16:25:45 [2019-11-01T20:25:45.360Z] [ 83%] Building CXX object fvtest/compilertest/CMakeFiles/testcompiler.dir/__/__/compiler/x/codegen/RegisterRematerialization.cpp.o
16:25:45 [2019-11-01T20:25:45.360Z] [ 83%] Building CXX object fvtest/compilertest/CMakeFiles/testcompiler.dir/__/__/compiler/x/codegen/SubtractAnalyser.cpp.o
16:25:45 [2019-11-01T20:25:45.360Z] [ 83%] Building CXX object jitbuilder/CMakeFiles/jitbuilder.dir/__/compiler/optimizer/VPHandlers.cpp.o
16:25:46 [2019-11-01T20:25:46.228Z] [ 83%] Building CXX object jitbuilder/CMakeFiles/jitbuilder.dir/__/compiler/optimizer/VPHandlersCommon.cpp.o
16:25:46 [2019-11-01T20:25:46.228Z] [ 83%] Building CXX object jitbuilder/CMakeFiles/jitbuilder.dir/__/compiler/optimizer/OMRValuePropagation.cpp.o
16:25:46 [2019-11-01T20:25:46.228Z] [ 83%] Building CXX object fvtest/compilertest/CMakeFiles/testcompiler.dir/__/__/compiler/x/codegen/OMRTreeEvaluator.cpp.o
16:25:46 [2019-11-01T20:25:46.228Z] [ 83%] Building CXX object fvtest/compilertest/CMakeFiles/testcompiler.dir/__/__/compiler/x/codegen/UnaryEvaluator.cpp.o
16:25:46 [2019-11-01T20:25:46.228Z] [ 83%] Building CXX object fvtest/compilertest/CMakeFiles/testcompiler.dir/__/__/compiler/x/codegen/X86BinaryEncoding.cpp.o
16:25:46 [2019-11-01T20:25:46.228Z] [ 83%] Building CXX object jitbuilder/CMakeFiles/jitbuilder.dir/__/compiler/optimizer/ValuePropagationCommon.cpp.o
16:25:46 [2019-11-01T20:25:46.228Z] [ 83%] Building CXX object jitbuilder/CMakeFiles/jitbuilder.dir/__/compiler/optimizer/TrivialDeadBlockRemover.cpp.o
16:25:46 [2019-11-01T20:25:46.228Z] [ 83%] Building CXX object jitbuilder/CMakeFiles/jitbuilder.dir/__/compiler/optimizer/FEInliner.cpp.o
16:25:46 [2019-11-01T20:25:46.228Z] [ 83%] Building CXX object fvtest/compilertest/CMakeFiles/testcompiler.dir/__/__/compiler/x/codegen/X86Debug.cpp.o
16:25:47 [2019-11-01T20:25:47.129Z] [ 83%] Building CXX object fvtest/compilertest/CMakeFiles/testcompiler.dir/__/__/compiler/x/codegen/X86FPConversionSnippet.cpp.o
16:25:47 [2019-11-01T20:25:47.129Z] [ 83%] Building CXX object fvtest/compilertest/CMakeFiles/testcompiler.dir/__/__/compiler/x/codegen/OMRInstruction.cpp.o
16:25:47 [2019-11-01T20:25:47.129Z] [ 84%] Building CXX object jitbuilder/CMakeFiles/jitbuilder.dir/__/compiler/ras/CallStack.cpp.o
16:25:47 [2019-11-01T20:25:47.129Z] [ 84%] Building CXX object fvtest/compilertest/CMakeFiles/testcompiler.dir/__/__/compiler/x/codegen/OMRInstructionDelegate.cpp.o
16:25:47 [2019-11-01T20:25:47.129Z] [ 84%] Building CXX object jitbuilder/CMakeFiles/jitbuilder.dir/__/compiler/ras/CFGChecker.cpp.o
16:25:47 [2019-11-01T20:25:47.129Z] [ 84%] Building CXX object fvtest/compilertest/CMakeFiles/testcompiler.dir/__/__/compiler/x/codegen/OMRX86Instruction.cpp.o
16:25:47 [2019-11-01T20:25:47.129Z] [ 84%] Building CXX object jitbuilder/CMakeFiles/jitbuilder.dir/__/compiler/ras/Debug.cpp.o
16:25:47 [2019-11-01T20:25:47.129Z] [ 84%] Building CXX object jitbuilder/CMakeFiles/jitbuilder.dir/__/compiler/ras/DebugCounter.cpp.o
16:25:47 [2019-11-01T20:25:47.129Z] [ 84%] Building CXX object fvtest/compilertest/CMakeFiles/testcompiler.dir/__/__/compiler/x/codegen/OMRMachine.cpp.o
16:25:47 [2019-11-01T20:25:47.129Z] [ 84%] Building CXX object jitbuilder/CMakeFiles/jitbuilder.dir/__/compiler/ras/ILValidationRules.cpp.o
16:25:47 [2019-11-01T20:25:47.129Z] [ 84%] Building CXX object jitbuilder/CMakeFiles/jitbuilder.dir/__/compiler/ras/ILValidationUtils.cpp.o
16:25:47 [2019-11-01T20:25:47.129Z] [ 84%] Building CXX object jitbuilder/CMakeFiles/jitbuilder.dir/__/compiler/ras/ILValidator.cpp.o
16:25:48 [2019-11-01T20:25:48.003Z] [ 85%] Building CXX object fvtest/compilertest/CMakeFiles/testcompiler.dir/__/__/compiler/x/codegen/OMRLinkage.cpp.o
16:25:48 [2019-11-01T20:25:48.003Z] [ 85%] Building CXX object jitbuilder/CMakeFiles/jitbuilder.dir/__/compiler/ras/IgnoreLocale.cpp.o
16:25:48 [2019-11-01T20:25:48.003Z] [ 85%] Building CXX object fvtest/compilertest/CMakeFiles/testcompiler.dir/__/__/compiler/x/codegen/OMRRegister.cpp.o
16:25:48 [2019-11-01T20:25:48.003Z] [ 85%] Building CXX object fvtest/compilertest/CMakeFiles/testcompiler.dir/__/__/compiler/x/codegen/OMRRealRegister.cpp.o
16:25:48 [2019-11-01T20:25:48.003Z] [ 85%] Building CXX object jitbuilder/CMakeFiles/jitbuilder.dir/__/compiler/ras/LimitFile.cpp.o
16:25:48 [2019-11-01T20:25:48.003Z] [ 85%] Building CXX object fvtest/compilertest/CMakeFiles/testcompiler.dir/__/__/compiler/x/codegen/OMRRegisterDependency.cpp.o
16:25:48 [2019-11-01T20:25:48.003Z] [ 85%] Building CXX object jitbuilder/CMakeFiles/jitbuilder.dir/__/compiler/ras/LogTracer.cpp.o
16:25:48 [2019-11-01T20:25:48.003Z] [ 85%] Building CXX object fvtest/compilertest/CMakeFiles/testcompiler.dir/__/__/compiler/x/codegen/OMRSnippet.cpp.o
16:25:48 [2019-11-01T20:25:48.003Z] [ 85%] Building CXX object fvtest/compilertest/CMakeFiles/testcompiler.dir/__/__/compiler/x/codegen/X86SystemLinkage.cpp.o
16:25:48 [2019-11-01T20:25:48.003Z] [ 85%] Building CXX object jitbuilder/CMakeFiles/jitbuilder.dir/__/compiler/ras/OptionsDebug.cpp.o
16:25:48 [2019-11-01T20:25:48.003Z] [ 85%] Building CXX object fvtest/compilertest/CMakeFiles/testcompiler.dir/__/__/compiler/x/codegen/OMRCodeGenerator.cpp.o
16:25:48 [2019-11-01T20:25:48.901Z] [ 85%] Building CXX object jitbuilder/CMakeFiles/jitbuilder.dir/__/compiler/ras/Tree.cpp.o
16:25:48 [2019-11-01T20:25:48.901Z] [ 85%] Building CXX object fvtest/compilertest/CMakeFiles/testcompiler.dir/__/__/compiler/x/env/OMRCPU.cpp.o
16:25:48 [2019-11-01T20:25:48.901Z] [ 85%] Building CXX object jitbuilder/CMakeFiles/jitbuilder.dir/__/compiler/runtime/Runtime.cpp.o
16:25:48 [2019-11-01T20:25:48.901Z] [ 86%] Building CXX object jitbuilder/CMakeFiles/jitbuilder.dir/__/compiler/runtime/Trampoline.cpp.o
16:25:48 [2019-11-01T20:25:48.901Z] [ 86%] Building CXX object fvtest/compilertest/CMakeFiles/testcompiler.dir/__/__/compiler/x/env/OMRDebugEnv.cpp.o
16:25:48 [2019-11-01T20:25:48.901Z] [ 86%] Building CXX object fvtest/compilertest/CMakeFiles/testcompiler.dir/__/__/compiler/x/amd64/codegen/OMRCodeGenerator.cpp.o
16:25:48 [2019-11-01T20:25:48.901Z] [ 86%] Building CXX object jitbuilder/CMakeFiles/jitbuilder.dir/__/compiler/runtime/Alignment.cpp.o
16:25:48 [2019-11-01T20:25:48.901Z] [ 86%] Building CXX object fvtest/compilertest/CMakeFiles/testcompiler.dir/__/__/compiler/x/amd64/codegen/OMRMachine.cpp.o
16:25:48 [2019-11-01T20:25:48.901Z] [ 86%] Building CXX object jitbuilder/CMakeFiles/jitbuilder.dir/__/compiler/runtime/CodeCacheTypes.cpp.o
16:25:48 [2019-11-01T20:25:48.901Z] [ 86%] Building CXX object jitbuilder/CMakeFiles/jitbuilder.dir/__/compiler/runtime/OMRCodeCache.cpp.o
16:25:48 [2019-11-01T20:25:48.901Z] [ 86%] Building CXX object jitbuilder/CMakeFiles/jitbuilder.dir/__/compiler/runtime/OMRCodeCacheManager.cpp.o
16:25:48 [2019-11-01T20:25:48.901Z] [ 86%] Building CXX object fvtest/compilertest/CMakeFiles/testcompiler.dir/__/__/compiler/x/amd64/codegen/OMRTreeEvaluator.cpp.o
16:25:48 [2019-11-01T20:25:48.901Z] [ 86%] Building CXX object jitbuilder/CMakeFiles/jitbuilder.dir/__/compiler/runtime/OMRCodeCacheMemorySegment.cpp.o
16:25:48 [2019-11-01T20:25:48.901Z] [ 87%] Building CXX object fvtest/compilertest/CMakeFiles/testcompiler.dir/__/__/compiler/x/amd64/codegen/OMRMemoryReference.cpp.o
16:25:48 [2019-11-01T20:25:48.901Z] [ 87%] Building CXX object fvtest/compilertest/CMakeFiles/testcompiler.dir/__/__/compiler/x/amd64/codegen/OMRRealRegister.cpp.o
16:25:48 [2019-11-01T20:25:48.901Z] [ 87%] Building CXX object jitbuilder/CMakeFiles/jitbuilder.dir/__/compiler/runtime/OMRCodeCacheConfig.cpp.o
16:25:49 [2019-11-01T20:25:49.809Z] [ 87%] Building CXX object jitbuilder/CMakeFiles/jitbuilder.dir/__/compiler/x/codegen/BinaryCommutativeAnalyser.cpp.o
16:25:49 [2019-11-01T20:25:49.809Z] [ 87%] Building CXX object fvtest/compilertest/CMakeFiles/testcompiler.dir/__/__/compiler/x/amd64/codegen/AMD64SystemLinkage.cpp.o
16:25:49 [2019-11-01T20:25:49.809Z] [ 87%] Building CXX object jitbuilder/CMakeFiles/jitbuilder.dir/__/compiler/x/codegen/BinaryEvaluator.cpp.o
16:25:49 [2019-11-01T20:25:49.809Z] [ 87%] Building CXX object jitbuilder/CMakeFiles/jitbuilder.dir/__/compiler/x/codegen/CompareAnalyser.cpp.o
16:25:49 [2019-11-01T20:25:49.809Z] [ 87%] Building CXX object fvtest/compilertest/CMakeFiles/testcompiler.dir/__/__/compiler/x/amd64/codegen/OMRELFRelocationResolver.cpp.o
16:25:49 [2019-11-01T20:25:49.809Z] [ 87%] Building CXX object jitbuilder/CMakeFiles/jitbuilder.dir/__/compiler/x/codegen/ControlFlowEvaluator.cpp.o
16:25:49 [2019-11-01T20:25:49.809Z] [ 87%] Linking CXX static library libtestcompiler.a
16:25:49 [2019-11-01T20:25:49.809Z] [ 87%] Building CXX object jitbuilder/CMakeFiles/jitbuilder.dir/__/compiler/x/codegen/DataSnippet.cpp.o
16:25:49 [2019-11-01T20:25:49.809Z] /Library/Developer/CommandLineTools/usr/bin/ranlib: file: libtestcompiler.a(Evaluator.cpp.o) has no symbols
16:25:49 [2019-11-01T20:25:49.809Z] /Library/Developer/CommandLineTools/usr/bin/ranlib: file: libtestcompiler.a(OMRMachine.cpp.o) has no symbols
16:25:49 [2019-11-01T20:25:49.809Z] /Library/Developer/CommandLineTools/usr/bin/ranlib: file: libtestcompiler.a(ELFGenerator.cpp.o) has no symbols
16:25:49 [2019-11-01T20:25:49.809Z] /Library/Developer/CommandLineTools/usr/bin/ranlib: file: libtestcompiler.a(OMRELFRelocationResolver.cpp.o) has no symbols
16:25:49 [2019-11-01T20:25:49.809Z] /Library/Developer/CommandLineTools/usr/bin/ranlib: file: libtestcompiler.a(OMRVMMethodEnv.cpp.o) has no symbols
16:25:49 [2019-11-01T20:25:49.809Z] /Library/Developer/CommandLineTools/usr/bin/ranlib: file: libtestcompiler.a(DominatorVerifier.cpp.o) has no symbols
16:25:49 [2019-11-01T20:25:49.809Z] /Library/Developer/CommandLineTools/usr/bin/ranlib: file: libtestcompiler.a(DominatorsChk.cpp.o) has no symbols
16:25:49 [2019-11-01T20:25:49.809Z] /Library/Developer/CommandLineTools/usr/bin/ranlib: file: libtestcompiler.a(OpNames.cpp.o) has no symbols
16:25:49 [2019-11-01T20:25:49.809Z] /Library/Developer/CommandLineTools/usr/bin/ranlib: file: libtestcompiler.a(OMRInstructionDelegate.cpp.o) has no symbols
16:25:49 [2019-11-01T20:25:49.809Z] /Library/Developer/CommandLineTools/usr/bin/ranlib: file: libtestcompiler.a(OMRELFRelocationResolver.cpp.o) has no symbols
16:25:49 [2019-11-01T20:25:49.809Z] [ 87%] Building CXX object jitbuilder/CMakeFiles/jitbuilder.dir/__/compiler/x/codegen/DivideCheckSnippet.cpp.o
16:25:49 [2019-11-01T20:25:49.809Z] /Library/Developer/CommandLineTools/usr/bin/ranlib: file: libtestcompiler.a(Evaluator.cpp.o) has no symbols
16:25:49 [2019-11-01T20:25:49.809Z] /Library/Developer/CommandLineTools/usr/bin/ranlib: file: libtestcompiler.a(OMRMachine.cpp.o) has no symbols
16:25:49 [2019-11-01T20:25:49.809Z] /Library/Developer/CommandLineTools/usr/bin/ranlib: file: libtestcompiler.a(ELFGenerator.cpp.o) has no symbols
16:25:49 [2019-11-01T20:25:49.809Z] /Library/Developer/CommandLineTools/usr/bin/ranlib: file: libtestcompiler.a(OMRELFRelocationResolver.cpp.o) has no symbols
16:25:49 [2019-11-01T20:25:49.809Z] /Library/Developer/CommandLineTools/usr/bin/ranlib: file: libtestcompiler.a(OMRVMMethodEnv.cpp.o) has no symbols
16:25:49 [2019-11-01T20:25:49.809Z] /Library/Developer/CommandLineTools/usr/bin/ranlib: file: libtestcompiler.a(DominatorVerifier.cpp.o) has no symbols
16:25:49 [2019-11-01T20:25:49.809Z] /Library/Developer/CommandLineTools/usr/bin/ranlib: file: libtestcompiler.a(DominatorsChk.cpp.o) has no symbols
16:25:49 [2019-11-01T20:25:49.809Z] /Users/jenkins/workspace/PullRequest-osx_x86-64/compiler/x/codegen/DataSnippet.cpp:103:61: warning: shifting a negative signed value is undefined [-Wshift-negative-value]
16:25:49 [2019-11-01T20:25:49.809Z]       cursor = (uint8_t*)(((intptrj_t)(cursor + 15)) & ((-1)<<4));
16:25:49 [2019-11-01T20:25:49.809Z]                                                         ~~~~^
16:25:49 [2019-11-01T20:25:49.809Z] 1 warning generated.
16:25:49 [2019-11-01T20:25:49.809Z] /Library/Developer/CommandLineTools/usr/bin/ranlib: file: libtestcompiler.a(OpNames.cpp.o) has no symbols
16:25:49 [2019-11-01T20:25:49.809Z] /Library/Developer/CommandLineTools/usr/bin/ranlib: file: libtestcompiler.a(OMRInstructionDelegate.cpp.o) has no symbols
16:25:49 [2019-11-01T20:25:49.809Z] /Library/Developer/CommandLineTools/usr/bin/ranlib: file: libtestcompiler.a(OMRELFRelocationResolver.cpp.o) has no symbols
16:25:49 [2019-11-01T20:25:49.809Z] [ 88%] Building CXX object jitbuilder/CMakeFiles/jitbuilder.dir/__/compiler/x/codegen/FPBinaryArithmeticAnalyser.cpp.o
16:25:49 [2019-11-01T20:25:49.809Z] [ 88%] Building CXX object jitbuilder/CMakeFiles/jitbuilder.dir/__/compiler/x/codegen/FPCompareAnalyser.cpp.o
16:25:50 [2019-11-01T20:25:50.735Z] [ 88%] Building CXX object jitbuilder/CMakeFiles/jitbuilder.dir/__/compiler/x/codegen/FPTreeEvaluator.cpp.o
16:25:50 [2019-11-01T20:25:50.735Z] [ 88%] Built target testcompiler
16:25:50 [2019-11-01T20:25:50.735Z] [ 88%] Building CXX object jitbuilder/CMakeFiles/jitbuilder.dir/__/compiler/x/codegen/SIMDTreeEvaluator.cpp.o
16:25:50 [2019-11-01T20:25:50.735Z] Scanning dependencies of target tril
16:25:50 [2019-11-01T20:25:50.735Z] [ 88%] Building CXX object fvtest/tril/tril/CMakeFiles/tril.dir/ast.cpp.o
16:25:50 [2019-11-01T20:25:50.735Z] [ 88%] Building CXX object fvtest/tril/tril/CMakeFiles/tril.dir/parser.cpp.o
16:25:50 [2019-11-01T20:25:50.735Z] [ 88%] Building CXX object jitbuilder/CMakeFiles/jitbuilder.dir/__/compiler/x/codegen/HelperCallSnippet.cpp.o
16:25:50 [2019-11-01T20:25:50.735Z] [ 88%] Building CXX object fvtest/tril/tril/CMakeFiles/tril.dir/ilgen.cpp.o
16:25:50 [2019-11-01T20:25:50.735Z] Scanning dependencies of target compilertest
16:25:50 [2019-11-01T20:25:50.735Z] [ 88%] Building CXX object fvtest/compilertest/CMakeFiles/compilertest.dir/tests/main.cpp.o
16:25:50 [2019-11-01T20:25:50.735Z] [ 88%] Building CXX object fvtest/tril/tril/CMakeFiles/tril.dir/simple_compiler.cpp.o
16:25:50 [2019-11-01T20:25:50.735Z] [ 88%] Building CXX object jitbuilder/CMakeFiles/jitbuilder.dir/__/compiler/x/codegen/IA32LinkageUtils.cpp.o
16:25:50 [2019-11-01T20:25:50.735Z] In file included from /Users/jenkins/workspace/PullRequest-osx_x86-64/fvtest/tril/tril/ilgen.cpp:24:
16:25:50 [2019-11-01T20:25:50.735Z] /Users/jenkins/workspace/PullRequest-osx_x86-64/fvtest/tril/tril/compiler_util.hpp:92:39: warning: comparison of unsigned expression >= 0 is always true [-Wtautological-compare]
16:25:50 [2019-11-01T20:25:50.735Z]          if (flagsValue->getInteger() >= 0 && flagsValue->getInteger() < 32)
16:25:50 [2019-11-01T20:25:50.735Z]              ~~~~~~~~~~~~~~~~~~~~~~~~ ^  ~
16:25:50 [2019-11-01T20:25:50.735Z] 1 warning generated.
16:25:51 [2019-11-01T20:25:51.674Z] [ 88%] Building CXX object jitbuilder/CMakeFiles/jitbuilder.dir/__/compiler/x/codegen/IntegerMultiplyDecomposer.cpp.o
16:25:51 [2019-11-01T20:25:51.674Z] [ 88%] Building CXX object fvtest/compilertest/CMakeFiles/compilertest.dir/tests/BuilderTest.cpp.o
16:25:51 [2019-11-01T20:25:51.674Z] [ 88%] Building CXX object jitbuilder/CMakeFiles/jitbuilder.dir/__/compiler/x/codegen/OMRMemoryReference.cpp.o
16:25:51 [2019-11-01T20:25:51.674Z] [ 88%] Building CXX object jitbuilder/CMakeFiles/jitbuilder.dir/__/compiler/x/codegen/OpBinary.cpp.o
16:25:51 [2019-11-01T20:25:51.674Z] [ 88%] Building CXX object jitbuilder/CMakeFiles/jitbuilder.dir/__/compiler/x/codegen/OpNames.cpp.o
16:25:51 [2019-11-01T20:25:51.674Z] [ 88%] Building CXX object jitbuilder/CMakeFiles/jitbuilder.dir/__/compiler/x/codegen/OutlinedInstructions.cpp.o
16:25:52 [2019-11-01T20:25:52.583Z] [ 88%] Building CXX object jitbuilder/CMakeFiles/jitbuilder.dir/__/compiler/x/codegen/RegisterRematerialization.cpp.o
16:25:52 [2019-11-01T20:25:52.583Z] [ 88%] Building CXX object fvtest/compilertest/CMakeFiles/compilertest.dir/tests/FooBarTest.cpp.o
16:25:52 [2019-11-01T20:25:52.583Z] [ 88%] Building CXX object jitbuilder/CMakeFiles/jitbuilder.dir/__/compiler/x/codegen/SubtractAnalyser.cpp.o
16:25:52 [2019-11-01T20:25:52.583Z] In file included from /Users/jenkins/workspace/PullRequest-osx_x86-64/fvtest/tril/tril/simple_compiler.cpp:22:
16:25:52 [2019-11-01T20:25:52.583Z] In file included from /Users/jenkins/workspace/PullRequest-osx_x86-64/fvtest/tril/tril/simple_compiler.hpp:25:
16:25:52 [2019-11-01T20:25:52.583Z] In file included from /Users/jenkins/workspace/PullRequest-osx_x86-64/fvtest/tril/tril/method_compiler.hpp:25:
16:25:52 [2019-11-01T20:25:52.583Z] In file included from /Users/jenkins/workspace/PullRequest-osx_x86-64/fvtest/tril/tril/method_info.hpp:27:
16:25:52 [2019-11-01T20:25:52.583Z] /Users/jenkins/workspace/PullRequest-osx_x86-64/fvtest/tril/tril/compiler_util.hpp:92:39: warning: comparison of unsigned expression >= 0 is always true [-Wtautological-compare]
16:25:52 [2019-11-01T20:25:52.583Z]          if (flagsValue->getInteger() >= 0 && flagsValue->getInteger() < 32)
16:25:52 [2019-11-01T20:25:52.583Z]              ~~~~~~~~~~~~~~~~~~~~~~~~ ^  ~
16:25:52 [2019-11-01T20:25:52.583Z] 1 warning generated.
16:25:52 [2019-11-01T20:25:52.583Z] [ 88%] Linking CXX static library libtril.a
16:25:53 [2019-11-01T20:25:53.537Z] [ 88%] Built target tril
16:25:53 [2019-11-01T20:25:53.537Z] [ 88%] Building CXX object fvtest/compilertest/CMakeFiles/compilertest.dir/tests/LimitFileTest.cpp.o
16:25:53 [2019-11-01T20:25:53.537Z] Scanning dependencies of target tril_compiler
16:25:53 [2019-11-01T20:25:53.537Z] [ 88%] Building CXX object fvtest/tril/tril/CMakeFiles/tril_compiler.dir/compiler.cpp.o
16:25:53 [2019-11-01T20:25:53.537Z] [ 89%] Building CXX object jitbuilder/CMakeFiles/jitbuilder.dir/__/compiler/x/codegen/OMRTreeEvaluator.cpp.o
16:25:53 [2019-11-01T20:25:53.537Z] [ 89%] Building CXX object jitbuilder/CMakeFiles/jitbuilder.dir/__/compiler/x/codegen/UnaryEvaluator.cpp.o
16:25:54 [2019-11-01T20:25:54.511Z] [ 89%] Building CXX object jitbuilder/CMakeFiles/jitbuilder.dir/__/compiler/x/codegen/X86BinaryEncoding.cpp.o
16:25:54 [2019-11-01T20:25:54.511Z] Scanning dependencies of target tril_dumper
16:25:54 [2019-11-01T20:25:54.511Z] [ 89%] Building CXX object fvtest/tril/tril/CMakeFiles/tril_dumper.dir/compiler.cpp.o
16:25:54 [2019-11-01T20:25:54.511Z] [ 89%] Building CXX object jitbuilder/CMakeFiles/jitbuilder.dir/__/compiler/x/codegen/X86Debug.cpp.o
16:25:54 [2019-11-01T20:25:54.511Z] In file included from /Users/jenkins/workspace/PullRequest-osx_x86-64/fvtest/tril/tril/compiler.cpp:22:
16:25:54 [2019-11-01T20:25:54.511Z] In file included from /Users/jenkins/workspace/PullRequest-osx_x86-64/fvtest/tril/tril/default_compiler.hpp:30:
16:25:54 [2019-11-01T20:25:54.511Z] In file included from /Users/jenkins/workspace/PullRequest-osx_x86-64/fvtest/tril/tril/simple_compiler.hpp:25:
16:25:54 [2019-11-01T20:25:54.511Z] In file included from /Users/jenkins/workspace/PullRequest-osx_x86-64/fvtest/tril/tril/method_compiler.hpp:25:
16:25:54 [2019-11-01T20:25:54.511Z] In file included from /Users/jenkins/workspace/PullRequest-osx_x86-64/fvtest/tril/tril/method_info.hpp:27:
16:25:54 [2019-11-01T20:25:54.511Z] /Users/jenkins/workspace/PullRequest-osx_x86-64/fvtest/tril/tril/compiler_util.hpp:92:39: warning: comparison of unsigned expression >= 0 is always true [-Wtautological-compare]
16:25:54 [2019-11-01T20:25:54.511Z]          if (flagsValue->getInteger() >= 0 && flagsValue->getInteger() < 32)
16:25:54 [2019-11-01T20:25:54.511Z]              ~~~~~~~~~~~~~~~~~~~~~~~~ ^  ~
16:25:54 [2019-11-01T20:25:54.511Z] 1 warning generated.
16:25:54 [2019-11-01T20:25:54.511Z] [ 89%] Linking CXX executable tril_compiler
16:25:54 [2019-11-01T20:25:54.511Z] In file included from /Users/jenkins/workspace/PullRequest-osx_x86-64/fvtest/tril/tril/compiler.cpp:22:
16:25:54 [2019-11-01T20:25:54.511Z] In file included from /Users/jenkins/workspace/PullRequest-osx_x86-64/fvtest/tril/tril/default_compiler.hpp:30:
16:25:54 [2019-11-01T20:25:54.511Z] In file included from /Users/jenkins/workspace/PullRequest-osx_x86-64/fvtest/tril/tril/simple_compiler.hpp:25:
16:25:54 [2019-11-01T20:25:54.511Z] In file included from /Users/jenkins/workspace/PullRequest-osx_x86-64/fvtest/tril/tril/method_compiler.hpp:25:
16:25:54 [2019-11-01T20:25:54.511Z] In file included from /Users/jenkins/workspace/PullRequest-osx_x86-64/fvtest/tril/tril/method_info.hpp:27:
16:25:54 [2019-11-01T20:25:54.511Z] /Users/jenkins/workspace/PullRequest-osx_x86-64/fvtest/tril/tril/compiler_util.hpp:92:39: warning: comparison of unsigned expression >= 0 is always true [-Wtautological-compare]
16:25:54 [2019-11-01T20:25:54.511Z]          if (flagsValue->getInteger() >= 0 && flagsValue->getInteger() < 32)
16:25:54 [2019-11-01T20:25:54.511Z]              ~~~~~~~~~~~~~~~~~~~~~~~~ ^  ~
16:25:54 [2019-11-01T20:25:54.511Z] 1 warning generated.
16:25:54 [2019-11-01T20:25:54.511Z] [ 89%] Linking CXX executable tril_dumper
16:25:54 [2019-11-01T20:25:54.511Z] [ 89%] Building CXX object jitbuilder/CMakeFiles/jitbuilder.dir/__/compiler/x/codegen/X86FPConversionSnippet.cpp.o
16:25:54 [2019-11-01T20:25:54.511Z] [ 89%] Building CXX object fvtest/compilertest/CMakeFiles/compilertest.dir/tests/LogFileTest.cpp.o
16:25:54 [2019-11-01T20:25:54.511Z] [ 89%] Building CXX object fvtest/compilertest/CMakeFiles/compilertest.dir/tests/OMRTestEnv.cpp.o
16:25:55 [2019-11-01T20:25:55.468Z] [ 89%] Building CXX object jitbuilder/CMakeFiles/jitbuilder.dir/__/compiler/x/codegen/OMRInstruction.cpp.o
16:25:55 [2019-11-01T20:25:55.468Z] [ 89%] Building CXX object jitbuilder/CMakeFiles/jitbuilder.dir/__/compiler/x/codegen/OMRInstructionDelegate.cpp.o
16:25:55 [2019-11-01T20:25:55.468Z] [ 89%] Building CXX object jitbuilder/CMakeFiles/jitbuilder.dir/__/compiler/x/codegen/OMRX86Instruction.cpp.o
16:25:55 [2019-11-01T20:25:55.468Z] [ 89%] Built target tril_compiler
16:25:55 [2019-11-01T20:25:55.468Z] [ 89%] Built target tril_dumper
16:25:55 [2019-11-01T20:25:55.468Z] [ 89%] Building CXX object fvtest/compilertest/CMakeFiles/compilertest.dir/tests/OptionSetTest.cpp.o
16:25:55 [2019-11-01T20:25:55.468Z] [ 89%] Building CXX object jitbuilder/CMakeFiles/jitbuilder.dir/__/compiler/x/codegen/OMRMachine.cpp.o
16:25:55 [2019-11-01T20:25:55.468Z] Scanning dependencies of target triltest
16:25:55 [2019-11-01T20:25:55.468Z] [ 89%] Building CXX object fvtest/tril/test/CMakeFiles/triltest.dir/main.cpp.o
16:25:56 [2019-11-01T20:25:56.343Z] [ 89%] Building CXX object fvtest/compilertest/CMakeFiles/compilertest.dir/tests/OpCodesTest.cpp.o
16:25:56 [2019-11-01T20:25:56.343Z] [ 89%] Building CXX object jitbuilder/CMakeFiles/jitbuilder.dir/__/compiler/x/codegen/OMRLinkage.cpp.o
16:25:56 [2019-11-01T20:25:56.343Z] [ 90%] Building CXX object fvtest/tril/test/CMakeFiles/triltest.dir/ASTTest.cpp.o
16:25:56 [2019-11-01T20:25:56.343Z] [ 90%] Building CXX object jitbuilder/CMakeFiles/jitbuilder.dir/__/compiler/x/codegen/OMRRegister.cpp.o
16:25:56 [2019-11-01T20:25:56.343Z] [ 90%] Building CXX object jitbuilder/CMakeFiles/jitbuilder.dir/__/compiler/x/codegen/OMRRealRegister.cpp.o
16:25:56 [2019-11-01T20:25:56.343Z] Scanning dependencies of target incordec
16:25:56 [2019-11-01T20:25:56.343Z] [ 90%] Building CXX object fvtest/tril/examples/incordec/CMakeFiles/incordec.dir/main.cpp.o
16:25:57 [2019-11-01T20:25:57.202Z] [ 90%] Building CXX object jitbuilder/CMakeFiles/jitbuilder.dir/__/compiler/x/codegen/OMRRegisterDependency.cpp.o
16:25:57 [2019-11-01T20:25:57.202Z] [ 91%] Building CXX object jitbuilder/CMakeFiles/jitbuilder.dir/__/compiler/x/codegen/OMRSnippet.cpp.o
16:25:57 [2019-11-01T20:25:57.202Z] [ 91%] Building CXX object fvtest/tril/test/CMakeFiles/triltest.dir/ParserTest.cpp.o
16:25:57 [2019-11-01T20:25:57.202Z] [ 91%] Building CXX object jitbuilder/CMakeFiles/jitbuilder.dir/__/compiler/x/codegen/X86SystemLinkage.cpp.o
16:25:58 [2019-11-01T20:25:58.095Z] In file included from /Users/jenkins/workspace/PullRequest-osx_x86-64/fvtest/tril/examples/incordec/main.cpp:22:
16:25:58 [2019-11-01T20:25:58.095Z] In file included from /Users/jenkins/workspace/PullRequest-osx_x86-64/fvtest/tril/tril/default_compiler.hpp:30:
16:25:58 [2019-11-01T20:25:58.095Z] In file included from /Users/jenkins/workspace/PullRequest-osx_x86-64/fvtest/tril/tril/simple_compiler.hpp:25:
16:25:58 [2019-11-01T20:25:58.095Z] In file included from /Users/jenkins/workspace/PullRequest-osx_x86-64/fvtest/tril/tril/method_compiler.hpp:25:
16:25:58 [2019-11-01T20:25:58.095Z] In file included from /Users/jenkins/workspace/PullRequest-osx_x86-64/fvtest/tril/tril/method_info.hpp:27:
16:25:58 [2019-11-01T20:25:58.095Z] /Users/jenkins/workspace/PullRequest-osx_x86-64/fvtest/tril/tril/compiler_util.hpp:92:39: warning: comparison of unsigned expression >= 0 is always true [-Wtautological-compare]
16:25:58 [2019-11-01T20:25:58.096Z]          if (flagsValue->getInteger() >= 0 && flagsValue->getInteger() < 32)
16:25:58 [2019-11-01T20:25:58.096Z]              ~~~~~~~~~~~~~~~~~~~~~~~~ ^  ~
16:25:58 [2019-11-01T20:25:58.096Z] 1 warning generated.
16:25:58 [2019-11-01T20:25:58.096Z] [ 91%] Linking CXX executable incordec
16:25:58 [2019-11-01T20:25:58.096Z] [ 91%] Building CXX object fvtest/tril/test/CMakeFiles/triltest.dir/MethodInfoTest.cpp.o
16:25:58 [2019-11-01T20:25:58.096Z] [ 91%] Building CXX object jitbuilder/CMakeFiles/jitbuilder.dir/__/compiler/x/codegen/OMRCodeGenerator.cpp.o
16:25:58 [2019-11-01T20:25:58.096Z] [ 91%] Building CXX object jitbuilder/CMakeFiles/jitbuilder.dir/__/compiler/x/env/OMRCPU.cpp.o
16:25:58 [2019-11-01T20:25:58.096Z] [ 91%] Building CXX object jitbuilder/CMakeFiles/jitbuilder.dir/__/compiler/x/env/OMRDebugEnv.cpp.o
16:25:58 [2019-11-01T20:25:58.096Z] [ 91%] Building CXX object jitbuilder/CMakeFiles/jitbuilder.dir/__/compiler/x/amd64/codegen/OMRCodeGenerator.cpp.o
16:25:59 [2019-11-01T20:25:59.013Z] [ 91%] Building CXX object jitbuilder/CMakeFiles/jitbuilder.dir/__/compiler/x/amd64/codegen/OMRMachine.cpp.o
16:25:59 [2019-11-01T20:25:59.013Z] [ 91%] Built target incordec
16:25:59 [2019-11-01T20:25:59.013Z] [ 91%] Building CXX object fvtest/compilertest/CMakeFiles/compilertest.dir/tests/Qux2Test.cpp.o
16:25:59 [2019-11-01T20:25:59.013Z] [ 91%] Building CXX object jitbuilder/CMakeFiles/jitbuilder.dir/__/compiler/x/amd64/codegen/OMRTreeEvaluator.cpp.o
16:25:59 [2019-11-01T20:25:59.013Z] Scanning dependencies of target mandelbrot
16:25:59 [2019-11-01T20:25:59.013Z] [ 91%] Building CXX object fvtest/tril/examples/mandelbrot/CMakeFiles/mandelbrot.dir/main.cpp.o
16:25:59 [2019-11-01T20:25:59.906Z] [ 91%] Building CXX object jitbuilder/CMakeFiles/jitbuilder.dir/__/compiler/x/amd64/codegen/OMRMemoryReference.cpp.o
16:25:59 [2019-11-01T20:25:59.906Z] In file included from /Users/jenkins/workspace/PullRequest-osx_x86-64/fvtest/tril/test/MethodInfoTest.cpp:23:
16:25:59 [2019-11-01T20:25:59.906Z] In file included from /Users/jenkins/workspace/PullRequest-osx_x86-64/fvtest/tril/tril/method_info.hpp:27:
16:25:59 [2019-11-01T20:25:59.906Z] /Users/jenkins/workspace/PullRequest-osx_x86-64/fvtest/tril/tril/compiler_util.hpp:92:39: warning: comparison of unsigned expression >= 0 is always true [-Wtautological-compare]
16:25:59 [2019-11-01T20:25:59.906Z]          if (flagsValue->getInteger() >= 0 && flagsValue->getInteger() < 32)
16:25:59 [2019-11-01T20:25:59.906Z]              ~~~~~~~~~~~~~~~~~~~~~~~~ ^  ~
16:25:59 [2019-11-01T20:25:59.906Z] 1 warning generated.
16:25:59 [2019-11-01T20:25:59.906Z] [ 91%] Building CXX object jitbuilder/CMakeFiles/jitbuilder.dir/__/compiler/x/amd64/codegen/OMRRealRegister.cpp.o
16:25:59 [2019-11-01T20:25:59.906Z] [ 91%] Building CXX object fvtest/tril/test/CMakeFiles/triltest.dir/IlGenTest.cpp.o
16:25:59 [2019-11-01T20:25:59.906Z] [ 91%] Building CXX object jitbuilder/CMakeFiles/jitbuilder.dir/__/compiler/x/amd64/codegen/AMD64SystemLinkage.cpp.o
16:25:59 [2019-11-01T20:25:59.906Z] [ 91%] Building CXX object jitbuilder/CMakeFiles/jitbuilder.dir/__/compiler/x/amd64/codegen/OMRELFRelocationResolver.cpp.o
16:26:00 [2019-11-01T20:26:00.756Z] [ 92%] Linking CXX static library libjitbuilder.a
16:26:00 [2019-11-01T20:26:00.756Z] /Library/Developer/CommandLineTools/usr/bin/ranlib: file: libjitbuilder.a(Evaluator.cpp.o) has no symbols
16:26:00 [2019-11-01T20:26:00.756Z] /Library/Developer/CommandLineTools/usr/bin/ranlib: file: libjitbuilder.a(OMRMachine.cpp.o) has no symbols
16:26:00 [2019-11-01T20:26:00.756Z] /Library/Developer/CommandLineTools/usr/bin/ranlib: file: libjitbuilder.a(ELFGenerator.cpp.o) has no symbols
16:26:00 [2019-11-01T20:26:00.756Z] /Library/Developer/CommandLineTools/usr/bin/ranlib: file: libjitbuilder.a(OMRELFRelocationResolver.cpp.o) has no symbols
16:26:00 [2019-11-01T20:26:00.756Z] /Library/Developer/CommandLineTools/usr/bin/ranlib: file: libjitbuilder.a(OMRVMMethodEnv.cpp.o) has no symbols
16:26:00 [2019-11-01T20:26:00.756Z] /Library/Developer/CommandLineTools/usr/bin/ranlib: file: libjitbuilder.a(DominatorVerifier.cpp.o) has no symbols
16:26:00 [2019-11-01T20:26:00.756Z] /Library/Developer/CommandLineTools/usr/bin/ranlib: file: libjitbuilder.a(DominatorsChk.cpp.o) has no symbols
16:26:00 [2019-11-01T20:26:00.756Z] /Library/Developer/CommandLineTools/usr/bin/ranlib: file: libjitbuilder.a(OpNames.cpp.o) has no symbols
16:26:00 [2019-11-01T20:26:00.756Z] /Library/Developer/CommandLineTools/usr/bin/ranlib: file: libjitbuilder.a(OMRInstructionDelegate.cpp.o) has no symbols
16:26:00 [2019-11-01T20:26:00.756Z] /Library/Developer/CommandLineTools/usr/bin/ranlib: file: libjitbuilder.a(OMRELFRelocationResolver.cpp.o) has no symbols
16:26:00 [2019-11-01T20:26:00.756Z] In file included from /Users/jenkins/workspace/PullRequest-osx_x86-64/fvtest/tril/examples/mandelbrot/main.cpp:22:
16:26:00 [2019-11-01T20:26:00.756Z] In file included from /Users/jenkins/workspace/PullRequest-osx_x86-64/fvtest/tril/tril/default_compiler.hpp:30:
16:26:00 [2019-11-01T20:26:00.756Z] In file included from /Users/jenkins/workspace/PullRequest-osx_x86-64/fvtest/tril/tril/simple_compiler.hpp:25:
16:26:00 [2019-11-01T20:26:00.756Z] In file included from /Users/jenkins/workspace/PullRequest-osx_x86-64/fvtest/tril/tril/method_compiler.hpp:25:
16:26:00 [2019-11-01T20:26:00.756Z] In file included from /Users/jenkins/workspace/PullRequest-osx_x86-64/fvtest/tril/tril/method_info.hpp:27:
16:26:00 [2019-11-01T20:26:00.756Z] /Users/jenkins/workspace/PullRequest-osx_x86-64/fvtest/tril/tril/compiler_util.hpp:92:39: warning: comparison of unsigned expression >= 0 is always true [-Wtautological-compare]
16:26:00 [2019-11-01T20:26:00.756Z]          if (flagsValue->getInteger() >= 0 && flagsValue->getInteger() < 32)
16:26:00 [2019-11-01T20:26:00.756Z]              ~~~~~~~~~~~~~~~~~~~~~~~~ ^  ~
16:26:00 [2019-11-01T20:26:00.756Z] 1 warning generated.
16:26:00 [2019-11-01T20:26:00.756Z] [ 92%] Linking CXX executable mandelbrot
16:26:00 [2019-11-01T20:26:00.756Z] /Library/Developer/CommandLineTools/usr/bin/ranlib: file: libjitbuilder.a(Evaluator.cpp.o) has no symbols
16:26:00 [2019-11-01T20:26:00.756Z] /Library/Developer/CommandLineTools/usr/bin/ranlib: file: libjitbuilder.a(OMRMachine.cpp.o) has no symbols
16:26:00 [2019-11-01T20:26:00.756Z] /Library/Developer/CommandLineTools/usr/bin/ranlib: file: libjitbuilder.a(ELFGenerator.cpp.o) has no symbols
16:26:00 [2019-11-01T20:26:00.756Z] /Library/Developer/CommandLineTools/usr/bin/ranlib: file: libjitbuilder.a(OMRELFRelocationResolver.cpp.o) has no symbols
16:26:00 [2019-11-01T20:26:00.756Z] /Library/Developer/CommandLineTools/usr/bin/ranlib: file: libjitbuilder.a(OMRVMMethodEnv.cpp.o) has no symbols
16:26:00 [2019-11-01T20:26:00.756Z] /Library/Developer/CommandLineTools/usr/bin/ranlib: file: libjitbuilder.a(DominatorVerifier.cpp.o) has no symbols
16:26:00 [2019-11-01T20:26:00.756Z] /Library/Developer/CommandLineTools/usr/bin/ranlib: file: libjitbuilder.a(DominatorsChk.cpp.o) has no symbols
16:26:00 [2019-11-01T20:26:00.756Z] /Library/Developer/CommandLineTools/usr/bin/ranlib: file: libjitbuilder.a(OpNames.cpp.o) has no symbols
16:26:00 [2019-11-01T20:26:00.756Z] /Library/Developer/CommandLineTools/usr/bin/ranlib: file: libjitbuilder.a(OMRInstructionDelegate.cpp.o) has no symbols
16:26:00 [2019-11-01T20:26:00.756Z] /Library/Developer/CommandLineTools/usr/bin/ranlib: file: libjitbuilder.a(OMRELFRelocationResolver.cpp.o) has no symbols
16:26:00 [2019-11-01T20:26:00.756Z] [ 92%] Built target jitbuilder
16:26:00 [2019-11-01T20:26:00.756Z] [ 93%] Building CXX object fvtest/compilertest/CMakeFiles/compilertest.dir/tests/SimplifierFoldAndTest.cpp.o
16:26:01 [2019-11-01T20:26:01.635Z] Scanning dependencies of target comptest
16:26:01 [2019-11-01T20:26:01.635Z] [ 93%] Building CXX object fvtest/compilertriltest/CMakeFiles/comptest.dir/main.cpp.o
16:26:01 [2019-11-01T20:26:01.635Z] [ 93%] Built target mandelbrot
16:26:01 [2019-11-01T20:26:01.635Z] [ 93%] Building CXX object fvtest/tril/test/CMakeFiles/triltest.dir/CompileTest.cpp.o
16:26:02 [2019-11-01T20:26:02.518Z] [ 93%] Building CXX object fvtest/compilertest/CMakeFiles/compilertest.dir/tests/OptTestDriver.cpp.o
16:26:03 [2019-11-01T20:26:03.362Z] Scanning dependencies of target union
16:26:03 [2019-11-01T20:26:03.362Z] [ 93%] Building CXX object jitbuilder/release/CMakeFiles/union.dir/cpp/samples/Union.cpp.o
16:26:03 [2019-11-01T20:26:03.362Z] [ 93%] Linking CXX executable union
16:26:03 [2019-11-01T20:26:03.362Z] In file included from /Users/jenkins/workspace/PullRequest-osx_x86-64/fvtest/tril/test/CompileTest.cpp:23:
16:26:03 [2019-11-01T20:26:03.362Z] In file included from /Users/jenkins/workspace/PullRequest-osx_x86-64/fvtest/tril/tril/default_compiler.hpp:30:
16:26:03 [2019-11-01T20:26:03.362Z] In file included from /Users/jenkins/workspace/PullRequest-osx_x86-64/fvtest/tril/tril/simple_compiler.hpp:25:
16:26:03 [2019-11-01T20:26:03.362Z] In file included from /Users/jenkins/workspace/PullRequest-osx_x86-64/fvtest/tril/tril/method_compiler.hpp:25:
16:26:03 [2019-11-01T20:26:03.362Z] In file included from /Users/jenkins/workspace/PullRequest-osx_x86-64/fvtest/tril/tril/method_info.hpp:27:
16:26:03 [2019-11-01T20:26:03.362Z] /Users/jenkins/workspace/PullRequest-osx_x86-64/fvtest/tril/tril/compiler_util.hpp:92:39: warning: comparison of unsigned expression >= 0 is always true [-Wtautological-compare]
16:26:03 [2019-11-01T20:26:03.362Z]          if (flagsValue->getInteger() >= 0 && flagsValue->getInteger() < 32)
16:26:03 [2019-11-01T20:26:03.362Z]              ~~~~~~~~~~~~~~~~~~~~~~~~ ^  ~
16:26:03 [2019-11-01T20:26:03.362Z] 1 warning generated.
16:26:03 [2019-11-01T20:26:03.362Z] [ 93%] Building CXX object fvtest/tril/test/CMakeFiles/triltest.dir/__/__/__/util/main_function/main_function.cpp.o
16:26:04 [2019-11-01T20:26:04.348Z] [ 93%] Linking CXX executable triltest
16:26:04 [2019-11-01T20:26:04.348Z] [ 93%] Building CXX object fvtest/compilertriltest/CMakeFiles/comptest.dir/JitTestUtilitiesTest.cpp.o
16:26:04 [2019-11-01T20:26:04.348Z] [ 93%] Building CXX object fvtest/compilertest/CMakeFiles/compilertest.dir/tests/TestDriver.cpp.o
16:26:04 [2019-11-01T20:26:04.348Z] [ 93%] Building CXX object fvtest/compilertest/CMakeFiles/compilertest.dir/tests/SingleBitContainerTest.cpp.o
16:26:04 [2019-11-01T20:26:04.348Z] [ 93%] Building CXX object fvtest/compilertest/CMakeFiles/compilertest.dir/tests/injectors/BarIlInjector.cpp.o
16:26:04 [2019-11-01T20:26:04.348Z] [ 93%] Built target union
16:26:04 [2019-11-01T20:26:04.348Z] [ 93%] Building CXX object fvtest/compilertriltest/CMakeFiles/comptest.dir/ILValidatorTest.cpp.o
16:26:05 [2019-11-01T20:26:05.261Z] [ 93%] Building CXX object fvtest/compilertest/CMakeFiles/compilertest.dir/tests/injectors/BinaryOpIlInjector.cpp.o
16:26:05 [2019-11-01T20:26:05.261Z] [ 93%] Built target triltest
16:26:05 [2019-11-01T20:26:05.261Z] [ 93%] Building CXX object fvtest/compilertriltest/CMakeFiles/comptest.dir/ArithmeticTest.cpp.o
16:26:05 [2019-11-01T20:26:05.261Z] [ 93%] Building CXX object fvtest/compilertest/CMakeFiles/compilertest.dir/tests/injectors/CallIlInjector.cpp.o
16:26:07 [2019-11-01T20:26:07.113Z] Scanning dependencies of target toiltype
16:26:07 [2019-11-01T20:26:07.113Z] [ 93%] Building CXX object jitbuilder/release/CMakeFiles/toiltype.dir/cpp/samples/ToIlType.cpp.o
16:26:07 [2019-11-01T20:26:07.113Z] [ 93%] Linking CXX executable toiltype
16:26:07 [2019-11-01T20:26:07.113Z] [ 93%] Building CXX object fvtest/compilertest/CMakeFiles/compilertest.dir/tests/injectors/ChildlessUnaryOpIlInjector.cpp.o
16:26:08 [2019-11-01T20:26:08.051Z] [ 93%] Built target toiltype
16:26:08 [2019-11-01T20:26:08.051Z] [ 93%] Building CXX object fvtest/compilertriltest/CMakeFiles/comptest.dir/ShiftAndRotateTest.cpp.o
16:26:08 [2019-11-01T20:26:08.051Z] [ 93%] Building CXX object fvtest/compilertest/CMakeFiles/compilertest.dir/tests/injectors/CmpBranchOpIlInjector.cpp.o
16:26:08 [2019-11-01T20:26:08.051Z] In file included from /Users/jenkins/workspace/PullRequest-osx_x86-64/fvtest/compilertriltest/ILValidatorTest.cpp:23:
16:26:08 [2019-11-01T20:26:08.051Z] In file included from /Users/jenkins/workspace/PullRequest-osx_x86-64/fvtest/tril/tril/default_compiler.hpp:30:
16:26:08 [2019-11-01T20:26:08.051Z] In file included from /Users/jenkins/workspace/PullRequest-osx_x86-64/fvtest/tril/tril/simple_compiler.hpp:25:
16:26:08 [2019-11-01T20:26:08.051Z] In file included from /Users/jenkins/workspace/PullRequest-osx_x86-64/fvtest/tril/tril/method_compiler.hpp:25:
16:26:08 [2019-11-01T20:26:08.051Z] In file included from /Users/jenkins/workspace/PullRequest-osx_x86-64/fvtest/tril/tril/method_info.hpp:27:
16:26:08 [2019-11-01T20:26:08.051Z] /Users/jenkins/workspace/PullRequest-osx_x86-64/fvtest/tril/tril/compiler_util.hpp:92:39: warning: comparison of unsigned expression >= 0 is always true [-Wtautological-compare]
16:26:08 [2019-11-01T20:26:08.051Z]          if (flagsValue->getInteger() >= 0 && flagsValue->getInteger() < 32)
16:26:08 [2019-11-01T20:26:08.051Z]              ~~~~~~~~~~~~~~~~~~~~~~~~ ^  ~
16:26:08 [2019-11-01T20:26:08.051Z] 1 warning generated.
16:26:08 [2019-11-01T20:26:08.051Z] Scanning dependencies of target tableswitch
16:26:08 [2019-11-01T20:26:08.051Z] [ 93%] Building CXX object jitbuilder/release/CMakeFiles/tableswitch.dir/cpp/samples/TableSwitch.cpp.o
16:26:08 [2019-11-01T20:26:08.051Z] [ 93%] Linking CXX executable tableswitch
16:26:08 [2019-11-01T20:26:08.051Z] [ 93%] Building CXX object fvtest/compilertest/CMakeFiles/compilertest.dir/tests/injectors/FooIlInjector.cpp.o
16:26:08 [2019-11-01T20:26:08.978Z] [ 93%] Building CXX object fvtest/compilertest/CMakeFiles/compilertest.dir/tests/injectors/IndirectLoadIlInjector.cpp.o
16:26:08 [2019-11-01T20:26:08.978Z] [ 93%] Built target tableswitch
16:26:08 [2019-11-01T20:26:08.978Z] [ 93%] Building CXX object fvtest/compilertriltest/CMakeFiles/comptest.dir/SimplifierFoldAbsNegTest.cpp.o
16:26:10 [2019-11-01T20:26:10.775Z] [ 93%] Building CXX object fvtest/compilertest/CMakeFiles/compilertest.dir/tests/injectors/IndirectStoreIlInjector.cpp.o
16:26:12 [2019-11-01T20:26:12.465Z] In file included from /Users/jenkins/workspace/PullRequest-osx_x86-64/fvtest/compilertriltest/SimplifierFoldAbsNegTest.cpp:24:
16:26:12 [2019-11-01T20:26:12.465Z] In file included from /Users/jenkins/workspace/PullRequest-osx_x86-64/fvtest/tril/tril/default_compiler.hpp:30:
16:26:12 [2019-11-01T20:26:12.465Z] In file included from /Users/jenkins/workspace/PullRequest-osx_x86-64/fvtest/tril/tril/simple_compiler.hpp:25:
16:26:12 [2019-11-01T20:26:12.465Z] In file included from /Users/jenkins/workspace/PullRequest-osx_x86-64/fvtest/tril/tril/method_compiler.hpp:25:
16:26:12 [2019-11-01T20:26:12.465Z] In file included from /Users/jenkins/workspace/PullRequest-osx_x86-64/fvtest/tril/tril/method_info.hpp:27:
16:26:12 [2019-11-01T20:26:12.465Z] /Users/jenkins/workspace/PullRequest-osx_x86-64/fvtest/tril/tril/compiler_util.hpp:92:39: warning: comparison of unsigned expression >= 0 is always true [-Wtautological-compare]
16:26:12 [2019-11-01T20:26:12.465Z]          if (flagsValue->getInteger() >= 0 && flagsValue->getInteger() < 32)
16:26:12 [2019-11-01T20:26:12.465Z]              ~~~~~~~~~~~~~~~~~~~~~~~~ ^  ~
16:26:12 [2019-11-01T20:26:12.465Z] 1 warning generated.
16:26:12 [2019-11-01T20:26:12.465Z] Scanning dependencies of target switch
16:26:12 [2019-11-01T20:26:12.465Z] [ 93%] Building CXX object jitbuilder/release/CMakeFiles/switch.dir/cpp/samples/Switch.cpp.o
16:26:12 [2019-11-01T20:26:12.465Z] [ 93%] Linking CXX executable switch
16:26:13 [2019-11-01T20:26:13.349Z] In file included from /Users/jenkins/workspace/PullRequest-osx_x86-64/fvtest/compilertriltest/ArithmeticTest.cpp:23:
16:26:13 [2019-11-01T20:26:13.349Z] In file included from /Users/jenkins/workspace/PullRequest-osx_x86-64/fvtest/tril/tril/default_compiler.hpp:30:
16:26:13 [2019-11-01T20:26:13.349Z] In file included from /Users/jenkins/workspace/PullRequest-osx_x86-64/fvtest/tril/tril/simple_compiler.hpp:25:
16:26:13 [2019-11-01T20:26:13.349Z] In file included from /Users/jenkins/workspace/PullRequest-osx_x86-64/fvtest/tril/tril/method_compiler.hpp:25:
16:26:13 [2019-11-01T20:26:13.349Z] In file included from /Users/jenkins/workspace/PullRequest-osx_x86-64/fvtest/tril/tril/method_info.hpp:27:
16:26:13 [2019-11-01T20:26:13.349Z] /Users/jenkins/workspace/PullRequest-osx_x86-64/fvtest/tril/tril/compiler_util.hpp:92:39: warning: comparison of unsigned expression >= 0 is always true [-Wtautological-compare]
16:26:13 [2019-11-01T20:26:13.349Z]          if (flagsValue->getInteger() >= 0 && flagsValue->getInteger() < 32)
16:26:13 [2019-11-01T20:26:13.349Z]              ~~~~~~~~~~~~~~~~~~~~~~~~ ^  ~
16:26:13 [2019-11-01T20:26:13.349Z] 1 warning generated.
16:26:13 [2019-11-01T20:26:13.349Z] [ 93%] Building CXX object fvtest/compilertest/CMakeFiles/compilertest.dir/tests/injectors/OpIlInjector.cpp.o
16:26:13 [2019-11-01T20:26:13.349Z] [ 93%] Built target switch
16:26:13 [2019-11-01T20:26:13.349Z] Scanning dependencies of target structArray
16:26:13 [2019-11-01T20:26:13.349Z] [ 93%] Building CXX object fvtest/compilertriltest/CMakeFiles/comptest.dir/SimplifierFoldAndTest.cpp.o
16:26:13 [2019-11-01T20:26:13.349Z] [ 93%] Building CXX object jitbuilder/release/CMakeFiles/structArray.dir/cpp/samples/StructArray.cpp.o
16:26:13 [2019-11-01T20:26:13.349Z] [ 94%] Linking CXX executable structArray
16:26:13 [2019-11-01T20:26:13.349Z] [ 95%] Building CXX object fvtest/compilertest/CMakeFiles/compilertest.dir/tests/injectors/Qux2IlInjector.cpp.o
16:26:14 [2019-11-01T20:26:14.300Z] [ 95%] Building CXX object fvtest/compilertest/CMakeFiles/compilertest.dir/tests/injectors/StoreOpIlInjector.cpp.o
16:26:14 [2019-11-01T20:26:14.300Z] [ 95%] Built target structArray
16:26:14 [2019-11-01T20:26:14.300Z] [ 96%] Building CXX object fvtest/compilertriltest/CMakeFiles/comptest.dir/IfxcmpgeReductionTest.cpp.o
16:26:14 [2019-11-01T20:26:14.300Z] [ 96%] Building CXX object fvtest/compilertest/CMakeFiles/compilertest.dir/tests/injectors/TernaryOpIlInjector.cpp.o
16:26:14 [2019-11-01T20:26:14.300Z] [ 96%] Building CXX object fvtest/compilertest/CMakeFiles/compilertest.dir/tests/injectors/UnaryOpIlInjector.cpp.o
16:26:15 [2019-11-01T20:26:15.230Z] [ 96%] Building CXX object fvtest/compilertest/CMakeFiles/compilertest.dir/tests/X86OpCodesTest.cpp.o
16:26:16 [2019-11-01T20:26:16.081Z] In file included from /Users/jenkins/workspace/PullRequest-osx_x86-64/fvtest/compilertriltest/SimplifierFoldAndTest.cpp:23:
16:26:16 [2019-11-01T20:26:16.081Z] In file included from /Users/jenkins/workspace/PullRequest-osx_x86-64/fvtest/tril/tril/default_compiler.hpp:30:
16:26:16 [2019-11-01T20:26:16.081Z] In file included from /Users/jenkins/workspace/PullRequest-osx_x86-64/fvtest/tril/tril/simple_compiler.hpp:25:
16:26:16 [2019-11-01T20:26:16.081Z] In file included from /Users/jenkins/workspace/PullRequest-osx_x86-64/fvtest/tril/tril/method_compiler.hpp:25:
16:26:16 [2019-11-01T20:26:16.081Z] In file included from /Users/jenkins/workspace/PullRequest-osx_x86-64/fvtest/tril/tril/method_info.hpp:27:
16:26:16 [2019-11-01T20:26:16.081Z] /Users/jenkins/workspace/PullRequest-osx_x86-64/fvtest/tril/tril/compiler_util.hpp:92:39: warning: comparison of unsigned expression >= 0 is always true [-Wtautological-compare]
16:26:16 [2019-11-01T20:26:16.081Z]          if (flagsValue->getInteger() >= 0 && flagsValue->getInteger() < 32)
16:26:16 [2019-11-01T20:26:16.081Z]              ~~~~~~~~~~~~~~~~~~~~~~~~ ^  ~
16:26:16 [2019-11-01T20:26:16.081Z] 1 warning generated.
16:26:16 [2019-11-01T20:26:16.081Z] Scanning dependencies of target pointer
16:26:16 [2019-11-01T20:26:16.081Z] [ 96%] Building CXX object jitbuilder/release/CMakeFiles/pointer.dir/cpp/samples/Pointer.cpp.o
16:26:16 [2019-11-01T20:26:16.081Z] [ 96%] Linking CXX executable pointer
16:26:16 [2019-11-01T20:26:16.936Z] [ 96%] Built target pointer
16:26:16 [2019-11-01T20:26:16.936Z] [ 96%] Building CXX object fvtest/compilertriltest/CMakeFiles/comptest.dir/VectorTest.cpp.o
16:26:19 [2019-11-01T20:26:19.670Z] In file included from /Users/jenkins/workspace/PullRequest-osx_x86-64/fvtest/compilertriltest/VectorTest.cpp:23:
16:26:19 [2019-11-01T20:26:19.670Z] In file included from /Users/jenkins/workspace/PullRequest-osx_x86-64/fvtest/tril/tril/default_compiler.hpp:30:
16:26:19 [2019-11-01T20:26:19.670Z] In file included from /Users/jenkins/workspace/PullRequest-osx_x86-64/fvtest/tril/tril/simple_compiler.hpp:25:
16:26:19 [2019-11-01T20:26:19.670Z] In file included from /Users/jenkins/workspace/PullRequest-osx_x86-64/fvtest/tril/tril/method_compiler.hpp:25:
16:26:19 [2019-11-01T20:26:19.670Z] In file included from /Users/jenkins/workspace/PullRequest-osx_x86-64/fvtest/tril/tril/method_info.hpp:27:
16:26:19 [2019-11-01T20:26:19.670Z] /Users/jenkins/workspace/PullRequest-osx_x86-64/fvtest/tril/tril/compiler_util.hpp:92:39: warning: comparison of unsigned expression >= 0 is always true [-Wtautological-compare]
16:26:19 [2019-11-01T20:26:19.670Z]          if (flagsValue->getInteger() >= 0 && flagsValue->getInteger() < 32)
16:26:19 [2019-11-01T20:26:19.670Z]              ~~~~~~~~~~~~~~~~~~~~~~~~ ^  ~
16:26:19 [2019-11-01T20:26:19.670Z] 1 warning generated.
16:26:19 [2019-11-01T20:26:19.670Z] Scanning dependencies of target operandarraytests
16:26:19 [2019-11-01T20:26:19.670Z] [ 96%] Building CXX object jitbuilder/release/CMakeFiles/operandarraytests.dir/cpp/samples/OperandArrayTests.cpp.o
16:26:19 [2019-11-01T20:26:19.670Z] In file included from /Users/jenkins/workspace/PullRequest-osx_x86-64/fvtest/compilertriltest/ShiftAndRotateTest.cpp:23:
16:26:19 [2019-11-01T20:26:19.670Z] In file included from /Users/jenkins/workspace/PullRequest-osx_x86-64/fvtest/tril/tril/default_compiler.hpp:30:
16:26:19 [2019-11-01T20:26:19.670Z] In file included from /Users/jenkins/workspace/PullRequest-osx_x86-64/fvtest/tril/tril/simple_compiler.hpp:25:
16:26:19 [2019-11-01T20:26:19.670Z] In file included from /Users/jenkins/workspace/PullRequest-osx_x86-64/fvtest/tril/tril/method_compiler.hpp:25:
16:26:19 [2019-11-01T20:26:19.670Z] In file included from /Users/jenkins/workspace/PullRequest-osx_x86-64/fvtest/tril/tril/method_info.hpp:27:
16:26:19 [2019-11-01T20:26:19.670Z] /Users/jenkins/workspace/PullRequest-osx_x86-64/fvtest/tril/tril/compiler_util.hpp:92:39: warning: comparison of unsigned expression >= 0 is always true [-Wtautological-compare]
16:26:19 [2019-11-01T20:26:19.670Z]          if (flagsValue->getInteger() >= 0 && flagsValue->getInteger() < 32)
16:26:19 [2019-11-01T20:26:19.670Z]              ~~~~~~~~~~~~~~~~~~~~~~~~ ^  ~
16:26:19 [2019-11-01T20:26:19.670Z] 1 warning generated.
16:26:19 [2019-11-01T20:26:19.670Z] [ 96%] Linking CXX executable operandarraytests
16:26:19 [2019-11-01T20:26:19.670Z] In file included from /Users/jenkins/workspace/PullRequest-osx_x86-64/fvtest/compilertriltest/IfxcmpgeReductionTest.cpp:24:
16:26:19 [2019-11-01T20:26:19.670Z] In file included from /Users/jenkins/workspace/PullRequest-osx_x86-64/fvtest/tril/tril/default_compiler.hpp:30:
16:26:19 [2019-11-01T20:26:19.670Z] In file included from /Users/jenkins/workspace/PullRequest-osx_x86-64/fvtest/tril/tril/simple_compiler.hpp:25:
16:26:19 [2019-11-01T20:26:19.670Z] In file included from /Users/jenkins/workspace/PullRequest-osx_x86-64/fvtest/tril/tril/method_compiler.hpp:25:
16:26:19 [2019-11-01T20:26:19.670Z] In file included from /Users/jenkins/workspace/PullRequest-osx_x86-64/fvtest/tril/tril/method_info.hpp:27:
16:26:19 [2019-11-01T20:26:19.670Z] /Users/jenkins/workspace/PullRequest-osx_x86-64/fvtest/tril/tril/compiler_util.hpp:92:39: warning: comparison of unsigned expression >= 0 is always true [-Wtautological-compare]
16:26:19 [2019-11-01T20:26:19.670Z]          if (flagsValue->getInteger() >= 0 && flagsValue->getInteger() < 32)
16:26:19 [2019-11-01T20:26:19.670Z]              ~~~~~~~~~~~~~~~~~~~~~~~~ ^  ~
16:26:19 [2019-11-01T20:26:19.670Z] 1 warning generated.
16:26:19 [2019-11-01T20:26:19.670Z] Scanning dependencies of target localarray
16:26:19 [2019-11-01T20:26:19.670Z] [ 96%] Building CXX object fvtest/compilertriltest/CMakeFiles/comptest.dir/CallTest.cpp.o
16:26:19 [2019-11-01T20:26:19.670Z] [ 96%] Building CXX object jitbuilder/release/CMakeFiles/localarray.dir/cpp/samples/LocalArray.cpp.o
16:26:19 [2019-11-01T20:26:19.670Z] [ 96%] Linking CXX executable localarray
16:26:19 [2019-11-01T20:26:19.670Z] [ 96%] Linking CXX executable compilertest
16:26:20 [2019-11-01T20:26:20.555Z] [ 96%] Built target operandarraytests
16:26:20 [2019-11-01T20:26:20.555Z] [ 96%] Building CXX object fvtest/compilertriltest/CMakeFiles/comptest.dir/LongAndAsRotateTest.cpp.o
16:26:20 [2019-11-01T20:26:20.555Z] [ 96%] Built target localarray
16:26:20 [2019-11-01T20:26:20.555Z] [ 96%] Building CXX object fvtest/compilertriltest/CMakeFiles/comptest.dir/MockStrategyTest.cpp.o
16:26:21 [2019-11-01T20:26:21.524Z] [ 96%] Built target compilertest
16:26:21 [2019-11-01T20:26:21.524Z] [ 96%] Building CXX object fvtest/compilertriltest/CMakeFiles/comptest.dir/LogicalTest.cpp.o
16:26:22 [2019-11-01T20:26:22.438Z] In file included from /Users/jenkins/workspace/PullRequest-osx_x86-64/fvtest/compilertriltest/CallTest.cpp:23:
16:26:22 [2019-11-01T20:26:22.438Z] In file included from /Users/jenkins/workspace/PullRequest-osx_x86-64/fvtest/tril/tril/default_compiler.hpp:30:
16:26:22 [2019-11-01T20:26:22.438Z] In file included from /Users/jenkins/workspace/PullRequest-osx_x86-64/fvtest/tril/tril/simple_compiler.hpp:25:
16:26:22 [2019-11-01T20:26:22.438Z] In file included from /Users/jenkins/workspace/PullRequest-osx_x86-64/fvtest/tril/tril/method_compiler.hpp:25:
16:26:22 [2019-11-01T20:26:22.438Z] In file included from /Users/jenkins/workspace/PullRequest-osx_x86-64/fvtest/tril/tril/method_info.hpp:27:
16:26:22 [2019-11-01T20:26:22.438Z] /Users/jenkins/workspace/PullRequest-osx_x86-64/fvtest/tril/tril/compiler_util.hpp:92:39: warning: comparison of unsigned expression >= 0 is always true [-Wtautological-compare]
16:26:22 [2019-11-01T20:26:22.438Z]          if (flagsValue->getInteger() >= 0 && flagsValue->getInteger() < 32)
16:26:22 [2019-11-01T20:26:22.438Z]              ~~~~~~~~~~~~~~~~~~~~~~~~ ^  ~
16:26:22 [2019-11-01T20:26:22.438Z] 1 warning generated.
16:26:22 [2019-11-01T20:26:22.438Z] Scanning dependencies of target vmregister
16:26:22 [2019-11-01T20:26:22.438Z] [ 96%] Building CXX object jitbuilder/release/CMakeFiles/vmregister.dir/cpp/samples/VMRegister.cpp.o
16:26:22 [2019-11-01T20:26:22.438Z] [ 96%] Linking CXX executable vmregister
16:26:23 [2019-11-01T20:26:23.295Z] [ 96%] Built target vmregister
16:26:23 [2019-11-01T20:26:23.295Z] [ 96%] Building CXX object fvtest/compilertriltest/CMakeFiles/comptest.dir/LinkageTest.cpp.o
16:26:23 [2019-11-01T20:26:23.295Z] In file included from /Users/jenkins/workspace/PullRequest-osx_x86-64/fvtest/compilertriltest/MockStrategyTest.cpp:23:
16:26:23 [2019-11-01T20:26:23.295Z] In file included from /Users/jenkins/workspace/PullRequest-osx_x86-64/fvtest/tril/tril/default_compiler.hpp:30:
16:26:23 [2019-11-01T20:26:23.295Z] In file included from /Users/jenkins/workspace/PullRequest-osx_x86-64/fvtest/tril/tril/simple_compiler.hpp:25:
16:26:23 [2019-11-01T20:26:23.295Z] In file included from /Users/jenkins/workspace/PullRequest-osx_x86-64/fvtest/tril/tril/method_compiler.hpp:25:
16:26:23 [2019-11-01T20:26:23.295Z] In file included from /Users/jenkins/workspace/PullRequest-osx_x86-64/fvtest/tril/tril/method_info.hpp:27:
16:26:23 [2019-11-01T20:26:23.295Z] /Users/jenkins/workspace/PullRequest-osx_x86-64/fvtest/tril/tril/compiler_util.hpp:92:39: warning: comparison of unsigned expression >= 0 is always true [-Wtautological-compare]
16:26:23 [2019-11-01T20:26:23.295Z]          if (flagsValue->getInteger() >= 0 && flagsValue->getInteger() < 32)
16:26:23 [2019-11-01T20:26:23.295Z]              ~~~~~~~~~~~~~~~~~~~~~~~~ ^  ~
16:26:23 [2019-11-01T20:26:23.295Z] 1 warning generated.
16:26:23 [2019-11-01T20:26:23.295Z] Scanning dependencies of target nestedloop
16:26:23 [2019-11-01T20:26:23.295Z] [ 96%] Building CXX object jitbuilder/release/CMakeFiles/nestedloop.dir/cpp/samples/NestedLoop.cpp.o
16:26:23 [2019-11-01T20:26:23.295Z] [ 96%] Linking CXX executable nestedloop
16:26:24 [2019-11-01T20:26:24.157Z] In file included from /Users/jenkins/workspace/PullRequest-osx_x86-64/fvtest/compilertriltest/LongAndAsRotateTest.cpp:23:
16:26:24 [2019-11-01T20:26:24.157Z] In file included from /Users/jenkins/workspace/PullRequest-osx_x86-64/fvtest/tril/tril/default_compiler.hpp:30:
16:26:24 [2019-11-01T20:26:24.157Z] In file included from /Users/jenkins/workspace/PullRequest-osx_x86-64/fvtest/tril/tril/simple_compiler.hpp:25:
16:26:24 [2019-11-01T20:26:24.157Z] In file included from /Users/jenkins/workspace/PullRequest-osx_x86-64/fvtest/tril/tril/method_compiler.hpp:25:
16:26:24 [2019-11-01T20:26:24.157Z] In file included from /Users/jenkins/workspace/PullRequest-osx_x86-64/fvtest/tril/tril/method_info.hpp:27:
16:26:24 [2019-11-01T20:26:24.157Z] /Users/jenkins/workspace/PullRequest-osx_x86-64/fvtest/tril/tril/compiler_util.hpp:92:39: warning: comparison of unsigned expression >= 0 is always true [-Wtautological-compare]
16:26:24 [2019-11-01T20:26:24.157Z]          if (flagsValue->getInteger() >= 0 && flagsValue->getInteger() < 32)
16:26:24 [2019-11-01T20:26:24.157Z]              ~~~~~~~~~~~~~~~~~~~~~~~~ ^  ~
16:26:24 [2019-11-01T20:26:24.157Z] 1 warning generated.
16:26:24 [2019-11-01T20:26:24.157Z] Scanning dependencies of target linkedlist
16:26:24 [2019-11-01T20:26:24.157Z] [ 96%] Building CXX object jitbuilder/release/CMakeFiles/linkedlist.dir/cpp/samples/LinkedList.cpp.o
16:26:24 [2019-11-01T20:26:24.157Z] [ 96%] Linking CXX executable linkedlist
16:26:24 [2019-11-01T20:26:24.157Z] [ 96%] Built target nestedloop
16:26:24 [2019-11-01T20:26:24.157Z] [ 96%] Building CXX object fvtest/compilertriltest/CMakeFiles/comptest.dir/BitPermuteTest.cpp.o
16:26:25 [2019-11-01T20:26:25.094Z] [ 96%] Built target linkedlist
16:26:25 [2019-11-01T20:26:25.094Z] [ 96%] Building CXX object fvtest/compilertriltest/CMakeFiles/comptest.dir/MaxMinTest.cpp.o
16:26:25 [2019-11-01T20:26:25.974Z] In file included from /Users/jenkins/workspace/PullRequest-osx_x86-64/fvtest/compilertriltest/LogicalTest.cpp:24:
16:26:25 [2019-11-01T20:26:25.974Z] In file included from /Users/jenkins/workspace/PullRequest-osx_x86-64/fvtest/tril/tril/default_compiler.hpp:30:
16:26:25 [2019-11-01T20:26:25.974Z] In file included from /Users/jenkins/workspace/PullRequest-osx_x86-64/fvtest/tril/tril/simple_compiler.hpp:25:
16:26:25 [2019-11-01T20:26:25.974Z] In file included from /Users/jenkins/workspace/PullRequest-osx_x86-64/fvtest/tril/tril/method_compiler.hpp:25:
16:26:25 [2019-11-01T20:26:25.974Z] In file included from /Users/jenkins/workspace/PullRequest-osx_x86-64/fvtest/tril/tril/method_info.hpp:27:
16:26:25 [2019-11-01T20:26:25.974Z] /Users/jenkins/workspace/PullRequest-osx_x86-64/fvtest/tril/tril/compiler_util.hpp:92:39: warning: comparison of unsigned expression >= 0 is always true [-Wtautological-compare]
16:26:25 [2019-11-01T20:26:25.974Z]          if (flagsValue->getInteger() >= 0 && flagsValue->getInteger() < 32)
16:26:25 [2019-11-01T20:26:25.974Z]              ~~~~~~~~~~~~~~~~~~~~~~~~ ^  ~
16:26:25 [2019-11-01T20:26:25.974Z] 1 warning generated.
16:26:25 [2019-11-01T20:26:25.974Z] Scanning dependencies of target fieldaddress
16:26:25 [2019-11-01T20:26:25.974Z] [ 96%] Building CXX object jitbuilder/release/CMakeFiles/fieldaddress.dir/cpp/samples/FieldAddress.cpp.o
16:26:25 [2019-11-01T20:26:25.974Z] [ 96%] Linking CXX executable fieldaddress
16:26:25 [2019-11-01T20:26:25.974Z] In file included from /Users/jenkins/workspace/PullRequest-osx_x86-64/fvtest/compilertriltest/LinkageTest.cpp:23:
16:26:25 [2019-11-01T20:26:25.974Z] In file included from /Users/jenkins/workspace/PullRequest-osx_x86-64/fvtest/tril/tril/default_compiler.hpp:30:
16:26:25 [2019-11-01T20:26:25.974Z] In file included from /Users/jenkins/workspace/PullRequest-osx_x86-64/fvtest/tril/tril/simple_compiler.hpp:25:
16:26:25 [2019-11-01T20:26:25.974Z] In file included from /Users/jenkins/workspace/PullRequest-osx_x86-64/fvtest/tril/tril/method_compiler.hpp:25:
16:26:25 [2019-11-01T20:26:25.974Z] In file included from /Users/jenkins/workspace/PullRequest-osx_x86-64/fvtest/tril/tril/method_info.hpp:27:
16:26:25 [2019-11-01T20:26:25.974Z] /Users/jenkins/workspace/PullRequest-osx_x86-64/fvtest/tril/tril/compiler_util.hpp:92:39: warning: comparison of unsigned expression >= 0 is always true [-Wtautological-compare]
16:26:25 [2019-11-01T20:26:25.974Z]          if (flagsValue->getInteger() >= 0 && flagsValue->getInteger() < 32)
16:26:25 [2019-11-01T20:26:25.974Z]              ~~~~~~~~~~~~~~~~~~~~~~~~ ^  ~
16:26:25 [2019-11-01T20:26:25.974Z] /Users/jenkins/workspace/PullRequest-osx_x86-64/fvtest/compilertriltest/LinkageTest.cpp:215:51: warning: format specifies type 'uintmax_t' (aka 'unsigned long') but the argument has type 'double (*)(double, double, double, double)' [-Wformat]
16:26:25 [2019-11-01T20:26:25.974Z]                                                   callee_entry_point,              // address
16:26:25 [2019-11-01T20:26:25.974Z]                                                   ^~~~~~~~~~~~~~~~~~
16:26:25 [2019-11-01T20:26:25.974Z] /Users/jenkins/workspace/PullRequest-osx_x86-64/third_party/gtest-1.8.0/include/gtest/internal/gtest-internal.h:484:43: note: in instantiation of member function 'LinkageTest_SystemLinkageJitedToJitedParameterPassingFourArg_Test<double>::TestBody' requested here
16:26:25 [2019-11-01T20:26:25.974Z]   virtual Test* CreateTest() { return new TestClass; }
16:26:25 [2019-11-01T20:26:25.974Z]                                           ^
16:26:25 [2019-11-01T20:26:25.974Z] /Users/jenkins/workspace/PullRequest-osx_x86-64/third_party/gtest-1.8.0/include/gtest/internal/gtest-internal.h:649:13: note: in instantiation of member function 'testing::internal::TestFactoryImpl<LinkageTest_SystemLinkageJitedToJitedParameterPassingFourArg_Test<double> >::CreateTest' requested here
16:26:25 [2019-11-01T20:26:25.974Z]         new TestFactoryImpl<TestClass>);
16:26:25 [2019-11-01T20:26:25.974Z]             ^
16:26:25 [2019-11-01T20:26:25.974Z] /Users/jenkins/workspace/PullRequest-osx_x86-64/third_party/gtest-1.8.0/include/gtest/internal/gtest-internal.h:653:11: note: in instantiation of member function 'testing::internal::TypeParameterizedTest<LinkageTest, testing::internal::TemplateSel<LinkageTest_SystemLinkageJitedToJitedParameterPassingFourArg_Test>, testing::internal::Types1<double> >::Register' requested here
16:26:25 [2019-11-01T20:26:25.974Z]         ::Register(prefix, code_location, case_name, test_names, index + 1);
16:26:25 [2019-11-01T20:26:25.974Z]           ^
16:26:25 [2019-11-01T20:26:25.974Z] /Users/jenkins/workspace/PullRequest-osx_x86-64/third_party/gtest-1.8.0/include/gtest/internal/gtest-internal.h:653:11: note: in instantiation of member function 'testing::internal::TypeParameterizedTest<LinkageTest, testing::internal::TemplateSel<LinkageTest_SystemLinkageJitedToJitedParameterPassingFourArg_Test>, testing::internal::Types2<float, double> >::Register' requested here
16:26:25 [2019-11-01T20:26:25.974Z] /Users/jenkins/workspace/PullRequest-osx_x86-64/third_party/gtest-1.8.0/include/gtest/internal/gtest-internal.h:653:11: note: in instantiation of member function 'testing::internal::TypeParameterizedTest<LinkageTest, testing::internal::TemplateSel<LinkageTest_SystemLinkageJitedToJitedParameterPassingFourArg_Test>, testing::internal::Types3<long long, float, double> >::Register' requested here
16:26:25 [2019-11-01T20:26:25.974Z] /Users/jenkins/workspace/PullRequest-osx_x86-64/fvtest/compilertriltest/LinkageTest.cpp:187:1: note: in instantiation of member function 'testing::internal::TypeParameterizedTest<LinkageTest, testing::internal::TemplateSel<LinkageTest_SystemLinkageJitedToJitedParameterPassingFourArg_Test>, testing::internal::Types4<int, long long, float, double> >::Register' requested here
16:26:25 [2019-11-01T20:26:25.974Z] TYPED_TEST(LinkageTest, SystemLinkageJitedToJitedParameterPassingFourArg) {
16:26:25 [2019-11-01T20:26:25.974Z] ^
16:26:25 [2019-11-01T20:26:25.974Z] /Users/jenkins/workspace/PullRequest-osx_x86-64/third_party/gtest-1.8.0/include/gtest/gtest-typed-test.h:183:42: note: expanded from macro 'TYPED_TEST'
16:26:25 [2019-11-01T20:26:25.974Z]           GTEST_TYPE_PARAMS_(CaseName)>::Register(\
16:26:25 [2019-11-01T20:26:25.974Z]                                          ^
16:26:25 [2019-11-01T20:26:25.974Z] /Users/jenkins/workspace/PullRequest-osx_x86-64/fvtest/compilertriltest/LinkageTest.cpp:202:105: note: format string is defined here
16:26:25 [2019-11-01T20:26:25.974Z]     const auto format_string = "(method return=%s args=[%s,%s,%s,%s] (block (%sreturn (%scall address=0x%jX args=[%s,%s,%s,%s] linkage=system"
16:26:25 [2019-11-01T20:26:25.974Z]                                                                                                         ^~~
16:26:25 [2019-11-01T20:26:25.974Z] /Users/jenkins/workspace/PullRequest-osx_x86-64/fvtest/compilertriltest/LinkageTest.cpp:215:51: warning: format specifies type 'uintmax_t' (aka 'unsigned long') but the argument has type 'float (*)(float, float, float, float)' [-Wformat]
16:26:25 [2019-11-01T20:26:25.974Z]                                                   callee_entry_point,              // address
16:26:25 [2019-11-01T20:26:25.974Z]                                                   ^~~~~~~~~~~~~~~~~~
16:26:25 [2019-11-01T20:26:25.974Z] /Users/jenkins/workspace/PullRequest-osx_x86-64/third_party/gtest-1.8.0/include/gtest/internal/gtest-internal.h:484:43: note: in instantiation of member function 'LinkageTest_SystemLinkageJitedToJitedParameterPassingFourArg_Test<float>::TestBody' requested here
16:26:25 [2019-11-01T20:26:25.974Z]   virtual Test* CreateTest() { return new TestClass; }
16:26:25 [2019-11-01T20:26:25.974Z]                                           ^
16:26:25 [2019-11-01T20:26:25.974Z] /Users/jenkins/workspace/PullRequest-osx_x86-64/third_party/gtest-1.8.0/include/gtest/internal/gtest-internal.h:649:13: note: in instantiation of member function 'testing::internal::TestFactoryImpl<LinkageTest_SystemLinkageJitedToJitedParameterPassingFourArg_Test<float> >::CreateTest' requested here
16:26:25 [2019-11-01T20:26:25.974Z]         new TestFactoryImpl<TestClass>);
16:26:25 [2019-11-01T20:26:25.974Z]             ^
16:26:25 [2019-11-01T20:26:25.974Z] /Users/jenkins/workspace/PullRequest-osx_x86-64/third_party/gtest-1.8.0/include/gtest/internal/gtest-internal.h:653:11: note: in instantiation of member function 'testing::internal::TypeParameterizedTest<LinkageTest, testing::internal::TemplateSel<LinkageTest_SystemLinkageJitedToJitedParameterPassingFourArg_Test>, testing::internal::Types2<float, double> >::Register' requested here
16:26:25 [2019-11-01T20:26:25.974Z]         ::Register(prefix, code_location, case_name, test_names, index + 1);
16:26:25 [2019-11-01T20:26:25.974Z]           ^
16:26:25 [2019-11-01T20:26:25.974Z] /Users/jenkins/workspace/PullRequest-osx_x86-64/third_party/gtest-1.8.0/include/gtest/internal/gtest-internal.h:653:11: note: in instantiation of member function 'testing::internal::TypeParameterizedTest<LinkageTest, testing::internal::TemplateSel<LinkageTest_SystemLinkageJitedToJitedParameterPassingFourArg_Test>, testing::internal::Types3<long long, float, double> >::Register' requested here
16:26:25 [2019-11-01T20:26:25.974Z] /Users/jenkins/workspace/PullRequest-osx_x86-64/fvtest/compilertriltest/LinkageTest.cpp:187:1: note: in instantiation of member function 'testing::internal::TypeParameterizedTest<LinkageTest, testing::internal::TemplateSel<LinkageTest_SystemLinkageJitedToJitedParameterPassingFourArg_Test>, testing::internal::Types4<int, long long, float, double> >::Register' requested here
16:26:25 [2019-11-01T20:26:25.974Z] TYPED_TEST(LinkageTest, SystemLinkageJitedToJitedParameterPassingFourArg) {
16:26:25 [2019-11-01T20:26:25.974Z] ^
16:26:25 [2019-11-01T20:26:25.974Z] /Users/jenkins/workspace/PullRequest-osx_x86-64/third_party/gtest-1.8.0/include/gtest/gtest-typed-test.h:183:42: note: expanded from macro 'TYPED_TEST'
16:26:25 [2019-11-01T20:26:25.974Z]           GTEST_TYPE_PARAMS_(CaseName)>::Register(\
16:26:25 [2019-11-01T20:26:25.974Z]                                          ^
16:26:25 [2019-11-01T20:26:25.974Z] /Users/jenkins/workspace/PullRequest-osx_x86-64/fvtest/compilertriltest/LinkageTest.cpp:202:105: note: format string is defined here
16:26:25 [2019-11-01T20:26:25.974Z]     const auto format_string = "(method return=%s args=[%s,%s,%s,%s] (block (%sreturn (%scall address=0x%jX args=[%s,%s,%s,%s] linkage=system"
16:26:25 [2019-11-01T20:26:25.974Z]                                                                                                         ^~~
16:26:25 [2019-11-01T20:26:25.974Z] /Users/jenkins/workspace/PullRequest-osx_x86-64/fvtest/compilertriltest/LinkageTest.cpp:215:51: warning: format specifies type 'uintmax_t' (aka 'unsigned long') but the argument has type 'long long (*)(long long, long long, long long, long long)' [-Wformat]
16:26:25 [2019-11-01T20:26:25.974Z]                                                   callee_entry_point,              // address
16:26:25 [2019-11-01T20:26:25.974Z]                                                   ^~~~~~~~~~~~~~~~~~
16:26:25 [2019-11-01T20:26:25.974Z] /Users/jenkins/workspace/PullRequest-osx_x86-64/third_party/gtest-1.8.0/include/gtest/internal/gtest-internal.h:484:43: note: in instantiation of member function 'LinkageTest_SystemLinkageJitedToJitedParameterPassingFourArg_Test<long long>::TestBody' requested here
16:26:25 [2019-11-01T20:26:25.974Z]   virtual Test* CreateTest() { return new TestClass; }
16:26:25 [2019-11-01T20:26:25.974Z]                                           ^
16:26:25 [2019-11-01T20:26:25.974Z] /Users/jenkins/workspace/PullRequest-osx_x86-64/third_party/gtest-1.8.0/include/gtest/internal/gtest-internal.h:649:13: note: in instantiation of member function 'testing::internal::TestFactoryImpl<LinkageTest_SystemLinkageJitedToJitedParameterPassingFourArg_Test<long long> >::CreateTest' requested here
16:26:25 [2019-11-01T20:26:25.974Z]         new TestFactoryImpl<TestClass>);
16:26:25 [2019-11-01T20:26:25.974Z]             ^
16:26:25 [2019-11-01T20:26:25.974Z] /Users/jenkins/workspace/PullRequest-osx_x86-64/third_party/gtest-1.8.0/include/gtest/internal/gtest-internal.h:653:11: note: in instantiation of member function 'testing::internal::TypeParameterizedTest<LinkageTest, testing::internal::TemplateSel<LinkageTest_SystemLinkageJitedToJitedParameterPassingFourArg_Test>, testing::internal::Types3<long long, float, double> >::Register' requested here
16:26:25 [2019-11-01T20:26:25.974Z]         ::Register(prefix, code_location, case_name, test_names, index + 1);
16:26:25 [2019-11-01T20:26:25.974Z]           ^
16:26:25 [2019-11-01T20:26:25.974Z] /Users/jenkins/workspace/PullRequest-osx_x86-64/fvtest/compilertriltest/LinkageTest.cpp:187:1: note: in instantiation of member function 'testing::internal::TypeParameterizedTest<LinkageTest, testing::internal::TemplateSel<LinkageTest_SystemLinkageJitedToJitedParameterPassingFourArg_Test>, testing::internal::Types4<int, long long, float, double> >::Register' requested here
16:26:25 [2019-11-01T20:26:25.974Z] TYPED_TEST(LinkageTest, SystemLinkageJitedToJitedParameterPassingFourArg) {
16:26:25 [2019-11-01T20:26:25.974Z] ^
16:26:25 [2019-11-01T20:26:25.974Z] /Users/jenkins/workspace/PullRequest-osx_x86-64/third_party/gtest-1.8.0/include/gtest/gtest-typed-test.h:183:42: note: expanded from macro 'TYPED_TEST'
16:26:25 [2019-11-01T20:26:25.975Z]           GTEST_TYPE_PARAMS_(CaseName)>::Register(\
16:26:25 [2019-11-01T20:26:25.975Z]                                          ^
16:26:25 [2019-11-01T20:26:25.975Z] /Users/jenkins/workspace/PullRequest-osx_x86-64/fvtest/compilertriltest/LinkageTest.cpp:202:105: note: format string is defined here
16:26:25 [2019-11-01T20:26:25.975Z]     const auto format_string = "(method return=%s args=[%s,%s,%s,%s] (block (%sreturn (%scall address=0x%jX args=[%s,%s,%s,%s] linkage=system"
16:26:25 [2019-11-01T20:26:25.975Z]                                                                                                         ^~~
16:26:25 [2019-11-01T20:26:25.975Z] /Users/jenkins/workspace/PullRequest-osx_x86-64/fvtest/compilertriltest/LinkageTest.cpp:215:51: warning: format specifies type 'uintmax_t' (aka 'unsigned long') but the argument has type 'int (*)(int, int, int, int)' [-Wformat]
16:26:25 [2019-11-01T20:26:25.975Z]                                                   callee_entry_point,              // address
16:26:25 [2019-11-01T20:26:25.975Z]                                                   ^~~~~~~~~~~~~~~~~~
16:26:25 [2019-11-01T20:26:25.975Z] /Users/jenkins/workspace/PullRequest-osx_x86-64/third_party/gtest-1.8.0/include/gtest/internal/gtest-internal.h:484:43: note: in instantiation of member function 'LinkageTest_SystemLinkageJitedToJitedParameterPassingFourArg_Test<int>::TestBody' requested here
16:26:25 [2019-11-01T20:26:25.975Z]   virtual Test* CreateTest() { return new TestClass; }
16:26:25 [2019-11-01T20:26:25.975Z]                                           ^
16:26:25 [2019-11-01T20:26:25.975Z] /Users/jenkins/workspace/PullRequest-osx_x86-64/third_party/gtest-1.8.0/include/gtest/internal/gtest-internal.h:649:13: note: in instantiation of member function 'testing::internal::TestFactoryImpl<LinkageTest_SystemLinkageJitedToJitedParameterPassingFourArg_Test<int> >::CreateTest' requested here
16:26:25 [2019-11-01T20:26:25.975Z]         new TestFactoryImpl<TestClass>);
16:26:25 [2019-11-01T20:26:25.975Z]             ^
16:26:25 [2019-11-01T20:26:25.975Z] /Users/jenkins/workspace/PullRequest-osx_x86-64/fvtest/compilertriltest/LinkageTest.cpp:187:1: note: in instantiation of member function 'testing::internal::TypeParameterizedTest<LinkageTest, testing::internal::TemplateSel<LinkageTest_SystemLinkageJitedToJitedParameterPassingFourArg_Test>, testing::internal::Types4<int, long long, float, double> >::Register' requested here
16:26:25 [2019-11-01T20:26:25.975Z] TYPED_TEST(LinkageTest, SystemLinkageJitedToJitedParameterPassingFourArg) {
16:26:25 [2019-11-01T20:26:25.975Z] ^
16:26:25 [2019-11-01T20:26:25.975Z] /Users/jenkins/workspace/PullRequest-osx_x86-64/third_party/gtest-1.8.0/include/gtest/gtest-typed-test.h:183:42: note: expanded from macro 'TYPED_TEST'
16:26:25 [2019-11-01T20:26:25.975Z]           GTEST_TYPE_PARAMS_(CaseName)>::Register(\
16:26:25 [2019-11-01T20:26:25.975Z]                                          ^
16:26:25 [2019-11-01T20:26:25.975Z] /Users/jenkins/workspace/PullRequest-osx_x86-64/fvtest/compilertriltest/LinkageTest.cpp:202:105: note: format string is defined here
16:26:25 [2019-11-01T20:26:25.975Z]     const auto format_string = "(method return=%s args=[%s,%s,%s,%s] (block (%sreturn (%scall address=0x%jX args=[%s,%s,%s,%s] linkage=system"
16:26:25 [2019-11-01T20:26:25.975Z]                                                                                                         ^~~
16:26:25 [2019-11-01T20:26:25.975Z] 5 warnings generated.
16:26:25 [2019-11-01T20:26:25.975Z] Scanning dependencies of target iterfib
16:26:25 [2019-11-01T20:26:25.975Z] [ 97%] Building CXX object jitbuilder/release/CMakeFiles/iterfib.dir/cpp/samples/IterativeFib.cpp.o
16:26:26 [2019-11-01T20:26:26.858Z] [ 97%] Linking CXX executable iterfib
16:26:26 [2019-11-01T20:26:26.858Z] [ 97%] Built target fieldaddress
16:26:26 [2019-11-01T20:26:26.858Z] [ 97%] Building CXX object fvtest/compilertriltest/CMakeFiles/comptest.dir/CompareTest.cpp.o
16:26:27 [2019-11-01T20:26:27.735Z] [ 97%] Built target iterfib
16:26:27 [2019-11-01T20:26:27.736Z] [ 97%] Building CXX object fvtest/compilertriltest/CMakeFiles/comptest.dir/TypeConversionTest.cpp.o
16:26:28 [2019-11-01T20:26:28.666Z] In file included from /Users/jenkins/workspace/PullRequest-osx_x86-64/fvtest/compilertriltest/BitPermuteTest.cpp:24:
16:26:28 [2019-11-01T20:26:28.666Z] In file included from /Users/jenkins/workspace/PullRequest-osx_x86-64/fvtest/tril/tril/default_compiler.hpp:30:
16:26:28 [2019-11-01T20:26:28.666Z] In file included from /Users/jenkins/workspace/PullRequest-osx_x86-64/fvtest/tril/tril/simple_compiler.hpp:25:
16:26:28 [2019-11-01T20:26:28.666Z] In file included from /Users/jenkins/workspace/PullRequest-osx_x86-64/fvtest/tril/tril/method_compiler.hpp:25:
16:26:28 [2019-11-01T20:26:28.666Z] In file included from /Users/jenkins/workspace/PullRequest-osx_x86-64/fvtest/tril/tril/method_info.hpp:27:
16:26:28 [2019-11-01T20:26:28.666Z] /Users/jenkins/workspace/PullRequest-osx_x86-64/fvtest/tril/tril/compiler_util.hpp:92:39: warning: comparison of unsigned expression >= 0 is always true [-Wtautological-compare]
16:26:28 [2019-11-01T20:26:28.666Z]          if (flagsValue->getInteger() >= 0 && flagsValue->getInteger() < 32)
16:26:28 [2019-11-01T20:26:28.666Z]              ~~~~~~~~~~~~~~~~~~~~~~~~ ^  ~
16:26:28 [2019-11-01T20:26:28.666Z] 1 warning generated.
16:26:28 [2019-11-01T20:26:28.666Z] Scanning dependencies of target dotproduct
16:26:28 [2019-11-01T20:26:28.666Z] [ 97%] Building CXX object jitbuilder/release/CMakeFiles/dotproduct.dir/cpp/samples/DotProduct.cpp.o
16:26:28 [2019-11-01T20:26:28.666Z] [ 97%] Linking CXX executable dotproduct
16:26:29 [2019-11-01T20:26:29.525Z] In file included from /Users/jenkins/workspace/PullRequest-osx_x86-64/fvtest/compilertriltest/MaxMinTest.cpp:23:
16:26:29 [2019-11-01T20:26:29.525Z] In file included from /Users/jenkins/workspace/PullRequest-osx_x86-64/fvtest/tril/tril/default_compiler.hpp:30:
16:26:29 [2019-11-01T20:26:29.525Z] In file included from /Users/jenkins/workspace/PullRequest-osx_x86-64/fvtest/tril/tril/simple_compiler.hpp:25:
16:26:29 [2019-11-01T20:26:29.525Z] In file included from /Users/jenkins/workspace/PullRequest-osx_x86-64/fvtest/tril/tril/method_compiler.hpp:25:
16:26:29 [2019-11-01T20:26:29.525Z] In file included from /Users/jenkins/workspace/PullRequest-osx_x86-64/fvtest/tril/tril/method_info.hpp:27:
16:26:29 [2019-11-01T20:26:29.525Z] /Users/jenkins/workspace/PullRequest-osx_x86-64/fvtest/tril/tril/compiler_util.hpp:92:39: warning: comparison of unsigned expression >= 0 is always true [-Wtautological-compare]
16:26:29 [2019-11-01T20:26:29.525Z]          if (flagsValue->getInteger() >= 0 && flagsValue->getInteger() < 32)
16:26:29 [2019-11-01T20:26:29.525Z]              ~~~~~~~~~~~~~~~~~~~~~~~~ ^  ~
16:26:29 [2019-11-01T20:26:29.525Z] 1 warning generated.
16:26:29 [2019-11-01T20:26:29.525Z] Scanning dependencies of target operandstacktests
16:26:29 [2019-11-01T20:26:29.525Z] [ 97%] Building CXX object jitbuilder/release/CMakeFiles/operandstacktests.dir/cpp/samples/OperandStackTests.cpp.o
16:26:29 [2019-11-01T20:26:29.525Z] [ 97%] Linking CXX executable operandstacktests
16:26:29 [2019-11-01T20:26:29.525Z] [ 97%] Built target dotproduct
16:26:29 [2019-11-01T20:26:29.525Z] [ 97%] Building CXX object fvtest/compilertriltest/CMakeFiles/comptest.dir/TernaryTest.cpp.o
16:26:30 [2019-11-01T20:26:30.436Z] [ 97%] Built target operandstacktests
16:26:30 [2019-11-01T20:26:30.436Z] [ 97%] Building CXX object fvtest/compilertriltest/CMakeFiles/comptest.dir/MinimalTest.cpp.o
16:26:33 [2019-11-01T20:26:33.260Z] /Users/jenkins/workspace/PullRequest-osx_x86-64/fvtest/compilertriltest/MinimalTest.cpp:57:26: error: variable has incomplete type 'TR::ResolvedMethod'
16:26:33 [2019-11-01T20:26:33.260Z]       TR::ResolvedMethod resolvedMethod(this);
16:26:33 [2019-11-01T20:26:33.260Z]                          ^
16:26:33 [2019-11-01T20:26:33.260Z] /Users/jenkins/workspace/PullRequest-osx_x86-64/fvtest/compilertest/ilgen/IlInjector.hpp:35:22: note: forward declaration of 'TR::ResolvedMethod'
16:26:33 [2019-11-01T20:26:33.260Z] namespace TR { class ResolvedMethod; }
16:26:33 [2019-11-01T20:26:33.260Z]                      ^
16:26:33 [2019-11-01T20:26:33.260Z] 1 error generated.
16:26:33 [2019-11-01T20:26:33.260Z] make[2]: *** [fvtest/compilertriltest/CMakeFiles/comptest.dir/MinimalTest.cpp.o] Error 1
16:26:33 [2019-11-01T20:26:33.260Z] make[2]: *** Waiting for unfinished jobs....
16:26:33 [2019-11-01T20:26:33.260Z] Scanning dependencies of target pow2
16:26:33 [2019-11-01T20:26:33.260Z] [ 97%] Building CXX object jitbuilder/release/CMakeFiles/pow2.dir/cpp/samples/Pow2.cpp.o
16:26:33 [2019-11-01T20:26:33.260Z] [ 97%] Linking CXX executable pow2
16:26:33 [2019-11-01T20:26:33.260Z] In file included from /Users/jenkins/workspace/PullRequest-osx_x86-64/fvtest/compilertriltest/CompareTest.cpp:23:
16:26:33 [2019-11-01T20:26:33.260Z] In file included from /Users/jenkins/workspace/PullRequest-osx_x86-64/fvtest/tril/tril/default_compiler.hpp:30:
16:26:33 [2019-11-01T20:26:33.260Z] In file included from /Users/jenkins/workspace/PullRequest-osx_x86-64/fvtest/tril/tril/simple_compiler.hpp:25:
16:26:33 [2019-11-01T20:26:33.260Z] In file included from /Users/jenkins/workspace/PullRequest-osx_x86-64/fvtest/tril/tril/method_compiler.hpp:25:
16:26:33 [2019-11-01T20:26:33.260Z] In file included from /Users/jenkins/workspace/PullRequest-osx_x86-64/fvtest/tril/tril/method_info.hpp:27:
16:26:33 [2019-11-01T20:26:33.260Z] /Users/jenkins/workspace/PullRequest-osx_x86-64/fvtest/tril/tril/compiler_util.hpp:92:39: warning: comparison of unsigned expression >= 0 is always true [-Wtautological-compare]
16:26:33 [2019-11-01T20:26:33.260Z]          if (flagsValue->getInteger() >= 0 && flagsValue->getInteger() < 32)
16:26:33 [2019-11-01T20:26:33.260Z]              ~~~~~~~~~~~~~~~~~~~~~~~~ ^  ~
16:26:33 [2019-11-01T20:26:33.260Z] 1 warning generated.
16:26:34 [2019-11-01T20:26:34.157Z] Scanning dependencies of target inliningrecfib
16:26:34 [2019-11-01T20:26:34.157Z] [ 97%] Building CXX object jitbuilder/release/CMakeFiles/inliningrecfib.dir/cpp/samples/InliningRecFib.cpp.o
16:26:34 [2019-11-01T20:26:34.157Z] [ 97%] Linking CXX executable inliningrecfib
16:26:34 [2019-11-01T20:26:34.157Z] [ 97%] Built target pow2
16:26:34 [2019-11-01T20:26:34.157Z] Scanning dependencies of target call
16:26:34 [2019-11-01T20:26:34.157Z] [ 97%] Building CXX object jitbuilder/release/CMakeFiles/call.dir/cpp/samples/Call.cpp.o
16:26:34 [2019-11-01T20:26:34.157Z] [ 97%] Linking CXX executable call
16:26:34 [2019-11-01T20:26:34.157Z] In file included from /Users/jenkins/workspace/PullRequest-osx_x86-64/fvtest/compilertriltest/TernaryTest.cpp:23:
16:26:34 [2019-11-01T20:26:34.157Z] In file included from /Users/jenkins/workspace/PullRequest-osx_x86-64/fvtest/tril/tril/default_compiler.hpp:30:
16:26:34 [2019-11-01T20:26:34.157Z] In file included from /Users/jenkins/workspace/PullRequest-osx_x86-64/fvtest/tril/tril/simple_compiler.hpp:25:
16:26:34 [2019-11-01T20:26:34.157Z] In file included from /Users/jenkins/workspace/PullRequest-osx_x86-64/fvtest/tril/tril/method_compiler.hpp:25:
16:26:34 [2019-11-01T20:26:34.157Z] In file included from /Users/jenkins/workspace/PullRequest-osx_x86-64/fvtest/tril/tril/method_info.hpp:27:
16:26:34 [2019-11-01T20:26:34.157Z] /Users/jenkins/workspace/PullRequest-osx_x86-64/fvtest/tril/tril/compiler_util.hpp:92:39: warning: comparison of unsigned expression >= 0 is always true [-Wtautological-compare]
16:26:34 [2019-11-01T20:26:34.157Z]          if (flagsValue->getInteger() >= 0 && flagsValue->getInteger() < 32)
16:26:34 [2019-11-01T20:26:34.157Z]              ~~~~~~~~~~~~~~~~~~~~~~~~ ^  ~
16:26:34 [2019-11-01T20:26:34.157Z] 1 warning generated.
16:26:34 [2019-11-01T20:26:34.157Z] Scanning dependencies of target conditionals
16:26:34 [2019-11-01T20:26:34.157Z] [ 97%] Building CXX object jitbuilder/release/CMakeFiles/conditionals.dir/cpp/samples/Conditionals.cpp.o
16:26:34 [2019-11-01T20:26:34.157Z] [ 97%] Linking CXX executable conditionals
16:26:35 [2019-11-01T20:26:35.053Z] [ 97%] Built target inliningrecfib
16:26:35 [2019-11-01T20:26:35.053Z] Scanning dependencies of target simple
16:26:35 [2019-11-01T20:26:35.053Z] [ 97%] Building CXX object jitbuilder/release/CMakeFiles/simple.dir/cpp/samples/Simple.cpp.o
16:26:35 [2019-11-01T20:26:35.053Z] [ 97%] Built target call
16:26:35 [2019-11-01T20:26:35.053Z] [ 97%] Linking CXX executable simple
16:26:35 [2019-11-01T20:26:35.053Z] Scanning dependencies of target recfib
16:26:35 [2019-11-01T20:26:35.053Z] [ 97%] Building CXX object jitbuilder/release/CMakeFiles/recfib.dir/cpp/samples/RecursiveFib.cpp.o
16:26:35 [2019-11-01T20:26:35.053Z] [ 97%] Linking CXX executable recfib
16:26:35 [2019-11-01T20:26:35.053Z] [ 97%] Built target conditionals
16:26:35 [2019-11-01T20:26:35.053Z] Scanning dependencies of target worklist
16:26:35 [2019-11-01T20:26:35.053Z] [ 97%] Building CXX object jitbuilder/release/CMakeFiles/worklist.dir/cpp/samples/Worklist.cpp.o
16:26:35 [2019-11-01T20:26:35.053Z] [ 98%] Linking CXX executable worklist
16:26:35 [2019-11-01T20:26:35.988Z] [ 98%] Built target simple
16:26:35 [2019-11-01T20:26:35.988Z] Scanning dependencies of target conststring
16:26:35 [2019-11-01T20:26:35.989Z] [ 98%] Building CXX object jitbuilder/release/CMakeFiles/conststring.dir/cpp/samples/ConstString.cpp.o
16:26:35 [2019-11-01T20:26:35.989Z] [ 98%] Linking CXX executable conststring
16:26:35 [2019-11-01T20:26:35.989Z] [ 98%] Built target recfib
16:26:35 [2019-11-01T20:26:35.989Z] Scanning dependencies of target isSupportedType
16:26:35 [2019-11-01T20:26:35.989Z] [ 98%] Building CXX object jitbuilder/release/CMakeFiles/isSupportedType.dir/cpp/samples/IsSupportedType.cpp.o
16:26:35 [2019-11-01T20:26:35.989Z] [ 98%] Linking CXX executable isSupportedType
16:26:35 [2019-11-01T20:26:35.989Z] [ 98%] Built target isSupportedType
16:26:35 [2019-11-01T20:26:35.989Z] Scanning dependencies of target jitbuildertest
16:26:35 [2019-11-01T20:26:35.989Z] [ 98%] Building CXX object fvtest/jitbuildertest/CMakeFiles/jitbuildertest.dir/main.cpp.o
16:26:35 [2019-11-01T20:26:35.989Z] [ 98%] Building CXX object fvtest/jitbuildertest/CMakeFiles/jitbuildertest.dir/selftest.cpp.o
16:26:35 [2019-11-01T20:26:35.989Z] [ 98%] Building CXX object fvtest/jitbuildertest/CMakeFiles/jitbuildertest.dir/UnionTest.cpp.o
16:26:35 [2019-11-01T20:26:35.989Z] [ 98%] Built target worklist
16:26:35 [2019-11-01T20:26:35.989Z] [ 98%] Building CXX object fvtest/jitbuildertest/CMakeFiles/jitbuildertest.dir/FieldAddressTest.cpp.o
16:26:36 [2019-11-01T20:26:36.902Z] [ 98%] Building CXX object fvtest/jitbuildertest/CMakeFiles/jitbuildertest.dir/AnonymousTest.cpp.o
16:26:36 [2019-11-01T20:26:36.902Z] [ 98%] Building CXX object fvtest/jitbuildertest/CMakeFiles/jitbuildertest.dir/ControlFlowTest.cpp.o
16:26:36 [2019-11-01T20:26:36.902Z] [ 98%] Building CXX object fvtest/jitbuildertest/CMakeFiles/jitbuildertest.dir/NegateTest.cpp.o
16:26:36 [2019-11-01T20:26:36.902Z] [ 98%] Building CXX object fvtest/jitbuildertest/CMakeFiles/jitbuildertest.dir/SystemLinkageTest.cpp.o
16:26:36 [2019-11-01T20:26:36.902Z] [ 98%] Building CXX object fvtest/jitbuildertest/CMakeFiles/jitbuildertest.dir/WorklistTest.cpp.o
16:26:36 [2019-11-01T20:26:36.902Z] [ 98%] Building CXX object fvtest/jitbuildertest/CMakeFiles/jitbuildertest.dir/FieldNameTest.cpp.o
16:26:36 [2019-11-01T20:26:36.902Z] [ 98%] Building CXX object fvtest/jitbuildertest/CMakeFiles/jitbuildertest.dir/ConvertBitsTest.cpp.o
16:26:36 [2019-11-01T20:26:36.902Z] [ 98%] Building CXX object fvtest/jitbuildertest/CMakeFiles/jitbuildertest.dir/SelectTest.cpp.o
16:26:36 [2019-11-01T20:26:36.902Z] [ 99%] Building CXX object fvtest/jitbuildertest/CMakeFiles/jitbuildertest.dir/CallReturnTest.cpp.o
16:26:36 [2019-11-01T20:26:36.902Z] [ 99%] Building CXX object fvtest/jitbuildertest/CMakeFiles/jitbuildertest.dir/UnsignedDivRemTest.cpp.o
16:26:36 [2019-11-01T20:26:36.902Z] [ 99%] Linking CXX executable jitbuildertest
16:26:36 [2019-11-01T20:26:36.902Z] [ 99%] Built target conststring
16:26:37 [2019-11-01T20:26:37.784Z] [ 99%] Built target jitbuildertest
16:26:37 [2019-11-01T20:26:37.784Z] In file included from /Users/jenkins/workspace/PullRequest-osx_x86-64/fvtest/compilertriltest/TypeConversionTest.cpp:23:
16:26:37 [2019-11-01T20:26:37.784Z] In file included from /Users/jenkins/workspace/PullRequest-osx_x86-64/fvtest/tril/tril/default_compiler.hpp:30:
16:26:37 [2019-11-01T20:26:37.784Z] In file included from /Users/jenkins/workspace/PullRequest-osx_x86-64/fvtest/tril/tril/simple_compiler.hpp:25:
16:26:37 [2019-11-01T20:26:37.784Z] In file included from /Users/jenkins/workspace/PullRequest-osx_x86-64/fvtest/tril/tril/method_compiler.hpp:25:
16:26:37 [2019-11-01T20:26:37.784Z] In file included from /Users/jenkins/workspace/PullRequest-osx_x86-64/fvtest/tril/tril/method_info.hpp:27:
16:26:37 [2019-11-01T20:26:37.784Z] /Users/jenkins/workspace/PullRequest-osx_x86-64/fvtest/tril/tril/compiler_util.hpp:92:39: warning: comparison of unsigned expression >= 0 is always true [-Wtautological-compare]
16:26:37 [2019-11-01T20:26:37.784Z]          if (flagsValue->getInteger() >= 0 && flagsValue->getInteger() < 32)
16:26:37 [2019-11-01T20:26:37.784Z]              ~~~~~~~~~~~~~~~~~~~~~~~~ ^  ~
16:26:37 [2019-11-01T20:26:37.784Z] 1 warning generated.
16:26:37 [2019-11-01T20:26:37.784Z] make[1]: *** [fvtest/compilertriltest/CMakeFiles/comptest.dir/all] Error 2
16:26:37 [2019-11-01T20:26:37.784Z] make: *** [all] Error 2
[Pipeline] }
[Pipeline] // dir
[Pipeline] }
[Pipeline] // timestamps
[Pipeline] }
[Pipeline] // stage
[Pipeline] stage
[Pipeline] { (Test)
Stage "Test" skipped due to earlier failure(s)
[Pipeline] }
[Pipeline] // stage
[Pipeline] stage
[Pipeline] { (Declarative: Post Actions)
[Pipeline] echo
Cleanup workspace
[Pipeline] deleteDir
[Pipeline] }
[Pipeline] // stage
[Pipeline] }
[Pipeline] // withEnv
[Pipeline] }
[Pipeline] // withEnv
[Pipeline] }
[Pipeline] // node
[Pipeline] End of Pipeline
Setting status of 025f927b832f81e43cd9791f92edb3fd871b47e3 to FAILURE with url https://ci.eclipse.org/omr/job/PullRequest-osx_x86-64/1179/ and message: 'Build finished. '
Using context: continuous-integration/eclipse-omr/pr/osx_x86-64
ERROR: script returned exit code 2
Finished: FAILURE