FailedConsole Output

Skipping 2,111 KB.. Full Log
m/81
17:10:34 [2020-01-14T22:10:34.230Z] 29:     The s390x code generator currently doesn't support dmax/dmin (see issue #4276)
17:10:34 [2020-01-14T22:10:34.230Z] 29: Known Bug: Skipping test: UsingLoadParam/82
17:10:34 [2020-01-14T22:10:34.230Z] 29:     The s390x code generator currently doesn't support dmax/dmin (see issue #4276)
17:10:34 [2020-01-14T22:10:34.230Z] 29: Known Bug: Skipping test: UsingLoadParam/83
17:10:34 [2020-01-14T22:10:34.230Z] 29:     The s390x code generator currently doesn't support dmax/dmin (see issue #4276)
17:10:34 [2020-01-14T22:10:34.230Z] 29: Known Bug: Skipping test: UsingLoadParam/84
17:10:34 [2020-01-14T22:10:34.230Z] 29:     The s390x code generator currently doesn't support dmax/dmin (see issue #4276)
17:10:34 [2020-01-14T22:10:34.230Z] 29: Known Bug: Skipping test: UsingLoadParam/85
17:10:34 [2020-01-14T22:10:34.230Z] 29:     The s390x code generator currently doesn't support dmax/dmin (see issue #4276)
17:10:34 [2020-01-14T22:10:34.230Z] 29: Known Bug: Skipping test: UsingLoadParam/86
17:10:34 [2020-01-14T22:10:34.230Z] 29:     The s390x code generator currently doesn't support dmax/dmin (see issue #4276)
17:10:34 [2020-01-14T22:10:34.230Z] 29: Known Bug: Skipping test: UsingLoadParam/87
17:10:34 [2020-01-14T22:10:34.230Z] 29:     The s390x code generator currently doesn't support dmax/dmin (see issue #4276)
17:10:34 [2020-01-14T22:10:34.230Z] 29: Known Bug: Skipping test: UsingLoadParam/88
17:10:34 [2020-01-14T22:10:34.230Z] 29:     The s390x code generator currently doesn't support dmax/dmin (see issue #4276)
17:10:34 [2020-01-14T22:10:34.230Z] 29: Known Bug: Skipping test: UsingLoadParam/89
17:10:34 [2020-01-14T22:10:34.230Z] 29:     The s390x code generator currently doesn't support dmax/dmin (see issue #4276)
17:10:34 [2020-01-14T22:10:34.230Z] 29: Known Bug: Skipping test: UsingLoadParam/90
17:10:34 [2020-01-14T22:10:34.230Z] 29:     The s390x code generator currently doesn't support dmax/dmin (see issue #4276)
17:10:34 [2020-01-14T22:10:34.230Z] 29: Known Bug: Skipping test: UsingLoadParam/91
17:10:34 [2020-01-14T22:10:34.230Z] 29:     The s390x code generator currently doesn't support dmax/dmin (see issue #4276)
17:10:34 [2020-01-14T22:10:34.230Z] 29: Known Bug: Skipping test: UsingLoadParam/92
17:10:34 [2020-01-14T22:10:34.230Z] 29:     The s390x code generator currently doesn't support dmax/dmin (see issue #4276)
17:10:34 [2020-01-14T22:10:34.230Z] 29: Known Bug: Skipping test: UsingLoadParam/93
17:10:34 [2020-01-14T22:10:34.230Z] 29:     The s390x code generator currently doesn't support dmax/dmin (see issue #4276)
17:10:34 [2020-01-14T22:10:34.230Z] 29: Known Bug: Skipping test: UsingLoadParam/94
17:10:34 [2020-01-14T22:10:34.230Z] 29:     The s390x code generator currently doesn't support dmax/dmin (see issue #4276)
17:10:34 [2020-01-14T22:10:34.230Z] 29: Known Bug: Skipping test: UsingLoadParam/95
17:10:34 [2020-01-14T22:10:34.230Z] 29:     The s390x code generator currently doesn't support dmax/dmin (see issue #4276)
17:10:34 [2020-01-14T22:10:34.230Z] 29: Known Bug: Skipping test: UsingLoadParam/96
17:10:34 [2020-01-14T22:10:34.230Z] 29:     The s390x code generator currently doesn't support dmax/dmin (see issue #4276)
17:10:34 [2020-01-14T22:10:34.230Z] 29: Known Bug: Skipping test: UsingLoadParam/97
17:10:34 [2020-01-14T22:10:34.230Z] 29:     The s390x code generator currently doesn't support dmax/dmin (see issue #4276)
17:10:34 [2020-01-14T22:10:34.230Z] 29: Known Bug: Skipping test: UsingLoadParam/98
17:10:34 [2020-01-14T22:10:34.230Z] 29:     The s390x code generator currently doesn't support dmax/dmin (see issue #4276)
17:10:34 [2020-01-14T22:10:34.230Z] 29: Known Bug: Skipping test: UsingLoadParam/99
17:10:34 [2020-01-14T22:10:34.230Z] 29:     The s390x code generator currently doesn't support dmax/dmin (see issue #4276)
17:10:34 [2020-01-14T22:10:34.230Z] 29: Known Bug: Skipping test: UsingLoadParam/100
17:10:34 [2020-01-14T22:10:34.230Z] 29:     The s390x code generator currently doesn't support dmax/dmin (see issue #4276)
17:10:34 [2020-01-14T22:10:34.230Z] 29: Known Bug: Skipping test: UsingLoadParam/101
17:10:34 [2020-01-14T22:10:34.230Z] 29:     The s390x code generator currently doesn't support dmax/dmin (see issue #4276)
17:10:34 [2020-01-14T22:10:34.230Z] 29: Known Bug: Skipping test: UsingLoadParam/102
17:10:34 [2020-01-14T22:10:34.230Z] 29:     The s390x code generator currently doesn't support dmax/dmin (see issue #4276)
17:10:34 [2020-01-14T22:10:34.230Z] 29: Known Bug: Skipping test: UsingLoadParam/103
17:10:34 [2020-01-14T22:10:34.230Z] 29:     The s390x code generator currently doesn't support dmax/dmin (see issue #4276)
17:10:34 [2020-01-14T22:10:34.230Z] 29: Known Bug: Skipping test: UsingLoadParam/104
17:10:34 [2020-01-14T22:10:34.230Z] 29:     The s390x code generator currently doesn't support dmax/dmin (see issue #4276)
17:10:34 [2020-01-14T22:10:34.230Z] 29: Known Bug: Skipping test: UsingLoadParam/105
17:10:34 [2020-01-14T22:10:34.230Z] 29:     The s390x code generator currently doesn't support dmax/dmin (see issue #4276)
17:10:34 [2020-01-14T22:10:34.230Z] 29: Known Bug: Skipping test: UsingLoadParam/106
17:10:34 [2020-01-14T22:10:34.230Z] 29:     The s390x code generator currently doesn't support dmax/dmin (see issue #4276)
17:10:34 [2020-01-14T22:10:34.230Z] 29: Known Bug: Skipping test: UsingLoadParam/107
17:10:34 [2020-01-14T22:10:34.230Z] 29:     The s390x code generator currently doesn't support dmax/dmin (see issue #4276)
17:10:34 [2020-01-14T22:10:34.230Z] 29: Known Bug: Skipping test: UsingLoadParam/108
17:10:34 [2020-01-14T22:10:34.230Z] 29:     The s390x code generator currently doesn't support dmax/dmin (see issue #4276)
17:10:34 [2020-01-14T22:10:34.230Z] 29: Known Bug: Skipping test: UsingLoadParam/109
17:10:34 [2020-01-14T22:10:34.230Z] 29:     The s390x code generator currently doesn't support dmax/dmin (see issue #4276)
17:10:34 [2020-01-14T22:10:34.230Z] 29: Known Bug: Skipping test: UsingLoadParam/110
17:10:34 [2020-01-14T22:10:34.230Z] 29:     The s390x code generator currently doesn't support dmax/dmin (see issue #4276)
17:10:34 [2020-01-14T22:10:34.230Z] 29: Known Bug: Skipping test: UsingLoadParam/111
17:10:34 [2020-01-14T22:10:34.230Z] 29:     The s390x code generator currently doesn't support dmax/dmin (see issue #4276)
17:10:34 [2020-01-14T22:10:34.230Z] 29: Known Bug: Skipping test: UsingLoadParam/112
17:10:34 [2020-01-14T22:10:34.230Z] 29:     The s390x code generator currently doesn't support dmax/dmin (see issue #4276)
17:10:34 [2020-01-14T22:10:34.230Z] 29: Known Bug: Skipping test: UsingLoadParam/113
17:10:34 [2020-01-14T22:10:34.230Z] 29:     The s390x code generator currently doesn't support dmax/dmin (see issue #4276)
17:10:34 [2020-01-14T22:10:34.230Z] 29: Known Bug: Skipping test: UsingLoadParam/114
17:10:34 [2020-01-14T22:10:34.230Z] 29:     The s390x code generator currently doesn't support dmax/dmin (see issue #4276)
17:10:34 [2020-01-14T22:10:34.230Z] 29: Known Bug: Skipping test: UsingLoadParam/115
17:10:34 [2020-01-14T22:10:34.230Z] 29:     The s390x code generator currently doesn't support dmax/dmin (see issue #4276)
17:10:34 [2020-01-14T22:10:34.230Z] 29: Known Bug: Skipping test: UsingLoadParam/116
17:10:34 [2020-01-14T22:10:34.230Z] 29:     The s390x code generator currently doesn't support dmax/dmin (see issue #4276)
17:10:34 [2020-01-14T22:10:34.230Z] 29: Known Bug: Skipping test: UsingLoadParam/117
17:10:34 [2020-01-14T22:10:34.230Z] 29:     The s390x code generator currently doesn't support dmax/dmin (see issue #4276)
17:10:34 [2020-01-14T22:10:34.230Z] 29: Known Bug: Skipping test: UsingLoadParam/118
17:10:34 [2020-01-14T22:10:34.230Z] 29:     The s390x code generator currently doesn't support dmax/dmin (see issue #4276)
17:10:34 [2020-01-14T22:10:34.230Z] 29: Known Bug: Skipping test: UsingLoadParam/119
17:10:34 [2020-01-14T22:10:34.230Z] 29:     The s390x code generator currently doesn't support dmax/dmin (see issue #4276)
17:10:34 [2020-01-14T22:10:34.230Z] 29: Known Bug: Skipping test: UsingLoadParam/120
17:10:34 [2020-01-14T22:10:34.230Z] 29:     The s390x code generator currently doesn't support dmax/dmin (see issue #4276)
17:10:34 [2020-01-14T22:10:34.230Z] 29: Known Bug: Skipping test: UsingLoadParam/121
17:10:34 [2020-01-14T22:10:34.230Z] 29:     The s390x code generator currently doesn't support dmax/dmin (see issue #4276)
17:10:34 [2020-01-14T22:10:34.230Z] 29: Known Bug: Skipping test: UsingLoadParam/122
17:10:34 [2020-01-14T22:10:34.230Z] 29:     The s390x code generator currently doesn't support dmax/dmin (see issue #4276)
17:10:34 [2020-01-14T22:10:34.230Z] 29: Known Bug: Skipping test: UsingLoadParam/123
17:10:34 [2020-01-14T22:10:34.230Z] 29:     The s390x code generator currently doesn't support dmax/dmin (see issue #4276)
17:10:34 [2020-01-14T22:10:34.230Z] 29: Known Bug: Skipping test: UsingLoadParam/124
17:10:34 [2020-01-14T22:10:34.230Z] 29:     The s390x code generator currently doesn't support dmax/dmin (see issue #4276)
17:10:34 [2020-01-14T22:10:34.230Z] 29: Known Bug: Skipping test: UsingLoadParam/125
17:10:34 [2020-01-14T22:10:34.230Z] 29:     The s390x code generator currently doesn't support dmax/dmin (see issue #4276)
17:10:34 [2020-01-14T22:10:34.230Z] 29: Known Bug: Skipping test: UsingLoadParam/126
17:10:34 [2020-01-14T22:10:34.230Z] 29:     The s390x code generator currently doesn't support dmax/dmin (see issue #4276)
17:10:34 [2020-01-14T22:10:34.230Z] 29: Known Bug: Skipping test: UsingLoadParam/127
17:10:34 [2020-01-14T22:10:34.230Z] 29:     The s390x code generator currently doesn't support dmax/dmin (see issue #4276)
17:10:34 [2020-01-14T22:10:34.230Z] 29: Known Bug: Skipping test: UsingLoadParam/128
17:10:34 [2020-01-14T22:10:34.230Z] 29:     The s390x code generator currently doesn't support dmax/dmin (see issue #4276)
17:10:34 [2020-01-14T22:10:34.230Z] 29: Known Bug: Skipping test: UsingLoadParam/129
17:10:34 [2020-01-14T22:10:34.230Z] 29:     The s390x code generator currently doesn't support dmax/dmin (see issue #4276)
17:10:34 [2020-01-14T22:10:34.230Z] 29: Known Bug: Skipping test: UsingLoadParam/130
17:10:34 [2020-01-14T22:10:34.230Z] 29:     The s390x code generator currently doesn't support dmax/dmin (see issue #4276)
17:10:34 [2020-01-14T22:10:34.230Z] 29: Known Bug: Skipping test: UsingLoadParam/131
17:10:34 [2020-01-14T22:10:34.230Z] 29:     The s390x code generator currently doesn't support dmax/dmin (see issue #4276)
17:10:34 [2020-01-14T22:10:34.230Z] 29: Known Bug: Skipping test: UsingLoadParam/132
17:10:34 [2020-01-14T22:10:34.230Z] 29:     The s390x code generator currently doesn't support dmax/dmin (see issue #4276)
17:10:34 [2020-01-14T22:10:34.230Z] 29: Known Bug: Skipping test: UsingLoadParam/133
17:10:34 [2020-01-14T22:10:34.230Z] 29:     The s390x code generator currently doesn't support dmax/dmin (see issue #4276)
17:10:34 [2020-01-14T22:10:34.230Z] 29: Known Bug: Skipping test: UsingLoadParam/134
17:10:34 [2020-01-14T22:10:34.230Z] 29:     The s390x code generator currently doesn't support dmax/dmin (see issue #4276)
17:10:34 [2020-01-14T22:10:34.230Z] 29: Known Bug: Skipping test: UsingLoadParam/135
17:10:34 [2020-01-14T22:10:34.230Z] 29:     The s390x code generator currently doesn't support dmax/dmin (see issue #4276)
17:10:34 [2020-01-14T22:10:34.231Z] 29: Known Bug: Skipping test: UsingLoadParam/136
17:10:34 [2020-01-14T22:10:34.231Z] 29:     The s390x code generator currently doesn't support dmax/dmin (see issue #4276)
17:10:34 [2020-01-14T22:10:34.231Z] 29: Known Bug: Skipping test: UsingLoadParam/137
17:10:34 [2020-01-14T22:10:34.231Z] 29:     The s390x code generator currently doesn't support dmax/dmin (see issue #4276)
17:10:34 [2020-01-14T22:10:34.231Z] 29: Known Bug: Skipping test: UsingLoadParam/138
17:10:34 [2020-01-14T22:10:34.231Z] 29:     The s390x code generator currently doesn't support dmax/dmin (see issue #4276)
17:10:34 [2020-01-14T22:10:34.231Z] 29: Known Bug: Skipping test: UsingLoadParam/139
17:10:34 [2020-01-14T22:10:34.231Z] 29:     The s390x code generator currently doesn't support dmax/dmin (see issue #4276)
17:10:34 [2020-01-14T22:10:34.231Z] 29: Known Bug: Skipping test: UsingLoadParam/140
17:10:34 [2020-01-14T22:10:34.231Z] 29:     The s390x code generator currently doesn't support dmax/dmin (see issue #4276)
17:10:34 [2020-01-14T22:10:34.231Z] 29: Known Bug: Skipping test: UsingLoadParam/141
17:10:34 [2020-01-14T22:10:34.231Z] 29:     The s390x code generator currently doesn't support dmax/dmin (see issue #4276)
17:10:34 [2020-01-14T22:10:34.231Z] 29: Known Bug: Skipping test: UsingLoadParam/142
17:10:34 [2020-01-14T22:10:34.231Z] 29:     The s390x code generator currently doesn't support dmax/dmin (see issue #4276)
17:10:34 [2020-01-14T22:10:34.231Z] 29: Known Bug: Skipping test: UsingLoadParam/143
17:10:34 [2020-01-14T22:10:34.231Z] 29:     The s390x code generator currently doesn't support dmax/dmin (see issue #4276)
17:10:34 [2020-01-14T22:10:34.231Z] 29: Known Bug: Skipping test: UsingLoadParam/144
17:10:34 [2020-01-14T22:10:34.231Z] 29:     The s390x code generator currently doesn't support dmax/dmin (see issue #4276)
17:10:34 [2020-01-14T22:10:34.231Z] 29: Known Bug: Skipping test: UsingLoadParam/145
17:10:34 [2020-01-14T22:10:34.231Z] 29:     The s390x code generator currently doesn't support dmax/dmin (see issue #4276)
17:10:34 [2020-01-14T22:10:34.231Z] 29: Known Bug: Skipping test: UsingLoadParam/146
17:10:34 [2020-01-14T22:10:34.231Z] 29:     The s390x code generator currently doesn't support dmax/dmin (see issue #4276)
17:10:34 [2020-01-14T22:10:34.231Z] 29: Known Bug: Skipping test: UsingLoadParam/147
17:10:34 [2020-01-14T22:10:34.231Z] 29:     The s390x code generator currently doesn't support dmax/dmin (see issue #4276)
17:10:34 [2020-01-14T22:10:34.231Z] 29: Known Bug: Skipping test: UsingLoadParam/148
17:10:34 [2020-01-14T22:10:34.231Z] 29:     The s390x code generator currently doesn't support dmax/dmin (see issue #4276)
17:10:34 [2020-01-14T22:10:34.231Z] 29: Known Bug: Skipping test: UsingLoadParam/149
17:10:34 [2020-01-14T22:10:34.231Z] 29:     The s390x code generator currently doesn't support dmax/dmin (see issue #4276)
17:10:34 [2020-01-14T22:10:34.231Z] 29: Known Bug: Skipping test: UsingLoadParam/150
17:10:34 [2020-01-14T22:10:34.231Z] 29:     The s390x code generator currently doesn't support dmax/dmin (see issue #4276)
17:10:34 [2020-01-14T22:10:34.231Z] 29: Known Bug: Skipping test: UsingLoadParam/151
17:10:34 [2020-01-14T22:10:34.231Z] 29:     The s390x code generator currently doesn't support dmax/dmin (see issue #4276)
17:10:34 [2020-01-14T22:10:34.231Z] 29: Known Bug: Skipping test: UsingLoadParam/152
17:10:34 [2020-01-14T22:10:34.231Z] 29:     The s390x code generator currently doesn't support dmax/dmin (see issue #4276)
17:10:34 [2020-01-14T22:10:34.231Z] 29: Known Bug: Skipping test: UsingLoadParam/153
17:10:34 [2020-01-14T22:10:34.231Z] 29:     The s390x code generator currently doesn't support dmax/dmin (see issue #4276)
17:10:34 [2020-01-14T22:10:34.231Z] 29: Known Bug: Skipping test: UsingLoadParam/154
17:10:34 [2020-01-14T22:10:34.231Z] 29:     The s390x code generator currently doesn't support dmax/dmin (see issue #4276)
17:10:34 [2020-01-14T22:10:34.231Z] 29: Known Bug: Skipping test: UsingLoadParam/155
17:10:34 [2020-01-14T22:10:34.231Z] 29:     The s390x code generator currently doesn't support dmax/dmin (see issue #4276)
17:10:34 [2020-01-14T22:10:34.231Z] 29: Known Bug: Skipping test: UsingLoadParam/156
17:10:34 [2020-01-14T22:10:34.231Z] 29:     The s390x code generator currently doesn't support dmax/dmin (see issue #4276)
17:10:34 [2020-01-14T22:10:34.231Z] 29: Known Bug: Skipping test: UsingLoadParam/157
17:10:34 [2020-01-14T22:10:34.231Z] 29:     The s390x code generator currently doesn't support dmax/dmin (see issue #4276)
17:10:34 [2020-01-14T22:10:34.231Z] 29: Known Bug: Skipping test: UsingLoadParam/158
17:10:34 [2020-01-14T22:10:34.231Z] 29:     The s390x code generator currently doesn't support dmax/dmin (see issue #4276)
17:10:34 [2020-01-14T22:10:34.231Z] 29: Known Bug: Skipping test: UsingLoadParam/159
17:10:34 [2020-01-14T22:10:34.231Z] 29:     The s390x code generator currently doesn't support dmax/dmin (see issue #4276)
17:10:34 [2020-01-14T22:10:34.231Z] 29: Known Bug: Skipping test: UsingLoadParam/160
17:10:34 [2020-01-14T22:10:34.231Z] 29:     The s390x code generator currently doesn't support dmax/dmin (see issue #4276)
17:10:34 [2020-01-14T22:10:34.231Z] 29: Known Bug: Skipping test: UsingLoadParam/161
17:10:34 [2020-01-14T22:10:34.231Z] 29:     The s390x code generator currently doesn't support dmax/dmin (see issue #4276)
17:10:34 [2020-01-14T22:10:34.231Z] 29: Known Bug: Skipping test: UsingLoadParam/162
17:10:34 [2020-01-14T22:10:34.231Z] 29:     The s390x code generator currently doesn't support dmax/dmin (see issue #4276)
17:10:34 [2020-01-14T22:10:34.231Z] 29: Known Bug: Skipping test: UsingLoadParam/163
17:10:34 [2020-01-14T22:10:34.231Z] 29:     The s390x code generator currently doesn't support dmax/dmin (see issue #4276)
17:10:34 [2020-01-14T22:10:34.231Z] 29: Known Bug: Skipping test: UsingLoadParam/164
17:10:34 [2020-01-14T22:10:34.231Z] 29:     The s390x code generator currently doesn't support dmax/dmin (see issue #4276)
17:10:34 [2020-01-14T22:10:34.231Z] 29: Known Bug: Skipping test: UsingLoadParam/165
17:10:34 [2020-01-14T22:10:34.231Z] 29:     The s390x code generator currently doesn't support dmax/dmin (see issue #4276)
17:10:34 [2020-01-14T22:10:34.231Z] 29: Known Bug: Skipping test: UsingLoadParam/166
17:10:34 [2020-01-14T22:10:34.231Z] 29:     The s390x code generator currently doesn't support dmax/dmin (see issue #4276)
17:10:34 [2020-01-14T22:10:34.231Z] 29: Known Bug: Skipping test: UsingLoadParam/167
17:10:34 [2020-01-14T22:10:34.231Z] 29:     The s390x code generator currently doesn't support dmax/dmin (see issue #4276)
17:10:34 [2020-01-14T22:10:34.231Z] 29: Known Bug: Skipping test: UsingLoadParam/168
17:10:34 [2020-01-14T22:10:34.231Z] 29:     The s390x code generator currently doesn't support dmax/dmin (see issue #4276)
17:10:34 [2020-01-14T22:10:34.231Z] 29: Known Bug: Skipping test: UsingLoadParam/169
17:10:34 [2020-01-14T22:10:34.231Z] 29:     The s390x code generator currently doesn't support dmax/dmin (see issue #4276)
17:10:34 [2020-01-14T22:10:34.231Z] 29: Known Bug: Skipping test: UsingLoadParam/170
17:10:34 [2020-01-14T22:10:34.231Z] 29:     The s390x code generator currently doesn't support dmax/dmin (see issue #4276)
17:10:34 [2020-01-14T22:10:34.231Z] 29: Known Bug: Skipping test: UsingLoadParam/171
17:10:34 [2020-01-14T22:10:34.231Z] 29:     The s390x code generator currently doesn't support dmax/dmin (see issue #4276)
17:10:34 [2020-01-14T22:10:34.231Z] 29: Known Bug: Skipping test: UsingLoadParam/172
17:10:34 [2020-01-14T22:10:34.231Z] 29:     The s390x code generator currently doesn't support dmax/dmin (see issue #4276)
17:10:34 [2020-01-14T22:10:34.231Z] 29: Known Bug: Skipping test: UsingLoadParam/173
17:10:34 [2020-01-14T22:10:34.231Z] 29:     The s390x code generator currently doesn't support dmax/dmin (see issue #4276)
17:10:34 [2020-01-14T22:10:34.231Z] 29: Known Bug: Skipping test: UsingLoadParam/174
17:10:34 [2020-01-14T22:10:34.231Z] 29:     The s390x code generator currently doesn't support dmax/dmin (see issue #4276)
17:10:34 [2020-01-14T22:10:34.231Z] 29: Known Bug: Skipping test: UsingLoadParam/175
17:10:34 [2020-01-14T22:10:34.231Z] 29:     The s390x code generator currently doesn't support dmax/dmin (see issue #4276)
17:10:34 [2020-01-14T22:10:34.231Z] 29: Known Bug: Skipping test: UsingLoadParam/176
17:10:34 [2020-01-14T22:10:34.231Z] 29:     The s390x code generator currently doesn't support dmax/dmin (see issue #4276)
17:10:34 [2020-01-14T22:10:34.231Z] 29: Known Bug: Skipping test: UsingLoadParam/177
17:10:34 [2020-01-14T22:10:34.231Z] 29:     The s390x code generator currently doesn't support dmax/dmin (see issue #4276)
17:10:34 [2020-01-14T22:10:34.231Z] 29: Known Bug: Skipping test: UsingLoadParam/178
17:10:34 [2020-01-14T22:10:34.231Z] 29:     The s390x code generator currently doesn't support dmax/dmin (see issue #4276)
17:10:34 [2020-01-14T22:10:34.231Z] 29: Known Bug: Skipping test: UsingLoadParam/179
17:10:34 [2020-01-14T22:10:34.231Z] 29:     The s390x code generator currently doesn't support dmax/dmin (see issue #4276)
17:10:34 [2020-01-14T22:10:34.231Z] 29: Known Bug: Skipping test: UsingLoadParam/180
17:10:34 [2020-01-14T22:10:34.231Z] 29:     The s390x code generator currently doesn't support dmax/dmin (see issue #4276)
17:10:34 [2020-01-14T22:10:34.231Z] 29: Known Bug: Skipping test: UsingLoadParam/181
17:10:34 [2020-01-14T22:10:34.231Z] 29:     The s390x code generator currently doesn't support dmax/dmin (see issue #4276)
17:10:34 [2020-01-14T22:10:34.231Z] 29: Known Bug: Skipping test: UsingLoadParam/182
17:10:34 [2020-01-14T22:10:34.231Z] 29:     The s390x code generator currently doesn't support dmax/dmin (see issue #4276)
17:10:34 [2020-01-14T22:10:34.231Z] 29: Known Bug: Skipping test: UsingLoadParam/183
17:10:34 [2020-01-14T22:10:34.231Z] 29:     The s390x code generator currently doesn't support dmax/dmin (see issue #4276)
17:10:34 [2020-01-14T22:10:34.231Z] 29: Known Bug: Skipping test: UsingLoadParam/184
17:10:34 [2020-01-14T22:10:34.231Z] 29:     The s390x code generator currently doesn't support dmax/dmin (see issue #4276)
17:10:34 [2020-01-14T22:10:34.231Z] 29: Known Bug: Skipping test: UsingLoadParam/185
17:10:34 [2020-01-14T22:10:34.231Z] 29:     The s390x code generator currently doesn't support dmax/dmin (see issue #4276)
17:10:34 [2020-01-14T22:10:34.231Z] 29: Known Bug: Skipping test: UsingLoadParam/186
17:10:34 [2020-01-14T22:10:34.231Z] 29:     The s390x code generator currently doesn't support dmax/dmin (see issue #4276)
17:10:34 [2020-01-14T22:10:34.231Z] 29: Known Bug: Skipping test: UsingLoadParam/187
17:10:34 [2020-01-14T22:10:34.231Z] 29:     The s390x code generator currently doesn't support dmax/dmin (see issue #4276)
17:10:34 [2020-01-14T22:10:34.231Z] 29: Known Bug: Skipping test: UsingLoadParam/188
17:10:34 [2020-01-14T22:10:34.231Z] 29:     The s390x code generator currently doesn't support dmax/dmin (see issue #4276)
17:10:34 [2020-01-14T22:10:34.231Z] 29: Known Bug: Skipping test: UsingLoadParam/189
17:10:34 [2020-01-14T22:10:34.231Z] 29:     The s390x code generator currently doesn't support dmax/dmin (see issue #4276)
17:10:34 [2020-01-14T22:10:34.231Z] 29: Known Bug: Skipping test: UsingLoadParam/190
17:10:34 [2020-01-14T22:10:34.231Z] 29:     The s390x code generator currently doesn't support dmax/dmin (see issue #4276)
17:10:34 [2020-01-14T22:10:34.231Z] 29: Known Bug: Skipping test: UsingLoadParam/191
17:10:34 [2020-01-14T22:10:34.231Z] 29:     The s390x code generator currently doesn't support dmax/dmin (see issue #4276)
17:10:34 [2020-01-14T22:10:34.231Z] 29: Known Bug: Skipping test: UsingLoadParam/192
17:10:34 [2020-01-14T22:10:34.231Z] 29:     The s390x code generator currently doesn't support dmax/dmin (see issue #4276)
17:10:34 [2020-01-14T22:10:34.231Z] 29: Known Bug: Skipping test: UsingLoadParam/193
17:10:34 [2020-01-14T22:10:34.231Z] 29:     The s390x code generator currently doesn't support dmax/dmin (see issue #4276)
17:10:34 [2020-01-14T22:10:34.231Z] 29: Known Bug: Skipping test: UsingLoadParam/194
17:10:34 [2020-01-14T22:10:34.231Z] 29:     The s390x code generator currently doesn't support dmax/dmin (see issue #4276)
17:10:34 [2020-01-14T22:10:34.231Z] 29: Known Bug: Skipping test: UsingLoadParam/195
17:10:34 [2020-01-14T22:10:34.231Z] 29:     The s390x code generator currently doesn't support dmax/dmin (see issue #4276)
17:10:34 [2020-01-14T22:10:34.231Z] 29: Known Bug: Skipping test: UsingLoadParam/196
17:10:34 [2020-01-14T22:10:34.231Z] 29:     The s390x code generator currently doesn't support dmax/dmin (see issue #4276)
17:10:34 [2020-01-14T22:10:34.231Z] 29: Known Bug: Skipping test: UsingLoadParam/197
17:10:34 [2020-01-14T22:10:34.231Z] 29:     The s390x code generator currently doesn't support dmax/dmin (see issue #4276)
17:10:34 [2020-01-14T22:10:34.231Z] 29: Known Bug: Skipping test: UsingLoadParam/198
17:10:34 [2020-01-14T22:10:34.231Z] 29:     The s390x code generator currently doesn't support dmax/dmin (see issue #4276)
17:10:34 [2020-01-14T22:10:34.231Z] 29: Known Bug: Skipping test: UsingLoadParam/199
17:10:34 [2020-01-14T22:10:34.231Z] 29:     The s390x code generator currently doesn't support dmax/dmin (see issue #4276)
17:10:34 [2020-01-14T22:10:34.231Z] 29: Known Bug: Skipping test: UsingLoadParam/200
17:10:34 [2020-01-14T22:10:34.231Z] 29:     The s390x code generator currently doesn't support dmax/dmin (see issue #4276)
17:10:34 [2020-01-14T22:10:34.231Z] 29: Known Bug: Skipping test: UsingLoadParam/201
17:10:34 [2020-01-14T22:10:34.231Z] 29:     The s390x code generator currently doesn't support dmax/dmin (see issue #4276)
17:10:34 [2020-01-14T22:10:34.231Z] 29: Known Bug: Skipping test: UsingLoadParam/202
17:10:34 [2020-01-14T22:10:34.231Z] 29:     The s390x code generator currently doesn't support dmax/dmin (see issue #4276)
17:10:34 [2020-01-14T22:10:34.231Z] 29: Known Bug: Skipping test: UsingLoadParam/203
17:10:34 [2020-01-14T22:10:34.231Z] 29:     The s390x code generator currently doesn't support dmax/dmin (see issue #4276)
17:10:34 [2020-01-14T22:10:34.231Z] 29: Known Bug: Skipping test: UsingLoadParam/204
17:10:34 [2020-01-14T22:10:34.231Z] 29:     The s390x code generator currently doesn't support dmax/dmin (see issue #4276)
17:10:34 [2020-01-14T22:10:34.231Z] 29: Known Bug: Skipping test: UsingLoadParam/205
17:10:34 [2020-01-14T22:10:34.231Z] 29:     The s390x code generator currently doesn't support dmax/dmin (see issue #4276)
17:10:34 [2020-01-14T22:10:34.231Z] 29: Known Bug: Skipping test: UsingLoadParam/206
17:10:34 [2020-01-14T22:10:34.231Z] 29:     The s390x code generator currently doesn't support dmax/dmin (see issue #4276)
17:10:34 [2020-01-14T22:10:34.231Z] 29: Known Bug: Skipping test: UsingLoadParam/207
17:10:34 [2020-01-14T22:10:34.231Z] 29:     The s390x code generator currently doesn't support dmax/dmin (see issue #4276)
17:10:34 [2020-01-14T22:10:34.231Z] 29: Known Bug: Skipping test: UsingLoadParam/208
17:10:34 [2020-01-14T22:10:34.231Z] 29:     The s390x code generator currently doesn't support dmax/dmin (see issue #4276)
17:10:34 [2020-01-14T22:10:34.231Z] 29: Known Bug: Skipping test: UsingLoadParam/209
17:10:34 [2020-01-14T22:10:34.231Z] 29:     The s390x code generator currently doesn't support dmax/dmin (see issue #4276)
17:10:34 [2020-01-14T22:10:34.231Z] 29: Known Bug: Skipping test: UsingLoadParam/210
17:10:34 [2020-01-14T22:10:34.231Z] 29:     The s390x code generator currently doesn't support dmax/dmin (see issue #4276)
17:10:34 [2020-01-14T22:10:34.231Z] 29: Known Bug: Skipping test: UsingLoadParam/211
17:10:34 [2020-01-14T22:10:34.231Z] 29:     The s390x code generator currently doesn't support dmax/dmin (see issue #4276)
17:10:34 [2020-01-14T22:10:34.231Z] 29: Known Bug: Skipping test: UsingLoadParam/212
17:10:34 [2020-01-14T22:10:34.231Z] 29:     The s390x code generator currently doesn't support dmax/dmin (see issue #4276)
17:10:34 [2020-01-14T22:10:34.231Z] 29: Known Bug: Skipping test: UsingLoadParam/213
17:10:34 [2020-01-14T22:10:34.231Z] 29:     The s390x code generator currently doesn't support dmax/dmin (see issue #4276)
17:10:34 [2020-01-14T22:10:34.231Z] 29: Known Bug: Skipping test: UsingLoadParam/214
17:10:34 [2020-01-14T22:10:34.231Z] 29:     The s390x code generator currently doesn't support dmax/dmin (see issue #4276)
17:10:34 [2020-01-14T22:10:34.231Z] 29: Known Bug: Skipping test: UsingLoadParam/215
17:10:34 [2020-01-14T22:10:34.231Z] 29:     The s390x code generator currently doesn't support dmax/dmin (see issue #4276)
17:10:34 [2020-01-14T22:10:34.231Z] 29: Known Bug: Skipping test: UsingLoadParam/216
17:10:34 [2020-01-14T22:10:34.231Z] 29:     The s390x code generator currently doesn't support dmax/dmin (see issue #4276)
17:10:34 [2020-01-14T22:10:34.231Z] 29: Known Bug: Skipping test: UsingLoadParam/217
17:10:34 [2020-01-14T22:10:34.231Z] 29:     The s390x code generator currently doesn't support dmax/dmin (see issue #4276)
17:10:34 [2020-01-14T22:10:34.231Z] 29: Known Bug: Skipping test: UsingLoadParam/218
17:10:34 [2020-01-14T22:10:34.231Z] 29:     The s390x code generator currently doesn't support dmax/dmin (see issue #4276)
17:10:34 [2020-01-14T22:10:34.231Z] 29: Known Bug: Skipping test: UsingLoadParam/219
17:10:34 [2020-01-14T22:10:34.231Z] 29:     The s390x code generator currently doesn't support dmax/dmin (see issue #4276)
17:10:34 [2020-01-14T22:10:34.231Z] 29: Known Bug: Skipping test: UsingLoadParam/220
17:10:34 [2020-01-14T22:10:34.231Z] 29:     The s390x code generator currently doesn't support dmax/dmin (see issue #4276)
17:10:34 [2020-01-14T22:10:34.231Z] 29: Known Bug: Skipping test: UsingLoadParam/221
17:10:34 [2020-01-14T22:10:34.231Z] 29:     The s390x code generator currently doesn't support dmax/dmin (see issue #4276)
17:10:34 [2020-01-14T22:10:34.231Z] 29: Known Bug: Skipping test: UsingLoadParam/222
17:10:34 [2020-01-14T22:10:34.231Z] 29:     The s390x code generator currently doesn't support dmax/dmin (see issue #4276)
17:10:34 [2020-01-14T22:10:34.231Z] 29: Known Bug: Skipping test: UsingLoadParam/223
17:10:34 [2020-01-14T22:10:34.231Z] 29:     The s390x code generator currently doesn't support dmax/dmin (see issue #4276)
17:10:34 [2020-01-14T22:10:34.231Z] 29: Known Bug: Skipping test: UsingLoadParam/224
17:10:34 [2020-01-14T22:10:34.231Z] 29:     The s390x code generator currently doesn't support dmax/dmin (see issue #4276)
17:10:34 [2020-01-14T22:10:34.231Z] 29: Known Bug: Skipping test: UsingLoadParam/225
17:10:34 [2020-01-14T22:10:34.231Z] 29:     The s390x code generator currently doesn't support dmax/dmin (see issue #4276)
17:10:34 [2020-01-14T22:10:34.231Z] 29: Known Bug: Skipping test: UsingLoadParam/226
17:10:34 [2020-01-14T22:10:34.231Z] 29:     The s390x code generator currently doesn't support dmax/dmin (see issue #4276)
17:10:34 [2020-01-14T22:10:34.231Z] 29: Known Bug: Skipping test: UsingLoadParam/227
17:10:34 [2020-01-14T22:10:34.231Z] 29:     The s390x code generator currently doesn't support dmax/dmin (see issue #4276)
17:10:34 [2020-01-14T22:10:34.231Z] 29: Known Bug: Skipping test: UsingLoadParam/228
17:10:34 [2020-01-14T22:10:34.231Z] 29:     The s390x code generator currently doesn't support dmax/dmin (see issue #4276)
17:10:34 [2020-01-14T22:10:34.231Z] 29: Known Bug: Skipping test: UsingLoadParam/229
17:10:34 [2020-01-14T22:10:34.231Z] 29:     The s390x code generator currently doesn't support dmax/dmin (see issue #4276)
17:10:34 [2020-01-14T22:10:34.231Z] 29: Known Bug: Skipping test: UsingLoadParam/230
17:10:34 [2020-01-14T22:10:34.231Z] 29:     The s390x code generator currently doesn't support dmax/dmin (see issue #4276)
17:10:34 [2020-01-14T22:10:34.231Z] 29: Known Bug: Skipping test: UsingLoadParam/231
17:10:34 [2020-01-14T22:10:34.231Z] 29:     The s390x code generator currently doesn't support dmax/dmin (see issue #4276)
17:10:34 [2020-01-14T22:10:34.231Z] 29: Known Bug: Skipping test: UsingLoadParam/232
17:10:34 [2020-01-14T22:10:34.231Z] 29:     The s390x code generator currently doesn't support dmax/dmin (see issue #4276)
17:10:34 [2020-01-14T22:10:34.231Z] 29: Known Bug: Skipping test: UsingLoadParam/233
17:10:34 [2020-01-14T22:10:34.231Z] 29:     The s390x code generator currently doesn't support dmax/dmin (see issue #4276)
17:10:34 [2020-01-14T22:10:34.231Z] 29: Known Bug: Skipping test: UsingLoadParam/234
17:10:34 [2020-01-14T22:10:34.231Z] 29:     The s390x code generator currently doesn't support dmax/dmin (see issue #4276)
17:10:34 [2020-01-14T22:10:34.231Z] 29: Known Bug: Skipping test: UsingLoadParam/235
17:10:34 [2020-01-14T22:10:34.231Z] 29:     The s390x code generator currently doesn't support dmax/dmin (see issue #4276)
17:10:34 [2020-01-14T22:10:34.231Z] 29: Known Bug: Skipping test: UsingLoadParam/236
17:10:34 [2020-01-14T22:10:34.231Z] 29:     The s390x code generator currently doesn't support dmax/dmin (see issue #4276)
17:10:34 [2020-01-14T22:10:34.232Z] 29: Known Bug: Skipping test: UsingLoadParam/237
17:10:34 [2020-01-14T22:10:34.232Z] 29:     The s390x code generator currently doesn't support dmax/dmin (see issue #4276)
17:10:34 [2020-01-14T22:10:34.232Z] 29: Known Bug: Skipping test: UsingLoadParam/238
17:10:34 [2020-01-14T22:10:34.232Z] 29:     The s390x code generator currently doesn't support dmax/dmin (see issue #4276)
17:10:34 [2020-01-14T22:10:34.232Z] 29: Known Bug: Skipping test: UsingLoadParam/239
17:10:34 [2020-01-14T22:10:34.232Z] 29:     The s390x code generator currently doesn't support dmax/dmin (see issue #4276)
17:10:34 [2020-01-14T22:10:34.232Z] 29: Known Bug: Skipping test: UsingLoadParam/240
17:10:34 [2020-01-14T22:10:34.232Z] 29:     The s390x code generator currently doesn't support dmax/dmin (see issue #4276)
17:10:34 [2020-01-14T22:10:34.232Z] 29: Known Bug: Skipping test: UsingLoadParam/241
17:10:34 [2020-01-14T22:10:34.232Z] 29:     The s390x code generator currently doesn't support dmax/dmin (see issue #4276)
17:10:34 [2020-01-14T22:10:34.232Z] 29: Known Bug: Skipping test: UsingLoadParam/242
17:10:34 [2020-01-14T22:10:34.232Z] 29:     The s390x code generator currently doesn't support dmax/dmin (see issue #4276)
17:10:34 [2020-01-14T22:10:34.232Z] 29: Known Bug: Skipping test: UsingLoadParam/243
17:10:34 [2020-01-14T22:10:34.232Z] 29:     The s390x code generator currently doesn't support dmax/dmin (see issue #4276)
17:10:34 [2020-01-14T22:10:34.232Z] 29: Known Bug: Skipping test: UsingLoadParam/244
17:10:34 [2020-01-14T22:10:34.232Z] 29:     The s390x code generator currently doesn't support dmax/dmin (see issue #4276)
17:10:34 [2020-01-14T22:10:34.232Z] 29: Known Bug: Skipping test: UsingLoadParam/245
17:10:34 [2020-01-14T22:10:34.232Z] 29:     The s390x code generator currently doesn't support dmax/dmin (see issue #4276)
17:10:34 [2020-01-14T22:10:34.232Z] 29: Known Bug: Skipping test: UsingLoadParam/246
17:10:34 [2020-01-14T22:10:34.232Z] 29:     The s390x code generator currently doesn't support dmax/dmin (see issue #4276)
17:10:34 [2020-01-14T22:10:34.232Z] 29: Known Bug: Skipping test: UsingLoadParam/247
17:10:34 [2020-01-14T22:10:34.232Z] 29:     The s390x code generator currently doesn't support dmax/dmin (see issue #4276)
17:10:34 [2020-01-14T22:10:34.232Z] 29: Known Bug: Skipping test: UsingLoadParam/248
17:10:34 [2020-01-14T22:10:34.232Z] 29:     The s390x code generator currently doesn't support dmax/dmin (see issue #4276)
17:10:34 [2020-01-14T22:10:34.232Z] 29: Known Bug: Skipping test: UsingLoadParam/249
17:10:34 [2020-01-14T22:10:34.232Z] 29:     The s390x code generator currently doesn't support dmax/dmin (see issue #4276)
17:10:34 [2020-01-14T22:10:34.232Z] 29: Known Bug: Skipping test: UsingLoadParam/250
17:10:34 [2020-01-14T22:10:34.232Z] 29:     The s390x code generator currently doesn't support dmax/dmin (see issue #4276)
17:10:34 [2020-01-14T22:10:34.232Z] 29: Known Bug: Skipping test: UsingLoadParam/251
17:10:34 [2020-01-14T22:10:34.232Z] 29:     The s390x code generator currently doesn't support dmax/dmin (see issue #4276)
17:10:34 [2020-01-14T22:10:34.232Z] 29: Known Bug: Skipping test: UsingLoadParam/252
17:10:34 [2020-01-14T22:10:34.232Z] 29:     The s390x code generator currently doesn't support dmax/dmin (see issue #4276)
17:10:34 [2020-01-14T22:10:34.232Z] 29: Known Bug: Skipping test: UsingLoadParam/253
17:10:34 [2020-01-14T22:10:34.232Z] 29:     The s390x code generator currently doesn't support dmax/dmin (see issue #4276)
17:10:34 [2020-01-14T22:10:34.232Z] 29: Known Bug: Skipping test: UsingLoadParam/254
17:10:34 [2020-01-14T22:10:34.232Z] 29:     The s390x code generator currently doesn't support dmax/dmin (see issue #4276)
17:10:34 [2020-01-14T22:10:34.232Z] 29: Known Bug: Skipping test: UsingLoadParam/255
17:10:34 [2020-01-14T22:10:34.232Z] 29:     The s390x code generator currently doesn't support dmax/dmin (see issue #4276)
17:10:34 [2020-01-14T22:10:34.232Z] 29: Known Bug: Skipping test: UsingLoadParam/256
17:10:34 [2020-01-14T22:10:34.232Z] 29:     The s390x code generator currently doesn't support dmax/dmin (see issue #4276)
17:10:34 [2020-01-14T22:10:34.232Z] 29: Known Bug: Skipping test: UsingLoadParam/257
17:10:34 [2020-01-14T22:10:34.232Z] 29:     The s390x code generator currently doesn't support dmax/dmin (see issue #4276)
17:10:34 [2020-01-14T22:10:34.232Z] 29: Known Bug: Skipping test: UsingLoadParam/258
17:10:34 [2020-01-14T22:10:34.232Z] 29:     The s390x code generator currently doesn't support dmax/dmin (see issue #4276)
17:10:34 [2020-01-14T22:10:34.232Z] 29: Known Bug: Skipping test: UsingLoadParam/259
17:10:34 [2020-01-14T22:10:34.232Z] 29:     The s390x code generator currently doesn't support dmax/dmin (see issue #4276)
17:10:34 [2020-01-14T22:10:34.232Z] 29: Known Bug: Skipping test: UsingLoadParam/260
17:10:34 [2020-01-14T22:10:34.232Z] 29:     The s390x code generator currently doesn't support dmax/dmin (see issue #4276)
17:10:34 [2020-01-14T22:10:34.232Z] 29: Known Bug: Skipping test: UsingLoadParam/261
17:10:34 [2020-01-14T22:10:34.232Z] 29:     The s390x code generator currently doesn't support dmax/dmin (see issue #4276)
17:10:34 [2020-01-14T22:10:34.232Z] 29: Known Bug: Skipping test: UsingLoadParam/262
17:10:34 [2020-01-14T22:10:34.232Z] 29:     The s390x code generator currently doesn't support dmax/dmin (see issue #4276)
17:10:34 [2020-01-14T22:10:34.232Z] 29: Known Bug: Skipping test: UsingLoadParam/263
17:10:34 [2020-01-14T22:10:34.232Z] 29:     The s390x code generator currently doesn't support dmax/dmin (see issue #4276)
17:10:34 [2020-01-14T22:10:34.232Z] 29: Known Bug: Skipping test: UsingLoadParam/264
17:10:34 [2020-01-14T22:10:34.232Z] 29:     The s390x code generator currently doesn't support dmax/dmin (see issue #4276)
17:10:34 [2020-01-14T22:10:34.232Z] 29: Known Bug: Skipping test: UsingLoadParam/265
17:10:34 [2020-01-14T22:10:34.232Z] 29:     The s390x code generator currently doesn't support dmax/dmin (see issue #4276)
17:10:34 [2020-01-14T22:10:34.232Z] 29: Known Bug: Skipping test: UsingLoadParam/266
17:10:34 [2020-01-14T22:10:34.232Z] 29:     The s390x code generator currently doesn't support dmax/dmin (see issue #4276)
17:10:34 [2020-01-14T22:10:34.232Z] 29: Known Bug: Skipping test: UsingLoadParam/267
17:10:34 [2020-01-14T22:10:34.232Z] 29:     The s390x code generator currently doesn't support dmax/dmin (see issue #4276)
17:10:34 [2020-01-14T22:10:34.232Z] 29: Known Bug: Skipping test: UsingLoadParam/268
17:10:34 [2020-01-14T22:10:34.232Z] 29:     The s390x code generator currently doesn't support dmax/dmin (see issue #4276)
17:10:34 [2020-01-14T22:10:34.232Z] 29: Known Bug: Skipping test: UsingLoadParam/269
17:10:34 [2020-01-14T22:10:34.232Z] 29:     The s390x code generator currently doesn't support dmax/dmin (see issue #4276)
17:10:34 [2020-01-14T22:10:34.232Z] 29: Known Bug: Skipping test: UsingLoadParam/270
17:10:34 [2020-01-14T22:10:34.232Z] 29:     The s390x code generator currently doesn't support dmax/dmin (see issue #4276)
17:10:34 [2020-01-14T22:10:34.232Z] 29: Known Bug: Skipping test: UsingLoadParam/271
17:10:34 [2020-01-14T22:10:34.232Z] 29:     The s390x code generator currently doesn't support dmax/dmin (see issue #4276)
17:10:34 [2020-01-14T22:10:34.232Z] 29: Known Bug: Skipping test: UsingLoadParam/272
17:10:34 [2020-01-14T22:10:34.232Z] 29:     The s390x code generator currently doesn't support dmax/dmin (see issue #4276)
17:10:34 [2020-01-14T22:10:34.232Z] 29: Known Bug: Skipping test: UsingLoadParam/273
17:10:34 [2020-01-14T22:10:34.232Z] 29:     The s390x code generator currently doesn't support dmax/dmin (see issue #4276)
17:10:34 [2020-01-14T22:10:34.232Z] 29: Known Bug: Skipping test: UsingLoadParam/274
17:10:34 [2020-01-14T22:10:34.232Z] 29:     The s390x code generator currently doesn't support dmax/dmin (see issue #4276)
17:10:34 [2020-01-14T22:10:34.232Z] 29: Known Bug: Skipping test: UsingLoadParam/275
17:10:34 [2020-01-14T22:10:34.232Z] 29:     The s390x code generator currently doesn't support dmax/dmin (see issue #4276)
17:10:34 [2020-01-14T22:10:34.232Z] 29: Known Bug: Skipping test: UsingLoadParam/276
17:10:34 [2020-01-14T22:10:34.232Z] 29:     The s390x code generator currently doesn't support dmax/dmin (see issue #4276)
17:10:34 [2020-01-14T22:10:34.232Z] 29: Known Bug: Skipping test: UsingLoadParam/277
17:10:34 [2020-01-14T22:10:34.232Z] 29:     The s390x code generator currently doesn't support dmax/dmin (see issue #4276)
17:10:34 [2020-01-14T22:10:34.232Z] 29: Known Bug: Skipping test: UsingLoadParam/278
17:10:34 [2020-01-14T22:10:34.232Z] 29:     The s390x code generator currently doesn't support dmax/dmin (see issue #4276)
17:10:34 [2020-01-14T22:10:34.232Z] 29: Known Bug: Skipping test: UsingLoadParam/279
17:10:34 [2020-01-14T22:10:34.232Z] 29:     The s390x code generator currently doesn't support dmax/dmin (see issue #4276)
17:10:34 [2020-01-14T22:10:34.232Z] 29: Known Bug: Skipping test: UsingLoadParam/280
17:10:34 [2020-01-14T22:10:34.232Z] 29:     The s390x code generator currently doesn't support dmax/dmin (see issue #4276)
17:10:34 [2020-01-14T22:10:34.232Z] 29: Known Bug: Skipping test: UsingLoadParam/281
17:10:34 [2020-01-14T22:10:34.232Z] 29:     The s390x code generator currently doesn't support dmax/dmin (see issue #4276)
17:10:34 [2020-01-14T22:10:34.232Z] 29: Known Bug: Skipping test: UsingLoadParam/282
17:10:34 [2020-01-14T22:10:34.232Z] 29:     The s390x code generator currently doesn't support dmax/dmin (see issue #4276)
17:10:34 [2020-01-14T22:10:34.232Z] 29: Known Bug: Skipping test: UsingLoadParam/283
17:10:34 [2020-01-14T22:10:34.232Z] 29:     The s390x code generator currently doesn't support dmax/dmin (see issue #4276)
17:10:34 [2020-01-14T22:10:34.232Z] 29: Known Bug: Skipping test: UsingLoadParam/284
17:10:34 [2020-01-14T22:10:34.232Z] 29:     The s390x code generator currently doesn't support dmax/dmin (see issue #4276)
17:10:34 [2020-01-14T22:10:34.232Z] 29: Known Bug: Skipping test: UsingLoadParam/285
17:10:34 [2020-01-14T22:10:34.232Z] 29:     The s390x code generator currently doesn't support dmax/dmin (see issue #4276)
17:10:34 [2020-01-14T22:10:34.232Z] 29: Known Bug: Skipping test: UsingLoadParam/286
17:10:34 [2020-01-14T22:10:34.232Z] 29:     The s390x code generator currently doesn't support dmax/dmin (see issue #4276)
17:10:34 [2020-01-14T22:10:34.232Z] 29: Known Bug: Skipping test: UsingLoadParam/287
17:10:34 [2020-01-14T22:10:34.232Z] 29:     The s390x code generator currently doesn't support dmax/dmin (see issue #4276)
17:10:34 [2020-01-14T22:10:34.232Z] 29: Known Bug: Skipping test: UsingLoadParam/288
17:10:34 [2020-01-14T22:10:34.232Z] 29:     The s390x code generator currently doesn't support dmax/dmin (see issue #4276)
17:10:34 [2020-01-14T22:10:34.232Z] 29: Known Bug: Skipping test: UsingLoadParam/289
17:10:34 [2020-01-14T22:10:34.232Z] 29:     The s390x code generator currently doesn't support dmax/dmin (see issue #4276)
17:10:34 [2020-01-14T22:10:34.232Z] 29: Known Bug: Skipping test: UsingLoadParam/290
17:10:34 [2020-01-14T22:10:34.232Z] 29:     The s390x code generator currently doesn't support dmax/dmin (see issue #4276)
17:10:34 [2020-01-14T22:10:34.232Z] 29: Known Bug: Skipping test: UsingLoadParam/291
17:10:34 [2020-01-14T22:10:34.232Z] 29:     The s390x code generator currently doesn't support dmax/dmin (see issue #4276)
17:10:34 [2020-01-14T22:10:34.232Z] 29: Known Bug: Skipping test: UsingLoadParam/292
17:10:34 [2020-01-14T22:10:34.232Z] 29:     The s390x code generator currently doesn't support dmax/dmin (see issue #4276)
17:10:34 [2020-01-14T22:10:34.232Z] 29: Known Bug: Skipping test: UsingLoadParam/293
17:10:34 [2020-01-14T22:10:34.232Z] 29:     The s390x code generator currently doesn't support dmax/dmin (see issue #4276)
17:10:34 [2020-01-14T22:10:34.232Z] 29: Known Bug: Skipping test: UsingLoadParam/294
17:10:34 [2020-01-14T22:10:34.232Z] 29:     The s390x code generator currently doesn't support dmax/dmin (see issue #4276)
17:10:34 [2020-01-14T22:10:34.232Z] 29: Known Bug: Skipping test: UsingLoadParam/295
17:10:34 [2020-01-14T22:10:34.232Z] 29:     The s390x code generator currently doesn't support dmax/dmin (see issue #4276)
17:10:34 [2020-01-14T22:10:34.232Z] 29: Known Bug: Skipping test: UsingLoadParam/296
17:10:34 [2020-01-14T22:10:34.232Z] 29:     The s390x code generator currently doesn't support dmax/dmin (see issue #4276)
17:10:34 [2020-01-14T22:10:34.232Z] 29: Known Bug: Skipping test: UsingLoadParam/297
17:10:34 [2020-01-14T22:10:34.232Z] 29:     The s390x code generator currently doesn't support dmax/dmin (see issue #4276)
17:10:34 [2020-01-14T22:10:34.232Z] 29: Known Bug: Skipping test: UsingLoadParam/298
17:10:34 [2020-01-14T22:10:34.232Z] 29:     The s390x code generator currently doesn't support dmax/dmin (see issue #4276)
17:10:34 [2020-01-14T22:10:34.232Z] 29: Known Bug: Skipping test: UsingLoadParam/299
17:10:34 [2020-01-14T22:10:34.232Z] 29:     The s390x code generator currently doesn't support dmax/dmin (see issue #4276)
17:10:34 [2020-01-14T22:10:34.232Z] 29: Known Bug: Skipping test: UsingLoadParam/300
17:10:34 [2020-01-14T22:10:34.232Z] 29:     The s390x code generator currently doesn't support dmax/dmin (see issue #4276)
17:10:34 [2020-01-14T22:10:34.232Z] 29: Known Bug: Skipping test: UsingLoadParam/301
17:10:34 [2020-01-14T22:10:34.232Z] 29:     The s390x code generator currently doesn't support dmax/dmin (see issue #4276)
17:10:34 [2020-01-14T22:10:34.232Z] 29: Known Bug: Skipping test: UsingLoadParam/302
17:10:34 [2020-01-14T22:10:34.232Z] 29:     The s390x code generator currently doesn't support dmax/dmin (see issue #4276)
17:10:34 [2020-01-14T22:10:34.232Z] 29: Known Bug: Skipping test: UsingLoadParam/303
17:10:34 [2020-01-14T22:10:34.232Z] 29:     The s390x code generator currently doesn't support dmax/dmin (see issue #4276)
17:10:34 [2020-01-14T22:10:34.232Z] 29: Known Bug: Skipping test: UsingLoadParam/304
17:10:34 [2020-01-14T22:10:34.232Z] 29:     The s390x code generator currently doesn't support dmax/dmin (see issue #4276)
17:10:34 [2020-01-14T22:10:34.232Z] 29: Known Bug: Skipping test: UsingLoadParam/305
17:10:34 [2020-01-14T22:10:34.232Z] 29:     The s390x code generator currently doesn't support dmax/dmin (see issue #4276)
17:10:34 [2020-01-14T22:10:34.232Z] 29: Known Bug: Skipping test: UsingLoadParam/306
17:10:34 [2020-01-14T22:10:34.232Z] 29:     The s390x code generator currently doesn't support dmax/dmin (see issue #4276)
17:10:34 [2020-01-14T22:10:34.232Z] 29: Known Bug: Skipping test: UsingLoadParam/307
17:10:34 [2020-01-14T22:10:34.232Z] 29:     The s390x code generator currently doesn't support dmax/dmin (see issue #4276)
17:10:34 [2020-01-14T22:10:34.232Z] 29: Known Bug: Skipping test: UsingLoadParam/308
17:10:34 [2020-01-14T22:10:34.232Z] 29:     The s390x code generator currently doesn't support dmax/dmin (see issue #4276)
17:10:34 [2020-01-14T22:10:34.232Z] 29: Known Bug: Skipping test: UsingLoadParam/309
17:10:34 [2020-01-14T22:10:34.232Z] 29:     The s390x code generator currently doesn't support dmax/dmin (see issue #4276)
17:10:34 [2020-01-14T22:10:34.232Z] 29: Known Bug: Skipping test: UsingLoadParam/310
17:10:34 [2020-01-14T22:10:34.232Z] 29:     The s390x code generator currently doesn't support dmax/dmin (see issue #4276)
17:10:34 [2020-01-14T22:10:34.232Z] 29: Known Bug: Skipping test: UsingLoadParam/311
17:10:34 [2020-01-14T22:10:34.232Z] 29:     The s390x code generator currently doesn't support dmax/dmin (see issue #4276)
17:10:34 [2020-01-14T22:10:34.232Z] 29: Known Bug: Skipping test: UsingLoadParam/312
17:10:34 [2020-01-14T22:10:34.232Z] 29:     The s390x code generator currently doesn't support dmax/dmin (see issue #4276)
17:10:34 [2020-01-14T22:10:34.232Z] 29: Known Bug: Skipping test: UsingLoadParam/313
17:10:34 [2020-01-14T22:10:34.232Z] 29:     The s390x code generator currently doesn't support dmax/dmin (see issue #4276)
17:10:34 [2020-01-14T22:10:34.232Z] 29: Known Bug: Skipping test: UsingLoadParam/314
17:10:34 [2020-01-14T22:10:34.232Z] 29:     The s390x code generator currently doesn't support dmax/dmin (see issue #4276)
17:10:34 [2020-01-14T22:10:34.232Z] 29: Known Bug: Skipping test: UsingLoadParam/315
17:10:34 [2020-01-14T22:10:34.232Z] 29:     The s390x code generator currently doesn't support dmax/dmin (see issue #4276)
17:10:34 [2020-01-14T22:10:34.232Z] 29: Known Bug: Skipping test: UsingLoadParam/316
17:10:34 [2020-01-14T22:10:34.232Z] 29:     The s390x code generator currently doesn't support dmax/dmin (see issue #4276)
17:10:34 [2020-01-14T22:10:34.232Z] 29: Known Bug: Skipping test: UsingLoadParam/317
17:10:34 [2020-01-14T22:10:34.232Z] 29:     The s390x code generator currently doesn't support dmax/dmin (see issue #4276)
17:10:34 [2020-01-14T22:10:34.232Z] 29: Known Bug: Skipping test: UsingLoadParam/318
17:10:34 [2020-01-14T22:10:34.232Z] 29:     The s390x code generator currently doesn't support dmax/dmin (see issue #4276)
17:10:34 [2020-01-14T22:10:34.232Z] 29: Known Bug: Skipping test: UsingLoadParam/319
17:10:34 [2020-01-14T22:10:34.232Z] 29:     The s390x code generator currently doesn't support dmax/dmin (see issue #4276)
17:10:34 [2020-01-14T22:10:34.232Z] 29: Known Bug: Skipping test: UsingLoadParam/320
17:10:34 [2020-01-14T22:10:34.232Z] 29:     The s390x code generator currently doesn't support dmax/dmin (see issue #4276)
17:10:34 [2020-01-14T22:10:34.232Z] 29: Known Bug: Skipping test: UsingLoadParam/321
17:10:34 [2020-01-14T22:10:34.232Z] 29:     The s390x code generator currently doesn't support dmax/dmin (see issue #4276)
17:10:34 [2020-01-14T22:10:34.232Z] 29: Known Bug: Skipping test: UsingLoadParam/322
17:10:34 [2020-01-14T22:10:34.232Z] 29:     The s390x code generator currently doesn't support dmax/dmin (see issue #4276)
17:10:34 [2020-01-14T22:10:34.232Z] 29: Known Bug: Skipping test: UsingLoadParam/323
17:10:34 [2020-01-14T22:10:34.232Z] 29:     The s390x code generator currently doesn't support dmax/dmin (see issue #4276)
17:10:34 [2020-01-14T22:10:34.232Z] 29: Known Bug: Skipping test: UsingLoadParam/324
17:10:34 [2020-01-14T22:10:34.232Z] 29:     The s390x code generator currently doesn't support dmax/dmin (see issue #4276)
17:10:34 [2020-01-14T22:10:34.232Z] 29: Known Bug: Skipping test: UsingLoadParam/325
17:10:34 [2020-01-14T22:10:34.232Z] 29:     The s390x code generator currently doesn't support dmax/dmin (see issue #4276)
17:10:34 [2020-01-14T22:10:34.232Z] 29: Known Bug: Skipping test: UsingLoadParam/326
17:10:34 [2020-01-14T22:10:34.232Z] 29:     The s390x code generator currently doesn't support dmax/dmin (see issue #4276)
17:10:34 [2020-01-14T22:10:34.232Z] 29: Known Bug: Skipping test: UsingLoadParam/327
17:10:34 [2020-01-14T22:10:34.232Z] 29:     The s390x code generator currently doesn't support dmax/dmin (see issue #4276)
17:10:34 [2020-01-14T22:10:34.232Z] 29: Known Bug: Skipping test: UsingLoadParam/328
17:10:34 [2020-01-14T22:10:34.232Z] 29:     The s390x code generator currently doesn't support dmax/dmin (see issue #4276)
17:10:34 [2020-01-14T22:10:34.232Z] 29: Known Bug: Skipping test: UsingLoadParam/329
17:10:34 [2020-01-14T22:10:34.232Z] 29:     The s390x code generator currently doesn't support dmax/dmin (see issue #4276)
17:10:34 [2020-01-14T22:10:34.232Z] 29: Known Bug: Skipping test: UsingLoadParam/330
17:10:34 [2020-01-14T22:10:34.232Z] 29:     The s390x code generator currently doesn't support dmax/dmin (see issue #4276)
17:10:34 [2020-01-14T22:10:34.232Z] 29: Known Bug: Skipping test: UsingLoadParam/331
17:10:34 [2020-01-14T22:10:34.233Z] 29:     The s390x code generator currently doesn't support dmax/dmin (see issue #4276)
17:10:34 [2020-01-14T22:10:34.233Z] 29: Known Bug: Skipping test: UsingLoadParam/332
17:10:34 [2020-01-14T22:10:34.233Z] 29:     The s390x code generator currently doesn't support dmax/dmin (see issue #4276)
17:10:34 [2020-01-14T22:10:34.233Z] 29: Known Bug: Skipping test: UsingLoadParam/333
17:10:34 [2020-01-14T22:10:34.233Z] 29:     The s390x code generator currently doesn't support dmax/dmin (see issue #4276)
17:10:34 [2020-01-14T22:10:34.233Z] 29: Known Bug: Skipping test: UsingLoadParam/334
17:10:34 [2020-01-14T22:10:34.233Z] 29:     The s390x code generator currently doesn't support dmax/dmin (see issue #4276)
17:10:34 [2020-01-14T22:10:34.233Z] 29: Known Bug: Skipping test: UsingLoadParam/335
17:10:34 [2020-01-14T22:10:34.233Z] 29:     The s390x code generator currently doesn't support dmax/dmin (see issue #4276)
17:10:34 [2020-01-14T22:10:34.233Z] 29: Known Bug: Skipping test: UsingLoadParam/336
17:10:34 [2020-01-14T22:10:34.233Z] 29:     The s390x code generator currently doesn't support dmax/dmin (see issue #4276)
17:10:34 [2020-01-14T22:10:34.233Z] 29: Known Bug: Skipping test: UsingLoadParam/337
17:10:34 [2020-01-14T22:10:34.233Z] 29:     The s390x code generator currently doesn't support dmax/dmin (see issue #4276)
17:10:34 [2020-01-14T22:10:34.233Z] 29: Known Bug: Skipping test: UsingLoadParam/338
17:10:34 [2020-01-14T22:10:34.233Z] 29:     The s390x code generator currently doesn't support dmax/dmin (see issue #4276)
17:10:34 [2020-01-14T22:10:34.233Z] 29: Known Bug: Skipping test: UsingLoadParam/339
17:10:34 [2020-01-14T22:10:34.233Z] 29:     The s390x code generator currently doesn't support dmax/dmin (see issue #4276)
17:10:34 [2020-01-14T22:10:34.233Z] 29: Known Bug: Skipping test: UsingLoadParam/340
17:10:34 [2020-01-14T22:10:34.233Z] 29:     The s390x code generator currently doesn't support dmax/dmin (see issue #4276)
17:10:34 [2020-01-14T22:10:34.233Z] 29: Known Bug: Skipping test: UsingLoadParam/341
17:10:34 [2020-01-14T22:10:34.233Z] 29:     The s390x code generator currently doesn't support dmax/dmin (see issue #4276)
17:10:34 [2020-01-14T22:10:34.233Z] 29: Known Bug: Skipping test: UsingLoadParam/342
17:10:34 [2020-01-14T22:10:34.233Z] 29:     The s390x code generator currently doesn't support dmax/dmin (see issue #4276)
17:10:34 [2020-01-14T22:10:34.233Z] 29: Known Bug: Skipping test: UsingLoadParam/343
17:10:34 [2020-01-14T22:10:34.233Z] 29:     The s390x code generator currently doesn't support dmax/dmin (see issue #4276)
17:10:34 [2020-01-14T22:10:34.233Z] 29: Known Bug: Skipping test: UsingLoadParam/344
17:10:34 [2020-01-14T22:10:34.233Z] 29:     The s390x code generator currently doesn't support dmax/dmin (see issue #4276)
17:10:34 [2020-01-14T22:10:34.233Z] 29: Known Bug: Skipping test: UsingLoadParam/345
17:10:34 [2020-01-14T22:10:34.233Z] 29:     The s390x code generator currently doesn't support dmax/dmin (see issue #4276)
17:10:34 [2020-01-14T22:10:34.233Z] 29: Known Bug: Skipping test: UsingLoadParam/346
17:10:34 [2020-01-14T22:10:34.233Z] 29:     The s390x code generator currently doesn't support dmax/dmin (see issue #4276)
17:10:34 [2020-01-14T22:10:34.233Z] 29: Known Bug: Skipping test: UsingLoadParam/347
17:10:34 [2020-01-14T22:10:34.233Z] 29:     The s390x code generator currently doesn't support dmax/dmin (see issue #4276)
17:10:34 [2020-01-14T22:10:34.233Z] 29: Known Bug: Skipping test: UsingLoadParam/348
17:10:34 [2020-01-14T22:10:34.233Z] 29:     The s390x code generator currently doesn't support dmax/dmin (see issue #4276)
17:10:34 [2020-01-14T22:10:34.233Z] 29: Known Bug: Skipping test: UsingLoadParam/349
17:10:34 [2020-01-14T22:10:34.233Z] 29:     The s390x code generator currently doesn't support dmax/dmin (see issue #4276)
17:10:34 [2020-01-14T22:10:34.233Z] 29: Known Bug: Skipping test: UsingLoadParam/350
17:10:34 [2020-01-14T22:10:34.233Z] 29:     The s390x code generator currently doesn't support dmax/dmin (see issue #4276)
17:10:34 [2020-01-14T22:10:34.233Z] 29: Known Bug: Skipping test: UsingLoadParam/351
17:10:34 [2020-01-14T22:10:34.233Z] 29:     The s390x code generator currently doesn't support dmax/dmin (see issue #4276)
17:10:34 [2020-01-14T22:10:34.233Z] 29: Known Bug: Skipping test: UsingLoadParam/352
17:10:34 [2020-01-14T22:10:34.233Z] 29:     The s390x code generator currently doesn't support dmax/dmin (see issue #4276)
17:10:34 [2020-01-14T22:10:34.233Z] 29: Known Bug: Skipping test: UsingLoadParam/353
17:10:34 [2020-01-14T22:10:34.233Z] 29:     The s390x code generator currently doesn't support dmax/dmin (see issue #4276)
17:10:34 [2020-01-14T22:10:34.233Z] 29: Known Bug: Skipping test: UsingLoadParam/354
17:10:34 [2020-01-14T22:10:34.233Z] 29:     The s390x code generator currently doesn't support dmax/dmin (see issue #4276)
17:10:34 [2020-01-14T22:10:34.233Z] 29: Known Bug: Skipping test: UsingLoadParam/355
17:10:34 [2020-01-14T22:10:34.233Z] 29:     The s390x code generator currently doesn't support dmax/dmin (see issue #4276)
17:10:34 [2020-01-14T22:10:34.233Z] 29: Known Bug: Skipping test: UsingLoadParam/356
17:10:34 [2020-01-14T22:10:34.233Z] 29:     The s390x code generator currently doesn't support dmax/dmin (see issue #4276)
17:10:34 [2020-01-14T22:10:34.233Z] 29: Known Bug: Skipping test: UsingLoadParam/357
17:10:34 [2020-01-14T22:10:34.233Z] 29:     The s390x code generator currently doesn't support dmax/dmin (see issue #4276)
17:10:34 [2020-01-14T22:10:34.233Z] 29: Known Bug: Skipping test: UsingLoadParam/358
17:10:34 [2020-01-14T22:10:34.233Z] 29:     The s390x code generator currently doesn't support dmax/dmin (see issue #4276)
17:10:34 [2020-01-14T22:10:34.233Z] 29: Known Bug: Skipping test: UsingLoadParam/359
17:10:34 [2020-01-14T22:10:34.233Z] 29:     The s390x code generator currently doesn't support dmax/dmin (see issue #4276)
17:10:34 [2020-01-14T22:10:34.233Z] 29: Known Bug: Skipping test: UsingLoadParam/360
17:10:34 [2020-01-14T22:10:34.233Z] 29:     The s390x code generator currently doesn't support dmax/dmin (see issue #4276)
17:10:34 [2020-01-14T22:10:34.233Z] 29: Known Bug: Skipping test: UsingLoadParam/361
17:10:34 [2020-01-14T22:10:34.233Z] 29:     The s390x code generator currently doesn't support dmax/dmin (see issue #4276)
17:10:34 [2020-01-14T22:10:34.233Z] 29: Known Bug: Skipping test: UsingLoadParam/362
17:10:34 [2020-01-14T22:10:34.233Z] 29:     The s390x code generator currently doesn't support dmax/dmin (see issue #4276)
17:10:34 [2020-01-14T22:10:34.233Z] 29: Known Bug: Skipping test: UsingLoadParam/363
17:10:34 [2020-01-14T22:10:34.233Z] 29:     The s390x code generator currently doesn't support dmax/dmin (see issue #4276)
17:10:34 [2020-01-14T22:10:34.233Z] 29: Known Bug: Skipping test: UsingLoadParam/364
17:10:34 [2020-01-14T22:10:34.233Z] 29:     The s390x code generator currently doesn't support dmax/dmin (see issue #4276)
17:10:34 [2020-01-14T22:10:34.233Z] 29: Known Bug: Skipping test: UsingLoadParam/365
17:10:34 [2020-01-14T22:10:34.233Z] 29:     The s390x code generator currently doesn't support dmax/dmin (see issue #4276)
17:10:34 [2020-01-14T22:10:34.233Z] 29: Known Bug: Skipping test: UsingLoadParam/366
17:10:34 [2020-01-14T22:10:34.233Z] 29:     The s390x code generator currently doesn't support dmax/dmin (see issue #4276)
17:10:34 [2020-01-14T22:10:34.233Z] 29: Known Bug: Skipping test: UsingLoadParam/367
17:10:34 [2020-01-14T22:10:34.233Z] 29:     The s390x code generator currently doesn't support dmax/dmin (see issue #4276)
17:10:34 [2020-01-14T22:10:34.233Z] 29: Known Bug: Skipping test: UsingLoadParam/368
17:10:34 [2020-01-14T22:10:34.233Z] 29:     The s390x code generator currently doesn't support dmax/dmin (see issue #4276)
17:10:34 [2020-01-14T22:10:34.233Z] 29: Known Bug: Skipping test: UsingLoadParam/369
17:10:34 [2020-01-14T22:10:34.233Z] 29:     The s390x code generator currently doesn't support dmax/dmin (see issue #4276)
17:10:34 [2020-01-14T22:10:34.233Z] 29: Known Bug: Skipping test: UsingLoadParam/370
17:10:34 [2020-01-14T22:10:34.233Z] 29:     The s390x code generator currently doesn't support dmax/dmin (see issue #4276)
17:10:34 [2020-01-14T22:10:34.233Z] 29: Known Bug: Skipping test: UsingLoadParam/371
17:10:34 [2020-01-14T22:10:34.233Z] 29:     The s390x code generator currently doesn't support dmax/dmin (see issue #4276)
17:10:34 [2020-01-14T22:10:34.233Z] 29: Known Bug: Skipping test: UsingLoadParam/372
17:10:34 [2020-01-14T22:10:34.233Z] 29:     The s390x code generator currently doesn't support dmax/dmin (see issue #4276)
17:10:34 [2020-01-14T22:10:34.233Z] 29: Known Bug: Skipping test: UsingLoadParam/373
17:10:34 [2020-01-14T22:10:34.233Z] 29:     The s390x code generator currently doesn't support dmax/dmin (see issue #4276)
17:10:34 [2020-01-14T22:10:34.233Z] 29: Known Bug: Skipping test: UsingLoadParam/374
17:10:34 [2020-01-14T22:10:34.233Z] 29:     The s390x code generator currently doesn't support dmax/dmin (see issue #4276)
17:10:34 [2020-01-14T22:10:34.233Z] 29: Known Bug: Skipping test: UsingLoadParam/375
17:10:34 [2020-01-14T22:10:34.233Z] 29:     The s390x code generator currently doesn't support dmax/dmin (see issue #4276)
17:10:34 [2020-01-14T22:10:34.233Z] 29: Known Bug: Skipping test: UsingLoadParam/376
17:10:34 [2020-01-14T22:10:34.233Z] 29:     The s390x code generator currently doesn't support dmax/dmin (see issue #4276)
17:10:34 [2020-01-14T22:10:34.233Z] 29: Known Bug: Skipping test: UsingLoadParam/377
17:10:34 [2020-01-14T22:10:34.233Z] 29:     The s390x code generator currently doesn't support dmax/dmin (see issue #4276)
17:10:34 [2020-01-14T22:10:34.233Z] 29: Known Bug: Skipping test: UsingLoadParam/378
17:10:34 [2020-01-14T22:10:34.233Z] 29:     The s390x code generator currently doesn't support dmax/dmin (see issue #4276)
17:10:34 [2020-01-14T22:10:34.233Z] 29: Known Bug: Skipping test: UsingLoadParam/379
17:10:34 [2020-01-14T22:10:34.233Z] 29:     The s390x code generator currently doesn't support dmax/dmin (see issue #4276)
17:10:34 [2020-01-14T22:10:34.233Z] 29: Known Bug: Skipping test: UsingLoadParam/380
17:10:34 [2020-01-14T22:10:34.233Z] 29:     The s390x code generator currently doesn't support dmax/dmin (see issue #4276)
17:10:34 [2020-01-14T22:10:34.233Z] 29: Known Bug: Skipping test: UsingLoadParam/381
17:10:34 [2020-01-14T22:10:34.233Z] 29:     The s390x code generator currently doesn't support dmax/dmin (see issue #4276)
17:10:34 [2020-01-14T22:10:34.233Z] 29: Known Bug: Skipping test: UsingLoadParam/382
17:10:34 [2020-01-14T22:10:34.233Z] 29:     The s390x code generator currently doesn't support dmax/dmin (see issue #4276)
17:10:34 [2020-01-14T22:10:34.233Z] 29: Known Bug: Skipping test: UsingLoadParam/383
17:10:34 [2020-01-14T22:10:34.233Z] 29:     The s390x code generator currently doesn't support dmax/dmin (see issue #4276)
17:10:34 [2020-01-14T22:10:34.233Z] 29: Known Bug: Skipping test: UsingLoadParam/384
17:10:34 [2020-01-14T22:10:34.233Z] 29:     The s390x code generator currently doesn't support dmax/dmin (see issue #4276)
17:10:34 [2020-01-14T22:10:34.233Z] 29: Known Bug: Skipping test: UsingLoadParam/385
17:10:34 [2020-01-14T22:10:34.233Z] 29:     The s390x code generator currently doesn't support dmax/dmin (see issue #4276)
17:10:34 [2020-01-14T22:10:34.233Z] 29: Known Bug: Skipping test: UsingLoadParam/386
17:10:34 [2020-01-14T22:10:34.233Z] 29:     The s390x code generator currently doesn't support dmax/dmin (see issue #4276)
17:10:34 [2020-01-14T22:10:34.233Z] 29: Known Bug: Skipping test: UsingLoadParam/387
17:10:34 [2020-01-14T22:10:34.233Z] 29:     The s390x code generator currently doesn't support dmax/dmin (see issue #4276)
17:10:34 [2020-01-14T22:10:34.233Z] 29: Known Bug: Skipping test: UsingLoadParam/388
17:10:34 [2020-01-14T22:10:34.233Z] 29:     The s390x code generator currently doesn't support dmax/dmin (see issue #4276)
17:10:34 [2020-01-14T22:10:34.233Z] 29: Known Bug: Skipping test: UsingLoadParam/389
17:10:34 [2020-01-14T22:10:34.233Z] 29:     The s390x code generator currently doesn't support dmax/dmin (see issue #4276)
17:10:34 [2020-01-14T22:10:34.233Z] 29: Known Bug: Skipping test: UsingLoadParam/390
17:10:34 [2020-01-14T22:10:34.233Z] 29:     The s390x code generator currently doesn't support dmax/dmin (see issue #4276)
17:10:34 [2020-01-14T22:10:34.233Z] 29: Known Bug: Skipping test: UsingLoadParam/391
17:10:34 [2020-01-14T22:10:34.233Z] 29:     The s390x code generator currently doesn't support dmax/dmin (see issue #4276)
17:10:34 [2020-01-14T22:10:34.233Z] 29: Known Bug: Skipping test: UsingLoadParam/392
17:10:34 [2020-01-14T22:10:34.233Z] 29:     The s390x code generator currently doesn't support dmax/dmin (see issue #4276)
17:10:34 [2020-01-14T22:10:34.233Z] 29: Known Bug: Skipping test: UsingLoadParam/393
17:10:34 [2020-01-14T22:10:34.233Z] 29:     The s390x code generator currently doesn't support dmax/dmin (see issue #4276)
17:10:34 [2020-01-14T22:10:34.233Z] 29: Known Bug: Skipping test: UsingLoadParam/394
17:10:34 [2020-01-14T22:10:34.233Z] 29:     The s390x code generator currently doesn't support dmax/dmin (see issue #4276)
17:10:34 [2020-01-14T22:10:34.233Z] 29: Known Bug: Skipping test: UsingLoadParam/395
17:10:34 [2020-01-14T22:10:34.233Z] 29:     The s390x code generator currently doesn't support dmax/dmin (see issue #4276)
17:10:34 [2020-01-14T22:10:34.233Z] 29: Known Bug: Skipping test: UsingLoadParam/396
17:10:34 [2020-01-14T22:10:34.233Z] 29:     The s390x code generator currently doesn't support dmax/dmin (see issue #4276)
17:10:34 [2020-01-14T22:10:34.233Z] 29: Known Bug: Skipping test: UsingLoadParam/397
17:10:34 [2020-01-14T22:10:34.233Z] 29:     The s390x code generator currently doesn't support dmax/dmin (see issue #4276)
17:10:34 [2020-01-14T22:10:34.233Z] 29: Known Bug: Skipping test: UsingLoadParam/398
17:10:34 [2020-01-14T22:10:34.233Z] 29:     The s390x code generator currently doesn't support dmax/dmin (see issue #4276)
17:10:34 [2020-01-14T22:10:34.233Z] 29: Known Bug: Skipping test: UsingLoadParam/399
17:10:34 [2020-01-14T22:10:34.233Z] 29:     The s390x code generator currently doesn't support dmax/dmin (see issue #4276)
17:10:34 [2020-01-14T22:10:34.233Z] 29: Known Bug: Skipping test: UsingLoadParam/400
17:10:34 [2020-01-14T22:10:34.233Z] 29:     The s390x code generator currently doesn't support dmax/dmin (see issue #4276)
17:10:34 [2020-01-14T22:10:34.233Z] 29: Known Bug: Skipping test: UsingLoadParam/401
17:10:34 [2020-01-14T22:10:34.233Z] 29:     The s390x code generator currently doesn't support dmax/dmin (see issue #4276)
17:10:34 [2020-01-14T22:10:34.233Z] 29: Known Bug: Skipping test: UsingLoadParam/402
17:10:34 [2020-01-14T22:10:34.233Z] 29:     The s390x code generator currently doesn't support dmax/dmin (see issue #4276)
17:10:34 [2020-01-14T22:10:34.233Z] 29: Known Bug: Skipping test: UsingLoadParam/403
17:10:34 [2020-01-14T22:10:34.233Z] 29:     The s390x code generator currently doesn't support dmax/dmin (see issue #4276)
17:10:34 [2020-01-14T22:10:34.233Z] 29: Known Bug: Skipping test: UsingLoadParam/404
17:10:34 [2020-01-14T22:10:34.233Z] 29:     The s390x code generator currently doesn't support dmax/dmin (see issue #4276)
17:10:34 [2020-01-14T22:10:34.233Z] 29: Known Bug: Skipping test: UsingLoadParam/405
17:10:34 [2020-01-14T22:10:34.233Z] 29:     The s390x code generator currently doesn't support dmax/dmin (see issue #4276)
17:10:34 [2020-01-14T22:10:34.233Z] 29: Known Bug: Skipping test: UsingLoadParam/406
17:10:34 [2020-01-14T22:10:34.233Z] 29:     The s390x code generator currently doesn't support dmax/dmin (see issue #4276)
17:10:34 [2020-01-14T22:10:34.233Z] 29: Known Bug: Skipping test: UsingLoadParam/407
17:10:34 [2020-01-14T22:10:34.233Z] 29:     The s390x code generator currently doesn't support dmax/dmin (see issue #4276)
17:10:34 [2020-01-14T22:10:34.233Z] 29: Known Bug: Skipping test: UsingLoadParam/408
17:10:34 [2020-01-14T22:10:34.233Z] 29:     The s390x code generator currently doesn't support dmax/dmin (see issue #4276)
17:10:34 [2020-01-14T22:10:34.233Z] 29: Known Bug: Skipping test: UsingLoadParam/409
17:10:34 [2020-01-14T22:10:34.233Z] 29:     The s390x code generator currently doesn't support dmax/dmin (see issue #4276)
17:10:34 [2020-01-14T22:10:34.233Z] 29: Known Bug: Skipping test: UsingLoadParam/410
17:10:34 [2020-01-14T22:10:34.233Z] 29:     The s390x code generator currently doesn't support dmax/dmin (see issue #4276)
17:10:34 [2020-01-14T22:10:34.233Z] 29: Known Bug: Skipping test: UsingLoadParam/411
17:10:34 [2020-01-14T22:10:34.233Z] 29:     The s390x code generator currently doesn't support dmax/dmin (see issue #4276)
17:10:34 [2020-01-14T22:10:34.233Z] 29: Known Bug: Skipping test: UsingLoadParam/412
17:10:34 [2020-01-14T22:10:34.233Z] 29:     The s390x code generator currently doesn't support dmax/dmin (see issue #4276)
17:10:34 [2020-01-14T22:10:34.233Z] 29: Known Bug: Skipping test: UsingLoadParam/413
17:10:34 [2020-01-14T22:10:34.233Z] 29:     The s390x code generator currently doesn't support dmax/dmin (see issue #4276)
17:10:34 [2020-01-14T22:10:34.233Z] 29: Known Bug: Skipping test: UsingLoadParam/414
17:10:34 [2020-01-14T22:10:34.233Z] 29:     The s390x code generator currently doesn't support dmax/dmin (see issue #4276)
17:10:34 [2020-01-14T22:10:34.233Z] 29: Known Bug: Skipping test: UsingLoadParam/415
17:10:34 [2020-01-14T22:10:34.233Z] 29:     The s390x code generator currently doesn't support dmax/dmin (see issue #4276)
17:10:34 [2020-01-14T22:10:34.233Z] 29: Known Bug: Skipping test: UsingLoadParam/416
17:10:34 [2020-01-14T22:10:34.233Z] 29:     The s390x code generator currently doesn't support dmax/dmin (see issue #4276)
17:10:34 [2020-01-14T22:10:34.233Z] 29: Known Bug: Skipping test: UsingLoadParam/417
17:10:34 [2020-01-14T22:10:34.233Z] 29:     The s390x code generator currently doesn't support dmax/dmin (see issue #4276)
17:10:34 [2020-01-14T22:10:34.233Z] 29: Known Bug: Skipping test: UsingLoadParam/418
17:10:34 [2020-01-14T22:10:34.233Z] 29:     The s390x code generator currently doesn't support dmax/dmin (see issue #4276)
17:10:34 [2020-01-14T22:10:34.233Z] 29: Known Bug: Skipping test: UsingLoadParam/419
17:10:34 [2020-01-14T22:10:34.233Z] 29:     The s390x code generator currently doesn't support dmax/dmin (see issue #4276)
17:10:34 [2020-01-14T22:10:34.233Z] 29: Known Bug: Skipping test: UsingLoadParam/420
17:10:34 [2020-01-14T22:10:34.233Z] 29:     The s390x code generator currently doesn't support dmax/dmin (see issue #4276)
17:10:34 [2020-01-14T22:10:34.233Z] 29: Known Bug: Skipping test: UsingLoadParam/421
17:10:34 [2020-01-14T22:10:34.233Z] 29:     The s390x code generator currently doesn't support dmax/dmin (see issue #4276)
17:10:34 [2020-01-14T22:10:34.233Z] 29: Known Bug: Skipping test: UsingLoadParam/422
17:10:34 [2020-01-14T22:10:34.233Z] 29:     The s390x code generator currently doesn't support dmax/dmin (see issue #4276)
17:10:34 [2020-01-14T22:10:34.233Z] 29: Known Bug: Skipping test: UsingLoadParam/423
17:10:34 [2020-01-14T22:10:34.233Z] 29:     The s390x code generator currently doesn't support dmax/dmin (see issue #4276)
17:10:34 [2020-01-14T22:10:34.233Z] 29: Known Bug: Skipping test: UsingLoadParam/424
17:10:34 [2020-01-14T22:10:34.233Z] 29:     The s390x code generator currently doesn't support dmax/dmin (see issue #4276)
17:10:34 [2020-01-14T22:10:34.233Z] 29: Known Bug: Skipping test: UsingLoadParam/425
17:10:34 [2020-01-14T22:10:34.233Z] 29:     The s390x code generator currently doesn't support dmax/dmin (see issue #4276)
17:10:34 [2020-01-14T22:10:34.233Z] 29: Known Bug: Skipping test: UsingLoadParam/426
17:10:34 [2020-01-14T22:10:34.233Z] 29:     The s390x code generator currently doesn't support dmax/dmin (see issue #4276)
17:10:34 [2020-01-14T22:10:34.233Z] 29: Known Bug: Skipping test: UsingLoadParam/427
17:10:34 [2020-01-14T22:10:34.233Z] 29:     The s390x code generator currently doesn't support dmax/dmin (see issue #4276)
17:10:34 [2020-01-14T22:10:34.233Z] 29: Known Bug: Skipping test: UsingLoadParam/428
17:10:34 [2020-01-14T22:10:34.233Z] 29:     The s390x code generator currently doesn't support dmax/dmin (see issue #4276)
17:10:34 [2020-01-14T22:10:34.233Z] 29: Known Bug: Skipping test: UsingLoadParam/429
17:10:34 [2020-01-14T22:10:34.233Z] 29:     The s390x code generator currently doesn't support dmax/dmin (see issue #4276)
17:10:34 [2020-01-14T22:10:34.233Z] 29: Known Bug: Skipping test: UsingLoadParam/430
17:10:34 [2020-01-14T22:10:34.234Z] 29:     The s390x code generator currently doesn't support dmax/dmin (see issue #4276)
17:10:34 [2020-01-14T22:10:34.234Z] 29: Known Bug: Skipping test: UsingLoadParam/431
17:10:34 [2020-01-14T22:10:34.234Z] 29:     The s390x code generator currently doesn't support dmax/dmin (see issue #4276)
17:10:34 [2020-01-14T22:10:34.234Z] 29: Known Bug: Skipping test: UsingLoadParam/432
17:10:34 [2020-01-14T22:10:34.234Z] 29:     The s390x code generator currently doesn't support dmax/dmin (see issue #4276)
17:10:34 [2020-01-14T22:10:34.234Z] 29: Known Bug: Skipping test: UsingLoadParam/433
17:10:34 [2020-01-14T22:10:34.234Z] 29:     The s390x code generator currently doesn't support dmax/dmin (see issue #4276)
17:10:34 [2020-01-14T22:10:34.234Z] 29: Known Bug: Skipping test: UsingLoadParam/434
17:10:34 [2020-01-14T22:10:34.234Z] 29:     The s390x code generator currently doesn't support dmax/dmin (see issue #4276)
17:10:34 [2020-01-14T22:10:34.234Z] 29: Known Bug: Skipping test: UsingLoadParam/435
17:10:34 [2020-01-14T22:10:34.234Z] 29:     The s390x code generator currently doesn't support dmax/dmin (see issue #4276)
17:10:34 [2020-01-14T22:10:34.234Z] 29: Known Bug: Skipping test: UsingLoadParam/436
17:10:34 [2020-01-14T22:10:34.234Z] 29:     The s390x code generator currently doesn't support dmax/dmin (see issue #4276)
17:10:34 [2020-01-14T22:10:34.234Z] 29: Known Bug: Skipping test: UsingLoadParam/437
17:10:34 [2020-01-14T22:10:34.234Z] 29:     The s390x code generator currently doesn't support dmax/dmin (see issue #4276)
17:10:34 [2020-01-14T22:10:34.234Z] 29: Known Bug: Skipping test: UsingLoadParam/438
17:10:34 [2020-01-14T22:10:34.234Z] 29:     The s390x code generator currently doesn't support dmax/dmin (see issue #4276)
17:10:34 [2020-01-14T22:10:34.234Z] 29: Known Bug: Skipping test: UsingLoadParam/439
17:10:34 [2020-01-14T22:10:34.234Z] 29:     The s390x code generator currently doesn't support dmax/dmin (see issue #4276)
17:10:34 [2020-01-14T22:10:34.234Z] 29: Known Bug: Skipping test: UsingLoadParam/440
17:10:34 [2020-01-14T22:10:34.234Z] 29:     The s390x code generator currently doesn't support dmax/dmin (see issue #4276)
17:10:34 [2020-01-14T22:10:34.234Z] 29: Known Bug: Skipping test: UsingLoadParam/441
17:10:34 [2020-01-14T22:10:34.234Z] 29:     The s390x code generator currently doesn't support dmax/dmin (see issue #4276)
17:10:34 [2020-01-14T22:10:34.234Z] 29: Known Bug: Skipping test: UsingLoadParam/442
17:10:34 [2020-01-14T22:10:34.234Z] 29:     The s390x code generator currently doesn't support dmax/dmin (see issue #4276)
17:10:34 [2020-01-14T22:10:34.234Z] 29: Known Bug: Skipping test: UsingLoadParam/443
17:10:34 [2020-01-14T22:10:34.234Z] 29:     The s390x code generator currently doesn't support dmax/dmin (see issue #4276)
17:10:34 [2020-01-14T22:10:34.234Z] 29: Known Bug: Skipping test: UsingLoadParam/444
17:10:34 [2020-01-14T22:10:34.234Z] 29:     The s390x code generator currently doesn't support dmax/dmin (see issue #4276)
17:10:34 [2020-01-14T22:10:34.234Z] 29: Known Bug: Skipping test: UsingLoadParam/445
17:10:34 [2020-01-14T22:10:34.234Z] 29:     The s390x code generator currently doesn't support dmax/dmin (see issue #4276)
17:10:34 [2020-01-14T22:10:34.234Z] 29: Known Bug: Skipping test: UsingLoadParam/446
17:10:34 [2020-01-14T22:10:34.234Z] 29:     The s390x code generator currently doesn't support dmax/dmin (see issue #4276)
17:10:34 [2020-01-14T22:10:34.234Z] 29: Known Bug: Skipping test: UsingLoadParam/447
17:10:34 [2020-01-14T22:10:34.234Z] 29:     The s390x code generator currently doesn't support dmax/dmin (see issue #4276)
17:10:34 [2020-01-14T22:10:34.234Z] 29: Known Bug: Skipping test: UsingLoadParam/448
17:10:34 [2020-01-14T22:10:34.234Z] 29:     The s390x code generator currently doesn't support dmax/dmin (see issue #4276)
17:10:34 [2020-01-14T22:10:34.234Z] 29: Known Bug: Skipping test: UsingLoadParam/449
17:10:34 [2020-01-14T22:10:34.234Z] 29:     The s390x code generator currently doesn't support dmax/dmin (see issue #4276)
17:10:34 [2020-01-14T22:10:34.234Z] 29: Known Bug: Skipping test: UsingLoadParam/450
17:10:34 [2020-01-14T22:10:34.234Z] 29:     The s390x code generator currently doesn't support dmax/dmin (see issue #4276)
17:10:34 [2020-01-14T22:10:34.234Z] 29: Known Bug: Skipping test: UsingLoadParam/451
17:10:34 [2020-01-14T22:10:34.234Z] 29:     The s390x code generator currently doesn't support dmax/dmin (see issue #4276)
17:10:34 [2020-01-14T22:10:34.234Z] 29: Known Bug: Skipping test: UsingLoadParam/452
17:10:34 [2020-01-14T22:10:34.234Z] 29:     The s390x code generator currently doesn't support dmax/dmin (see issue #4276)
17:10:34 [2020-01-14T22:10:34.234Z] 29: Known Bug: Skipping test: UsingLoadParam/453
17:10:34 [2020-01-14T22:10:34.234Z] 29:     The s390x code generator currently doesn't support dmax/dmin (see issue #4276)
17:10:34 [2020-01-14T22:10:34.234Z] 29: Known Bug: Skipping test: UsingLoadParam/454
17:10:34 [2020-01-14T22:10:34.234Z] 29:     The s390x code generator currently doesn't support dmax/dmin (see issue #4276)
17:10:34 [2020-01-14T22:10:34.234Z] 29: Known Bug: Skipping test: UsingLoadParam/455
17:10:34 [2020-01-14T22:10:34.234Z] 29:     The s390x code generator currently doesn't support dmax/dmin (see issue #4276)
17:10:34 [2020-01-14T22:10:34.234Z] 29: Known Bug: Skipping test: UsingLoadParam/456
17:10:34 [2020-01-14T22:10:34.234Z] 29:     The s390x code generator currently doesn't support dmax/dmin (see issue #4276)
17:10:34 [2020-01-14T22:10:34.234Z] 29: Known Bug: Skipping test: UsingLoadParam/457
17:10:34 [2020-01-14T22:10:34.234Z] 29:     The s390x code generator currently doesn't support dmax/dmin (see issue #4276)
17:10:34 [2020-01-14T22:10:34.234Z] 29: Known Bug: Skipping test: UsingLoadParam/458
17:10:34 [2020-01-14T22:10:34.234Z] 29:     The s390x code generator currently doesn't support dmax/dmin (see issue #4276)
17:10:34 [2020-01-14T22:10:34.234Z] 29: Known Bug: Skipping test: UsingLoadParam/459
17:10:34 [2020-01-14T22:10:34.234Z] 29:     The s390x code generator currently doesn't support dmax/dmin (see issue #4276)
17:10:34 [2020-01-14T22:10:34.234Z] 29: Known Bug: Skipping test: UsingLoadParam/460
17:10:34 [2020-01-14T22:10:34.234Z] 29:     The s390x code generator currently doesn't support dmax/dmin (see issue #4276)
17:10:34 [2020-01-14T22:10:34.234Z] 29: Known Bug: Skipping test: UsingLoadParam/461
17:10:34 [2020-01-14T22:10:34.234Z] 29:     The s390x code generator currently doesn't support dmax/dmin (see issue #4276)
17:10:34 [2020-01-14T22:10:34.234Z] 29: Known Bug: Skipping test: UsingLoadParam/462
17:10:34 [2020-01-14T22:10:34.234Z] 29:     The s390x code generator currently doesn't support dmax/dmin (see issue #4276)
17:10:34 [2020-01-14T22:10:34.234Z] 29: Known Bug: Skipping test: UsingLoadParam/463
17:10:34 [2020-01-14T22:10:34.234Z] 29:     The s390x code generator currently doesn't support dmax/dmin (see issue #4276)
17:10:34 [2020-01-14T22:10:34.234Z] 29: Known Bug: Skipping test: UsingLoadParam/464
17:10:34 [2020-01-14T22:10:34.234Z] 29:     The s390x code generator currently doesn't support dmax/dmin (see issue #4276)
17:10:34 [2020-01-14T22:10:34.234Z] 29: Known Bug: Skipping test: UsingLoadParam/465
17:10:34 [2020-01-14T22:10:34.234Z] 29:     The s390x code generator currently doesn't support dmax/dmin (see issue #4276)
17:10:34 [2020-01-14T22:10:34.234Z] 29: Known Bug: Skipping test: UsingLoadParam/466
17:10:34 [2020-01-14T22:10:34.234Z] 29:     The s390x code generator currently doesn't support dmax/dmin (see issue #4276)
17:10:34 [2020-01-14T22:10:34.234Z] 29: Known Bug: Skipping test: UsingLoadParam/467
17:10:34 [2020-01-14T22:10:34.234Z] 29:     The s390x code generator currently doesn't support dmax/dmin (see issue #4276)
17:10:34 [2020-01-14T22:10:34.234Z] 29: Known Bug: Skipping test: UsingLoadParam/468
17:10:34 [2020-01-14T22:10:34.234Z] 29:     The s390x code generator currently doesn't support dmax/dmin (see issue #4276)
17:10:34 [2020-01-14T22:10:34.234Z] 29: Known Bug: Skipping test: UsingLoadParam/469
17:10:34 [2020-01-14T22:10:34.234Z] 29:     The s390x code generator currently doesn't support dmax/dmin (see issue #4276)
17:10:34 [2020-01-14T22:10:34.234Z] 29: Known Bug: Skipping test: UsingLoadParam/470
17:10:34 [2020-01-14T22:10:34.234Z] 29:     The s390x code generator currently doesn't support dmax/dmin (see issue #4276)
17:10:34 [2020-01-14T22:10:34.234Z] 29: Known Bug: Skipping test: UsingLoadParam/471
17:10:34 [2020-01-14T22:10:34.234Z] 29:     The s390x code generator currently doesn't support dmax/dmin (see issue #4276)
17:10:34 [2020-01-14T22:10:34.234Z] 29: Known Bug: Skipping test: UsingLoadParam/472
17:10:34 [2020-01-14T22:10:34.234Z] 29:     The s390x code generator currently doesn't support dmax/dmin (see issue #4276)
17:10:34 [2020-01-14T22:10:34.234Z] 29: Known Bug: Skipping test: UsingLoadParam/473
17:10:34 [2020-01-14T22:10:34.234Z] 29:     The s390x code generator currently doesn't support dmax/dmin (see issue #4276)
17:10:34 [2020-01-14T22:10:34.234Z] 29: Known Bug: Skipping test: UsingLoadParam/474
17:10:34 [2020-01-14T22:10:34.234Z] 29:     The s390x code generator currently doesn't support dmax/dmin (see issue #4276)
17:10:34 [2020-01-14T22:10:34.234Z] 29: Known Bug: Skipping test: UsingLoadParam/475
17:10:34 [2020-01-14T22:10:34.234Z] 29:     The s390x code generator currently doesn't support dmax/dmin (see issue #4276)
17:10:34 [2020-01-14T22:10:34.234Z] 29: Known Bug: Skipping test: UsingLoadParam/476
17:10:34 [2020-01-14T22:10:34.234Z] 29:     The s390x code generator currently doesn't support dmax/dmin (see issue #4276)
17:10:34 [2020-01-14T22:10:34.234Z] 29: Known Bug: Skipping test: UsingLoadParam/477
17:10:34 [2020-01-14T22:10:34.234Z] 29:     The s390x code generator currently doesn't support dmax/dmin (see issue #4276)
17:10:34 [2020-01-14T22:10:34.234Z] 29: Known Bug: Skipping test: UsingLoadParam/478
17:10:34 [2020-01-14T22:10:34.234Z] 29:     The s390x code generator currently doesn't support dmax/dmin (see issue #4276)
17:10:34 [2020-01-14T22:10:34.234Z] 29: Known Bug: Skipping test: UsingLoadParam/479
17:10:34 [2020-01-14T22:10:34.234Z] 29:     The s390x code generator currently doesn't support dmax/dmin (see issue #4276)
17:10:34 [2020-01-14T22:10:34.234Z] 29: Known Bug: Skipping test: UsingLoadParam/480
17:10:34 [2020-01-14T22:10:34.234Z] 29:     The s390x code generator currently doesn't support dmax/dmin (see issue #4276)
17:10:34 [2020-01-14T22:10:34.234Z] 29: Known Bug: Skipping test: UsingLoadParam/481
17:10:34 [2020-01-14T22:10:34.234Z] 29:     The s390x code generator currently doesn't support dmax/dmin (see issue #4276)
17:10:34 [2020-01-14T22:10:34.234Z] 29: Known Bug: Skipping test: UsingLoadParam/482
17:10:34 [2020-01-14T22:10:34.234Z] 29:     The s390x code generator currently doesn't support dmax/dmin (see issue #4276)
17:10:34 [2020-01-14T22:10:34.234Z] 29: Known Bug: Skipping test: UsingLoadParam/483
17:10:34 [2020-01-14T22:10:34.234Z] 29:     The s390x code generator currently doesn't support dmax/dmin (see issue #4276)
17:10:34 [2020-01-14T22:10:34.234Z] 29: Known Bug: Skipping test: UsingLoadParam/484
17:10:34 [2020-01-14T22:10:34.234Z] 29:     The s390x code generator currently doesn't support dmax/dmin (see issue #4276)
17:10:34 [2020-01-14T22:10:34.234Z] 29: Known Bug: Skipping test: UsingLoadParam/485
17:10:34 [2020-01-14T22:10:34.234Z] 29:     The s390x code generator currently doesn't support dmax/dmin (see issue #4276)
17:10:34 [2020-01-14T22:10:34.234Z] 29: Known Bug: Skipping test: UsingLoadParam/486
17:10:34 [2020-01-14T22:10:34.234Z] 29:     The s390x code generator currently doesn't support dmax/dmin (see issue #4276)
17:10:34 [2020-01-14T22:10:34.234Z] 29: Known Bug: Skipping test: UsingLoadParam/487
17:10:34 [2020-01-14T22:10:34.234Z] 29:     The s390x code generator currently doesn't support dmax/dmin (see issue #4276)
17:10:34 [2020-01-14T22:10:34.234Z] 29: Known Bug: Skipping test: UsingLoadParam/488
17:10:34 [2020-01-14T22:10:34.234Z] 29:     The s390x code generator currently doesn't support dmax/dmin (see issue #4276)
17:10:34 [2020-01-14T22:10:34.234Z] 29: Known Bug: Skipping test: UsingLoadParam/489
17:10:34 [2020-01-14T22:10:34.234Z] 29:     The s390x code generator currently doesn't support dmax/dmin (see issue #4276)
17:10:34 [2020-01-14T22:10:34.234Z] 29: Known Bug: Skipping test: UsingLoadParam/490
17:10:34 [2020-01-14T22:10:34.234Z] 29:     The s390x code generator currently doesn't support dmax/dmin (see issue #4276)
17:10:34 [2020-01-14T22:10:34.234Z] 29: Known Bug: Skipping test: UsingLoadParam/491
17:10:34 [2020-01-14T22:10:34.234Z] 29:     The s390x code generator currently doesn't support dmax/dmin (see issue #4276)
17:10:34 [2020-01-14T22:10:34.234Z] 29: Known Bug: Skipping test: UsingLoadParam/492
17:10:34 [2020-01-14T22:10:34.234Z] 29:     The s390x code generator currently doesn't support dmax/dmin (see issue #4276)
17:10:34 [2020-01-14T22:10:34.234Z] 29: Known Bug: Skipping test: UsingLoadParam/493
17:10:34 [2020-01-14T22:10:34.234Z] 29:     The s390x code generator currently doesn't support dmax/dmin (see issue #4276)
17:10:34 [2020-01-14T22:10:34.234Z] 29: Known Bug: Skipping test: UsingLoadParam/494
17:10:34 [2020-01-14T22:10:34.234Z] 29:     The s390x code generator currently doesn't support dmax/dmin (see issue #4276)
17:10:34 [2020-01-14T22:10:34.234Z] 29: Known Bug: Skipping test: UsingLoadParam/495
17:10:34 [2020-01-14T22:10:34.234Z] 29:     The s390x code generator currently doesn't support dmax/dmin (see issue #4276)
17:10:34 [2020-01-14T22:10:34.234Z] 29: Known Bug: Skipping test: UsingLoadParam/496
17:10:34 [2020-01-14T22:10:34.234Z] 29:     The s390x code generator currently doesn't support dmax/dmin (see issue #4276)
17:10:34 [2020-01-14T22:10:34.234Z] 29: Known Bug: Skipping test: UsingLoadParam/497
17:10:34 [2020-01-14T22:10:34.234Z] 29:     The s390x code generator currently doesn't support dmax/dmin (see issue #4276)
17:10:34 [2020-01-14T22:10:34.234Z] 29: Known Bug: Skipping test: UsingLoadParam/498
17:10:34 [2020-01-14T22:10:34.234Z] 29:     The s390x code generator currently doesn't support dmax/dmin (see issue #4276)
17:10:34 [2020-01-14T22:10:34.234Z] 29: Known Bug: Skipping test: UsingLoadParam/499
17:10:34 [2020-01-14T22:10:34.234Z] 29:     The s390x code generator currently doesn't support dmax/dmin (see issue #4276)
17:10:34 [2020-01-14T22:10:34.234Z] 29: Known Bug: Skipping test: UsingLoadParam/500
17:10:34 [2020-01-14T22:10:34.234Z] 29:     The s390x code generator currently doesn't support dmax/dmin (see issue #4276)
17:10:34 [2020-01-14T22:10:34.234Z] 29: Known Bug: Skipping test: UsingLoadParam/501
17:10:34 [2020-01-14T22:10:34.234Z] 29:     The s390x code generator currently doesn't support dmax/dmin (see issue #4276)
17:10:34 [2020-01-14T22:10:34.234Z] 29: Known Bug: Skipping test: UsingLoadParam/502
17:10:34 [2020-01-14T22:10:34.234Z] 29:     The s390x code generator currently doesn't support dmax/dmin (see issue #4276)
17:10:34 [2020-01-14T22:10:34.234Z] 29: Known Bug: Skipping test: UsingLoadParam/503
17:10:34 [2020-01-14T22:10:34.234Z] 29:     The s390x code generator currently doesn't support dmax/dmin (see issue #4276)
17:10:34 [2020-01-14T22:10:34.234Z] 29: Known Bug: Skipping test: UsingLoadParam/504
17:10:34 [2020-01-14T22:10:34.234Z] 29:     The s390x code generator currently doesn't support dmax/dmin (see issue #4276)
17:10:34 [2020-01-14T22:10:34.234Z] 29: Known Bug: Skipping test: UsingLoadParam/505
17:10:34 [2020-01-14T22:10:34.234Z] 29:     The s390x code generator currently doesn't support dmax/dmin (see issue #4276)
17:10:34 [2020-01-14T22:10:34.234Z] 29: Known Bug: Skipping test: UsingLoadParam/506
17:10:34 [2020-01-14T22:10:34.234Z] 29:     The s390x code generator currently doesn't support dmax/dmin (see issue #4276)
17:10:34 [2020-01-14T22:10:34.234Z] 29: Known Bug: Skipping test: UsingLoadParam/507
17:10:34 [2020-01-14T22:10:34.234Z] 29:     The s390x code generator currently doesn't support dmax/dmin (see issue #4276)
17:10:34 [2020-01-14T22:10:34.234Z] 29: Known Bug: Skipping test: UsingLoadParam/508
17:10:34 [2020-01-14T22:10:34.234Z] 29:     The s390x code generator currently doesn't support dmax/dmin (see issue #4276)
17:10:34 [2020-01-14T22:10:34.234Z] 29: Known Bug: Skipping test: UsingLoadParam/509
17:10:34 [2020-01-14T22:10:34.234Z] 29:     The s390x code generator currently doesn't support dmax/dmin (see issue #4276)
17:10:34 [2020-01-14T22:10:34.234Z] 29: Known Bug: Skipping test: UsingLoadParam/510
17:10:34 [2020-01-14T22:10:34.234Z] 29:     The s390x code generator currently doesn't support dmax/dmin (see issue #4276)
17:10:34 [2020-01-14T22:10:34.234Z] 29: Known Bug: Skipping test: UsingLoadParam/511
17:10:34 [2020-01-14T22:10:34.234Z] 29:     The s390x code generator currently doesn't support dmax/dmin (see issue #4276)
17:10:34 [2020-01-14T22:10:34.234Z] 29: [----------] 1024 tests from MaxMin/DoubleMaxMin (64 ms total)
17:10:34 [2020-01-14T22:10:34.234Z] 29: 
17:10:34 [2020-01-14T22:10:34.234Z] 29: [----------] 2700 tests from CompareTest/Int32Compare
17:10:35 [2020-01-14T22:10:35.587Z] 29: [----------] 2700 tests from CompareTest/Int32Compare (1374 ms total)
17:10:35 [2020-01-14T22:10:35.587Z] 29: 
17:10:35 [2020-01-14T22:10:35.587Z] 29: [----------] 2888 tests from CompareTest/UInt32Compare
17:10:36 [2020-01-14T22:10:36.976Z] 29: [----------] 2888 tests from CompareTest/UInt32Compare (1535 ms total)
17:10:36 [2020-01-14T22:10:36.976Z] 29: 
17:10:36 [2020-01-14T22:10:36.976Z] 29: [----------] 4046 tests from CompareTest/Int64Compare
17:10:39 [2020-01-14T22:10:39.017Z] 29: [----------] 4046 tests from CompareTest/Int64Compare (2057 ms total)
17:10:39 [2020-01-14T22:10:39.017Z] 29: 
17:10:39 [2020-01-14T22:10:39.017Z] 29: [----------] 3528 tests from CompareTest/UInt64Compare
17:10:40 [2020-01-14T22:10:40.980Z] 29: [----------] 3528 tests from CompareTest/UInt64Compare (1774 ms total)
17:10:40 [2020-01-14T22:10:40.980Z] 29: 
17:10:40 [2020-01-14T22:10:40.980Z] 29: [----------] 2700 tests from CompareTest/Int32IfCompare
17:10:42 [2020-01-14T22:10:42.942Z] 29: [----------] 2700 tests from CompareTest/Int32IfCompare (2097 ms total)
17:10:42 [2020-01-14T22:10:42.942Z] 29: 
17:10:42 [2020-01-14T22:10:42.942Z] 29: [----------] 2888 tests from CompareTest/UInt32IfCompare
17:10:45 [2020-01-14T22:10:45.571Z] 29: [----------] 2888 tests from CompareTest/UInt32IfCompare (2270 ms total)
17:10:45 [2020-01-14T22:10:45.571Z] 29: 
17:10:45 [2020-01-14T22:10:45.571Z] 29: [----------] 3468 tests from CompareTest/Int64IfCompare
17:10:48 [2020-01-14T22:10:48.208Z] 29: [----------] 3468 tests from CompareTest/Int64IfCompare (2679 ms total)
17:10:48 [2020-01-14T22:10:48.208Z] 29: 
17:10:48 [2020-01-14T22:10:48.208Z] 29: [----------] 3528 tests from CompareTest/UInt64IfCompare
17:10:50 [2020-01-14T22:10:50.826Z] 29: [----------] 3528 tests from CompareTest/UInt64IfCompare (2735 ms total)
17:10:50 [2020-01-14T22:10:50.826Z] 29: 
17:10:50 [2020-01-14T22:10:50.826Z] 29: [----------] 2700 tests from CompareTest/FloatCompare
17:10:52 [2020-01-14T22:10:52.213Z] 29: [----------] 2700 tests from CompareTest/FloatCompare (1482 ms total)
17:10:52 [2020-01-14T22:10:52.213Z] 29: 
17:10:52 [2020-01-14T22:10:52.213Z] 29: [----------] 3072 tests from CompareTest/DoubleCompare
17:10:54 [2020-01-14T22:10:54.197Z] 29: [----------] 3072 tests from CompareTest/DoubleCompare (1723 ms total)
17:10:54 [2020-01-14T22:10:54.197Z] 29: 
17:10:54 [2020-01-14T22:10:54.197Z] 29: [----------] 2700 tests from CompareTest/FloatIfCompare
17:10:56 [2020-01-14T22:10:56.804Z] 29: [----------] 2700 tests from CompareTest/FloatIfCompare (2556 ms total)
17:10:56 [2020-01-14T22:10:56.804Z] 29: 
17:10:56 [2020-01-14T22:10:56.804Z] 29: [----------] 3072 tests from CompareTest/DoubleIfCompare
17:10:59 [2020-01-14T22:10:59.432Z] 29: [----------] 3072 tests from CompareTest/DoubleIfCompare (3050 ms total)
17:10:59 [2020-01-14T22:10:59.432Z] 29: 
17:10:59 [2020-01-14T22:10:59.432Z] 29: [----------] 18 tests from TypeConversionTest/Int8ToInt32
17:10:59 [2020-01-14T22:10:59.432Z] 29: Known Bug: Skipping test: UsingLoadParam/0
17:10:59 [2020-01-14T22:10:59.432Z] 29:     The Z code generator incorrectly spills sub-integer types arguments (see issue #3525)
17:10:59 [2020-01-14T22:10:59.432Z] 29: Known Bug: Skipping test: UsingLoadParam/1
17:10:59 [2020-01-14T22:10:59.432Z] 29:     The Z code generator incorrectly spills sub-integer types arguments (see issue #3525)
17:10:59 [2020-01-14T22:10:59.432Z] 29: Known Bug: Skipping test: UsingLoadParam/2
17:10:59 [2020-01-14T22:10:59.432Z] 29:     The Z code generator incorrectly spills sub-integer types arguments (see issue #3525)
17:10:59 [2020-01-14T22:10:59.432Z] 29: Known Bug: Skipping test: UsingLoadParam/3
17:10:59 [2020-01-14T22:10:59.432Z] 29:     The Z code generator incorrectly spills sub-integer types arguments (see issue #3525)
17:10:59 [2020-01-14T22:10:59.432Z] 29: Known Bug: Skipping test: UsingLoadParam/4
17:10:59 [2020-01-14T22:10:59.432Z] 29:     The Z code generator incorrectly spills sub-integer types arguments (see issue #3525)
17:10:59 [2020-01-14T22:10:59.432Z] 29: Known Bug: Skipping test: UsingLoadParam/5
17:10:59 [2020-01-14T22:10:59.432Z] 29:     The Z code generator incorrectly spills sub-integer types arguments (see issue #3525)
17:10:59 [2020-01-14T22:10:59.432Z] 29: Known Bug: Skipping test: UsingLoadParam/6
17:10:59 [2020-01-14T22:10:59.432Z] 29:     The Z code generator incorrectly spills sub-integer types arguments (see issue #3525)
17:10:59 [2020-01-14T22:10:59.432Z] 29: Known Bug: Skipping test: UsingLoadParam/7
17:10:59 [2020-01-14T22:10:59.432Z] 29:     The Z code generator incorrectly spills sub-integer types arguments (see issue #3525)
17:10:59 [2020-01-14T22:10:59.432Z] 29: Known Bug: Skipping test: UsingLoadParam/8
17:10:59 [2020-01-14T22:10:59.432Z] 29:     The Z code generator incorrectly spills sub-integer types arguments (see issue #3525)
17:10:59 [2020-01-14T22:10:59.432Z] 29: [----------] 18 tests from TypeConversionTest/Int8ToInt32 (5 ms total)
17:10:59 [2020-01-14T22:10:59.432Z] 29: 
17:10:59 [2020-01-14T22:10:59.432Z] 29: [----------] 18 tests from TypeConversionTest/UInt8ToInt32
17:10:59 [2020-01-14T22:10:59.432Z] 29: Known Bug: Skipping test: UsingLoadParam/0
17:10:59 [2020-01-14T22:10:59.432Z] 29:     The Z code generator incorrectly spills sub-integer types arguments (see issue #3525)
17:10:59 [2020-01-14T22:10:59.432Z] 29: Known Bug: Skipping test: UsingLoadParam/1
17:10:59 [2020-01-14T22:10:59.432Z] 29:     The Z code generator incorrectly spills sub-integer types arguments (see issue #3525)
17:10:59 [2020-01-14T22:10:59.432Z] 29: Known Bug: Skipping test: UsingLoadParam/2
17:10:59 [2020-01-14T22:10:59.432Z] 29:     The Z code generator incorrectly spills sub-integer types arguments (see issue #3525)
17:10:59 [2020-01-14T22:10:59.432Z] 29: Known Bug: Skipping test: UsingLoadParam/3
17:10:59 [2020-01-14T22:10:59.432Z] 29:     The Z code generator incorrectly spills sub-integer types arguments (see issue #3525)
17:10:59 [2020-01-14T22:10:59.432Z] 29: Known Bug: Skipping test: UsingLoadParam/4
17:10:59 [2020-01-14T22:10:59.432Z] 29:     The Z code generator incorrectly spills sub-integer types arguments (see issue #3525)
17:10:59 [2020-01-14T22:10:59.432Z] 29: Known Bug: Skipping test: UsingLoadParam/5
17:10:59 [2020-01-14T22:10:59.432Z] 29:     The Z code generator incorrectly spills sub-integer types arguments (see issue #3525)
17:10:59 [2020-01-14T22:10:59.432Z] 29: Known Bug: Skipping test: UsingLoadParam/6
17:10:59 [2020-01-14T22:10:59.432Z] 29:     The Z code generator incorrectly spills sub-integer types arguments (see issue #3525)
17:10:59 [2020-01-14T22:10:59.432Z] 29: Known Bug: Skipping test: UsingLoadParam/7
17:10:59 [2020-01-14T22:10:59.432Z] 29:     The Z code generator incorrectly spills sub-integer types arguments (see issue #3525)
17:10:59 [2020-01-14T22:10:59.432Z] 29: Known Bug: Skipping test: UsingLoadParam/8
17:10:59 [2020-01-14T22:10:59.432Z] 29:     The Z code generator incorrectly spills sub-integer types arguments (see issue #3525)
17:10:59 [2020-01-14T22:10:59.432Z] 29: [----------] 18 tests from TypeConversionTest/UInt8ToInt32 (5 ms total)
17:10:59 [2020-01-14T22:10:59.432Z] 29: 
17:10:59 [2020-01-14T22:10:59.432Z] 29: [----------] 18 tests from TypeConversionTest/Int8ToInt64
17:10:59 [2020-01-14T22:10:59.432Z] 29: Known Bug: Skipping test: UsingLoadParam/0
17:10:59 [2020-01-14T22:10:59.432Z] 29:     The Z code generator incorrectly spills sub-integer types arguments (see issue #3525)
17:10:59 [2020-01-14T22:10:59.432Z] 29: Known Bug: Skipping test: UsingLoadParam/1
17:10:59 [2020-01-14T22:10:59.432Z] 29:     The Z code generator incorrectly spills sub-integer types arguments (see issue #3525)
17:10:59 [2020-01-14T22:10:59.432Z] 29: Known Bug: Skipping test: UsingLoadParam/2
17:10:59 [2020-01-14T22:10:59.432Z] 29:     The Z code generator incorrectly spills sub-integer types arguments (see issue #3525)
17:10:59 [2020-01-14T22:10:59.432Z] 29: Known Bug: Skipping test: UsingLoadParam/3
17:10:59 [2020-01-14T22:10:59.432Z] 29:     The Z code generator incorrectly spills sub-integer types arguments (see issue #3525)
17:10:59 [2020-01-14T22:10:59.432Z] 29: Known Bug: Skipping test: UsingLoadParam/4
17:10:59 [2020-01-14T22:10:59.432Z] 29:     The Z code generator incorrectly spills sub-integer types arguments (see issue #3525)
17:10:59 [2020-01-14T22:10:59.432Z] 29: Known Bug: Skipping test: UsingLoadParam/5
17:10:59 [2020-01-14T22:10:59.432Z] 29:     The Z code generator incorrectly spills sub-integer types arguments (see issue #3525)
17:10:59 [2020-01-14T22:10:59.432Z] 29: Known Bug: Skipping test: UsingLoadParam/6
17:10:59 [2020-01-14T22:10:59.432Z] 29:     The Z code generator incorrectly spills sub-integer types arguments (see issue #3525)
17:10:59 [2020-01-14T22:10:59.432Z] 29: Known Bug: Skipping test: UsingLoadParam/7
17:10:59 [2020-01-14T22:10:59.432Z] 29:     The Z code generator incorrectly spills sub-integer types arguments (see issue #3525)
17:10:59 [2020-01-14T22:10:59.432Z] 29: Known Bug: Skipping test: UsingLoadParam/8
17:10:59 [2020-01-14T22:10:59.432Z] 29:     The Z code generator incorrectly spills sub-integer types arguments (see issue #3525)
17:10:59 [2020-01-14T22:10:59.432Z] 29: [----------] 18 tests from TypeConversionTest/Int8ToInt64 (4 ms total)
17:10:59 [2020-01-14T22:10:59.432Z] 29: 
17:10:59 [2020-01-14T22:10:59.432Z] 29: [----------] 18 tests from TypeConversionTest/UInt8ToInt64
17:10:59 [2020-01-14T22:10:59.432Z] 29: Known Bug: Skipping test: UsingLoadParam/0
17:10:59 [2020-01-14T22:10:59.432Z] 29:     The Z code generator incorrectly spills sub-integer types arguments (see issue #3525)
17:10:59 [2020-01-14T22:10:59.432Z] 29: Known Bug: Skipping test: UsingLoadParam/1
17:10:59 [2020-01-14T22:10:59.432Z] 29:     The Z code generator incorrectly spills sub-integer types arguments (see issue #3525)
17:10:59 [2020-01-14T22:10:59.432Z] 29: Known Bug: Skipping test: UsingLoadParam/2
17:10:59 [2020-01-14T22:10:59.432Z] 29:     The Z code generator incorrectly spills sub-integer types arguments (see issue #3525)
17:10:59 [2020-01-14T22:10:59.432Z] 29: Known Bug: Skipping test: UsingLoadParam/3
17:10:59 [2020-01-14T22:10:59.432Z] 29:     The Z code generator incorrectly spills sub-integer types arguments (see issue #3525)
17:10:59 [2020-01-14T22:10:59.432Z] 29: Known Bug: Skipping test: UsingLoadParam/4
17:10:59 [2020-01-14T22:10:59.432Z] 29:     The Z code generator incorrectly spills sub-integer types arguments (see issue #3525)
17:10:59 [2020-01-14T22:10:59.432Z] 29: Known Bug: Skipping test: UsingLoadParam/5
17:10:59 [2020-01-14T22:10:59.432Z] 29:     The Z code generator incorrectly spills sub-integer types arguments (see issue #3525)
17:10:59 [2020-01-14T22:10:59.432Z] 29: Known Bug: Skipping test: UsingLoadParam/6
17:10:59 [2020-01-14T22:10:59.432Z] 29:     The Z code generator incorrectly spills sub-integer types arguments (see issue #3525)
17:10:59 [2020-01-14T22:10:59.432Z] 29: Known Bug: Skipping test: UsingLoadParam/7
17:10:59 [2020-01-14T22:10:59.432Z] 29:     The Z code generator incorrectly spills sub-integer types arguments (see issue #3525)
17:10:59 [2020-01-14T22:10:59.432Z] 29: Known Bug: Skipping test: UsingLoadParam/8
17:10:59 [2020-01-14T22:10:59.432Z] 29:     The Z code generator incorrectly spills sub-integer types arguments (see issue #3525)
17:10:59 [2020-01-14T22:10:59.432Z] 29: [----------] 18 tests from TypeConversionTest/UInt8ToInt64 (4 ms total)
17:10:59 [2020-01-14T22:10:59.432Z] 29: 
17:10:59 [2020-01-14T22:10:59.432Z] 29: [----------] 18 tests from TypeConversionTest/Int16ToInt32
17:10:59 [2020-01-14T22:10:59.432Z] 29: Known Bug: Skipping test: UsingLoadParam/0
17:10:59 [2020-01-14T22:10:59.432Z] 29:     The Z code generator incorrectly spills sub-integer types arguments (see issue #3525)
17:10:59 [2020-01-14T22:10:59.432Z] 29: Known Bug: Skipping test: UsingLoadParam/1
17:10:59 [2020-01-14T22:10:59.432Z] 29:     The Z code generator incorrectly spills sub-integer types arguments (see issue #3525)
17:10:59 [2020-01-14T22:10:59.432Z] 29: Known Bug: Skipping test: UsingLoadParam/2
17:10:59 [2020-01-14T22:10:59.432Z] 29:     The Z code generator incorrectly spills sub-integer types arguments (see issue #3525)
17:10:59 [2020-01-14T22:10:59.432Z] 29: Known Bug: Skipping test: UsingLoadParam/3
17:10:59 [2020-01-14T22:10:59.432Z] 29:     The Z code generator incorrectly spills sub-integer types arguments (see issue #3525)
17:10:59 [2020-01-14T22:10:59.432Z] 29: Known Bug: Skipping test: UsingLoadParam/4
17:10:59 [2020-01-14T22:10:59.432Z] 29:     The Z code generator incorrectly spills sub-integer types arguments (see issue #3525)
17:10:59 [2020-01-14T22:10:59.432Z] 29: Known Bug: Skipping test: UsingLoadParam/5
17:10:59 [2020-01-14T22:10:59.432Z] 29:     The Z code generator incorrectly spills sub-integer types arguments (see issue #3525)
17:10:59 [2020-01-14T22:10:59.432Z] 29: Known Bug: Skipping test: UsingLoadParam/6
17:10:59 [2020-01-14T22:10:59.432Z] 29:     The Z code generator incorrectly spills sub-integer types arguments (see issue #3525)
17:10:59 [2020-01-14T22:10:59.432Z] 29: Known Bug: Skipping test: UsingLoadParam/7
17:10:59 [2020-01-14T22:10:59.432Z] 29:     The Z code generator incorrectly spills sub-integer types arguments (see issue #3525)
17:10:59 [2020-01-14T22:10:59.432Z] 29: Known Bug: Skipping test: UsingLoadParam/8
17:10:59 [2020-01-14T22:10:59.432Z] 29:     The Z code generator incorrectly spills sub-integer types arguments (see issue #3525)
17:10:59 [2020-01-14T22:10:59.432Z] 29: [----------] 18 tests from TypeConversionTest/Int16ToInt32 (5 ms total)
17:10:59 [2020-01-14T22:10:59.432Z] 29: 
17:10:59 [2020-01-14T22:10:59.432Z] 29: [----------] 18 tests from TypeConversionTest/UInt16ToInt32
17:10:59 [2020-01-14T22:10:59.432Z] 29: Known Bug: Skipping test: UsingLoadParam/0
17:10:59 [2020-01-14T22:10:59.432Z] 29:     The Z code generator incorrectly spills sub-integer types arguments (see issue #3525)
17:10:59 [2020-01-14T22:10:59.432Z] 29: Known Bug: Skipping test: UsingLoadParam/1
17:10:59 [2020-01-14T22:10:59.432Z] 29:     The Z code generator incorrectly spills sub-integer types arguments (see issue #3525)
17:10:59 [2020-01-14T22:10:59.432Z] 29: Known Bug: Skipping test: UsingLoadParam/2
17:10:59 [2020-01-14T22:10:59.432Z] 29:     The Z code generator incorrectly spills sub-integer types arguments (see issue #3525)
17:10:59 [2020-01-14T22:10:59.432Z] 29: Known Bug: Skipping test: UsingLoadParam/3
17:10:59 [2020-01-14T22:10:59.432Z] 29:     The Z code generator incorrectly spills sub-integer types arguments (see issue #3525)
17:10:59 [2020-01-14T22:10:59.432Z] 29: Known Bug: Skipping test: UsingLoadParam/4
17:10:59 [2020-01-14T22:10:59.432Z] 29:     The Z code generator incorrectly spills sub-integer types arguments (see issue #3525)
17:10:59 [2020-01-14T22:10:59.432Z] 29: Known Bug: Skipping test: UsingLoadParam/5
17:10:59 [2020-01-14T22:10:59.432Z] 29:     The Z code generator incorrectly spills sub-integer types arguments (see issue #3525)
17:10:59 [2020-01-14T22:10:59.432Z] 29: Known Bug: Skipping test: UsingLoadParam/6
17:10:59 [2020-01-14T22:10:59.432Z] 29:     The Z code generator incorrectly spills sub-integer types arguments (see issue #3525)
17:10:59 [2020-01-14T22:10:59.432Z] 29: Known Bug: Skipping test: UsingLoadParam/7
17:10:59 [2020-01-14T22:10:59.432Z] 29:     The Z code generator incorrectly spills sub-integer types arguments (see issue #3525)
17:10:59 [2020-01-14T22:10:59.432Z] 29: Known Bug: Skipping test: UsingLoadParam/8
17:10:59 [2020-01-14T22:10:59.432Z] 29:     The Z code generator incorrectly spills sub-integer types arguments (see issue #3525)
17:10:59 [2020-01-14T22:10:59.432Z] 29: [----------] 18 tests from TypeConversionTest/UInt16ToInt32 (5 ms total)
17:10:59 [2020-01-14T22:10:59.432Z] 29: 
17:10:59 [2020-01-14T22:10:59.432Z] 29: [----------] 18 tests from TypeConversionTest/Int16ToInt64
17:10:59 [2020-01-14T22:10:59.432Z] 29: Known Bug: Skipping test: UsingLoadParam/0
17:10:59 [2020-01-14T22:10:59.432Z] 29:     The Z code generator incorrectly spills sub-integer types arguments (see issue #3525)
17:10:59 [2020-01-14T22:10:59.432Z] 29: Known Bug: Skipping test: UsingLoadParam/1
17:10:59 [2020-01-14T22:10:59.432Z] 29:     The Z code generator incorrectly spills sub-integer types arguments (see issue #3525)
17:10:59 [2020-01-14T22:10:59.432Z] 29: Known Bug: Skipping test: UsingLoadParam/2
17:10:59 [2020-01-14T22:10:59.432Z] 29:     The Z code generator incorrectly spills sub-integer types arguments (see issue #3525)
17:10:59 [2020-01-14T22:10:59.432Z] 29: Known Bug: Skipping test: UsingLoadParam/3
17:10:59 [2020-01-14T22:10:59.432Z] 29:     The Z code generator incorrectly spills sub-integer types arguments (see issue #3525)
17:10:59 [2020-01-14T22:10:59.432Z] 29: Known Bug: Skipping test: UsingLoadParam/4
17:10:59 [2020-01-14T22:10:59.432Z] 29:     The Z code generator incorrectly spills sub-integer types arguments (see issue #3525)
17:10:59 [2020-01-14T22:10:59.432Z] 29: Known Bug: Skipping test: UsingLoadParam/5
17:10:59 [2020-01-14T22:10:59.432Z] 29:     The Z code generator incorrectly spills sub-integer types arguments (see issue #3525)
17:10:59 [2020-01-14T22:10:59.432Z] 29: Known Bug: Skipping test: UsingLoadParam/6
17:10:59 [2020-01-14T22:10:59.432Z] 29:     The Z code generator incorrectly spills sub-integer types arguments (see issue #3525)
17:10:59 [2020-01-14T22:10:59.432Z] 29: Known Bug: Skipping test: UsingLoadParam/7
17:10:59 [2020-01-14T22:10:59.432Z] 29:     The Z code generator incorrectly spills sub-integer types arguments (see issue #3525)
17:10:59 [2020-01-14T22:10:59.432Z] 29: Known Bug: Skipping test: UsingLoadParam/8
17:10:59 [2020-01-14T22:10:59.432Z] 29:     The Z code generator incorrectly spills sub-integer types arguments (see issue #3525)
17:10:59 [2020-01-14T22:10:59.432Z] 29: [----------] 18 tests from TypeConversionTest/Int16ToInt64 (4 ms total)
17:10:59 [2020-01-14T22:10:59.432Z] 29: 
17:10:59 [2020-01-14T22:10:59.432Z] 29: [----------] 18 tests from TypeConversionTest/UInt16ToInt64
17:10:59 [2020-01-14T22:10:59.432Z] 29: Known Bug: Skipping test: UsingLoadParam/0
17:10:59 [2020-01-14T22:10:59.432Z] 29:     The Z code generator incorrectly spills sub-integer types arguments (see issue #3525)
17:10:59 [2020-01-14T22:10:59.432Z] 29: Known Bug: Skipping test: UsingLoadParam/1
17:10:59 [2020-01-14T22:10:59.432Z] 29:     The Z code generator incorrectly spills sub-integer types arguments (see issue #3525)
17:10:59 [2020-01-14T22:10:59.432Z] 29: Known Bug: Skipping test: UsingLoadParam/2
17:10:59 [2020-01-14T22:10:59.432Z] 29:     The Z code generator incorrectly spills sub-integer types arguments (see issue #3525)
17:10:59 [2020-01-14T22:10:59.432Z] 29: Known Bug: Skipping test: UsingLoadParam/3
17:10:59 [2020-01-14T22:10:59.432Z] 29:     The Z code generator incorrectly spills sub-integer types arguments (see issue #3525)
17:10:59 [2020-01-14T22:10:59.432Z] 29: Known Bug: Skipping test: UsingLoadParam/4
17:10:59 [2020-01-14T22:10:59.433Z] 29:     The Z code generator incorrectly spills sub-integer types arguments (see issue #3525)
17:10:59 [2020-01-14T22:10:59.433Z] 29: Known Bug: Skipping test: UsingLoadParam/5
17:10:59 [2020-01-14T22:10:59.433Z] 29:     The Z code generator incorrectly spills sub-integer types arguments (see issue #3525)
17:10:59 [2020-01-14T22:10:59.433Z] 29: Known Bug: Skipping test: UsingLoadParam/6
17:10:59 [2020-01-14T22:10:59.433Z] 29:     The Z code generator incorrectly spills sub-integer types arguments (see issue #3525)
17:10:59 [2020-01-14T22:10:59.433Z] 29: Known Bug: Skipping test: UsingLoadParam/7
17:10:59 [2020-01-14T22:10:59.433Z] 29:     The Z code generator incorrectly spills sub-integer types arguments (see issue #3525)
17:10:59 [2020-01-14T22:10:59.433Z] 29: Known Bug: Skipping test: UsingLoadParam/8
17:10:59 [2020-01-14T22:10:59.433Z] 29:     The Z code generator incorrectly spills sub-integer types arguments (see issue #3525)
17:10:59 [2020-01-14T22:10:59.433Z] 29: [----------] 18 tests from TypeConversionTest/UInt16ToInt64 (5 ms total)
17:10:59 [2020-01-14T22:10:59.433Z] 29: 
17:10:59 [2020-01-14T22:10:59.433Z] 29: [----------] 30 tests from TypeConversionTest/Int32ToInt64
17:10:59 [2020-01-14T22:10:59.433Z] 29: [----------] 30 tests from TypeConversionTest/Int32ToInt64 (15 ms total)
17:10:59 [2020-01-14T22:10:59.433Z] 29: 
17:10:59 [2020-01-14T22:10:59.433Z] 29: [----------] 38 tests from TypeConversionTest/UInt32ToInt64
17:10:59 [2020-01-14T22:10:59.433Z] 29: [----------] 38 tests from TypeConversionTest/UInt32ToInt64 (18 ms total)
17:10:59 [2020-01-14T22:10:59.433Z] 29: 
17:10:59 [2020-01-14T22:10:59.433Z] 29: [----------] 34 tests from TypeConversionTest/Int64ToInt32
17:10:59 [2020-01-14T22:10:59.433Z] 29: [----------] 34 tests from TypeConversionTest/Int64ToInt32 (16 ms total)
17:10:59 [2020-01-14T22:10:59.433Z] 29: 
17:10:59 [2020-01-14T22:10:59.433Z] 29: [----------] 30 tests from TypeConversionTest/Int32ToFloat
17:10:59 [2020-01-14T22:10:59.433Z] 29: [----------] 30 tests from TypeConversionTest/Int32ToFloat (15 ms total)
17:10:59 [2020-01-14T22:10:59.433Z] 29: 
17:10:59 [2020-01-14T22:10:59.433Z] 29: [----------] 34 tests from TypeConversionTest/Int64ToFloat
17:10:59 [2020-01-14T22:10:59.433Z] 29: [----------] 34 tests from TypeConversionTest/Int64ToFloat (17 ms total)
17:10:59 [2020-01-14T22:10:59.433Z] 29: 
17:10:59 [2020-01-14T22:10:59.433Z] 29: [----------] 30 tests from TypeConversionTest/Int32ToDouble
17:10:59 [2020-01-14T22:10:59.433Z] 29: [----------] 30 tests from TypeConversionTest/Int32ToDouble (14 ms total)
17:10:59 [2020-01-14T22:10:59.433Z] 29: 
17:10:59 [2020-01-14T22:10:59.433Z] 29: [----------] 34 tests from TypeConversionTest/Int64ToDouble
17:10:59 [2020-01-14T22:10:59.433Z] 29: [----------] 34 tests from TypeConversionTest/Int64ToDouble (18 ms total)
17:10:59 [2020-01-14T22:10:59.433Z] 29: 
17:10:59 [2020-01-14T22:10:59.433Z] 29: [----------] 20 tests from TypeConversionTest/FloatToInt32
17:10:59 [2020-01-14T22:10:59.433Z] 29: [----------] 20 tests from TypeConversionTest/FloatToInt32 (11 ms total)
17:10:59 [2020-01-14T22:10:59.433Z] 29: 
17:10:59 [2020-01-14T22:10:59.433Z] 29: [----------] 26 tests from TypeConversionTest/FloatToInt64
17:10:59 [2020-01-14T22:10:59.433Z] 29: [----------] 26 tests from TypeConversionTest/FloatToInt64 (12 ms total)
17:10:59 [2020-01-14T22:10:59.433Z] 29: 
17:10:59 [2020-01-14T22:10:59.433Z] 29: [----------] 20 tests from TypeConversionTest/DoubleToInt32
17:10:59 [2020-01-14T22:10:59.433Z] 29: [----------] 20 tests from TypeConversionTest/DoubleToInt32 (11 ms total)
17:10:59 [2020-01-14T22:10:59.433Z] 29: 
17:10:59 [2020-01-14T22:10:59.433Z] 29: [----------] 28 tests from TypeConversionTest/DoubleToInt64
17:10:59 [2020-01-14T22:10:59.892Z] 29: [----------] 28 tests from TypeConversionTest/DoubleToInt64 (15 ms total)
17:10:59 [2020-01-14T22:10:59.892Z] 29: 
17:10:59 [2020-01-14T22:10:59.892Z] 29: [----------] 30 tests from TypeConversionTest/FloatToDouble
17:10:59 [2020-01-14T22:10:59.892Z] 29: [----------] 30 tests from TypeConversionTest/FloatToDouble (16 ms total)
17:10:59 [2020-01-14T22:10:59.892Z] 29: 
17:10:59 [2020-01-14T22:10:59.892Z] 29: [----------] 32 tests from TypeConversionTest/DoubleToFloat
17:10:59 [2020-01-14T22:10:59.892Z] 29: [----------] 32 tests from TypeConversionTest/DoubleToFloat (15 ms total)
17:10:59 [2020-01-14T22:10:59.892Z] 29: 
17:10:59 [2020-01-14T22:10:59.892Z] 29: [----------] 33 tests from TypeConversionTest/FloatNormalizeNan
17:10:59 [2020-01-14T22:10:59.892Z] 29: Known Bug: Skipping test: UsingLoadIndirect/0
17:10:59 [2020-01-14T22:10:59.892Z] 29:     The Z code generator crashes when specifying the mustNormalizeNanValues flag (see issue #4381)
17:10:59 [2020-01-14T22:10:59.892Z] 29: Known Bug: Skipping test: UsingLoadIndirect/1
17:10:59 [2020-01-14T22:10:59.892Z] 29:     The Z code generator crashes when specifying the mustNormalizeNanValues flag (see issue #4381)
17:10:59 [2020-01-14T22:10:59.892Z] 29: Known Bug: Skipping test: UsingLoadIndirect/2
17:10:59 [2020-01-14T22:10:59.892Z] 29:     The Z code generator crashes when specifying the mustNormalizeNanValues flag (see issue #4381)
17:10:59 [2020-01-14T22:10:59.892Z] 29: Known Bug: Skipping test: UsingLoadIndirect/3
17:10:59 [2020-01-14T22:10:59.892Z] 29:     The Z code generator crashes when specifying the mustNormalizeNanValues flag (see issue #4381)
17:10:59 [2020-01-14T22:10:59.892Z] 29: Known Bug: Skipping test: UsingLoadIndirect/4
17:10:59 [2020-01-14T22:10:59.892Z] 29:     The Z code generator crashes when specifying the mustNormalizeNanValues flag (see issue #4381)
17:10:59 [2020-01-14T22:10:59.892Z] 29: Known Bug: Skipping test: UsingLoadIndirect/5
17:10:59 [2020-01-14T22:10:59.892Z] 29:     The Z code generator crashes when specifying the mustNormalizeNanValues flag (see issue #4381)
17:10:59 [2020-01-14T22:10:59.892Z] 29: Known Bug: Skipping test: UsingLoadIndirect/6
17:10:59 [2020-01-14T22:10:59.892Z] 29:     The Z code generator crashes when specifying the mustNormalizeNanValues flag (see issue #4381)
17:10:59 [2020-01-14T22:10:59.892Z] 29: Known Bug: Skipping test: UsingLoadIndirect/7
17:10:59 [2020-01-14T22:10:59.892Z] 29:     The Z code generator crashes when specifying the mustNormalizeNanValues flag (see issue #4381)
17:10:59 [2020-01-14T22:10:59.892Z] 29: Known Bug: Skipping test: UsingLoadIndirect/8
17:10:59 [2020-01-14T22:10:59.892Z] 29:     The Z code generator crashes when specifying the mustNormalizeNanValues flag (see issue #4381)
17:10:59 [2020-01-14T22:10:59.892Z] 29: Known Bug: Skipping test: UsingLoadIndirect/9
17:10:59 [2020-01-14T22:10:59.892Z] 29:     The Z code generator crashes when specifying the mustNormalizeNanValues flag (see issue #4381)
17:10:59 [2020-01-14T22:10:59.892Z] 29: Known Bug: Skipping test: UsingLoadIndirect/10
17:10:59 [2020-01-14T22:10:59.892Z] 29:     The Z code generator crashes when specifying the mustNormalizeNanValues flag (see issue #4381)
17:10:59 [2020-01-14T22:10:59.892Z] 29: Known Bug: Skipping test: UsingLoadParam/0
17:10:59 [2020-01-14T22:10:59.892Z] 29:     The Z code generator crashes when specifying the mustNormalizeNanValues flag (see issue #4381)
17:10:59 [2020-01-14T22:10:59.892Z] 29: Known Bug: Skipping test: UsingLoadParam/1
17:10:59 [2020-01-14T22:10:59.892Z] 29:     The Z code generator crashes when specifying the mustNormalizeNanValues flag (see issue #4381)
17:10:59 [2020-01-14T22:10:59.892Z] 29: Known Bug: Skipping test: UsingLoadParam/2
17:10:59 [2020-01-14T22:10:59.892Z] 29:     The Z code generator crashes when specifying the mustNormalizeNanValues flag (see issue #4381)
17:10:59 [2020-01-14T22:10:59.892Z] 29: Known Bug: Skipping test: UsingLoadParam/3
17:10:59 [2020-01-14T22:10:59.892Z] 29:     The Z code generator crashes when specifying the mustNormalizeNanValues flag (see issue #4381)
17:10:59 [2020-01-14T22:10:59.892Z] 29: Known Bug: Skipping test: UsingLoadParam/4
17:10:59 [2020-01-14T22:10:59.892Z] 29:     The Z code generator crashes when specifying the mustNormalizeNanValues flag (see issue #4381)
17:10:59 [2020-01-14T22:10:59.892Z] 29: Known Bug: Skipping test: UsingLoadParam/5
17:10:59 [2020-01-14T22:10:59.892Z] 29:     The Z code generator crashes when specifying the mustNormalizeNanValues flag (see issue #4381)
17:10:59 [2020-01-14T22:10:59.892Z] 29: Known Bug: Skipping test: UsingLoadParam/6
17:10:59 [2020-01-14T22:10:59.892Z] 29:     The Z code generator crashes when specifying the mustNormalizeNanValues flag (see issue #4381)
17:10:59 [2020-01-14T22:10:59.892Z] 29: Known Bug: Skipping test: UsingLoadParam/7
17:10:59 [2020-01-14T22:10:59.892Z] 29:     The Z code generator crashes when specifying the mustNormalizeNanValues flag (see issue #4381)
17:10:59 [2020-01-14T22:10:59.892Z] 29: Known Bug: Skipping test: UsingLoadParam/8
17:10:59 [2020-01-14T22:10:59.892Z] 29:     The Z code generator crashes when specifying the mustNormalizeNanValues flag (see issue #4381)
17:10:59 [2020-01-14T22:10:59.892Z] 29: Known Bug: Skipping test: UsingLoadParam/9
17:10:59 [2020-01-14T22:10:59.892Z] 29:     The Z code generator crashes when specifying the mustNormalizeNanValues flag (see issue #4381)
17:10:59 [2020-01-14T22:10:59.892Z] 29: Known Bug: Skipping test: UsingLoadParam/10
17:10:59 [2020-01-14T22:10:59.892Z] 29:     The Z code generator crashes when specifying the mustNormalizeNanValues flag (see issue #4381)
17:10:59 [2020-01-14T22:10:59.892Z] 29: Known Bug: Skipping test: UsingLoadConst/0
17:10:59 [2020-01-14T22:10:59.892Z] 29:     The Z code generator crashes when specifying the mustNormalizeNanValues flag (see issue #4381)
17:10:59 [2020-01-14T22:10:59.892Z] 29: Known Bug: Skipping test: UsingLoadConst/1
17:10:59 [2020-01-14T22:10:59.892Z] 29:     The Z code generator crashes when specifying the mustNormalizeNanValues flag (see issue #4381)
17:10:59 [2020-01-14T22:10:59.892Z] 29: Known Bug: Skipping test: UsingLoadConst/2
17:10:59 [2020-01-14T22:10:59.892Z] 29:     The Z code generator crashes when specifying the mustNormalizeNanValues flag (see issue #4381)
17:10:59 [2020-01-14T22:10:59.892Z] 29: Known Bug: Skipping test: UsingLoadConst/3
17:10:59 [2020-01-14T22:10:59.892Z] 29:     The Z code generator crashes when specifying the mustNormalizeNanValues flag (see issue #4381)
17:10:59 [2020-01-14T22:10:59.892Z] 29: Known Bug: Skipping test: UsingLoadConst/4
17:10:59 [2020-01-14T22:10:59.892Z] 29:     The Z code generator crashes when specifying the mustNormalizeNanValues flag (see issue #4381)
17:10:59 [2020-01-14T22:10:59.892Z] 29: Known Bug: Skipping test: UsingLoadConst/5
17:10:59 [2020-01-14T22:10:59.892Z] 29:     The Z code generator crashes when specifying the mustNormalizeNanValues flag (see issue #4381)
17:10:59 [2020-01-14T22:10:59.892Z] 29: Known Bug: Skipping test: UsingLoadConst/6
17:10:59 [2020-01-14T22:10:59.892Z] 29:     The Z code generator crashes when specifying the mustNormalizeNanValues flag (see issue #4381)
17:10:59 [2020-01-14T22:10:59.892Z] 29: Known Bug: Skipping test: UsingLoadConst/7
17:10:59 [2020-01-14T22:10:59.892Z] 29:     The Z code generator crashes when specifying the mustNormalizeNanValues flag (see issue #4381)
17:10:59 [2020-01-14T22:10:59.892Z] 29: Known Bug: Skipping test: UsingLoadConst/8
17:10:59 [2020-01-14T22:10:59.892Z] 29:     The Z code generator crashes when specifying the mustNormalizeNanValues flag (see issue #4381)
17:10:59 [2020-01-14T22:10:59.892Z] 29: Known Bug: Skipping test: UsingLoadConst/9
17:10:59 [2020-01-14T22:10:59.892Z] 29:     The Z code generator crashes when specifying the mustNormalizeNanValues flag (see issue #4381)
17:10:59 [2020-01-14T22:10:59.892Z] 29: Known Bug: Skipping test: UsingLoadConst/10
17:10:59 [2020-01-14T22:10:59.892Z] 29:     The Z code generator crashes when specifying the mustNormalizeNanValues flag (see issue #4381)
17:10:59 [2020-01-14T22:10:59.892Z] 29: [----------] 33 tests from TypeConversionTest/FloatNormalizeNan (2 ms total)
17:10:59 [2020-01-14T22:10:59.892Z] 29: 
17:10:59 [2020-01-14T22:10:59.892Z] 29: [----------] 33 tests from TypeConversionTest/DoubleNormalizeNan
17:10:59 [2020-01-14T22:10:59.892Z] 29: Known Bug: Skipping test: UsingLoadIndirect/0
17:10:59 [2020-01-14T22:10:59.892Z] 29:     The Z code generator crashes when specifying the mustNormalizeNanValues flag (see issue #4381)
17:10:59 [2020-01-14T22:10:59.892Z] 29: Known Bug: Skipping test: UsingLoadIndirect/1
17:10:59 [2020-01-14T22:10:59.892Z] 29:     The Z code generator crashes when specifying the mustNormalizeNanValues flag (see issue #4381)
17:10:59 [2020-01-14T22:10:59.892Z] 29: Known Bug: Skipping test: UsingLoadIndirect/2
17:10:59 [2020-01-14T22:10:59.892Z] 29:     The Z code generator crashes when specifying the mustNormalizeNanValues flag (see issue #4381)
17:10:59 [2020-01-14T22:10:59.892Z] 29: Known Bug: Skipping test: UsingLoadIndirect/3
17:10:59 [2020-01-14T22:10:59.893Z] 29:     The Z code generator crashes when specifying the mustNormalizeNanValues flag (see issue #4381)
17:10:59 [2020-01-14T22:10:59.893Z] 29: Known Bug: Skipping test: UsingLoadIndirect/4
17:10:59 [2020-01-14T22:10:59.893Z] 29:     The Z code generator crashes when specifying the mustNormalizeNanValues flag (see issue #4381)
17:10:59 [2020-01-14T22:10:59.893Z] 29: Known Bug: Skipping test: UsingLoadIndirect/5
17:10:59 [2020-01-14T22:10:59.893Z] 29:     The Z code generator crashes when specifying the mustNormalizeNanValues flag (see issue #4381)
17:10:59 [2020-01-14T22:10:59.893Z] 29: Known Bug: Skipping test: UsingLoadIndirect/6
17:10:59 [2020-01-14T22:10:59.893Z] 29:     The Z code generator crashes when specifying the mustNormalizeNanValues flag (see issue #4381)
17:10:59 [2020-01-14T22:10:59.893Z] 29: Known Bug: Skipping test: UsingLoadIndirect/7
17:10:59 [2020-01-14T22:10:59.893Z] 29:     The Z code generator crashes when specifying the mustNormalizeNanValues flag (see issue #4381)
17:10:59 [2020-01-14T22:10:59.893Z] 29: Known Bug: Skipping test: UsingLoadIndirect/8
17:10:59 [2020-01-14T22:10:59.893Z] 29:     The Z code generator crashes when specifying the mustNormalizeNanValues flag (see issue #4381)
17:10:59 [2020-01-14T22:10:59.893Z] 29: Known Bug: Skipping test: UsingLoadIndirect/9
17:10:59 [2020-01-14T22:10:59.893Z] 29:     The Z code generator crashes when specifying the mustNormalizeNanValues flag (see issue #4381)
17:10:59 [2020-01-14T22:10:59.893Z] 29: Known Bug: Skipping test: UsingLoadIndirect/10
17:10:59 [2020-01-14T22:10:59.893Z] 29:     The Z code generator crashes when specifying the mustNormalizeNanValues flag (see issue #4381)
17:10:59 [2020-01-14T22:10:59.893Z] 29: Known Bug: Skipping test: UsingLoadParam/0
17:10:59 [2020-01-14T22:10:59.893Z] 29:     The Z code generator crashes when specifying the mustNormalizeNanValues flag (see issue #4381)
17:10:59 [2020-01-14T22:10:59.893Z] 29: Known Bug: Skipping test: UsingLoadParam/1
17:10:59 [2020-01-14T22:10:59.893Z] 29:     The Z code generator crashes when specifying the mustNormalizeNanValues flag (see issue #4381)
17:10:59 [2020-01-14T22:10:59.893Z] 29: Known Bug: Skipping test: UsingLoadParam/2
17:10:59 [2020-01-14T22:10:59.893Z] 29:     The Z code generator crashes when specifying the mustNormalizeNanValues flag (see issue #4381)
17:10:59 [2020-01-14T22:10:59.893Z] 29: Known Bug: Skipping test: UsingLoadParam/3
17:10:59 [2020-01-14T22:10:59.893Z] 29:     The Z code generator crashes when specifying the mustNormalizeNanValues flag (see issue #4381)
17:10:59 [2020-01-14T22:10:59.893Z] 29: Known Bug: Skipping test: UsingLoadParam/4
17:10:59 [2020-01-14T22:10:59.893Z] 29:     The Z code generator crashes when specifying the mustNormalizeNanValues flag (see issue #4381)
17:10:59 [2020-01-14T22:10:59.893Z] 29: Known Bug: Skipping test: UsingLoadParam/5
17:10:59 [2020-01-14T22:10:59.893Z] 29:     The Z code generator crashes when specifying the mustNormalizeNanValues flag (see issue #4381)
17:10:59 [2020-01-14T22:10:59.893Z] 29: Known Bug: Skipping test: UsingLoadParam/6
17:10:59 [2020-01-14T22:10:59.893Z] 29:     The Z code generator crashes when specifying the mustNormalizeNanValues flag (see issue #4381)
17:10:59 [2020-01-14T22:10:59.893Z] 29: Known Bug: Skipping test: UsingLoadParam/7
17:10:59 [2020-01-14T22:10:59.893Z] 29:     The Z code generator crashes when specifying the mustNormalizeNanValues flag (see issue #4381)
17:10:59 [2020-01-14T22:10:59.893Z] 29: Known Bug: Skipping test: UsingLoadParam/8
17:10:59 [2020-01-14T22:10:59.893Z] 29:     The Z code generator crashes when specifying the mustNormalizeNanValues flag (see issue #4381)
17:10:59 [2020-01-14T22:10:59.893Z] 29: Known Bug: Skipping test: UsingLoadParam/9
17:10:59 [2020-01-14T22:10:59.893Z] 29:     The Z code generator crashes when specifying the mustNormalizeNanValues flag (see issue #4381)
17:10:59 [2020-01-14T22:10:59.893Z] 29: Known Bug: Skipping test: UsingLoadParam/10
17:10:59 [2020-01-14T22:10:59.893Z] 29:     The Z code generator crashes when specifying the mustNormalizeNanValues flag (see issue #4381)
17:10:59 [2020-01-14T22:10:59.893Z] 29: Known Bug: Skipping test: UsingLoadConst/0
17:10:59 [2020-01-14T22:10:59.893Z] 29:     The Z code generator crashes when specifying the mustNormalizeNanValues flag (see issue #4381)
17:10:59 [2020-01-14T22:10:59.893Z] 29: Known Bug: Skipping test: UsingLoadConst/1
17:10:59 [2020-01-14T22:10:59.893Z] 29:     The Z code generator crashes when specifying the mustNormalizeNanValues flag (see issue #4381)
17:10:59 [2020-01-14T22:10:59.893Z] 29: Known Bug: Skipping test: UsingLoadConst/2
17:10:59 [2020-01-14T22:10:59.893Z] 29:     The Z code generator crashes when specifying the mustNormalizeNanValues flag (see issue #4381)
17:10:59 [2020-01-14T22:10:59.893Z] 29: Known Bug: Skipping test: UsingLoadConst/3
17:10:59 [2020-01-14T22:10:59.893Z] 29:     The Z code generator crashes when specifying the mustNormalizeNanValues flag (see issue #4381)
17:10:59 [2020-01-14T22:10:59.893Z] 29: Known Bug: Skipping test: UsingLoadConst/4
17:10:59 [2020-01-14T22:10:59.893Z] 29:     The Z code generator crashes when specifying the mustNormalizeNanValues flag (see issue #4381)
17:10:59 [2020-01-14T22:10:59.893Z] 29: Known Bug: Skipping test: UsingLoadConst/5
17:10:59 [2020-01-14T22:10:59.893Z] 29:     The Z code generator crashes when specifying the mustNormalizeNanValues flag (see issue #4381)
17:10:59 [2020-01-14T22:10:59.893Z] 29: Known Bug: Skipping test: UsingLoadConst/6
17:10:59 [2020-01-14T22:10:59.893Z] 29:     The Z code generator crashes when specifying the mustNormalizeNanValues flag (see issue #4381)
17:10:59 [2020-01-14T22:10:59.893Z] 29: Known Bug: Skipping test: UsingLoadConst/7
17:10:59 [2020-01-14T22:10:59.893Z] 29:     The Z code generator crashes when specifying the mustNormalizeNanValues flag (see issue #4381)
17:10:59 [2020-01-14T22:10:59.893Z] 29: Known Bug: Skipping test: UsingLoadConst/8
17:10:59 [2020-01-14T22:10:59.893Z] 29:     The Z code generator crashes when specifying the mustNormalizeNanValues flag (see issue #4381)
17:10:59 [2020-01-14T22:10:59.893Z] 29: Known Bug: Skipping test: UsingLoadConst/9
17:10:59 [2020-01-14T22:10:59.893Z] 29:     The Z code generator crashes when specifying the mustNormalizeNanValues flag (see issue #4381)
17:10:59 [2020-01-14T22:10:59.893Z] 29: Known Bug: Skipping test: UsingLoadConst/10
17:10:59 [2020-01-14T22:10:59.893Z] 29:     The Z code generator crashes when specifying the mustNormalizeNanValues flag (see issue #4381)
17:10:59 [2020-01-14T22:10:59.893Z] 29: [----------] 33 tests from TypeConversionTest/DoubleNormalizeNan (3 ms total)
17:10:59 [2020-01-14T22:10:59.893Z] 29: 
17:10:59 [2020-01-14T22:10:59.893Z] 29: [----------] 28 tests from TernaryTest/Int32TernaryInt32CompareTest
17:10:59 [2020-01-14T22:10:59.893Z] 29: Missing Implementation: Skipping test: UsingLoadParam/0
17:10:59 [2020-01-14T22:10:59.893Z] 29:     The Z code generator implementation is missing currently (see issue #3796)
17:10:59 [2020-01-14T22:10:59.893Z] 29: Missing Implementation: Skipping test: UsingLoadParam/1
17:10:59 [2020-01-14T22:10:59.893Z] 29:     The Z code generator implementation is missing currently (see issue #3796)
17:10:59 [2020-01-14T22:10:59.893Z] 29: Missing Implementation: Skipping test: UsingLoadParam/2
17:10:59 [2020-01-14T22:10:59.893Z] 29:     The Z code generator implementation is missing currently (see issue #3796)
17:10:59 [2020-01-14T22:10:59.893Z] 29: Missing Implementation: Skipping test: UsingLoadParam/3
17:10:59 [2020-01-14T22:10:59.893Z] 29:     The Z code generator implementation is missing currently (see issue #3796)
17:10:59 [2020-01-14T22:10:59.893Z] 29: Missing Implementation: Skipping test: UsingLoadParam/4
17:10:59 [2020-01-14T22:10:59.893Z] 29:     The Z code generator implementation is missing currently (see issue #3796)
17:10:59 [2020-01-14T22:10:59.893Z] 29: Missing Implementation: Skipping test: UsingLoadParam/5
17:10:59 [2020-01-14T22:10:59.893Z] 29:     The Z code generator implementation is missing currently (see issue #3796)
17:10:59 [2020-01-14T22:10:59.893Z] 29: Missing Implementation: Skipping test: UsingLoadParam/6
17:10:59 [2020-01-14T22:10:59.893Z] 29:     The Z code generator implementation is missing currently (see issue #3796)
17:10:59 [2020-01-14T22:10:59.893Z] 29: Missing Implementation: Skipping test: UsingLoadParam/7
17:10:59 [2020-01-14T22:10:59.893Z] 29:     The Z code generator implementation is missing currently (see issue #3796)
17:10:59 [2020-01-14T22:10:59.893Z] 29: Missing Implementation: Skipping test: UsingLoadParam/8
17:10:59 [2020-01-14T22:10:59.893Z] 29:     The Z code generator implementation is missing currently (see issue #3796)
17:10:59 [2020-01-14T22:10:59.893Z] 29: Missing Implementation: Skipping test: UsingLoadParam/9
17:10:59 [2020-01-14T22:10:59.893Z] 29:     The Z code generator implementation is missing currently (see issue #3796)
17:10:59 [2020-01-14T22:10:59.893Z] 29: Missing Implementation: Skipping test: UsingLoadParam/10
17:10:59 [2020-01-14T22:10:59.893Z] 29:     The Z code generator implementation is missing currently (see issue #3796)
17:10:59 [2020-01-14T22:10:59.893Z] 29: Missing Implementation: Skipping test: UsingLoadParam/11
17:10:59 [2020-01-14T22:10:59.893Z] 29:     The Z code generator implementation is missing currently (see issue #3796)
17:10:59 [2020-01-14T22:10:59.893Z] 29: Missing Implementation: Skipping test: UsingLoadParam/12
17:10:59 [2020-01-14T22:10:59.893Z] 29:     The Z code generator implementation is missing currently (see issue #3796)
17:10:59 [2020-01-14T22:10:59.893Z] 29: Missing Implementation: Skipping test: UsingLoadParam/13
17:10:59 [2020-01-14T22:10:59.893Z] 29:     The Z code generator implementation is missing currently (see issue #3796)
17:10:59 [2020-01-14T22:10:59.893Z] 29: Missing Implementation: Skipping test: UsingConst/0
17:10:59 [2020-01-14T22:10:59.893Z] 29:     The Z code generator implementation is missing currently (see issue #3796)
17:10:59 [2020-01-14T22:10:59.893Z] 29: Missing Implementation: Skipping test: UsingConst/1
17:10:59 [2020-01-14T22:10:59.893Z] 29:     The Z code generator implementation is missing currently (see issue #3796)
17:10:59 [2020-01-14T22:10:59.893Z] 29: Missing Implementation: Skipping test: UsingConst/2
17:10:59 [2020-01-14T22:10:59.893Z] 29:     The Z code generator implementation is missing currently (see issue #3796)
17:10:59 [2020-01-14T22:10:59.893Z] 29: Missing Implementation: Skipping test: UsingConst/3
17:10:59 [2020-01-14T22:10:59.893Z] 29:     The Z code generator implementation is missing currently (see issue #3796)
17:10:59 [2020-01-14T22:10:59.893Z] 29: Missing Implementation: Skipping test: UsingConst/4
17:10:59 [2020-01-14T22:10:59.893Z] 29:     The Z code generator implementation is missing currently (see issue #3796)
17:10:59 [2020-01-14T22:10:59.893Z] 29: Missing Implementation: Skipping test: UsingConst/5
17:10:59 [2020-01-14T22:10:59.893Z] 29:     The Z code generator implementation is missing currently (see issue #3796)
17:10:59 [2020-01-14T22:10:59.893Z] 29: Missing Implementation: Skipping test: UsingConst/6
17:10:59 [2020-01-14T22:10:59.893Z] 29:     The Z code generator implementation is missing currently (see issue #3796)
17:10:59 [2020-01-14T22:10:59.893Z] 29: Missing Implementation: Skipping test: UsingConst/7
17:10:59 [2020-01-14T22:10:59.893Z] 29:     The Z code generator implementation is missing currently (see issue #3796)
17:10:59 [2020-01-14T22:10:59.893Z] 29: Missing Implementation: Skipping test: UsingConst/8
17:10:59 [2020-01-14T22:10:59.893Z] 29:     The Z code generator implementation is missing currently (see issue #3796)
17:10:59 [2020-01-14T22:10:59.893Z] 29: Missing Implementation: Skipping test: UsingConst/9
17:10:59 [2020-01-14T22:10:59.893Z] 29:     The Z code generator implementation is missing currently (see issue #3796)
17:10:59 [2020-01-14T22:10:59.893Z] 29: Missing Implementation: Skipping test: UsingConst/10
17:10:59 [2020-01-14T22:10:59.893Z] 29:     The Z code generator implementation is missing currently (see issue #3796)
17:10:59 [2020-01-14T22:10:59.893Z] 29: Missing Implementation: Skipping test: UsingConst/11
17:10:59 [2020-01-14T22:10:59.893Z] 29:     The Z code generator implementation is missing currently (see issue #3796)
17:10:59 [2020-01-14T22:10:59.893Z] 29: Missing Implementation: Skipping test: UsingConst/12
17:10:59 [2020-01-14T22:10:59.893Z] 29:     The Z code generator implementation is missing currently (see issue #3796)
17:10:59 [2020-01-14T22:10:59.893Z] 29: Missing Implementation: Skipping test: UsingConst/13
17:10:59 [2020-01-14T22:10:59.893Z] 29:     The Z code generator implementation is missing currently (see issue #3796)
17:10:59 [2020-01-14T22:10:59.893Z] 29: [----------] 28 tests from TernaryTest/Int32TernaryInt32CompareTest (2 ms total)
17:10:59 [2020-01-14T22:10:59.893Z] 29: 
17:10:59 [2020-01-14T22:10:59.893Z] 29: [----------] 28 tests from TernaryTest/Int64TernaryInt64CompareTest
17:10:59 [2020-01-14T22:10:59.893Z] 29: Missing Implementation: Skipping test: UsingLoadParam/0
17:10:59 [2020-01-14T22:10:59.893Z] 29:     The Z code generator implementation is missing currently (see issue #3796)
17:10:59 [2020-01-14T22:10:59.893Z] 29: Missing Implementation: Skipping test: UsingLoadParam/1
17:10:59 [2020-01-14T22:10:59.893Z] 29:     The Z code generator implementation is missing currently (see issue #3796)
17:10:59 [2020-01-14T22:10:59.893Z] 29: Missing Implementation: Skipping test: UsingLoadParam/2
17:10:59 [2020-01-14T22:10:59.893Z] 29:     The Z code generator implementation is missing currently (see issue #3796)
17:10:59 [2020-01-14T22:10:59.893Z] 29: Missing Implementation: Skipping test: UsingLoadParam/3
17:10:59 [2020-01-14T22:10:59.893Z] 29:     The Z code generator implementation is missing currently (see issue #3796)
17:10:59 [2020-01-14T22:10:59.893Z] 29: Missing Implementation: Skipping test: UsingLoadParam/4
17:10:59 [2020-01-14T22:10:59.893Z] 29:     The Z code generator implementation is missing currently (see issue #3796)
17:10:59 [2020-01-14T22:10:59.893Z] 29: Missing Implementation: Skipping test: UsingLoadParam/5
17:10:59 [2020-01-14T22:10:59.893Z] 29:     The Z code generator implementation is missing currently (see issue #3796)
17:10:59 [2020-01-14T22:10:59.893Z] 29: Missing Implementation: Skipping test: UsingLoadParam/6
17:10:59 [2020-01-14T22:10:59.893Z] 29:     The Z code generator implementation is missing currently (see issue #3796)
17:10:59 [2020-01-14T22:10:59.893Z] 29: Missing Implementation: Skipping test: UsingLoadParam/7
17:10:59 [2020-01-14T22:10:59.893Z] 29:     The Z code generator implementation is missing currently (see issue #3796)
17:10:59 [2020-01-14T22:10:59.893Z] 29: Missing Implementation: Skipping test: UsingLoadParam/8
17:10:59 [2020-01-14T22:10:59.893Z] 29:     The Z code generator implementation is missing currently (see issue #3796)
17:10:59 [2020-01-14T22:10:59.893Z] 29: Missing Implementation: Skipping test: UsingLoadParam/9
17:10:59 [2020-01-14T22:10:59.893Z] 29:     The Z code generator implementation is missing currently (see issue #3796)
17:10:59 [2020-01-14T22:10:59.893Z] 29: Missing Implementation: Skipping test: UsingLoadParam/10
17:10:59 [2020-01-14T22:10:59.893Z] 29:     The Z code generator implementation is missing currently (see issue #3796)
17:10:59 [2020-01-14T22:10:59.893Z] 29: Missing Implementation: Skipping test: UsingLoadParam/11
17:10:59 [2020-01-14T22:10:59.893Z] 29:     The Z code generator implementation is missing currently (see issue #3796)
17:10:59 [2020-01-14T22:10:59.893Z] 29: Missing Implementation: Skipping test: UsingLoadParam/12
17:10:59 [2020-01-14T22:10:59.893Z] 29:     The Z code generator implementation is missing currently (see issue #3796)
17:10:59 [2020-01-14T22:10:59.893Z] 29: Missing Implementation: Skipping test: UsingLoadParam/13
17:10:59 [2020-01-14T22:10:59.893Z] 29:     The Z code generator implementation is missing currently (see issue #3796)
17:10:59 [2020-01-14T22:10:59.893Z] 29: Missing Implementation: Skipping test: UsingConst/0
17:10:59 [2020-01-14T22:10:59.893Z] 29:     The Z code generator implementation is missing currently (see issue #3796)
17:10:59 [2020-01-14T22:10:59.893Z] 29: Missing Implementation: Skipping test: UsingConst/1
17:10:59 [2020-01-14T22:10:59.893Z] 29:     The Z code generator implementation is missing currently (see issue #3796)
17:10:59 [2020-01-14T22:10:59.893Z] 29: Missing Implementation: Skipping test: UsingConst/2
17:10:59 [2020-01-14T22:10:59.893Z] 29:     The Z code generator implementation is missing currently (see issue #3796)
17:10:59 [2020-01-14T22:10:59.893Z] 29: Missing Implementation: Skipping test: UsingConst/3
17:10:59 [2020-01-14T22:10:59.893Z] 29:     The Z code generator implementation is missing currently (see issue #3796)
17:10:59 [2020-01-14T22:10:59.893Z] 29: Missing Implementation: Skipping test: UsingConst/4
17:10:59 [2020-01-14T22:10:59.893Z] 29:     The Z code generator implementation is missing currently (see issue #3796)
17:10:59 [2020-01-14T22:10:59.893Z] 29: Missing Implementation: Skipping test: UsingConst/5
17:10:59 [2020-01-14T22:10:59.893Z] 29:     The Z code generator implementation is missing currently (see issue #3796)
17:10:59 [2020-01-14T22:10:59.893Z] 29: Missing Implementation: Skipping test: UsingConst/6
17:10:59 [2020-01-14T22:10:59.893Z] 29:     The Z code generator implementation is missing currently (see issue #3796)
17:10:59 [2020-01-14T22:10:59.893Z] 29: Missing Implementation: Skipping test: UsingConst/7
17:10:59 [2020-01-14T22:10:59.893Z] 29:     The Z code generator implementation is missing currently (see issue #3796)
17:10:59 [2020-01-14T22:10:59.893Z] 29: Missing Implementation: Skipping test: UsingConst/8
17:10:59 [2020-01-14T22:10:59.893Z] 29:     The Z code generator implementation is missing currently (see issue #3796)
17:10:59 [2020-01-14T22:10:59.893Z] 29: Missing Implementation: Skipping test: UsingConst/9
17:10:59 [2020-01-14T22:10:59.893Z] 29:     The Z code generator implementation is missing currently (see issue #3796)
17:10:59 [2020-01-14T22:10:59.893Z] 29: Missing Implementation: Skipping test: UsingConst/10
17:10:59 [2020-01-14T22:10:59.893Z] 29:     The Z code generator implementation is missing currently (see issue #3796)
17:10:59 [2020-01-14T22:10:59.893Z] 29: Missing Implementation: Skipping test: UsingConst/11
17:10:59 [2020-01-14T22:10:59.893Z] 29:     The Z code generator implementation is missing currently (see issue #3796)
17:10:59 [2020-01-14T22:10:59.893Z] 29: Missing Implementation: Skipping test: UsingConst/12
17:10:59 [2020-01-14T22:10:59.893Z] 29:     The Z code generator implementation is missing currently (see issue #3796)
17:10:59 [2020-01-14T22:10:59.893Z] 29: Missing Implementation: Skipping test: UsingConst/13
17:10:59 [2020-01-14T22:10:59.893Z] 29:     The Z code generator implementation is missing currently (see issue #3796)
17:10:59 [2020-01-14T22:10:59.893Z] 29: [----------] 28 tests from TernaryTest/Int64TernaryInt64CompareTest (1 ms total)
17:10:59 [2020-01-14T22:10:59.893Z] 29: 
17:10:59 [2020-01-14T22:10:59.894Z] 29: [----------] 28 tests from TernaryTest/Int64TernaryDoubleCompareTest
17:10:59 [2020-01-14T22:10:59.894Z] 29: Missing Implementation: Skipping test: UsingLoadParam/0
17:10:59 [2020-01-14T22:10:59.894Z] 29:     The Z code generator implementation is missing currently (see issue #3796)
17:10:59 [2020-01-14T22:10:59.894Z] 29: Missing Implementation: Skipping test: UsingLoadParam/1
17:10:59 [2020-01-14T22:10:59.894Z] 29:     The Z code generator implementation is missing currently (see issue #3796)
17:10:59 [2020-01-14T22:10:59.894Z] 29: Missing Implementation: Skipping test: UsingLoadParam/2
17:10:59 [2020-01-14T22:10:59.894Z] 29:     The Z code generator implementation is missing currently (see issue #3796)
17:10:59 [2020-01-14T22:10:59.894Z] 29: Missing Implementation: Skipping test: UsingLoadParam/3
17:10:59 [2020-01-14T22:10:59.894Z] 29:     The Z code generator implementation is missing currently (see issue #3796)
17:10:59 [2020-01-14T22:10:59.894Z] 29: Missing Implementation: Skipping test: UsingLoadParam/4
17:10:59 [2020-01-14T22:10:59.894Z] 29:     The Z code generator implementation is missing currently (see issue #3796)
17:10:59 [2020-01-14T22:10:59.894Z] 29: Missing Implementation: Skipping test: UsingLoadParam/5
17:10:59 [2020-01-14T22:10:59.894Z] 29:     The Z code generator implementation is missing currently (see issue #3796)
17:10:59 [2020-01-14T22:10:59.894Z] 29: Missing Implementation: Skipping test: UsingLoadParam/6
17:10:59 [2020-01-14T22:10:59.894Z] 29:     The Z code generator implementation is missing currently (see issue #3796)
17:10:59 [2020-01-14T22:10:59.894Z] 29: Missing Implementation: Skipping test: UsingLoadParam/7
17:10:59 [2020-01-14T22:10:59.894Z] 29:     The Z code generator implementation is missing currently (see issue #3796)
17:10:59 [2020-01-14T22:10:59.894Z] 29: Missing Implementation: Skipping test: UsingLoadParam/8
17:10:59 [2020-01-14T22:10:59.894Z] 29:     The Z code generator implementation is missing currently (see issue #3796)
17:10:59 [2020-01-14T22:10:59.894Z] 29: Missing Implementation: Skipping test: UsingLoadParam/9
17:10:59 [2020-01-14T22:10:59.894Z] 29:     The Z code generator implementation is missing currently (see issue #3796)
17:10:59 [2020-01-14T22:10:59.894Z] 29: Missing Implementation: Skipping test: UsingLoadParam/10
17:10:59 [2020-01-14T22:10:59.894Z] 29:     The Z code generator implementation is missing currently (see issue #3796)
17:10:59 [2020-01-14T22:10:59.894Z] 29: Missing Implementation: Skipping test: UsingLoadParam/11
17:10:59 [2020-01-14T22:10:59.894Z] 29:     The Z code generator implementation is missing currently (see issue #3796)
17:10:59 [2020-01-14T22:10:59.894Z] 29: Missing Implementation: Skipping test: UsingLoadParam/12
17:10:59 [2020-01-14T22:10:59.894Z] 29:     The Z code generator implementation is missing currently (see issue #3796)
17:10:59 [2020-01-14T22:10:59.894Z] 29: Missing Implementation: Skipping test: UsingLoadParam/13
17:10:59 [2020-01-14T22:10:59.894Z] 29:     The Z code generator implementation is missing currently (see issue #3796)
17:10:59 [2020-01-14T22:10:59.894Z] 29: Missing Implementation: Skipping test: UsingConst/0
17:10:59 [2020-01-14T22:10:59.894Z] 29:     The Z code generator implementation is missing currently (see issue #3796)
17:10:59 [2020-01-14T22:10:59.894Z] 29: Missing Implementation: Skipping test: UsingConst/1
17:10:59 [2020-01-14T22:10:59.894Z] 29:     The Z code generator implementation is missing currently (see issue #3796)
17:10:59 [2020-01-14T22:10:59.894Z] 29: Missing Implementation: Skipping test: UsingConst/2
17:10:59 [2020-01-14T22:10:59.894Z] 29:     The Z code generator implementation is missing currently (see issue #3796)
17:10:59 [2020-01-14T22:10:59.894Z] 29: Missing Implementation: Skipping test: UsingConst/3
17:10:59 [2020-01-14T22:10:59.894Z] 29:     The Z code generator implementation is missing currently (see issue #3796)
17:10:59 [2020-01-14T22:10:59.894Z] 29: Missing Implementation: Skipping test: UsingConst/4
17:10:59 [2020-01-14T22:10:59.894Z] 29:     The Z code generator implementation is missing currently (see issue #3796)
17:10:59 [2020-01-14T22:10:59.894Z] 29: Missing Implementation: Skipping test: UsingConst/5
17:10:59 [2020-01-14T22:10:59.894Z] 29:     The Z code generator implementation is missing currently (see issue #3796)
17:10:59 [2020-01-14T22:10:59.894Z] 29: Missing Implementation: Skipping test: UsingConst/6
17:10:59 [2020-01-14T22:10:59.894Z] 29:     The Z code generator implementation is missing currently (see issue #3796)
17:10:59 [2020-01-14T22:10:59.894Z] 29: Missing Implementation: Skipping test: UsingConst/7
17:10:59 [2020-01-14T22:10:59.894Z] 29:     The Z code generator implementation is missing currently (see issue #3796)
17:10:59 [2020-01-14T22:10:59.894Z] 29: Missing Implementation: Skipping test: UsingConst/8
17:10:59 [2020-01-14T22:10:59.894Z] 29:     The Z code generator implementation is missing currently (see issue #3796)
17:10:59 [2020-01-14T22:10:59.894Z] 29: Missing Implementation: Skipping test: UsingConst/9
17:10:59 [2020-01-14T22:10:59.894Z] 29:     The Z code generator implementation is missing currently (see issue #3796)
17:10:59 [2020-01-14T22:10:59.894Z] 29: Missing Implementation: Skipping test: UsingConst/10
17:10:59 [2020-01-14T22:10:59.894Z] 29:     The Z code generator implementation is missing currently (see issue #3796)
17:10:59 [2020-01-14T22:10:59.894Z] 29: Missing Implementation: Skipping test: UsingConst/11
17:10:59 [2020-01-14T22:10:59.894Z] 29:     The Z code generator implementation is missing currently (see issue #3796)
17:10:59 [2020-01-14T22:10:59.894Z] 29: Missing Implementation: Skipping test: UsingConst/12
17:10:59 [2020-01-14T22:10:59.894Z] 29:     The Z code generator implementation is missing currently (see issue #3796)
17:10:59 [2020-01-14T22:10:59.894Z] 29: Missing Implementation: Skipping test: UsingConst/13
17:10:59 [2020-01-14T22:10:59.894Z] 29:     The Z code generator implementation is missing currently (see issue #3796)
17:10:59 [2020-01-14T22:10:59.894Z] 29: [----------] 28 tests from TernaryTest/Int64TernaryDoubleCompareTest (1 ms total)
17:10:59 [2020-01-14T22:10:59.894Z] 29: 
17:10:59 [2020-01-14T22:10:59.894Z] 29: [----------] 28 tests from TernaryTest/Int32TernaryDoubleCompareTest
17:10:59 [2020-01-14T22:10:59.894Z] 29: Missing Implementation: Skipping test: UsingLoadParam/0
17:10:59 [2020-01-14T22:10:59.894Z] 29:     The Z code generator implementation is missing currently (see issue #3796)
17:10:59 [2020-01-14T22:10:59.894Z] 29: Missing Implementation: Skipping test: UsingLoadParam/1
17:10:59 [2020-01-14T22:10:59.894Z] 29:     The Z code generator implementation is missing currently (see issue #3796)
17:10:59 [2020-01-14T22:10:59.894Z] 29: Missing Implementation: Skipping test: UsingLoadParam/2
17:10:59 [2020-01-14T22:10:59.894Z] 29:     The Z code generator implementation is missing currently (see issue #3796)
17:10:59 [2020-01-14T22:10:59.894Z] 29: Missing Implementation: Skipping test: UsingLoadParam/3
17:10:59 [2020-01-14T22:10:59.894Z] 29:     The Z code generator implementation is missing currently (see issue #3796)
17:10:59 [2020-01-14T22:10:59.894Z] 29: Missing Implementation: Skipping test: UsingLoadParam/4
17:10:59 [2020-01-14T22:10:59.894Z] 29:     The Z code generator implementation is missing currently (see issue #3796)
17:10:59 [2020-01-14T22:10:59.894Z] 29: Missing Implementation: Skipping test: UsingLoadParam/5
17:10:59 [2020-01-14T22:10:59.894Z] 29:     The Z code generator implementation is missing currently (see issue #3796)
17:10:59 [2020-01-14T22:10:59.894Z] 29: Missing Implementation: Skipping test: UsingLoadParam/6
17:10:59 [2020-01-14T22:10:59.894Z] 29:     The Z code generator implementation is missing currently (see issue #3796)
17:10:59 [2020-01-14T22:10:59.894Z] 29: Missing Implementation: Skipping test: UsingLoadParam/7
17:10:59 [2020-01-14T22:10:59.894Z] 29:     The Z code generator implementation is missing currently (see issue #3796)
17:10:59 [2020-01-14T22:10:59.894Z] 29: Missing Implementation: Skipping test: UsingLoadParam/8
17:10:59 [2020-01-14T22:10:59.894Z] 29:     The Z code generator implementation is missing currently (see issue #3796)
17:10:59 [2020-01-14T22:10:59.894Z] 29: Missing Implementation: Skipping test: UsingLoadParam/9
17:10:59 [2020-01-14T22:10:59.894Z] 29:     The Z code generator implementation is missing currently (see issue #3796)
17:10:59 [2020-01-14T22:10:59.894Z] 29: Missing Implementation: Skipping test: UsingLoadParam/10
17:10:59 [2020-01-14T22:10:59.894Z] 29:     The Z code generator implementation is missing currently (see issue #3796)
17:10:59 [2020-01-14T22:10:59.894Z] 29: Missing Implementation: Skipping test: UsingLoadParam/11
17:10:59 [2020-01-14T22:10:59.894Z] 29:     The Z code generator implementation is missing currently (see issue #3796)
17:10:59 [2020-01-14T22:10:59.894Z] 29: Missing Implementation: Skipping test: UsingLoadParam/12
17:10:59 [2020-01-14T22:10:59.894Z] 29:     The Z code generator implementation is missing currently (see issue #3796)
17:10:59 [2020-01-14T22:10:59.894Z] 29: Missing Implementation: Skipping test: UsingLoadParam/13
17:10:59 [2020-01-14T22:10:59.894Z] 29:     The Z code generator implementation is missing currently (see issue #3796)
17:10:59 [2020-01-14T22:10:59.894Z] 29: Missing Implementation: Skipping test: UsingConst/0
17:10:59 [2020-01-14T22:10:59.894Z] 29:     The Z code generator implementation is missing currently (see issue #3796)
17:10:59 [2020-01-14T22:10:59.894Z] 29: Missing Implementation: Skipping test: UsingConst/1
17:10:59 [2020-01-14T22:10:59.894Z] 29:     The Z code generator implementation is missing currently (see issue #3796)
17:10:59 [2020-01-14T22:10:59.894Z] 29: Missing Implementation: Skipping test: UsingConst/2
17:10:59 [2020-01-14T22:10:59.894Z] 29:     The Z code generator implementation is missing currently (see issue #3796)
17:10:59 [2020-01-14T22:10:59.894Z] 29: Missing Implementation: Skipping test: UsingConst/3
17:10:59 [2020-01-14T22:10:59.894Z] 29:     The Z code generator implementation is missing currently (see issue #3796)
17:10:59 [2020-01-14T22:10:59.894Z] 29: Missing Implementation: Skipping test: UsingConst/4
17:10:59 [2020-01-14T22:10:59.894Z] 29:     The Z code generator implementation is missing currently (see issue #3796)
17:10:59 [2020-01-14T22:10:59.894Z] 29: Missing Implementation: Skipping test: UsingConst/5
17:10:59 [2020-01-14T22:10:59.894Z] 29:     The Z code generator implementation is missing currently (see issue #3796)
17:10:59 [2020-01-14T22:10:59.894Z] 29: Missing Implementation: Skipping test: UsingConst/6
17:10:59 [2020-01-14T22:10:59.894Z] 29:     The Z code generator implementation is missing currently (see issue #3796)
17:10:59 [2020-01-14T22:10:59.894Z] 29: Missing Implementation: Skipping test: UsingConst/7
17:10:59 [2020-01-14T22:10:59.894Z] 29:     The Z code generator implementation is missing currently (see issue #3796)
17:10:59 [2020-01-14T22:10:59.894Z] 29: Missing Implementation: Skipping test: UsingConst/8
17:10:59 [2020-01-14T22:10:59.894Z] 29:     The Z code generator implementation is missing currently (see issue #3796)
17:10:59 [2020-01-14T22:10:59.894Z] 29: Missing Implementation: Skipping test: UsingConst/9
17:10:59 [2020-01-14T22:10:59.894Z] 29:     The Z code generator implementation is missing currently (see issue #3796)
17:10:59 [2020-01-14T22:10:59.894Z] 29: Missing Implementation: Skipping test: UsingConst/10
17:10:59 [2020-01-14T22:10:59.894Z] 29:     The Z code generator implementation is missing currently (see issue #3796)
17:10:59 [2020-01-14T22:10:59.894Z] 29: Missing Implementation: Skipping test: UsingConst/11
17:10:59 [2020-01-14T22:10:59.894Z] 29:     The Z code generator implementation is missing currently (see issue #3796)
17:10:59 [2020-01-14T22:10:59.894Z] 29: Missing Implementation: Skipping test: UsingConst/12
17:10:59 [2020-01-14T22:10:59.894Z] 29:     The Z code generator implementation is missing currently (see issue #3796)
17:10:59 [2020-01-14T22:10:59.894Z] 29: Missing Implementation: Skipping test: UsingConst/13
17:10:59 [2020-01-14T22:10:59.894Z] 29:     The Z code generator implementation is missing currently (see issue #3796)
17:10:59 [2020-01-14T22:10:59.894Z] 29: [----------] 28 tests from TernaryTest/Int32TernaryDoubleCompareTest (2 ms total)
17:10:59 [2020-01-14T22:10:59.894Z] 29: 
17:10:59 [2020-01-14T22:10:59.894Z] 29: [----------] 28 tests from TernaryTest/ShortTernaryDoubleCompareTest
17:10:59 [2020-01-14T22:10:59.894Z] 29: Missing Implementation: Skipping test: UsingLoadParam/0
17:10:59 [2020-01-14T22:10:59.894Z] 29:     The Z code generator implementation is missing currently (see issue #3796)
17:10:59 [2020-01-14T22:10:59.894Z] 29: Missing Implementation: Skipping test: UsingLoadParam/1
17:10:59 [2020-01-14T22:10:59.894Z] 29:     The Z code generator implementation is missing currently (see issue #3796)
17:10:59 [2020-01-14T22:10:59.894Z] 29: Missing Implementation: Skipping test: UsingLoadParam/2
17:10:59 [2020-01-14T22:10:59.894Z] 29:     The Z code generator implementation is missing currently (see issue #3796)
17:10:59 [2020-01-14T22:10:59.894Z] 29: Missing Implementation: Skipping test: UsingLoadParam/3
17:10:59 [2020-01-14T22:10:59.894Z] 29:     The Z code generator implementation is missing currently (see issue #3796)
17:10:59 [2020-01-14T22:10:59.894Z] 29: Missing Implementation: Skipping test: UsingLoadParam/4
17:10:59 [2020-01-14T22:10:59.894Z] 29:     The Z code generator implementation is missing currently (see issue #3796)
17:10:59 [2020-01-14T22:10:59.894Z] 29: Missing Implementation: Skipping test: UsingLoadParam/5
17:10:59 [2020-01-14T22:10:59.894Z] 29:     The Z code generator implementation is missing currently (see issue #3796)
17:10:59 [2020-01-14T22:10:59.894Z] 29: Missing Implementation: Skipping test: UsingLoadParam/6
17:10:59 [2020-01-14T22:10:59.894Z] 29:     The Z code generator implementation is missing currently (see issue #3796)
17:10:59 [2020-01-14T22:10:59.894Z] 29: Missing Implementation: Skipping test: UsingLoadParam/7
17:10:59 [2020-01-14T22:10:59.894Z] 29:     The Z code generator implementation is missing currently (see issue #3796)
17:10:59 [2020-01-14T22:10:59.894Z] 29: Missing Implementation: Skipping test: UsingLoadParam/8
17:10:59 [2020-01-14T22:10:59.894Z] 29:     The Z code generator implementation is missing currently (see issue #3796)
17:10:59 [2020-01-14T22:10:59.894Z] 29: Missing Implementation: Skipping test: UsingLoadParam/9
17:10:59 [2020-01-14T22:10:59.894Z] 29:     The Z code generator implementation is missing currently (see issue #3796)
17:10:59 [2020-01-14T22:10:59.894Z] 29: Missing Implementation: Skipping test: UsingLoadParam/10
17:10:59 [2020-01-14T22:10:59.894Z] 29:     The Z code generator implementation is missing currently (see issue #3796)
17:10:59 [2020-01-14T22:10:59.894Z] 29: Missing Implementation: Skipping test: UsingLoadParam/11
17:10:59 [2020-01-14T22:10:59.894Z] 29:     The Z code generator implementation is missing currently (see issue #3796)
17:10:59 [2020-01-14T22:10:59.894Z] 29: Missing Implementation: Skipping test: UsingLoadParam/12
17:10:59 [2020-01-14T22:10:59.894Z] 29:     The Z code generator implementation is missing currently (see issue #3796)
17:10:59 [2020-01-14T22:10:59.894Z] 29: Missing Implementation: Skipping test: UsingLoadParam/13
17:10:59 [2020-01-14T22:10:59.894Z] 29:     The Z code generator implementation is missing currently (see issue #3796)
17:10:59 [2020-01-14T22:10:59.894Z] 29: Missing Implementation: Skipping test: UsingConst/0
17:10:59 [2020-01-14T22:10:59.894Z] 29:     The Z code generator implementation is missing currently (see issue #3796)
17:10:59 [2020-01-14T22:10:59.894Z] 29: Missing Implementation: Skipping test: UsingConst/1
17:10:59 [2020-01-14T22:10:59.894Z] 29:     The Z code generator implementation is missing currently (see issue #3796)
17:10:59 [2020-01-14T22:10:59.894Z] 29: Missing Implementation: Skipping test: UsingConst/2
17:10:59 [2020-01-14T22:10:59.894Z] 29:     The Z code generator implementation is missing currently (see issue #3796)
17:10:59 [2020-01-14T22:10:59.894Z] 29: Missing Implementation: Skipping test: UsingConst/3
17:10:59 [2020-01-14T22:10:59.894Z] 29:     The Z code generator implementation is missing currently (see issue #3796)
17:10:59 [2020-01-14T22:10:59.894Z] 29: Missing Implementation: Skipping test: UsingConst/4
17:10:59 [2020-01-14T22:10:59.894Z] 29:     The Z code generator implementation is missing currently (see issue #3796)
17:10:59 [2020-01-14T22:10:59.894Z] 29: Missing Implementation: Skipping test: UsingConst/5
17:10:59 [2020-01-14T22:10:59.894Z] 29:     The Z code generator implementation is missing currently (see issue #3796)
17:10:59 [2020-01-14T22:10:59.894Z] 29: Missing Implementation: Skipping test: UsingConst/6
17:10:59 [2020-01-14T22:10:59.894Z] 29:     The Z code generator implementation is missing currently (see issue #3796)
17:10:59 [2020-01-14T22:10:59.894Z] 29: Missing Implementation: Skipping test: UsingConst/7
17:10:59 [2020-01-14T22:10:59.894Z] 29:     The Z code generator implementation is missing currently (see issue #3796)
17:10:59 [2020-01-14T22:10:59.894Z] 29: Missing Implementation: Skipping test: UsingConst/8
17:10:59 [2020-01-14T22:10:59.894Z] 29:     The Z code generator implementation is missing currently (see issue #3796)
17:10:59 [2020-01-14T22:10:59.894Z] 29: Missing Implementation: Skipping test: UsingConst/9
17:10:59 [2020-01-14T22:10:59.894Z] 29:     The Z code generator implementation is missing currently (see issue #3796)
17:10:59 [2020-01-14T22:10:59.894Z] 29: Missing Implementation: Skipping test: UsingConst/10
17:10:59 [2020-01-14T22:10:59.894Z] 29:     The Z code generator implementation is missing currently (see issue #3796)
17:10:59 [2020-01-14T22:10:59.894Z] 29: Missing Implementation: Skipping test: UsingConst/11
17:10:59 [2020-01-14T22:10:59.894Z] 29:     The Z code generator implementation is missing currently (see issue #3796)
17:10:59 [2020-01-14T22:10:59.894Z] 29: Missing Implementation: Skipping test: UsingConst/12
17:10:59 [2020-01-14T22:10:59.894Z] 29:     The Z code generator implementation is missing currently (see issue #3796)
17:10:59 [2020-01-14T22:10:59.894Z] 29: Missing Implementation: Skipping test: UsingConst/13
17:10:59 [2020-01-14T22:10:59.894Z] 29:     The Z code generator implementation is missing currently (see issue #3796)
17:10:59 [2020-01-14T22:10:59.894Z] 29: [----------] 28 tests from TernaryTest/ShortTernaryDoubleCompareTest (2 ms total)
17:10:59 [2020-01-14T22:10:59.894Z] 29: 
17:10:59 [2020-01-14T22:10:59.894Z] 29: [==========] 83620 tests from 119 test cases ran. (46848 ms total)
17:10:59 [2020-01-14T22:10:59.894Z] 29: [  PASSED  ] 83620 tests.
17:10:59 [2020-01-14T22:10:59.894Z] 29: [  ALL TESTS PASSED  ] 
17:11:01 [2020-01-14T22:11:01.279Z] 29: 
17:11:01 [2020-01-14T22:11:01.279Z] 29/29 Test #29: comptest ..........................   Passed   49.28 sec
17:11:01 [2020-01-14T22:11:01.279Z] 
17:11:01 [2020-01-14T22:11:01.279Z] 97% tests passed, 1 tests failed out of 29
17:11:01 [2020-01-14T22:11:01.279Z] 
17:11:01 [2020-01-14T22:11:01.279Z] Total Test time (real) = 209.71 sec
17:11:01 [2020-01-14T22:11:01.279Z] 
17:11:01 [2020-01-14T22:11:01.279Z] The following tests FAILED:
17:11:01 [2020-01-14T22:11:01.279Z] 	 14 - porttest (SEGFAULT)
17:11:01 [2020-01-14T22:11:01.279Z] Errors while running CTest
[Pipeline] }
[Pipeline] // dir
[Pipeline] }
[Pipeline] // timestamps
[Pipeline] }
[Pipeline] // stage
[Pipeline] stage
[Pipeline] { (Declarative: Post Actions)
[Pipeline] echo
Cleanup workspace
[Pipeline] deleteDir
[Pipeline] }
[Pipeline] // stage
[Pipeline] }
[Pipeline] // withEnv
[Pipeline] }
[Pipeline] // withEnv
[Pipeline] }
[Pipeline] // node
[Pipeline] End of Pipeline
Setting status of b6b7dda6b1fa079052d14d23b55fbcb712b49ca4 to FAILURE with url https://ci.eclipse.org/omr/job/PullRequest-linux_390-64/2249/ and message: 'Build finished. '
Using context: continuous-integration/eclipse-omr/pr/linux_390-64
ERROR: script returned exit code 8
Finished: FAILURE