FailedConsole Output

Skipping 2,325 KB.. Full Log
ram/81
10:15:44 [2019-11-08T15:15:44.129Z] 29:     The s390x code generator currently doesn't support dmax/dmin (see issue #4276)
10:15:44 [2019-11-08T15:15:44.129Z] 29: Known Bug: Skipping test: UsingLoadParam/82
10:15:44 [2019-11-08T15:15:44.129Z] 29:     The s390x code generator currently doesn't support dmax/dmin (see issue #4276)
10:15:44 [2019-11-08T15:15:44.129Z] 29: Known Bug: Skipping test: UsingLoadParam/83
10:15:44 [2019-11-08T15:15:44.129Z] 29:     The s390x code generator currently doesn't support dmax/dmin (see issue #4276)
10:15:44 [2019-11-08T15:15:44.129Z] 29: Known Bug: Skipping test: UsingLoadParam/84
10:15:44 [2019-11-08T15:15:44.129Z] 29:     The s390x code generator currently doesn't support dmax/dmin (see issue #4276)
10:15:44 [2019-11-08T15:15:44.129Z] 29: Known Bug: Skipping test: UsingLoadParam/85
10:15:44 [2019-11-08T15:15:44.129Z] 29:     The s390x code generator currently doesn't support dmax/dmin (see issue #4276)
10:15:44 [2019-11-08T15:15:44.129Z] 29: Known Bug: Skipping test: UsingLoadParam/86
10:15:44 [2019-11-08T15:15:44.129Z] 29:     The s390x code generator currently doesn't support dmax/dmin (see issue #4276)
10:15:44 [2019-11-08T15:15:44.129Z] 29: Known Bug: Skipping test: UsingLoadParam/87
10:15:44 [2019-11-08T15:15:44.129Z] 29:     The s390x code generator currently doesn't support dmax/dmin (see issue #4276)
10:15:44 [2019-11-08T15:15:44.129Z] 29: Known Bug: Skipping test: UsingLoadParam/88
10:15:44 [2019-11-08T15:15:44.129Z] 29:     The s390x code generator currently doesn't support dmax/dmin (see issue #4276)
10:15:44 [2019-11-08T15:15:44.129Z] 29: Known Bug: Skipping test: UsingLoadParam/89
10:15:44 [2019-11-08T15:15:44.129Z] 29:     The s390x code generator currently doesn't support dmax/dmin (see issue #4276)
10:15:44 [2019-11-08T15:15:44.129Z] 29: Known Bug: Skipping test: UsingLoadParam/90
10:15:44 [2019-11-08T15:15:44.129Z] 29:     The s390x code generator currently doesn't support dmax/dmin (see issue #4276)
10:15:44 [2019-11-08T15:15:44.129Z] 29: Known Bug: Skipping test: UsingLoadParam/91
10:15:44 [2019-11-08T15:15:44.129Z] 29:     The s390x code generator currently doesn't support dmax/dmin (see issue #4276)
10:15:44 [2019-11-08T15:15:44.129Z] 29: Known Bug: Skipping test: UsingLoadParam/92
10:15:44 [2019-11-08T15:15:44.129Z] 29:     The s390x code generator currently doesn't support dmax/dmin (see issue #4276)
10:15:44 [2019-11-08T15:15:44.129Z] 29: Known Bug: Skipping test: UsingLoadParam/93
10:15:44 [2019-11-08T15:15:44.129Z] 29:     The s390x code generator currently doesn't support dmax/dmin (see issue #4276)
10:15:44 [2019-11-08T15:15:44.129Z] 29: Known Bug: Skipping test: UsingLoadParam/94
10:15:44 [2019-11-08T15:15:44.129Z] 29:     The s390x code generator currently doesn't support dmax/dmin (see issue #4276)
10:15:44 [2019-11-08T15:15:44.129Z] 29: Known Bug: Skipping test: UsingLoadParam/95
10:15:44 [2019-11-08T15:15:44.129Z] 29:     The s390x code generator currently doesn't support dmax/dmin (see issue #4276)
10:15:44 [2019-11-08T15:15:44.129Z] 29: Known Bug: Skipping test: UsingLoadParam/96
10:15:44 [2019-11-08T15:15:44.129Z] 29:     The s390x code generator currently doesn't support dmax/dmin (see issue #4276)
10:15:44 [2019-11-08T15:15:44.129Z] 29: Known Bug: Skipping test: UsingLoadParam/97
10:15:44 [2019-11-08T15:15:44.129Z] 29:     The s390x code generator currently doesn't support dmax/dmin (see issue #4276)
10:15:44 [2019-11-08T15:15:44.129Z] 29: Known Bug: Skipping test: UsingLoadParam/98
10:15:44 [2019-11-08T15:15:44.129Z] 29:     The s390x code generator currently doesn't support dmax/dmin (see issue #4276)
10:15:44 [2019-11-08T15:15:44.129Z] 29: Known Bug: Skipping test: UsingLoadParam/99
10:15:44 [2019-11-08T15:15:44.129Z] 29:     The s390x code generator currently doesn't support dmax/dmin (see issue #4276)
10:15:44 [2019-11-08T15:15:44.129Z] 29: Known Bug: Skipping test: UsingLoadParam/100
10:15:44 [2019-11-08T15:15:44.129Z] 29:     The s390x code generator currently doesn't support dmax/dmin (see issue #4276)
10:15:44 [2019-11-08T15:15:44.129Z] 29: Known Bug: Skipping test: UsingLoadParam/101
10:15:44 [2019-11-08T15:15:44.129Z] 29:     The s390x code generator currently doesn't support dmax/dmin (see issue #4276)
10:15:44 [2019-11-08T15:15:44.129Z] 29: Known Bug: Skipping test: UsingLoadParam/102
10:15:44 [2019-11-08T15:15:44.129Z] 29:     The s390x code generator currently doesn't support dmax/dmin (see issue #4276)
10:15:44 [2019-11-08T15:15:44.129Z] 29: Known Bug: Skipping test: UsingLoadParam/103
10:15:44 [2019-11-08T15:15:44.129Z] 29:     The s390x code generator currently doesn't support dmax/dmin (see issue #4276)
10:15:44 [2019-11-08T15:15:44.129Z] 29: Known Bug: Skipping test: UsingLoadParam/104
10:15:44 [2019-11-08T15:15:44.129Z] 29:     The s390x code generator currently doesn't support dmax/dmin (see issue #4276)
10:15:44 [2019-11-08T15:15:44.129Z] 29: Known Bug: Skipping test: UsingLoadParam/105
10:15:44 [2019-11-08T15:15:44.129Z] 29:     The s390x code generator currently doesn't support dmax/dmin (see issue #4276)
10:15:44 [2019-11-08T15:15:44.129Z] 29: Known Bug: Skipping test: UsingLoadParam/106
10:15:44 [2019-11-08T15:15:44.129Z] 29:     The s390x code generator currently doesn't support dmax/dmin (see issue #4276)
10:15:44 [2019-11-08T15:15:44.129Z] 29: Known Bug: Skipping test: UsingLoadParam/107
10:15:44 [2019-11-08T15:15:44.129Z] 29:     The s390x code generator currently doesn't support dmax/dmin (see issue #4276)
10:15:44 [2019-11-08T15:15:44.129Z] 29: Known Bug: Skipping test: UsingLoadParam/108
10:15:44 [2019-11-08T15:15:44.129Z] 29:     The s390x code generator currently doesn't support dmax/dmin (see issue #4276)
10:15:44 [2019-11-08T15:15:44.129Z] 29: Known Bug: Skipping test: UsingLoadParam/109
10:15:44 [2019-11-08T15:15:44.129Z] 29:     The s390x code generator currently doesn't support dmax/dmin (see issue #4276)
10:15:44 [2019-11-08T15:15:44.129Z] 29: Known Bug: Skipping test: UsingLoadParam/110
10:15:44 [2019-11-08T15:15:44.129Z] 29:     The s390x code generator currently doesn't support dmax/dmin (see issue #4276)
10:15:44 [2019-11-08T15:15:44.129Z] 29: Known Bug: Skipping test: UsingLoadParam/111
10:15:44 [2019-11-08T15:15:44.129Z] 29:     The s390x code generator currently doesn't support dmax/dmin (see issue #4276)
10:15:44 [2019-11-08T15:15:44.129Z] 29: Known Bug: Skipping test: UsingLoadParam/112
10:15:44 [2019-11-08T15:15:44.129Z] 29:     The s390x code generator currently doesn't support dmax/dmin (see issue #4276)
10:15:44 [2019-11-08T15:15:44.129Z] 29: Known Bug: Skipping test: UsingLoadParam/113
10:15:44 [2019-11-08T15:15:44.129Z] 29:     The s390x code generator currently doesn't support dmax/dmin (see issue #4276)
10:15:44 [2019-11-08T15:15:44.129Z] 29: Known Bug: Skipping test: UsingLoadParam/114
10:15:44 [2019-11-08T15:15:44.129Z] 29:     The s390x code generator currently doesn't support dmax/dmin (see issue #4276)
10:15:44 [2019-11-08T15:15:44.129Z] 29: Known Bug: Skipping test: UsingLoadParam/115
10:15:44 [2019-11-08T15:15:44.129Z] 29:     The s390x code generator currently doesn't support dmax/dmin (see issue #4276)
10:15:44 [2019-11-08T15:15:44.129Z] 29: Known Bug: Skipping test: UsingLoadParam/116
10:15:44 [2019-11-08T15:15:44.129Z] 29:     The s390x code generator currently doesn't support dmax/dmin (see issue #4276)
10:15:44 [2019-11-08T15:15:44.129Z] 29: Known Bug: Skipping test: UsingLoadParam/117
10:15:44 [2019-11-08T15:15:44.129Z] 29:     The s390x code generator currently doesn't support dmax/dmin (see issue #4276)
10:15:44 [2019-11-08T15:15:44.129Z] 29: Known Bug: Skipping test: UsingLoadParam/118
10:15:44 [2019-11-08T15:15:44.129Z] 29:     The s390x code generator currently doesn't support dmax/dmin (see issue #4276)
10:15:44 [2019-11-08T15:15:44.129Z] 29: Known Bug: Skipping test: UsingLoadParam/119
10:15:44 [2019-11-08T15:15:44.130Z] 29:     The s390x code generator currently doesn't support dmax/dmin (see issue #4276)
10:15:44 [2019-11-08T15:15:44.130Z] 29: Known Bug: Skipping test: UsingLoadParam/120
10:15:44 [2019-11-08T15:15:44.130Z] 29:     The s390x code generator currently doesn't support dmax/dmin (see issue #4276)
10:15:44 [2019-11-08T15:15:44.130Z] 29: Known Bug: Skipping test: UsingLoadParam/121
10:15:44 [2019-11-08T15:15:44.130Z] 29:     The s390x code generator currently doesn't support dmax/dmin (see issue #4276)
10:15:44 [2019-11-08T15:15:44.130Z] 29: Known Bug: Skipping test: UsingLoadParam/122
10:15:44 [2019-11-08T15:15:44.130Z] 29:     The s390x code generator currently doesn't support dmax/dmin (see issue #4276)
10:15:44 [2019-11-08T15:15:44.130Z] 29: Known Bug: Skipping test: UsingLoadParam/123
10:15:44 [2019-11-08T15:15:44.130Z] 29:     The s390x code generator currently doesn't support dmax/dmin (see issue #4276)
10:15:44 [2019-11-08T15:15:44.130Z] 29: Known Bug: Skipping test: UsingLoadParam/124
10:15:44 [2019-11-08T15:15:44.130Z] 29:     The s390x code generator currently doesn't support dmax/dmin (see issue #4276)
10:15:44 [2019-11-08T15:15:44.130Z] 29: Known Bug: Skipping test: UsingLoadParam/125
10:15:44 [2019-11-08T15:15:44.130Z] 29:     The s390x code generator currently doesn't support dmax/dmin (see issue #4276)
10:15:44 [2019-11-08T15:15:44.130Z] 29: Known Bug: Skipping test: UsingLoadParam/126
10:15:44 [2019-11-08T15:15:44.130Z] 29:     The s390x code generator currently doesn't support dmax/dmin (see issue #4276)
10:15:44 [2019-11-08T15:15:44.130Z] 29: Known Bug: Skipping test: UsingLoadParam/127
10:15:44 [2019-11-08T15:15:44.130Z] 29:     The s390x code generator currently doesn't support dmax/dmin (see issue #4276)
10:15:44 [2019-11-08T15:15:44.130Z] 29: Known Bug: Skipping test: UsingLoadParam/128
10:15:44 [2019-11-08T15:15:44.130Z] 29:     The s390x code generator currently doesn't support dmax/dmin (see issue #4276)
10:15:44 [2019-11-08T15:15:44.130Z] 29: Known Bug: Skipping test: UsingLoadParam/129
10:15:44 [2019-11-08T15:15:44.130Z] 29:     The s390x code generator currently doesn't support dmax/dmin (see issue #4276)
10:15:44 [2019-11-08T15:15:44.130Z] 29: Known Bug: Skipping test: UsingLoadParam/130
10:15:44 [2019-11-08T15:15:44.130Z] 29:     The s390x code generator currently doesn't support dmax/dmin (see issue #4276)
10:15:44 [2019-11-08T15:15:44.130Z] 29: Known Bug: Skipping test: UsingLoadParam/131
10:15:44 [2019-11-08T15:15:44.130Z] 29:     The s390x code generator currently doesn't support dmax/dmin (see issue #4276)
10:15:44 [2019-11-08T15:15:44.130Z] 29: Known Bug: Skipping test: UsingLoadParam/132
10:15:44 [2019-11-08T15:15:44.130Z] 29:     The s390x code generator currently doesn't support dmax/dmin (see issue #4276)
10:15:44 [2019-11-08T15:15:44.130Z] 29: Known Bug: Skipping test: UsingLoadParam/133
10:15:44 [2019-11-08T15:15:44.130Z] 29:     The s390x code generator currently doesn't support dmax/dmin (see issue #4276)
10:15:44 [2019-11-08T15:15:44.130Z] 29: Known Bug: Skipping test: UsingLoadParam/134
10:15:44 [2019-11-08T15:15:44.130Z] 29:     The s390x code generator currently doesn't support dmax/dmin (see issue #4276)
10:15:44 [2019-11-08T15:15:44.130Z] 29: Known Bug: Skipping test: UsingLoadParam/135
10:15:44 [2019-11-08T15:15:44.130Z] 29:     The s390x code generator currently doesn't support dmax/dmin (see issue #4276)
10:15:44 [2019-11-08T15:15:44.130Z] 29: Known Bug: Skipping test: UsingLoadParam/136
10:15:44 [2019-11-08T15:15:44.130Z] 29:     The s390x code generator currently doesn't support dmax/dmin (see issue #4276)
10:15:44 [2019-11-08T15:15:44.130Z] 29: Known Bug: Skipping test: UsingLoadParam/137
10:15:44 [2019-11-08T15:15:44.130Z] 29:     The s390x code generator currently doesn't support dmax/dmin (see issue #4276)
10:15:44 [2019-11-08T15:15:44.130Z] 29: Known Bug: Skipping test: UsingLoadParam/138
10:15:44 [2019-11-08T15:15:44.130Z] 29:     The s390x code generator currently doesn't support dmax/dmin (see issue #4276)
10:15:44 [2019-11-08T15:15:44.130Z] 29: Known Bug: Skipping test: UsingLoadParam/139
10:15:44 [2019-11-08T15:15:44.130Z] 29:     The s390x code generator currently doesn't support dmax/dmin (see issue #4276)
10:15:44 [2019-11-08T15:15:44.130Z] 29: Known Bug: Skipping test: UsingLoadParam/140
10:15:44 [2019-11-08T15:15:44.130Z] 29:     The s390x code generator currently doesn't support dmax/dmin (see issue #4276)
10:15:44 [2019-11-08T15:15:44.130Z] 29: Known Bug: Skipping test: UsingLoadParam/141
10:15:44 [2019-11-08T15:15:44.130Z] 29:     The s390x code generator currently doesn't support dmax/dmin (see issue #4276)
10:15:44 [2019-11-08T15:15:44.130Z] 29: Known Bug: Skipping test: UsingLoadParam/142
10:15:44 [2019-11-08T15:15:44.130Z] 29:     The s390x code generator currently doesn't support dmax/dmin (see issue #4276)
10:15:44 [2019-11-08T15:15:44.130Z] 29: Known Bug: Skipping test: UsingLoadParam/143
10:15:44 [2019-11-08T15:15:44.130Z] 29:     The s390x code generator currently doesn't support dmax/dmin (see issue #4276)
10:15:44 [2019-11-08T15:15:44.130Z] 29: Known Bug: Skipping test: UsingLoadParam/144
10:15:44 [2019-11-08T15:15:44.130Z] 29:     The s390x code generator currently doesn't support dmax/dmin (see issue #4276)
10:15:44 [2019-11-08T15:15:44.130Z] 29: Known Bug: Skipping test: UsingLoadParam/145
10:15:44 [2019-11-08T15:15:44.130Z] 29:     The s390x code generator currently doesn't support dmax/dmin (see issue #4276)
10:15:44 [2019-11-08T15:15:44.130Z] 29: Known Bug: Skipping test: UsingLoadParam/146
10:15:44 [2019-11-08T15:15:44.130Z] 29:     The s390x code generator currently doesn't support dmax/dmin (see issue #4276)
10:15:44 [2019-11-08T15:15:44.130Z] 29: Known Bug: Skipping test: UsingLoadParam/147
10:15:44 [2019-11-08T15:15:44.130Z] 29:     The s390x code generator currently doesn't support dmax/dmin (see issue #4276)
10:15:44 [2019-11-08T15:15:44.130Z] 29: Known Bug: Skipping test: UsingLoadParam/148
10:15:44 [2019-11-08T15:15:44.130Z] 29:     The s390x code generator currently doesn't support dmax/dmin (see issue #4276)
10:15:44 [2019-11-08T15:15:44.130Z] 29: Known Bug: Skipping test: UsingLoadParam/149
10:15:44 [2019-11-08T15:15:44.130Z] 29:     The s390x code generator currently doesn't support dmax/dmin (see issue #4276)
10:15:44 [2019-11-08T15:15:44.130Z] 29: Known Bug: Skipping test: UsingLoadParam/150
10:15:44 [2019-11-08T15:15:44.130Z] 29:     The s390x code generator currently doesn't support dmax/dmin (see issue #4276)
10:15:44 [2019-11-08T15:15:44.130Z] 29: Known Bug: Skipping test: UsingLoadParam/151
10:15:44 [2019-11-08T15:15:44.130Z] 29:     The s390x code generator currently doesn't support dmax/dmin (see issue #4276)
10:15:44 [2019-11-08T15:15:44.130Z] 29: Known Bug: Skipping test: UsingLoadParam/152
10:15:44 [2019-11-08T15:15:44.130Z] 29:     The s390x code generator currently doesn't support dmax/dmin (see issue #4276)
10:15:44 [2019-11-08T15:15:44.130Z] 29: Known Bug: Skipping test: UsingLoadParam/153
10:15:44 [2019-11-08T15:15:44.130Z] 29:     The s390x code generator currently doesn't support dmax/dmin (see issue #4276)
10:15:44 [2019-11-08T15:15:44.130Z] 29: Known Bug: Skipping test: UsingLoadParam/154
10:15:44 [2019-11-08T15:15:44.130Z] 29:     The s390x code generator currently doesn't support dmax/dmin (see issue #4276)
10:15:44 [2019-11-08T15:15:44.130Z] 29: Known Bug: Skipping test: UsingLoadParam/155
10:15:44 [2019-11-08T15:15:44.130Z] 29:     The s390x code generator currently doesn't support dmax/dmin (see issue #4276)
10:15:44 [2019-11-08T15:15:44.130Z] 29: Known Bug: Skipping test: UsingLoadParam/156
10:15:44 [2019-11-08T15:15:44.130Z] 29:     The s390x code generator currently doesn't support dmax/dmin (see issue #4276)
10:15:44 [2019-11-08T15:15:44.130Z] 29: Known Bug: Skipping test: UsingLoadParam/157
10:15:44 [2019-11-08T15:15:44.130Z] 29:     The s390x code generator currently doesn't support dmax/dmin (see issue #4276)
10:15:44 [2019-11-08T15:15:44.130Z] 29: Known Bug: Skipping test: UsingLoadParam/158
10:15:44 [2019-11-08T15:15:44.130Z] 29:     The s390x code generator currently doesn't support dmax/dmin (see issue #4276)
10:15:44 [2019-11-08T15:15:44.130Z] 29: Known Bug: Skipping test: UsingLoadParam/159
10:15:44 [2019-11-08T15:15:44.130Z] 29:     The s390x code generator currently doesn't support dmax/dmin (see issue #4276)
10:15:44 [2019-11-08T15:15:44.130Z] 29: Known Bug: Skipping test: UsingLoadParam/160
10:15:44 [2019-11-08T15:15:44.130Z] 29:     The s390x code generator currently doesn't support dmax/dmin (see issue #4276)
10:15:44 [2019-11-08T15:15:44.130Z] 29: Known Bug: Skipping test: UsingLoadParam/161
10:15:44 [2019-11-08T15:15:44.130Z] 29:     The s390x code generator currently doesn't support dmax/dmin (see issue #4276)
10:15:44 [2019-11-08T15:15:44.130Z] 29: Known Bug: Skipping test: UsingLoadParam/162
10:15:44 [2019-11-08T15:15:44.130Z] 29:     The s390x code generator currently doesn't support dmax/dmin (see issue #4276)
10:15:44 [2019-11-08T15:15:44.130Z] 29: Known Bug: Skipping test: UsingLoadParam/163
10:15:44 [2019-11-08T15:15:44.130Z] 29:     The s390x code generator currently doesn't support dmax/dmin (see issue #4276)
10:15:44 [2019-11-08T15:15:44.130Z] 29: Known Bug: Skipping test: UsingLoadParam/164
10:15:44 [2019-11-08T15:15:44.130Z] 29:     The s390x code generator currently doesn't support dmax/dmin (see issue #4276)
10:15:44 [2019-11-08T15:15:44.130Z] 29: Known Bug: Skipping test: UsingLoadParam/165
10:15:44 [2019-11-08T15:15:44.130Z] 29:     The s390x code generator currently doesn't support dmax/dmin (see issue #4276)
10:15:44 [2019-11-08T15:15:44.130Z] 29: Known Bug: Skipping test: UsingLoadParam/166
10:15:44 [2019-11-08T15:15:44.130Z] 29:     The s390x code generator currently doesn't support dmax/dmin (see issue #4276)
10:15:44 [2019-11-08T15:15:44.130Z] 29: Known Bug: Skipping test: UsingLoadParam/167
10:15:44 [2019-11-08T15:15:44.130Z] 29:     The s390x code generator currently doesn't support dmax/dmin (see issue #4276)
10:15:44 [2019-11-08T15:15:44.130Z] 29: Known Bug: Skipping test: UsingLoadParam/168
10:15:44 [2019-11-08T15:15:44.130Z] 29:     The s390x code generator currently doesn't support dmax/dmin (see issue #4276)
10:15:44 [2019-11-08T15:15:44.130Z] 29: Known Bug: Skipping test: UsingLoadParam/169
10:15:44 [2019-11-08T15:15:44.130Z] 29:     The s390x code generator currently doesn't support dmax/dmin (see issue #4276)
10:15:44 [2019-11-08T15:15:44.130Z] 29: Known Bug: Skipping test: UsingLoadParam/170
10:15:44 [2019-11-08T15:15:44.130Z] 29:     The s390x code generator currently doesn't support dmax/dmin (see issue #4276)
10:15:44 [2019-11-08T15:15:44.130Z] 29: Known Bug: Skipping test: UsingLoadParam/171
10:15:44 [2019-11-08T15:15:44.130Z] 29:     The s390x code generator currently doesn't support dmax/dmin (see issue #4276)
10:15:44 [2019-11-08T15:15:44.130Z] 29: Known Bug: Skipping test: UsingLoadParam/172
10:15:44 [2019-11-08T15:15:44.130Z] 29:     The s390x code generator currently doesn't support dmax/dmin (see issue #4276)
10:15:44 [2019-11-08T15:15:44.130Z] 29: Known Bug: Skipping test: UsingLoadParam/173
10:15:44 [2019-11-08T15:15:44.130Z] 29:     The s390x code generator currently doesn't support dmax/dmin (see issue #4276)
10:15:44 [2019-11-08T15:15:44.130Z] 29: Known Bug: Skipping test: UsingLoadParam/174
10:15:44 [2019-11-08T15:15:44.130Z] 29:     The s390x code generator currently doesn't support dmax/dmin (see issue #4276)
10:15:44 [2019-11-08T15:15:44.130Z] 29: Known Bug: Skipping test: UsingLoadParam/175
10:15:44 [2019-11-08T15:15:44.130Z] 29:     The s390x code generator currently doesn't support dmax/dmin (see issue #4276)
10:15:44 [2019-11-08T15:15:44.130Z] 29: Known Bug: Skipping test: UsingLoadParam/176
10:15:44 [2019-11-08T15:15:44.130Z] 29:     The s390x code generator currently doesn't support dmax/dmin (see issue #4276)
10:15:44 [2019-11-08T15:15:44.130Z] 29: Known Bug: Skipping test: UsingLoadParam/177
10:15:44 [2019-11-08T15:15:44.130Z] 29:     The s390x code generator currently doesn't support dmax/dmin (see issue #4276)
10:15:44 [2019-11-08T15:15:44.130Z] 29: Known Bug: Skipping test: UsingLoadParam/178
10:15:44 [2019-11-08T15:15:44.130Z] 29:     The s390x code generator currently doesn't support dmax/dmin (see issue #4276)
10:15:44 [2019-11-08T15:15:44.130Z] 29: Known Bug: Skipping test: UsingLoadParam/179
10:15:44 [2019-11-08T15:15:44.130Z] 29:     The s390x code generator currently doesn't support dmax/dmin (see issue #4276)
10:15:44 [2019-11-08T15:15:44.130Z] 29: Known Bug: Skipping test: UsingLoadParam/180
10:15:44 [2019-11-08T15:15:44.130Z] 29:     The s390x code generator currently doesn't support dmax/dmin (see issue #4276)
10:15:44 [2019-11-08T15:15:44.130Z] 29: Known Bug: Skipping test: UsingLoadParam/181
10:15:44 [2019-11-08T15:15:44.130Z] 29:     The s390x code generator currently doesn't support dmax/dmin (see issue #4276)
10:15:44 [2019-11-08T15:15:44.130Z] 29: Known Bug: Skipping test: UsingLoadParam/182
10:15:44 [2019-11-08T15:15:44.130Z] 29:     The s390x code generator currently doesn't support dmax/dmin (see issue #4276)
10:15:44 [2019-11-08T15:15:44.130Z] 29: Known Bug: Skipping test: UsingLoadParam/183
10:15:44 [2019-11-08T15:15:44.130Z] 29:     The s390x code generator currently doesn't support dmax/dmin (see issue #4276)
10:15:44 [2019-11-08T15:15:44.130Z] 29: Known Bug: Skipping test: UsingLoadParam/184
10:15:44 [2019-11-08T15:15:44.130Z] 29:     The s390x code generator currently doesn't support dmax/dmin (see issue #4276)
10:15:44 [2019-11-08T15:15:44.130Z] 29: Known Bug: Skipping test: UsingLoadParam/185
10:15:44 [2019-11-08T15:15:44.130Z] 29:     The s390x code generator currently doesn't support dmax/dmin (see issue #4276)
10:15:44 [2019-11-08T15:15:44.130Z] 29: Known Bug: Skipping test: UsingLoadParam/186
10:15:44 [2019-11-08T15:15:44.130Z] 29:     The s390x code generator currently doesn't support dmax/dmin (see issue #4276)
10:15:44 [2019-11-08T15:15:44.130Z] 29: Known Bug: Skipping test: UsingLoadParam/187
10:15:44 [2019-11-08T15:15:44.130Z] 29:     The s390x code generator currently doesn't support dmax/dmin (see issue #4276)
10:15:44 [2019-11-08T15:15:44.130Z] 29: Known Bug: Skipping test: UsingLoadParam/188
10:15:44 [2019-11-08T15:15:44.130Z] 29:     The s390x code generator currently doesn't support dmax/dmin (see issue #4276)
10:15:44 [2019-11-08T15:15:44.130Z] 29: Known Bug: Skipping test: UsingLoadParam/189
10:15:44 [2019-11-08T15:15:44.130Z] 29:     The s390x code generator currently doesn't support dmax/dmin (see issue #4276)
10:15:44 [2019-11-08T15:15:44.130Z] 29: Known Bug: Skipping test: UsingLoadParam/190
10:15:44 [2019-11-08T15:15:44.130Z] 29:     The s390x code generator currently doesn't support dmax/dmin (see issue #4276)
10:15:44 [2019-11-08T15:15:44.130Z] 29: Known Bug: Skipping test: UsingLoadParam/191
10:15:44 [2019-11-08T15:15:44.130Z] 29:     The s390x code generator currently doesn't support dmax/dmin (see issue #4276)
10:15:44 [2019-11-08T15:15:44.130Z] 29: Known Bug: Skipping test: UsingLoadParam/192
10:15:44 [2019-11-08T15:15:44.130Z] 29:     The s390x code generator currently doesn't support dmax/dmin (see issue #4276)
10:15:44 [2019-11-08T15:15:44.130Z] 29: Known Bug: Skipping test: UsingLoadParam/193
10:15:44 [2019-11-08T15:15:44.130Z] 29:     The s390x code generator currently doesn't support dmax/dmin (see issue #4276)
10:15:44 [2019-11-08T15:15:44.130Z] 29: Known Bug: Skipping test: UsingLoadParam/194
10:15:44 [2019-11-08T15:15:44.130Z] 29:     The s390x code generator currently doesn't support dmax/dmin (see issue #4276)
10:15:44 [2019-11-08T15:15:44.130Z] 29: Known Bug: Skipping test: UsingLoadParam/195
10:15:44 [2019-11-08T15:15:44.130Z] 29:     The s390x code generator currently doesn't support dmax/dmin (see issue #4276)
10:15:44 [2019-11-08T15:15:44.130Z] 29: Known Bug: Skipping test: UsingLoadParam/196
10:15:44 [2019-11-08T15:15:44.130Z] 29:     The s390x code generator currently doesn't support dmax/dmin (see issue #4276)
10:15:44 [2019-11-08T15:15:44.130Z] 29: Known Bug: Skipping test: UsingLoadParam/197
10:15:44 [2019-11-08T15:15:44.130Z] 29:     The s390x code generator currently doesn't support dmax/dmin (see issue #4276)
10:15:44 [2019-11-08T15:15:44.130Z] 29: Known Bug: Skipping test: UsingLoadParam/198
10:15:44 [2019-11-08T15:15:44.130Z] 29:     The s390x code generator currently doesn't support dmax/dmin (see issue #4276)
10:15:44 [2019-11-08T15:15:44.130Z] 29: Known Bug: Skipping test: UsingLoadParam/199
10:15:44 [2019-11-08T15:15:44.130Z] 29:     The s390x code generator currently doesn't support dmax/dmin (see issue #4276)
10:15:44 [2019-11-08T15:15:44.130Z] 29: Known Bug: Skipping test: UsingLoadParam/200
10:15:44 [2019-11-08T15:15:44.130Z] 29:     The s390x code generator currently doesn't support dmax/dmin (see issue #4276)
10:15:44 [2019-11-08T15:15:44.130Z] 29: Known Bug: Skipping test: UsingLoadParam/201
10:15:44 [2019-11-08T15:15:44.130Z] 29:     The s390x code generator currently doesn't support dmax/dmin (see issue #4276)
10:15:44 [2019-11-08T15:15:44.130Z] 29: Known Bug: Skipping test: UsingLoadParam/202
10:15:44 [2019-11-08T15:15:44.130Z] 29:     The s390x code generator currently doesn't support dmax/dmin (see issue #4276)
10:15:44 [2019-11-08T15:15:44.130Z] 29: Known Bug: Skipping test: UsingLoadParam/203
10:15:44 [2019-11-08T15:15:44.130Z] 29:     The s390x code generator currently doesn't support dmax/dmin (see issue #4276)
10:15:44 [2019-11-08T15:15:44.130Z] 29: Known Bug: Skipping test: UsingLoadParam/204
10:15:44 [2019-11-08T15:15:44.130Z] 29:     The s390x code generator currently doesn't support dmax/dmin (see issue #4276)
10:15:44 [2019-11-08T15:15:44.130Z] 29: Known Bug: Skipping test: UsingLoadParam/205
10:15:44 [2019-11-08T15:15:44.130Z] 29:     The s390x code generator currently doesn't support dmax/dmin (see issue #4276)
10:15:44 [2019-11-08T15:15:44.130Z] 29: Known Bug: Skipping test: UsingLoadParam/206
10:15:44 [2019-11-08T15:15:44.130Z] 29:     The s390x code generator currently doesn't support dmax/dmin (see issue #4276)
10:15:44 [2019-11-08T15:15:44.130Z] 29: Known Bug: Skipping test: UsingLoadParam/207
10:15:44 [2019-11-08T15:15:44.130Z] 29:     The s390x code generator currently doesn't support dmax/dmin (see issue #4276)
10:15:44 [2019-11-08T15:15:44.130Z] 29: Known Bug: Skipping test: UsingLoadParam/208
10:15:44 [2019-11-08T15:15:44.130Z] 29:     The s390x code generator currently doesn't support dmax/dmin (see issue #4276)
10:15:44 [2019-11-08T15:15:44.130Z] 29: Known Bug: Skipping test: UsingLoadParam/209
10:15:44 [2019-11-08T15:15:44.130Z] 29:     The s390x code generator currently doesn't support dmax/dmin (see issue #4276)
10:15:44 [2019-11-08T15:15:44.130Z] 29: Known Bug: Skipping test: UsingLoadParam/210
10:15:44 [2019-11-08T15:15:44.130Z] 29:     The s390x code generator currently doesn't support dmax/dmin (see issue #4276)
10:15:44 [2019-11-08T15:15:44.130Z] 29: Known Bug: Skipping test: UsingLoadParam/211
10:15:44 [2019-11-08T15:15:44.130Z] 29:     The s390x code generator currently doesn't support dmax/dmin (see issue #4276)
10:15:44 [2019-11-08T15:15:44.130Z] 29: Known Bug: Skipping test: UsingLoadParam/212
10:15:44 [2019-11-08T15:15:44.130Z] 29:     The s390x code generator currently doesn't support dmax/dmin (see issue #4276)
10:15:44 [2019-11-08T15:15:44.130Z] 29: Known Bug: Skipping test: UsingLoadParam/213
10:15:44 [2019-11-08T15:15:44.130Z] 29:     The s390x code generator currently doesn't support dmax/dmin (see issue #4276)
10:15:44 [2019-11-08T15:15:44.130Z] 29: Known Bug: Skipping test: UsingLoadParam/214
10:15:44 [2019-11-08T15:15:44.130Z] 29:     The s390x code generator currently doesn't support dmax/dmin (see issue #4276)
10:15:44 [2019-11-08T15:15:44.130Z] 29: Known Bug: Skipping test: UsingLoadParam/215
10:15:44 [2019-11-08T15:15:44.130Z] 29:     The s390x code generator currently doesn't support dmax/dmin (see issue #4276)
10:15:44 [2019-11-08T15:15:44.130Z] 29: Known Bug: Skipping test: UsingLoadParam/216
10:15:44 [2019-11-08T15:15:44.130Z] 29:     The s390x code generator currently doesn't support dmax/dmin (see issue #4276)
10:15:44 [2019-11-08T15:15:44.130Z] 29: Known Bug: Skipping test: UsingLoadParam/217
10:15:44 [2019-11-08T15:15:44.130Z] 29:     The s390x code generator currently doesn't support dmax/dmin (see issue #4276)
10:15:44 [2019-11-08T15:15:44.130Z] 29: Known Bug: Skipping test: UsingLoadParam/218
10:15:44 [2019-11-08T15:15:44.130Z] 29:     The s390x code generator currently doesn't support dmax/dmin (see issue #4276)
10:15:44 [2019-11-08T15:15:44.130Z] 29: Known Bug: Skipping test: UsingLoadParam/219
10:15:44 [2019-11-08T15:15:44.130Z] 29:     The s390x code generator currently doesn't support dmax/dmin (see issue #4276)
10:15:44 [2019-11-08T15:15:44.130Z] 29: Known Bug: Skipping test: UsingLoadParam/220
10:15:44 [2019-11-08T15:15:44.130Z] 29:     The s390x code generator currently doesn't support dmax/dmin (see issue #4276)
10:15:44 [2019-11-08T15:15:44.130Z] 29: Known Bug: Skipping test: UsingLoadParam/221
10:15:44 [2019-11-08T15:15:44.130Z] 29:     The s390x code generator currently doesn't support dmax/dmin (see issue #4276)
10:15:44 [2019-11-08T15:15:44.130Z] 29: Known Bug: Skipping test: UsingLoadParam/222
10:15:44 [2019-11-08T15:15:44.130Z] 29:     The s390x code generator currently doesn't support dmax/dmin (see issue #4276)
10:15:44 [2019-11-08T15:15:44.130Z] 29: Known Bug: Skipping test: UsingLoadParam/223
10:15:44 [2019-11-08T15:15:44.130Z] 29:     The s390x code generator currently doesn't support dmax/dmin (see issue #4276)
10:15:44 [2019-11-08T15:15:44.130Z] 29: Known Bug: Skipping test: UsingLoadParam/224
10:15:44 [2019-11-08T15:15:44.130Z] 29:     The s390x code generator currently doesn't support dmax/dmin (see issue #4276)
10:15:44 [2019-11-08T15:15:44.130Z] 29: Known Bug: Skipping test: UsingLoadParam/225
10:15:44 [2019-11-08T15:15:44.130Z] 29:     The s390x code generator currently doesn't support dmax/dmin (see issue #4276)
10:15:44 [2019-11-08T15:15:44.130Z] 29: Known Bug: Skipping test: UsingLoadParam/226
10:15:44 [2019-11-08T15:15:44.130Z] 29:     The s390x code generator currently doesn't support dmax/dmin (see issue #4276)
10:15:44 [2019-11-08T15:15:44.130Z] 29: Known Bug: Skipping test: UsingLoadParam/227
10:15:44 [2019-11-08T15:15:44.130Z] 29:     The s390x code generator currently doesn't support dmax/dmin (see issue #4276)
10:15:44 [2019-11-08T15:15:44.130Z] 29: Known Bug: Skipping test: UsingLoadParam/228
10:15:44 [2019-11-08T15:15:44.130Z] 29:     The s390x code generator currently doesn't support dmax/dmin (see issue #4276)
10:15:44 [2019-11-08T15:15:44.130Z] 29: Known Bug: Skipping test: UsingLoadParam/229
10:15:44 [2019-11-08T15:15:44.130Z] 29:     The s390x code generator currently doesn't support dmax/dmin (see issue #4276)
10:15:44 [2019-11-08T15:15:44.130Z] 29: Known Bug: Skipping test: UsingLoadParam/230
10:15:44 [2019-11-08T15:15:44.130Z] 29:     The s390x code generator currently doesn't support dmax/dmin (see issue #4276)
10:15:44 [2019-11-08T15:15:44.130Z] 29: Known Bug: Skipping test: UsingLoadParam/231
10:15:44 [2019-11-08T15:15:44.130Z] 29:     The s390x code generator currently doesn't support dmax/dmin (see issue #4276)
10:15:44 [2019-11-08T15:15:44.130Z] 29: Known Bug: Skipping test: UsingLoadParam/232
10:15:44 [2019-11-08T15:15:44.130Z] 29:     The s390x code generator currently doesn't support dmax/dmin (see issue #4276)
10:15:44 [2019-11-08T15:15:44.130Z] 29: Known Bug: Skipping test: UsingLoadParam/233
10:15:44 [2019-11-08T15:15:44.130Z] 29:     The s390x code generator currently doesn't support dmax/dmin (see issue #4276)
10:15:44 [2019-11-08T15:15:44.130Z] 29: Known Bug: Skipping test: UsingLoadParam/234
10:15:44 [2019-11-08T15:15:44.130Z] 29:     The s390x code generator currently doesn't support dmax/dmin (see issue #4276)
10:15:44 [2019-11-08T15:15:44.130Z] 29: Known Bug: Skipping test: UsingLoadParam/235
10:15:44 [2019-11-08T15:15:44.130Z] 29:     The s390x code generator currently doesn't support dmax/dmin (see issue #4276)
10:15:44 [2019-11-08T15:15:44.130Z] 29: Known Bug: Skipping test: UsingLoadParam/236
10:15:44 [2019-11-08T15:15:44.130Z] 29:     The s390x code generator currently doesn't support dmax/dmin (see issue #4276)
10:15:44 [2019-11-08T15:15:44.130Z] 29: Known Bug: Skipping test: UsingLoadParam/237
10:15:44 [2019-11-08T15:15:44.130Z] 29:     The s390x code generator currently doesn't support dmax/dmin (see issue #4276)
10:15:44 [2019-11-08T15:15:44.130Z] 29: Known Bug: Skipping test: UsingLoadParam/238
10:15:44 [2019-11-08T15:15:44.130Z] 29:     The s390x code generator currently doesn't support dmax/dmin (see issue #4276)
10:15:44 [2019-11-08T15:15:44.130Z] 29: Known Bug: Skipping test: UsingLoadParam/239
10:15:44 [2019-11-08T15:15:44.130Z] 29:     The s390x code generator currently doesn't support dmax/dmin (see issue #4276)
10:15:44 [2019-11-08T15:15:44.131Z] 29: Known Bug: Skipping test: UsingLoadParam/240
10:15:44 [2019-11-08T15:15:44.131Z] 29:     The s390x code generator currently doesn't support dmax/dmin (see issue #4276)
10:15:44 [2019-11-08T15:15:44.131Z] 29: Known Bug: Skipping test: UsingLoadParam/241
10:15:44 [2019-11-08T15:15:44.131Z] 29:     The s390x code generator currently doesn't support dmax/dmin (see issue #4276)
10:15:44 [2019-11-08T15:15:44.131Z] 29: Known Bug: Skipping test: UsingLoadParam/242
10:15:44 [2019-11-08T15:15:44.131Z] 29:     The s390x code generator currently doesn't support dmax/dmin (see issue #4276)
10:15:44 [2019-11-08T15:15:44.131Z] 29: Known Bug: Skipping test: UsingLoadParam/243
10:15:44 [2019-11-08T15:15:44.131Z] 29:     The s390x code generator currently doesn't support dmax/dmin (see issue #4276)
10:15:44 [2019-11-08T15:15:44.131Z] 29: Known Bug: Skipping test: UsingLoadParam/244
10:15:44 [2019-11-08T15:15:44.131Z] 29:     The s390x code generator currently doesn't support dmax/dmin (see issue #4276)
10:15:44 [2019-11-08T15:15:44.131Z] 29: Known Bug: Skipping test: UsingLoadParam/245
10:15:44 [2019-11-08T15:15:44.131Z] 29:     The s390x code generator currently doesn't support dmax/dmin (see issue #4276)
10:15:44 [2019-11-08T15:15:44.131Z] 29: Known Bug: Skipping test: UsingLoadParam/246
10:15:44 [2019-11-08T15:15:44.131Z] 29:     The s390x code generator currently doesn't support dmax/dmin (see issue #4276)
10:15:44 [2019-11-08T15:15:44.131Z] 29: Known Bug: Skipping test: UsingLoadParam/247
10:15:44 [2019-11-08T15:15:44.131Z] 29:     The s390x code generator currently doesn't support dmax/dmin (see issue #4276)
10:15:44 [2019-11-08T15:15:44.131Z] 29: Known Bug: Skipping test: UsingLoadParam/248
10:15:44 [2019-11-08T15:15:44.131Z] 29:     The s390x code generator currently doesn't support dmax/dmin (see issue #4276)
10:15:44 [2019-11-08T15:15:44.131Z] 29: Known Bug: Skipping test: UsingLoadParam/249
10:15:44 [2019-11-08T15:15:44.131Z] 29:     The s390x code generator currently doesn't support dmax/dmin (see issue #4276)
10:15:44 [2019-11-08T15:15:44.131Z] 29: Known Bug: Skipping test: UsingLoadParam/250
10:15:44 [2019-11-08T15:15:44.131Z] 29:     The s390x code generator currently doesn't support dmax/dmin (see issue #4276)
10:15:44 [2019-11-08T15:15:44.131Z] 29: Known Bug: Skipping test: UsingLoadParam/251
10:15:44 [2019-11-08T15:15:44.131Z] 29:     The s390x code generator currently doesn't support dmax/dmin (see issue #4276)
10:15:44 [2019-11-08T15:15:44.131Z] 29: Known Bug: Skipping test: UsingLoadParam/252
10:15:44 [2019-11-08T15:15:44.131Z] 29:     The s390x code generator currently doesn't support dmax/dmin (see issue #4276)
10:15:44 [2019-11-08T15:15:44.131Z] 29: Known Bug: Skipping test: UsingLoadParam/253
10:15:44 [2019-11-08T15:15:44.131Z] 29:     The s390x code generator currently doesn't support dmax/dmin (see issue #4276)
10:15:44 [2019-11-08T15:15:44.131Z] 29: Known Bug: Skipping test: UsingLoadParam/254
10:15:44 [2019-11-08T15:15:44.131Z] 29:     The s390x code generator currently doesn't support dmax/dmin (see issue #4276)
10:15:44 [2019-11-08T15:15:44.131Z] 29: Known Bug: Skipping test: UsingLoadParam/255
10:15:44 [2019-11-08T15:15:44.131Z] 29:     The s390x code generator currently doesn't support dmax/dmin (see issue #4276)
10:15:44 [2019-11-08T15:15:44.131Z] 29: Known Bug: Skipping test: UsingLoadParam/256
10:15:44 [2019-11-08T15:15:44.131Z] 29:     The s390x code generator currently doesn't support dmax/dmin (see issue #4276)
10:15:44 [2019-11-08T15:15:44.131Z] 29: Known Bug: Skipping test: UsingLoadParam/257
10:15:44 [2019-11-08T15:15:44.131Z] 29:     The s390x code generator currently doesn't support dmax/dmin (see issue #4276)
10:15:44 [2019-11-08T15:15:44.131Z] 29: Known Bug: Skipping test: UsingLoadParam/258
10:15:44 [2019-11-08T15:15:44.131Z] 29:     The s390x code generator currently doesn't support dmax/dmin (see issue #4276)
10:15:44 [2019-11-08T15:15:44.131Z] 29: Known Bug: Skipping test: UsingLoadParam/259
10:15:44 [2019-11-08T15:15:44.131Z] 29:     The s390x code generator currently doesn't support dmax/dmin (see issue #4276)
10:15:44 [2019-11-08T15:15:44.131Z] 29: Known Bug: Skipping test: UsingLoadParam/260
10:15:44 [2019-11-08T15:15:44.131Z] 29:     The s390x code generator currently doesn't support dmax/dmin (see issue #4276)
10:15:44 [2019-11-08T15:15:44.131Z] 29: Known Bug: Skipping test: UsingLoadParam/261
10:15:44 [2019-11-08T15:15:44.131Z] 29:     The s390x code generator currently doesn't support dmax/dmin (see issue #4276)
10:15:44 [2019-11-08T15:15:44.131Z] 29: Known Bug: Skipping test: UsingLoadParam/262
10:15:44 [2019-11-08T15:15:44.131Z] 29:     The s390x code generator currently doesn't support dmax/dmin (see issue #4276)
10:15:44 [2019-11-08T15:15:44.131Z] 29: Known Bug: Skipping test: UsingLoadParam/263
10:15:44 [2019-11-08T15:15:44.131Z] 29:     The s390x code generator currently doesn't support dmax/dmin (see issue #4276)
10:15:44 [2019-11-08T15:15:44.131Z] 29: Known Bug: Skipping test: UsingLoadParam/264
10:15:44 [2019-11-08T15:15:44.131Z] 29:     The s390x code generator currently doesn't support dmax/dmin (see issue #4276)
10:15:44 [2019-11-08T15:15:44.131Z] 29: Known Bug: Skipping test: UsingLoadParam/265
10:15:44 [2019-11-08T15:15:44.131Z] 29:     The s390x code generator currently doesn't support dmax/dmin (see issue #4276)
10:15:44 [2019-11-08T15:15:44.131Z] 29: Known Bug: Skipping test: UsingLoadParam/266
10:15:44 [2019-11-08T15:15:44.131Z] 29:     The s390x code generator currently doesn't support dmax/dmin (see issue #4276)
10:15:44 [2019-11-08T15:15:44.131Z] 29: Known Bug: Skipping test: UsingLoadParam/267
10:15:44 [2019-11-08T15:15:44.131Z] 29:     The s390x code generator currently doesn't support dmax/dmin (see issue #4276)
10:15:44 [2019-11-08T15:15:44.131Z] 29: Known Bug: Skipping test: UsingLoadParam/268
10:15:44 [2019-11-08T15:15:44.131Z] 29:     The s390x code generator currently doesn't support dmax/dmin (see issue #4276)
10:15:44 [2019-11-08T15:15:44.131Z] 29: Known Bug: Skipping test: UsingLoadParam/269
10:15:44 [2019-11-08T15:15:44.131Z] 29:     The s390x code generator currently doesn't support dmax/dmin (see issue #4276)
10:15:44 [2019-11-08T15:15:44.131Z] 29: Known Bug: Skipping test: UsingLoadParam/270
10:15:44 [2019-11-08T15:15:44.131Z] 29:     The s390x code generator currently doesn't support dmax/dmin (see issue #4276)
10:15:44 [2019-11-08T15:15:44.131Z] 29: Known Bug: Skipping test: UsingLoadParam/271
10:15:44 [2019-11-08T15:15:44.131Z] 29:     The s390x code generator currently doesn't support dmax/dmin (see issue #4276)
10:15:44 [2019-11-08T15:15:44.131Z] 29: Known Bug: Skipping test: UsingLoadParam/272
10:15:44 [2019-11-08T15:15:44.131Z] 29:     The s390x code generator currently doesn't support dmax/dmin (see issue #4276)
10:15:44 [2019-11-08T15:15:44.131Z] 29: Known Bug: Skipping test: UsingLoadParam/273
10:15:44 [2019-11-08T15:15:44.131Z] 29:     The s390x code generator currently doesn't support dmax/dmin (see issue #4276)
10:15:44 [2019-11-08T15:15:44.131Z] 29: Known Bug: Skipping test: UsingLoadParam/274
10:15:44 [2019-11-08T15:15:44.131Z] 29:     The s390x code generator currently doesn't support dmax/dmin (see issue #4276)
10:15:44 [2019-11-08T15:15:44.131Z] 29: Known Bug: Skipping test: UsingLoadParam/275
10:15:44 [2019-11-08T15:15:44.131Z] 29:     The s390x code generator currently doesn't support dmax/dmin (see issue #4276)
10:15:44 [2019-11-08T15:15:44.131Z] 29: Known Bug: Skipping test: UsingLoadParam/276
10:15:44 [2019-11-08T15:15:44.131Z] 29:     The s390x code generator currently doesn't support dmax/dmin (see issue #4276)
10:15:44 [2019-11-08T15:15:44.131Z] 29: Known Bug: Skipping test: UsingLoadParam/277
10:15:44 [2019-11-08T15:15:44.131Z] 29:     The s390x code generator currently doesn't support dmax/dmin (see issue #4276)
10:15:44 [2019-11-08T15:15:44.131Z] 29: Known Bug: Skipping test: UsingLoadParam/278
10:15:44 [2019-11-08T15:15:44.131Z] 29:     The s390x code generator currently doesn't support dmax/dmin (see issue #4276)
10:15:44 [2019-11-08T15:15:44.131Z] 29: Known Bug: Skipping test: UsingLoadParam/279
10:15:44 [2019-11-08T15:15:44.131Z] 29:     The s390x code generator currently doesn't support dmax/dmin (see issue #4276)
10:15:44 [2019-11-08T15:15:44.131Z] 29: Known Bug: Skipping test: UsingLoadParam/280
10:15:44 [2019-11-08T15:15:44.131Z] 29:     The s390x code generator currently doesn't support dmax/dmin (see issue #4276)
10:15:44 [2019-11-08T15:15:44.131Z] 29: Known Bug: Skipping test: UsingLoadParam/281
10:15:44 [2019-11-08T15:15:44.131Z] 29:     The s390x code generator currently doesn't support dmax/dmin (see issue #4276)
10:15:44 [2019-11-08T15:15:44.131Z] 29: Known Bug: Skipping test: UsingLoadParam/282
10:15:44 [2019-11-08T15:15:44.131Z] 29:     The s390x code generator currently doesn't support dmax/dmin (see issue #4276)
10:15:44 [2019-11-08T15:15:44.131Z] 29: Known Bug: Skipping test: UsingLoadParam/283
10:15:44 [2019-11-08T15:15:44.131Z] 29:     The s390x code generator currently doesn't support dmax/dmin (see issue #4276)
10:15:44 [2019-11-08T15:15:44.131Z] 29: Known Bug: Skipping test: UsingLoadParam/284
10:15:44 [2019-11-08T15:15:44.131Z] 29:     The s390x code generator currently doesn't support dmax/dmin (see issue #4276)
10:15:44 [2019-11-08T15:15:44.131Z] 29: Known Bug: Skipping test: UsingLoadParam/285
10:15:44 [2019-11-08T15:15:44.131Z] 29:     The s390x code generator currently doesn't support dmax/dmin (see issue #4276)
10:15:44 [2019-11-08T15:15:44.131Z] 29: Known Bug: Skipping test: UsingLoadParam/286
10:15:44 [2019-11-08T15:15:44.131Z] 29:     The s390x code generator currently doesn't support dmax/dmin (see issue #4276)
10:15:44 [2019-11-08T15:15:44.131Z] 29: Known Bug: Skipping test: UsingLoadParam/287
10:15:44 [2019-11-08T15:15:44.131Z] 29:     The s390x code generator currently doesn't support dmax/dmin (see issue #4276)
10:15:44 [2019-11-08T15:15:44.131Z] 29: Known Bug: Skipping test: UsingLoadParam/288
10:15:44 [2019-11-08T15:15:44.131Z] 29:     The s390x code generator currently doesn't support dmax/dmin (see issue #4276)
10:15:44 [2019-11-08T15:15:44.131Z] 29: Known Bug: Skipping test: UsingLoadParam/289
10:15:44 [2019-11-08T15:15:44.131Z] 29:     The s390x code generator currently doesn't support dmax/dmin (see issue #4276)
10:15:44 [2019-11-08T15:15:44.131Z] 29: Known Bug: Skipping test: UsingLoadParam/290
10:15:44 [2019-11-08T15:15:44.131Z] 29:     The s390x code generator currently doesn't support dmax/dmin (see issue #4276)
10:15:44 [2019-11-08T15:15:44.131Z] 29: Known Bug: Skipping test: UsingLoadParam/291
10:15:44 [2019-11-08T15:15:44.131Z] 29:     The s390x code generator currently doesn't support dmax/dmin (see issue #4276)
10:15:44 [2019-11-08T15:15:44.131Z] 29: Known Bug: Skipping test: UsingLoadParam/292
10:15:44 [2019-11-08T15:15:44.131Z] 29:     The s390x code generator currently doesn't support dmax/dmin (see issue #4276)
10:15:44 [2019-11-08T15:15:44.131Z] 29: Known Bug: Skipping test: UsingLoadParam/293
10:15:44 [2019-11-08T15:15:44.131Z] 29:     The s390x code generator currently doesn't support dmax/dmin (see issue #4276)
10:15:44 [2019-11-08T15:15:44.131Z] 29: Known Bug: Skipping test: UsingLoadParam/294
10:15:44 [2019-11-08T15:15:44.131Z] 29:     The s390x code generator currently doesn't support dmax/dmin (see issue #4276)
10:15:44 [2019-11-08T15:15:44.131Z] 29: Known Bug: Skipping test: UsingLoadParam/295
10:15:44 [2019-11-08T15:15:44.131Z] 29:     The s390x code generator currently doesn't support dmax/dmin (see issue #4276)
10:15:44 [2019-11-08T15:15:44.131Z] 29: Known Bug: Skipping test: UsingLoadParam/296
10:15:44 [2019-11-08T15:15:44.131Z] 29:     The s390x code generator currently doesn't support dmax/dmin (see issue #4276)
10:15:44 [2019-11-08T15:15:44.131Z] 29: Known Bug: Skipping test: UsingLoadParam/297
10:15:44 [2019-11-08T15:15:44.131Z] 29:     The s390x code generator currently doesn't support dmax/dmin (see issue #4276)
10:15:44 [2019-11-08T15:15:44.131Z] 29: Known Bug: Skipping test: UsingLoadParam/298
10:15:44 [2019-11-08T15:15:44.131Z] 29:     The s390x code generator currently doesn't support dmax/dmin (see issue #4276)
10:15:44 [2019-11-08T15:15:44.131Z] 29: Known Bug: Skipping test: UsingLoadParam/299
10:15:44 [2019-11-08T15:15:44.131Z] 29:     The s390x code generator currently doesn't support dmax/dmin (see issue #4276)
10:15:44 [2019-11-08T15:15:44.131Z] 29: Known Bug: Skipping test: UsingLoadParam/300
10:15:44 [2019-11-08T15:15:44.131Z] 29:     The s390x code generator currently doesn't support dmax/dmin (see issue #4276)
10:15:44 [2019-11-08T15:15:44.131Z] 29: Known Bug: Skipping test: UsingLoadParam/301
10:15:44 [2019-11-08T15:15:44.131Z] 29:     The s390x code generator currently doesn't support dmax/dmin (see issue #4276)
10:15:44 [2019-11-08T15:15:44.131Z] 29: Known Bug: Skipping test: UsingLoadParam/302
10:15:44 [2019-11-08T15:15:44.131Z] 29:     The s390x code generator currently doesn't support dmax/dmin (see issue #4276)
10:15:44 [2019-11-08T15:15:44.131Z] 29: Known Bug: Skipping test: UsingLoadParam/303
10:15:44 [2019-11-08T15:15:44.131Z] 29:     The s390x code generator currently doesn't support dmax/dmin (see issue #4276)
10:15:44 [2019-11-08T15:15:44.131Z] 29: Known Bug: Skipping test: UsingLoadParam/304
10:15:44 [2019-11-08T15:15:44.131Z] 29:     The s390x code generator currently doesn't support dmax/dmin (see issue #4276)
10:15:44 [2019-11-08T15:15:44.131Z] 29: Known Bug: Skipping test: UsingLoadParam/305
10:15:44 [2019-11-08T15:15:44.131Z] 29:     The s390x code generator currently doesn't support dmax/dmin (see issue #4276)
10:15:44 [2019-11-08T15:15:44.131Z] 29: Known Bug: Skipping test: UsingLoadParam/306
10:15:44 [2019-11-08T15:15:44.131Z] 29:     The s390x code generator currently doesn't support dmax/dmin (see issue #4276)
10:15:44 [2019-11-08T15:15:44.131Z] 29: Known Bug: Skipping test: UsingLoadParam/307
10:15:44 [2019-11-08T15:15:44.131Z] 29:     The s390x code generator currently doesn't support dmax/dmin (see issue #4276)
10:15:44 [2019-11-08T15:15:44.131Z] 29: Known Bug: Skipping test: UsingLoadParam/308
10:15:44 [2019-11-08T15:15:44.131Z] 29:     The s390x code generator currently doesn't support dmax/dmin (see issue #4276)
10:15:44 [2019-11-08T15:15:44.131Z] 29: Known Bug: Skipping test: UsingLoadParam/309
10:15:44 [2019-11-08T15:15:44.131Z] 29:     The s390x code generator currently doesn't support dmax/dmin (see issue #4276)
10:15:44 [2019-11-08T15:15:44.131Z] 29: Known Bug: Skipping test: UsingLoadParam/310
10:15:44 [2019-11-08T15:15:44.131Z] 29:     The s390x code generator currently doesn't support dmax/dmin (see issue #4276)
10:15:44 [2019-11-08T15:15:44.131Z] 29: Known Bug: Skipping test: UsingLoadParam/311
10:15:44 [2019-11-08T15:15:44.131Z] 29:     The s390x code generator currently doesn't support dmax/dmin (see issue #4276)
10:15:44 [2019-11-08T15:15:44.131Z] 29: Known Bug: Skipping test: UsingLoadParam/312
10:15:44 [2019-11-08T15:15:44.131Z] 29:     The s390x code generator currently doesn't support dmax/dmin (see issue #4276)
10:15:44 [2019-11-08T15:15:44.131Z] 29: Known Bug: Skipping test: UsingLoadParam/313
10:15:44 [2019-11-08T15:15:44.131Z] 29:     The s390x code generator currently doesn't support dmax/dmin (see issue #4276)
10:15:44 [2019-11-08T15:15:44.131Z] 29: Known Bug: Skipping test: UsingLoadParam/314
10:15:44 [2019-11-08T15:15:44.131Z] 29:     The s390x code generator currently doesn't support dmax/dmin (see issue #4276)
10:15:44 [2019-11-08T15:15:44.131Z] 29: Known Bug: Skipping test: UsingLoadParam/315
10:15:44 [2019-11-08T15:15:44.131Z] 29:     The s390x code generator currently doesn't support dmax/dmin (see issue #4276)
10:15:44 [2019-11-08T15:15:44.131Z] 29: Known Bug: Skipping test: UsingLoadParam/316
10:15:44 [2019-11-08T15:15:44.131Z] 29:     The s390x code generator currently doesn't support dmax/dmin (see issue #4276)
10:15:44 [2019-11-08T15:15:44.131Z] 29: Known Bug: Skipping test: UsingLoadParam/317
10:15:44 [2019-11-08T15:15:44.131Z] 29:     The s390x code generator currently doesn't support dmax/dmin (see issue #4276)
10:15:44 [2019-11-08T15:15:44.131Z] 29: Known Bug: Skipping test: UsingLoadParam/318
10:15:44 [2019-11-08T15:15:44.131Z] 29:     The s390x code generator currently doesn't support dmax/dmin (see issue #4276)
10:15:44 [2019-11-08T15:15:44.131Z] 29: Known Bug: Skipping test: UsingLoadParam/319
10:15:44 [2019-11-08T15:15:44.131Z] 29:     The s390x code generator currently doesn't support dmax/dmin (see issue #4276)
10:15:44 [2019-11-08T15:15:44.131Z] 29: Known Bug: Skipping test: UsingLoadParam/320
10:15:44 [2019-11-08T15:15:44.131Z] 29:     The s390x code generator currently doesn't support dmax/dmin (see issue #4276)
10:15:44 [2019-11-08T15:15:44.131Z] 29: Known Bug: Skipping test: UsingLoadParam/321
10:15:44 [2019-11-08T15:15:44.131Z] 29:     The s390x code generator currently doesn't support dmax/dmin (see issue #4276)
10:15:44 [2019-11-08T15:15:44.131Z] 29: Known Bug: Skipping test: UsingLoadParam/322
10:15:44 [2019-11-08T15:15:44.131Z] 29:     The s390x code generator currently doesn't support dmax/dmin (see issue #4276)
10:15:44 [2019-11-08T15:15:44.131Z] 29: Known Bug: Skipping test: UsingLoadParam/323
10:15:44 [2019-11-08T15:15:44.131Z] 29:     The s390x code generator currently doesn't support dmax/dmin (see issue #4276)
10:15:44 [2019-11-08T15:15:44.131Z] 29: Known Bug: Skipping test: UsingLoadParam/324
10:15:44 [2019-11-08T15:15:44.131Z] 29:     The s390x code generator currently doesn't support dmax/dmin (see issue #4276)
10:15:44 [2019-11-08T15:15:44.131Z] 29: Known Bug: Skipping test: UsingLoadParam/325
10:15:44 [2019-11-08T15:15:44.131Z] 29:     The s390x code generator currently doesn't support dmax/dmin (see issue #4276)
10:15:44 [2019-11-08T15:15:44.131Z] 29: Known Bug: Skipping test: UsingLoadParam/326
10:15:44 [2019-11-08T15:15:44.131Z] 29:     The s390x code generator currently doesn't support dmax/dmin (see issue #4276)
10:15:44 [2019-11-08T15:15:44.131Z] 29: Known Bug: Skipping test: UsingLoadParam/327
10:15:44 [2019-11-08T15:15:44.131Z] 29:     The s390x code generator currently doesn't support dmax/dmin (see issue #4276)
10:15:44 [2019-11-08T15:15:44.131Z] 29: Known Bug: Skipping test: UsingLoadParam/328
10:15:44 [2019-11-08T15:15:44.131Z] 29:     The s390x code generator currently doesn't support dmax/dmin (see issue #4276)
10:15:44 [2019-11-08T15:15:44.131Z] 29: Known Bug: Skipping test: UsingLoadParam/329
10:15:44 [2019-11-08T15:15:44.131Z] 29:     The s390x code generator currently doesn't support dmax/dmin (see issue #4276)
10:15:44 [2019-11-08T15:15:44.131Z] 29: Known Bug: Skipping test: UsingLoadParam/330
10:15:44 [2019-11-08T15:15:44.131Z] 29:     The s390x code generator currently doesn't support dmax/dmin (see issue #4276)
10:15:44 [2019-11-08T15:15:44.131Z] 29: Known Bug: Skipping test: UsingLoadParam/331
10:15:44 [2019-11-08T15:15:44.131Z] 29:     The s390x code generator currently doesn't support dmax/dmin (see issue #4276)
10:15:44 [2019-11-08T15:15:44.131Z] 29: Known Bug: Skipping test: UsingLoadParam/332
10:15:44 [2019-11-08T15:15:44.131Z] 29:     The s390x code generator currently doesn't support dmax/dmin (see issue #4276)
10:15:44 [2019-11-08T15:15:44.131Z] 29: Known Bug: Skipping test: UsingLoadParam/333
10:15:44 [2019-11-08T15:15:44.131Z] 29:     The s390x code generator currently doesn't support dmax/dmin (see issue #4276)
10:15:44 [2019-11-08T15:15:44.131Z] 29: Known Bug: Skipping test: UsingLoadParam/334
10:15:44 [2019-11-08T15:15:44.131Z] 29:     The s390x code generator currently doesn't support dmax/dmin (see issue #4276)
10:15:44 [2019-11-08T15:15:44.131Z] 29: Known Bug: Skipping test: UsingLoadParam/335
10:15:44 [2019-11-08T15:15:44.131Z] 29:     The s390x code generator currently doesn't support dmax/dmin (see issue #4276)
10:15:44 [2019-11-08T15:15:44.131Z] 29: Known Bug: Skipping test: UsingLoadParam/336
10:15:44 [2019-11-08T15:15:44.131Z] 29:     The s390x code generator currently doesn't support dmax/dmin (see issue #4276)
10:15:44 [2019-11-08T15:15:44.131Z] 29: Known Bug: Skipping test: UsingLoadParam/337
10:15:44 [2019-11-08T15:15:44.131Z] 29:     The s390x code generator currently doesn't support dmax/dmin (see issue #4276)
10:15:44 [2019-11-08T15:15:44.131Z] 29: Known Bug: Skipping test: UsingLoadParam/338
10:15:44 [2019-11-08T15:15:44.131Z] 29:     The s390x code generator currently doesn't support dmax/dmin (see issue #4276)
10:15:44 [2019-11-08T15:15:44.131Z] 29: Known Bug: Skipping test: UsingLoadParam/339
10:15:44 [2019-11-08T15:15:44.131Z] 29:     The s390x code generator currently doesn't support dmax/dmin (see issue #4276)
10:15:44 [2019-11-08T15:15:44.131Z] 29: Known Bug: Skipping test: UsingLoadParam/340
10:15:44 [2019-11-08T15:15:44.131Z] 29:     The s390x code generator currently doesn't support dmax/dmin (see issue #4276)
10:15:44 [2019-11-08T15:15:44.131Z] 29: Known Bug: Skipping test: UsingLoadParam/341
10:15:44 [2019-11-08T15:15:44.131Z] 29:     The s390x code generator currently doesn't support dmax/dmin (see issue #4276)
10:15:44 [2019-11-08T15:15:44.131Z] 29: Known Bug: Skipping test: UsingLoadParam/342
10:15:44 [2019-11-08T15:15:44.131Z] 29:     The s390x code generator currently doesn't support dmax/dmin (see issue #4276)
10:15:44 [2019-11-08T15:15:44.131Z] 29: Known Bug: Skipping test: UsingLoadParam/343
10:15:44 [2019-11-08T15:15:44.131Z] 29:     The s390x code generator currently doesn't support dmax/dmin (see issue #4276)
10:15:44 [2019-11-08T15:15:44.131Z] 29: Known Bug: Skipping test: UsingLoadParam/344
10:15:44 [2019-11-08T15:15:44.131Z] 29:     The s390x code generator currently doesn't support dmax/dmin (see issue #4276)
10:15:44 [2019-11-08T15:15:44.131Z] 29: Known Bug: Skipping test: UsingLoadParam/345
10:15:44 [2019-11-08T15:15:44.131Z] 29:     The s390x code generator currently doesn't support dmax/dmin (see issue #4276)
10:15:44 [2019-11-08T15:15:44.131Z] 29: Known Bug: Skipping test: UsingLoadParam/346
10:15:44 [2019-11-08T15:15:44.131Z] 29:     The s390x code generator currently doesn't support dmax/dmin (see issue #4276)
10:15:44 [2019-11-08T15:15:44.131Z] 29: Known Bug: Skipping test: UsingLoadParam/347
10:15:44 [2019-11-08T15:15:44.131Z] 29:     The s390x code generator currently doesn't support dmax/dmin (see issue #4276)
10:15:44 [2019-11-08T15:15:44.131Z] 29: Known Bug: Skipping test: UsingLoadParam/348
10:15:44 [2019-11-08T15:15:44.131Z] 29:     The s390x code generator currently doesn't support dmax/dmin (see issue #4276)
10:15:44 [2019-11-08T15:15:44.131Z] 29: Known Bug: Skipping test: UsingLoadParam/349
10:15:44 [2019-11-08T15:15:44.131Z] 29:     The s390x code generator currently doesn't support dmax/dmin (see issue #4276)
10:15:44 [2019-11-08T15:15:44.131Z] 29: Known Bug: Skipping test: UsingLoadParam/350
10:15:44 [2019-11-08T15:15:44.131Z] 29:     The s390x code generator currently doesn't support dmax/dmin (see issue #4276)
10:15:44 [2019-11-08T15:15:44.131Z] 29: Known Bug: Skipping test: UsingLoadParam/351
10:15:44 [2019-11-08T15:15:44.131Z] 29:     The s390x code generator currently doesn't support dmax/dmin (see issue #4276)
10:15:44 [2019-11-08T15:15:44.131Z] 29: Known Bug: Skipping test: UsingLoadParam/352
10:15:44 [2019-11-08T15:15:44.131Z] 29:     The s390x code generator currently doesn't support dmax/dmin (see issue #4276)
10:15:44 [2019-11-08T15:15:44.131Z] 29: Known Bug: Skipping test: UsingLoadParam/353
10:15:44 [2019-11-08T15:15:44.132Z] 29:     The s390x code generator currently doesn't support dmax/dmin (see issue #4276)
10:15:44 [2019-11-08T15:15:44.132Z] 29: Known Bug: Skipping test: UsingLoadParam/354
10:15:44 [2019-11-08T15:15:44.132Z] 29:     The s390x code generator currently doesn't support dmax/dmin (see issue #4276)
10:15:44 [2019-11-08T15:15:44.132Z] 29: Known Bug: Skipping test: UsingLoadParam/355
10:15:44 [2019-11-08T15:15:44.132Z] 29:     The s390x code generator currently doesn't support dmax/dmin (see issue #4276)
10:15:44 [2019-11-08T15:15:44.132Z] 29: Known Bug: Skipping test: UsingLoadParam/356
10:15:44 [2019-11-08T15:15:44.132Z] 29:     The s390x code generator currently doesn't support dmax/dmin (see issue #4276)
10:15:44 [2019-11-08T15:15:44.132Z] 29: Known Bug: Skipping test: UsingLoadParam/357
10:15:44 [2019-11-08T15:15:44.132Z] 29:     The s390x code generator currently doesn't support dmax/dmin (see issue #4276)
10:15:44 [2019-11-08T15:15:44.132Z] 29: Known Bug: Skipping test: UsingLoadParam/358
10:15:44 [2019-11-08T15:15:44.132Z] 29:     The s390x code generator currently doesn't support dmax/dmin (see issue #4276)
10:15:44 [2019-11-08T15:15:44.132Z] 29: Known Bug: Skipping test: UsingLoadParam/359
10:15:44 [2019-11-08T15:15:44.132Z] 29:     The s390x code generator currently doesn't support dmax/dmin (see issue #4276)
10:15:44 [2019-11-08T15:15:44.132Z] 29: Known Bug: Skipping test: UsingLoadParam/360
10:15:44 [2019-11-08T15:15:44.132Z] 29:     The s390x code generator currently doesn't support dmax/dmin (see issue #4276)
10:15:44 [2019-11-08T15:15:44.132Z] 29: Known Bug: Skipping test: UsingLoadParam/361
10:15:44 [2019-11-08T15:15:44.132Z] 29:     The s390x code generator currently doesn't support dmax/dmin (see issue #4276)
10:15:44 [2019-11-08T15:15:44.132Z] 29: Known Bug: Skipping test: UsingLoadParam/362
10:15:44 [2019-11-08T15:15:44.132Z] 29:     The s390x code generator currently doesn't support dmax/dmin (see issue #4276)
10:15:44 [2019-11-08T15:15:44.132Z] 29: Known Bug: Skipping test: UsingLoadParam/363
10:15:44 [2019-11-08T15:15:44.132Z] 29:     The s390x code generator currently doesn't support dmax/dmin (see issue #4276)
10:15:44 [2019-11-08T15:15:44.132Z] 29: Known Bug: Skipping test: UsingLoadParam/364
10:15:44 [2019-11-08T15:15:44.132Z] 29:     The s390x code generator currently doesn't support dmax/dmin (see issue #4276)
10:15:44 [2019-11-08T15:15:44.132Z] 29: Known Bug: Skipping test: UsingLoadParam/365
10:15:44 [2019-11-08T15:15:44.132Z] 29:     The s390x code generator currently doesn't support dmax/dmin (see issue #4276)
10:15:44 [2019-11-08T15:15:44.132Z] 29: Known Bug: Skipping test: UsingLoadParam/366
10:15:44 [2019-11-08T15:15:44.132Z] 29:     The s390x code generator currently doesn't support dmax/dmin (see issue #4276)
10:15:44 [2019-11-08T15:15:44.132Z] 29: Known Bug: Skipping test: UsingLoadParam/367
10:15:44 [2019-11-08T15:15:44.132Z] 29:     The s390x code generator currently doesn't support dmax/dmin (see issue #4276)
10:15:44 [2019-11-08T15:15:44.132Z] 29: Known Bug: Skipping test: UsingLoadParam/368
10:15:44 [2019-11-08T15:15:44.132Z] 29:     The s390x code generator currently doesn't support dmax/dmin (see issue #4276)
10:15:44 [2019-11-08T15:15:44.132Z] 29: Known Bug: Skipping test: UsingLoadParam/369
10:15:44 [2019-11-08T15:15:44.132Z] 29:     The s390x code generator currently doesn't support dmax/dmin (see issue #4276)
10:15:44 [2019-11-08T15:15:44.132Z] 29: Known Bug: Skipping test: UsingLoadParam/370
10:15:44 [2019-11-08T15:15:44.132Z] 29:     The s390x code generator currently doesn't support dmax/dmin (see issue #4276)
10:15:44 [2019-11-08T15:15:44.132Z] 29: Known Bug: Skipping test: UsingLoadParam/371
10:15:44 [2019-11-08T15:15:44.132Z] 29:     The s390x code generator currently doesn't support dmax/dmin (see issue #4276)
10:15:44 [2019-11-08T15:15:44.132Z] 29: Known Bug: Skipping test: UsingLoadParam/372
10:15:44 [2019-11-08T15:15:44.132Z] 29:     The s390x code generator currently doesn't support dmax/dmin (see issue #4276)
10:15:44 [2019-11-08T15:15:44.132Z] 29: Known Bug: Skipping test: UsingLoadParam/373
10:15:44 [2019-11-08T15:15:44.132Z] 29:     The s390x code generator currently doesn't support dmax/dmin (see issue #4276)
10:15:44 [2019-11-08T15:15:44.132Z] 29: Known Bug: Skipping test: UsingLoadParam/374
10:15:44 [2019-11-08T15:15:44.132Z] 29:     The s390x code generator currently doesn't support dmax/dmin (see issue #4276)
10:15:44 [2019-11-08T15:15:44.132Z] 29: Known Bug: Skipping test: UsingLoadParam/375
10:15:44 [2019-11-08T15:15:44.132Z] 29:     The s390x code generator currently doesn't support dmax/dmin (see issue #4276)
10:15:44 [2019-11-08T15:15:44.132Z] 29: Known Bug: Skipping test: UsingLoadParam/376
10:15:44 [2019-11-08T15:15:44.132Z] 29:     The s390x code generator currently doesn't support dmax/dmin (see issue #4276)
10:15:44 [2019-11-08T15:15:44.132Z] 29: Known Bug: Skipping test: UsingLoadParam/377
10:15:44 [2019-11-08T15:15:44.132Z] 29:     The s390x code generator currently doesn't support dmax/dmin (see issue #4276)
10:15:44 [2019-11-08T15:15:44.132Z] 29: Known Bug: Skipping test: UsingLoadParam/378
10:15:44 [2019-11-08T15:15:44.132Z] 29:     The s390x code generator currently doesn't support dmax/dmin (see issue #4276)
10:15:44 [2019-11-08T15:15:44.132Z] 29: Known Bug: Skipping test: UsingLoadParam/379
10:15:44 [2019-11-08T15:15:44.132Z] 29:     The s390x code generator currently doesn't support dmax/dmin (see issue #4276)
10:15:44 [2019-11-08T15:15:44.132Z] 29: Known Bug: Skipping test: UsingLoadParam/380
10:15:44 [2019-11-08T15:15:44.132Z] 29:     The s390x code generator currently doesn't support dmax/dmin (see issue #4276)
10:15:44 [2019-11-08T15:15:44.132Z] 29: Known Bug: Skipping test: UsingLoadParam/381
10:15:44 [2019-11-08T15:15:44.132Z] 29:     The s390x code generator currently doesn't support dmax/dmin (see issue #4276)
10:15:44 [2019-11-08T15:15:44.132Z] 29: Known Bug: Skipping test: UsingLoadParam/382
10:15:44 [2019-11-08T15:15:44.132Z] 29:     The s390x code generator currently doesn't support dmax/dmin (see issue #4276)
10:15:44 [2019-11-08T15:15:44.132Z] 29: Known Bug: Skipping test: UsingLoadParam/383
10:15:44 [2019-11-08T15:15:44.132Z] 29:     The s390x code generator currently doesn't support dmax/dmin (see issue #4276)
10:15:44 [2019-11-08T15:15:44.132Z] 29: Known Bug: Skipping test: UsingLoadParam/384
10:15:44 [2019-11-08T15:15:44.132Z] 29:     The s390x code generator currently doesn't support dmax/dmin (see issue #4276)
10:15:44 [2019-11-08T15:15:44.132Z] 29: Known Bug: Skipping test: UsingLoadParam/385
10:15:44 [2019-11-08T15:15:44.132Z] 29:     The s390x code generator currently doesn't support dmax/dmin (see issue #4276)
10:15:44 [2019-11-08T15:15:44.132Z] 29: Known Bug: Skipping test: UsingLoadParam/386
10:15:44 [2019-11-08T15:15:44.132Z] 29:     The s390x code generator currently doesn't support dmax/dmin (see issue #4276)
10:15:44 [2019-11-08T15:15:44.132Z] 29: Known Bug: Skipping test: UsingLoadParam/387
10:15:44 [2019-11-08T15:15:44.132Z] 29:     The s390x code generator currently doesn't support dmax/dmin (see issue #4276)
10:15:44 [2019-11-08T15:15:44.132Z] 29: Known Bug: Skipping test: UsingLoadParam/388
10:15:44 [2019-11-08T15:15:44.132Z] 29:     The s390x code generator currently doesn't support dmax/dmin (see issue #4276)
10:15:44 [2019-11-08T15:15:44.132Z] 29: Known Bug: Skipping test: UsingLoadParam/389
10:15:44 [2019-11-08T15:15:44.132Z] 29:     The s390x code generator currently doesn't support dmax/dmin (see issue #4276)
10:15:44 [2019-11-08T15:15:44.132Z] 29: Known Bug: Skipping test: UsingLoadParam/390
10:15:44 [2019-11-08T15:15:44.132Z] 29:     The s390x code generator currently doesn't support dmax/dmin (see issue #4276)
10:15:44 [2019-11-08T15:15:44.132Z] 29: Known Bug: Skipping test: UsingLoadParam/391
10:15:44 [2019-11-08T15:15:44.132Z] 29:     The s390x code generator currently doesn't support dmax/dmin (see issue #4276)
10:15:44 [2019-11-08T15:15:44.132Z] 29: Known Bug: Skipping test: UsingLoadParam/392
10:15:44 [2019-11-08T15:15:44.132Z] 29:     The s390x code generator currently doesn't support dmax/dmin (see issue #4276)
10:15:44 [2019-11-08T15:15:44.132Z] 29: Known Bug: Skipping test: UsingLoadParam/393
10:15:44 [2019-11-08T15:15:44.132Z] 29:     The s390x code generator currently doesn't support dmax/dmin (see issue #4276)
10:15:44 [2019-11-08T15:15:44.132Z] 29: Known Bug: Skipping test: UsingLoadParam/394
10:15:44 [2019-11-08T15:15:44.132Z] 29:     The s390x code generator currently doesn't support dmax/dmin (see issue #4276)
10:15:44 [2019-11-08T15:15:44.132Z] 29: Known Bug: Skipping test: UsingLoadParam/395
10:15:44 [2019-11-08T15:15:44.132Z] 29:     The s390x code generator currently doesn't support dmax/dmin (see issue #4276)
10:15:44 [2019-11-08T15:15:44.132Z] 29: Known Bug: Skipping test: UsingLoadParam/396
10:15:44 [2019-11-08T15:15:44.132Z] 29:     The s390x code generator currently doesn't support dmax/dmin (see issue #4276)
10:15:44 [2019-11-08T15:15:44.132Z] 29: Known Bug: Skipping test: UsingLoadParam/397
10:15:44 [2019-11-08T15:15:44.132Z] 29:     The s390x code generator currently doesn't support dmax/dmin (see issue #4276)
10:15:44 [2019-11-08T15:15:44.132Z] 29: Known Bug: Skipping test: UsingLoadParam/398
10:15:44 [2019-11-08T15:15:44.132Z] 29:     The s390x code generator currently doesn't support dmax/dmin (see issue #4276)
10:15:44 [2019-11-08T15:15:44.132Z] 29: Known Bug: Skipping test: UsingLoadParam/399
10:15:44 [2019-11-08T15:15:44.132Z] 29:     The s390x code generator currently doesn't support dmax/dmin (see issue #4276)
10:15:44 [2019-11-08T15:15:44.132Z] 29: Known Bug: Skipping test: UsingLoadParam/400
10:15:44 [2019-11-08T15:15:44.132Z] 29:     The s390x code generator currently doesn't support dmax/dmin (see issue #4276)
10:15:44 [2019-11-08T15:15:44.132Z] 29: Known Bug: Skipping test: UsingLoadParam/401
10:15:44 [2019-11-08T15:15:44.132Z] 29:     The s390x code generator currently doesn't support dmax/dmin (see issue #4276)
10:15:44 [2019-11-08T15:15:44.132Z] 29: Known Bug: Skipping test: UsingLoadParam/402
10:15:44 [2019-11-08T15:15:44.132Z] 29:     The s390x code generator currently doesn't support dmax/dmin (see issue #4276)
10:15:44 [2019-11-08T15:15:44.132Z] 29: Known Bug: Skipping test: UsingLoadParam/403
10:15:44 [2019-11-08T15:15:44.132Z] 29:     The s390x code generator currently doesn't support dmax/dmin (see issue #4276)
10:15:44 [2019-11-08T15:15:44.132Z] 29: Known Bug: Skipping test: UsingLoadParam/404
10:15:44 [2019-11-08T15:15:44.132Z] 29:     The s390x code generator currently doesn't support dmax/dmin (see issue #4276)
10:15:44 [2019-11-08T15:15:44.132Z] 29: Known Bug: Skipping test: UsingLoadParam/405
10:15:44 [2019-11-08T15:15:44.132Z] 29:     The s390x code generator currently doesn't support dmax/dmin (see issue #4276)
10:15:44 [2019-11-08T15:15:44.132Z] 29: Known Bug: Skipping test: UsingLoadParam/406
10:15:44 [2019-11-08T15:15:44.132Z] 29:     The s390x code generator currently doesn't support dmax/dmin (see issue #4276)
10:15:44 [2019-11-08T15:15:44.132Z] 29: Known Bug: Skipping test: UsingLoadParam/407
10:15:44 [2019-11-08T15:15:44.132Z] 29:     The s390x code generator currently doesn't support dmax/dmin (see issue #4276)
10:15:44 [2019-11-08T15:15:44.132Z] 29: Known Bug: Skipping test: UsingLoadParam/408
10:15:44 [2019-11-08T15:15:44.132Z] 29:     The s390x code generator currently doesn't support dmax/dmin (see issue #4276)
10:15:44 [2019-11-08T15:15:44.132Z] 29: Known Bug: Skipping test: UsingLoadParam/409
10:15:44 [2019-11-08T15:15:44.132Z] 29:     The s390x code generator currently doesn't support dmax/dmin (see issue #4276)
10:15:44 [2019-11-08T15:15:44.132Z] 29: Known Bug: Skipping test: UsingLoadParam/410
10:15:44 [2019-11-08T15:15:44.132Z] 29:     The s390x code generator currently doesn't support dmax/dmin (see issue #4276)
10:15:44 [2019-11-08T15:15:44.132Z] 29: Known Bug: Skipping test: UsingLoadParam/411
10:15:44 [2019-11-08T15:15:44.132Z] 29:     The s390x code generator currently doesn't support dmax/dmin (see issue #4276)
10:15:44 [2019-11-08T15:15:44.132Z] 29: Known Bug: Skipping test: UsingLoadParam/412
10:15:44 [2019-11-08T15:15:44.132Z] 29:     The s390x code generator currently doesn't support dmax/dmin (see issue #4276)
10:15:44 [2019-11-08T15:15:44.132Z] 29: Known Bug: Skipping test: UsingLoadParam/413
10:15:44 [2019-11-08T15:15:44.132Z] 29:     The s390x code generator currently doesn't support dmax/dmin (see issue #4276)
10:15:44 [2019-11-08T15:15:44.132Z] 29: Known Bug: Skipping test: UsingLoadParam/414
10:15:44 [2019-11-08T15:15:44.132Z] 29:     The s390x code generator currently doesn't support dmax/dmin (see issue #4276)
10:15:44 [2019-11-08T15:15:44.132Z] 29: Known Bug: Skipping test: UsingLoadParam/415
10:15:44 [2019-11-08T15:15:44.132Z] 29:     The s390x code generator currently doesn't support dmax/dmin (see issue #4276)
10:15:44 [2019-11-08T15:15:44.132Z] 29: Known Bug: Skipping test: UsingLoadParam/416
10:15:44 [2019-11-08T15:15:44.132Z] 29:     The s390x code generator currently doesn't support dmax/dmin (see issue #4276)
10:15:44 [2019-11-08T15:15:44.132Z] 29: Known Bug: Skipping test: UsingLoadParam/417
10:15:44 [2019-11-08T15:15:44.132Z] 29:     The s390x code generator currently doesn't support dmax/dmin (see issue #4276)
10:15:44 [2019-11-08T15:15:44.132Z] 29: Known Bug: Skipping test: UsingLoadParam/418
10:15:44 [2019-11-08T15:15:44.132Z] 29:     The s390x code generator currently doesn't support dmax/dmin (see issue #4276)
10:15:44 [2019-11-08T15:15:44.132Z] 29: Known Bug: Skipping test: UsingLoadParam/419
10:15:44 [2019-11-08T15:15:44.132Z] 29:     The s390x code generator currently doesn't support dmax/dmin (see issue #4276)
10:15:44 [2019-11-08T15:15:44.132Z] 29: Known Bug: Skipping test: UsingLoadParam/420
10:15:44 [2019-11-08T15:15:44.132Z] 29:     The s390x code generator currently doesn't support dmax/dmin (see issue #4276)
10:15:44 [2019-11-08T15:15:44.132Z] 29: Known Bug: Skipping test: UsingLoadParam/421
10:15:44 [2019-11-08T15:15:44.132Z] 29:     The s390x code generator currently doesn't support dmax/dmin (see issue #4276)
10:15:44 [2019-11-08T15:15:44.132Z] 29: Known Bug: Skipping test: UsingLoadParam/422
10:15:44 [2019-11-08T15:15:44.132Z] 29:     The s390x code generator currently doesn't support dmax/dmin (see issue #4276)
10:15:44 [2019-11-08T15:15:44.132Z] 29: Known Bug: Skipping test: UsingLoadParam/423
10:15:44 [2019-11-08T15:15:44.132Z] 29:     The s390x code generator currently doesn't support dmax/dmin (see issue #4276)
10:15:44 [2019-11-08T15:15:44.132Z] 29: Known Bug: Skipping test: UsingLoadParam/424
10:15:44 [2019-11-08T15:15:44.132Z] 29:     The s390x code generator currently doesn't support dmax/dmin (see issue #4276)
10:15:44 [2019-11-08T15:15:44.132Z] 29: Known Bug: Skipping test: UsingLoadParam/425
10:15:44 [2019-11-08T15:15:44.132Z] 29:     The s390x code generator currently doesn't support dmax/dmin (see issue #4276)
10:15:44 [2019-11-08T15:15:44.132Z] 29: Known Bug: Skipping test: UsingLoadParam/426
10:15:44 [2019-11-08T15:15:44.132Z] 29:     The s390x code generator currently doesn't support dmax/dmin (see issue #4276)
10:15:44 [2019-11-08T15:15:44.132Z] 29: Known Bug: Skipping test: UsingLoadParam/427
10:15:44 [2019-11-08T15:15:44.132Z] 29:     The s390x code generator currently doesn't support dmax/dmin (see issue #4276)
10:15:44 [2019-11-08T15:15:44.132Z] 29: Known Bug: Skipping test: UsingLoadParam/428
10:15:44 [2019-11-08T15:15:44.132Z] 29:     The s390x code generator currently doesn't support dmax/dmin (see issue #4276)
10:15:44 [2019-11-08T15:15:44.132Z] 29: Known Bug: Skipping test: UsingLoadParam/429
10:15:44 [2019-11-08T15:15:44.132Z] 29:     The s390x code generator currently doesn't support dmax/dmin (see issue #4276)
10:15:44 [2019-11-08T15:15:44.132Z] 29: Known Bug: Skipping test: UsingLoadParam/430
10:15:44 [2019-11-08T15:15:44.132Z] 29:     The s390x code generator currently doesn't support dmax/dmin (see issue #4276)
10:15:44 [2019-11-08T15:15:44.132Z] 29: Known Bug: Skipping test: UsingLoadParam/431
10:15:44 [2019-11-08T15:15:44.132Z] 29:     The s390x code generator currently doesn't support dmax/dmin (see issue #4276)
10:15:44 [2019-11-08T15:15:44.132Z] 29: Known Bug: Skipping test: UsingLoadParam/432
10:15:44 [2019-11-08T15:15:44.132Z] 29:     The s390x code generator currently doesn't support dmax/dmin (see issue #4276)
10:15:44 [2019-11-08T15:15:44.132Z] 29: Known Bug: Skipping test: UsingLoadParam/433
10:15:44 [2019-11-08T15:15:44.132Z] 29:     The s390x code generator currently doesn't support dmax/dmin (see issue #4276)
10:15:44 [2019-11-08T15:15:44.132Z] 29: Known Bug: Skipping test: UsingLoadParam/434
10:15:44 [2019-11-08T15:15:44.132Z] 29:     The s390x code generator currently doesn't support dmax/dmin (see issue #4276)
10:15:44 [2019-11-08T15:15:44.132Z] 29: Known Bug: Skipping test: UsingLoadParam/435
10:15:44 [2019-11-08T15:15:44.132Z] 29:     The s390x code generator currently doesn't support dmax/dmin (see issue #4276)
10:15:44 [2019-11-08T15:15:44.132Z] 29: Known Bug: Skipping test: UsingLoadParam/436
10:15:44 [2019-11-08T15:15:44.132Z] 29:     The s390x code generator currently doesn't support dmax/dmin (see issue #4276)
10:15:44 [2019-11-08T15:15:44.132Z] 29: Known Bug: Skipping test: UsingLoadParam/437
10:15:44 [2019-11-08T15:15:44.132Z] 29:     The s390x code generator currently doesn't support dmax/dmin (see issue #4276)
10:15:44 [2019-11-08T15:15:44.132Z] 29: Known Bug: Skipping test: UsingLoadParam/438
10:15:44 [2019-11-08T15:15:44.132Z] 29:     The s390x code generator currently doesn't support dmax/dmin (see issue #4276)
10:15:44 [2019-11-08T15:15:44.132Z] 29: Known Bug: Skipping test: UsingLoadParam/439
10:15:44 [2019-11-08T15:15:44.132Z] 29:     The s390x code generator currently doesn't support dmax/dmin (see issue #4276)
10:15:44 [2019-11-08T15:15:44.132Z] 29: Known Bug: Skipping test: UsingLoadParam/440
10:15:44 [2019-11-08T15:15:44.132Z] 29:     The s390x code generator currently doesn't support dmax/dmin (see issue #4276)
10:15:44 [2019-11-08T15:15:44.132Z] 29: Known Bug: Skipping test: UsingLoadParam/441
10:15:44 [2019-11-08T15:15:44.132Z] 29:     The s390x code generator currently doesn't support dmax/dmin (see issue #4276)
10:15:44 [2019-11-08T15:15:44.132Z] 29: Known Bug: Skipping test: UsingLoadParam/442
10:15:44 [2019-11-08T15:15:44.132Z] 29:     The s390x code generator currently doesn't support dmax/dmin (see issue #4276)
10:15:44 [2019-11-08T15:15:44.132Z] 29: Known Bug: Skipping test: UsingLoadParam/443
10:15:44 [2019-11-08T15:15:44.132Z] 29:     The s390x code generator currently doesn't support dmax/dmin (see issue #4276)
10:15:44 [2019-11-08T15:15:44.132Z] 29: Known Bug: Skipping test: UsingLoadParam/444
10:15:44 [2019-11-08T15:15:44.132Z] 29:     The s390x code generator currently doesn't support dmax/dmin (see issue #4276)
10:15:44 [2019-11-08T15:15:44.132Z] 29: Known Bug: Skipping test: UsingLoadParam/445
10:15:44 [2019-11-08T15:15:44.132Z] 29:     The s390x code generator currently doesn't support dmax/dmin (see issue #4276)
10:15:44 [2019-11-08T15:15:44.132Z] 29: Known Bug: Skipping test: UsingLoadParam/446
10:15:44 [2019-11-08T15:15:44.132Z] 29:     The s390x code generator currently doesn't support dmax/dmin (see issue #4276)
10:15:44 [2019-11-08T15:15:44.132Z] 29: Known Bug: Skipping test: UsingLoadParam/447
10:15:44 [2019-11-08T15:15:44.132Z] 29:     The s390x code generator currently doesn't support dmax/dmin (see issue #4276)
10:15:44 [2019-11-08T15:15:44.132Z] 29: Known Bug: Skipping test: UsingLoadParam/448
10:15:44 [2019-11-08T15:15:44.132Z] 29:     The s390x code generator currently doesn't support dmax/dmin (see issue #4276)
10:15:44 [2019-11-08T15:15:44.132Z] 29: Known Bug: Skipping test: UsingLoadParam/449
10:15:44 [2019-11-08T15:15:44.132Z] 29:     The s390x code generator currently doesn't support dmax/dmin (see issue #4276)
10:15:44 [2019-11-08T15:15:44.132Z] 29: Known Bug: Skipping test: UsingLoadParam/450
10:15:44 [2019-11-08T15:15:44.132Z] 29:     The s390x code generator currently doesn't support dmax/dmin (see issue #4276)
10:15:44 [2019-11-08T15:15:44.132Z] 29: Known Bug: Skipping test: UsingLoadParam/451
10:15:44 [2019-11-08T15:15:44.132Z] 29:     The s390x code generator currently doesn't support dmax/dmin (see issue #4276)
10:15:44 [2019-11-08T15:15:44.132Z] 29: Known Bug: Skipping test: UsingLoadParam/452
10:15:44 [2019-11-08T15:15:44.132Z] 29:     The s390x code generator currently doesn't support dmax/dmin (see issue #4276)
10:15:44 [2019-11-08T15:15:44.132Z] 29: Known Bug: Skipping test: UsingLoadParam/453
10:15:44 [2019-11-08T15:15:44.132Z] 29:     The s390x code generator currently doesn't support dmax/dmin (see issue #4276)
10:15:44 [2019-11-08T15:15:44.132Z] 29: Known Bug: Skipping test: UsingLoadParam/454
10:15:44 [2019-11-08T15:15:44.132Z] 29:     The s390x code generator currently doesn't support dmax/dmin (see issue #4276)
10:15:44 [2019-11-08T15:15:44.132Z] 29: Known Bug: Skipping test: UsingLoadParam/455
10:15:44 [2019-11-08T15:15:44.132Z] 29:     The s390x code generator currently doesn't support dmax/dmin (see issue #4276)
10:15:44 [2019-11-08T15:15:44.132Z] 29: Known Bug: Skipping test: UsingLoadParam/456
10:15:44 [2019-11-08T15:15:44.132Z] 29:     The s390x code generator currently doesn't support dmax/dmin (see issue #4276)
10:15:44 [2019-11-08T15:15:44.132Z] 29: Known Bug: Skipping test: UsingLoadParam/457
10:15:44 [2019-11-08T15:15:44.132Z] 29:     The s390x code generator currently doesn't support dmax/dmin (see issue #4276)
10:15:44 [2019-11-08T15:15:44.132Z] 29: Known Bug: Skipping test: UsingLoadParam/458
10:15:44 [2019-11-08T15:15:44.132Z] 29:     The s390x code generator currently doesn't support dmax/dmin (see issue #4276)
10:15:44 [2019-11-08T15:15:44.132Z] 29: Known Bug: Skipping test: UsingLoadParam/459
10:15:44 [2019-11-08T15:15:44.132Z] 29:     The s390x code generator currently doesn't support dmax/dmin (see issue #4276)
10:15:44 [2019-11-08T15:15:44.132Z] 29: Known Bug: Skipping test: UsingLoadParam/460
10:15:44 [2019-11-08T15:15:44.132Z] 29:     The s390x code generator currently doesn't support dmax/dmin (see issue #4276)
10:15:44 [2019-11-08T15:15:44.132Z] 29: Known Bug: Skipping test: UsingLoadParam/461
10:15:44 [2019-11-08T15:15:44.132Z] 29:     The s390x code generator currently doesn't support dmax/dmin (see issue #4276)
10:15:44 [2019-11-08T15:15:44.132Z] 29: Known Bug: Skipping test: UsingLoadParam/462
10:15:44 [2019-11-08T15:15:44.132Z] 29:     The s390x code generator currently doesn't support dmax/dmin (see issue #4276)
10:15:44 [2019-11-08T15:15:44.132Z] 29: Known Bug: Skipping test: UsingLoadParam/463
10:15:44 [2019-11-08T15:15:44.132Z] 29:     The s390x code generator currently doesn't support dmax/dmin (see issue #4276)
10:15:44 [2019-11-08T15:15:44.132Z] 29: Known Bug: Skipping test: UsingLoadParam/464
10:15:44 [2019-11-08T15:15:44.132Z] 29:     The s390x code generator currently doesn't support dmax/dmin (see issue #4276)
10:15:44 [2019-11-08T15:15:44.132Z] 29: Known Bug: Skipping test: UsingLoadParam/465
10:15:44 [2019-11-08T15:15:44.132Z] 29:     The s390x code generator currently doesn't support dmax/dmin (see issue #4276)
10:15:44 [2019-11-08T15:15:44.132Z] 29: Known Bug: Skipping test: UsingLoadParam/466
10:15:44 [2019-11-08T15:15:44.132Z] 29:     The s390x code generator currently doesn't support dmax/dmin (see issue #4276)
10:15:44 [2019-11-08T15:15:44.132Z] 29: Known Bug: Skipping test: UsingLoadParam/467
10:15:44 [2019-11-08T15:15:44.132Z] 29:     The s390x code generator currently doesn't support dmax/dmin (see issue #4276)
10:15:44 [2019-11-08T15:15:44.132Z] 29: Known Bug: Skipping test: UsingLoadParam/468
10:15:44 [2019-11-08T15:15:44.132Z] 29:     The s390x code generator currently doesn't support dmax/dmin (see issue #4276)
10:15:44 [2019-11-08T15:15:44.132Z] 29: Known Bug: Skipping test: UsingLoadParam/469
10:15:44 [2019-11-08T15:15:44.132Z] 29:     The s390x code generator currently doesn't support dmax/dmin (see issue #4276)
10:15:44 [2019-11-08T15:15:44.132Z] 29: Known Bug: Skipping test: UsingLoadParam/470
10:15:44 [2019-11-08T15:15:44.132Z] 29:     The s390x code generator currently doesn't support dmax/dmin (see issue #4276)
10:15:44 [2019-11-08T15:15:44.132Z] 29: Known Bug: Skipping test: UsingLoadParam/471
10:15:44 [2019-11-08T15:15:44.132Z] 29:     The s390x code generator currently doesn't support dmax/dmin (see issue #4276)
10:15:44 [2019-11-08T15:15:44.132Z] 29: Known Bug: Skipping test: UsingLoadParam/472
10:15:44 [2019-11-08T15:15:44.132Z] 29:     The s390x code generator currently doesn't support dmax/dmin (see issue #4276)
10:15:44 [2019-11-08T15:15:44.132Z] 29: Known Bug: Skipping test: UsingLoadParam/473
10:15:44 [2019-11-08T15:15:44.132Z] 29:     The s390x code generator currently doesn't support dmax/dmin (see issue #4276)
10:15:44 [2019-11-08T15:15:44.133Z] 29: Known Bug: Skipping test: UsingLoadParam/474
10:15:44 [2019-11-08T15:15:44.133Z] 29:     The s390x code generator currently doesn't support dmax/dmin (see issue #4276)
10:15:44 [2019-11-08T15:15:44.133Z] 29: Known Bug: Skipping test: UsingLoadParam/475
10:15:44 [2019-11-08T15:15:44.133Z] 29:     The s390x code generator currently doesn't support dmax/dmin (see issue #4276)
10:15:44 [2019-11-08T15:15:44.133Z] 29: Known Bug: Skipping test: UsingLoadParam/476
10:15:44 [2019-11-08T15:15:44.133Z] 29:     The s390x code generator currently doesn't support dmax/dmin (see issue #4276)
10:15:44 [2019-11-08T15:15:44.133Z] 29: Known Bug: Skipping test: UsingLoadParam/477
10:15:44 [2019-11-08T15:15:44.133Z] 29:     The s390x code generator currently doesn't support dmax/dmin (see issue #4276)
10:15:44 [2019-11-08T15:15:44.133Z] 29: Known Bug: Skipping test: UsingLoadParam/478
10:15:44 [2019-11-08T15:15:44.133Z] 29:     The s390x code generator currently doesn't support dmax/dmin (see issue #4276)
10:15:44 [2019-11-08T15:15:44.133Z] 29: Known Bug: Skipping test: UsingLoadParam/479
10:15:44 [2019-11-08T15:15:44.133Z] 29:     The s390x code generator currently doesn't support dmax/dmin (see issue #4276)
10:15:44 [2019-11-08T15:15:44.133Z] 29: Known Bug: Skipping test: UsingLoadParam/480
10:15:44 [2019-11-08T15:15:44.133Z] 29:     The s390x code generator currently doesn't support dmax/dmin (see issue #4276)
10:15:44 [2019-11-08T15:15:44.133Z] 29: Known Bug: Skipping test: UsingLoadParam/481
10:15:44 [2019-11-08T15:15:44.133Z] 29:     The s390x code generator currently doesn't support dmax/dmin (see issue #4276)
10:15:44 [2019-11-08T15:15:44.133Z] 29: Known Bug: Skipping test: UsingLoadParam/482
10:15:44 [2019-11-08T15:15:44.133Z] 29:     The s390x code generator currently doesn't support dmax/dmin (see issue #4276)
10:15:44 [2019-11-08T15:15:44.133Z] 29: Known Bug: Skipping test: UsingLoadParam/483
10:15:44 [2019-11-08T15:15:44.133Z] 29:     The s390x code generator currently doesn't support dmax/dmin (see issue #4276)
10:15:44 [2019-11-08T15:15:44.133Z] 29: Known Bug: Skipping test: UsingLoadParam/484
10:15:44 [2019-11-08T15:15:44.133Z] 29:     The s390x code generator currently doesn't support dmax/dmin (see issue #4276)
10:15:44 [2019-11-08T15:15:44.133Z] 29: Known Bug: Skipping test: UsingLoadParam/485
10:15:44 [2019-11-08T15:15:44.133Z] 29:     The s390x code generator currently doesn't support dmax/dmin (see issue #4276)
10:15:44 [2019-11-08T15:15:44.133Z] 29: Known Bug: Skipping test: UsingLoadParam/486
10:15:44 [2019-11-08T15:15:44.133Z] 29:     The s390x code generator currently doesn't support dmax/dmin (see issue #4276)
10:15:44 [2019-11-08T15:15:44.133Z] 29: Known Bug: Skipping test: UsingLoadParam/487
10:15:44 [2019-11-08T15:15:44.133Z] 29:     The s390x code generator currently doesn't support dmax/dmin (see issue #4276)
10:15:44 [2019-11-08T15:15:44.133Z] 29: Known Bug: Skipping test: UsingLoadParam/488
10:15:44 [2019-11-08T15:15:44.133Z] 29:     The s390x code generator currently doesn't support dmax/dmin (see issue #4276)
10:15:44 [2019-11-08T15:15:44.133Z] 29: Known Bug: Skipping test: UsingLoadParam/489
10:15:44 [2019-11-08T15:15:44.133Z] 29:     The s390x code generator currently doesn't support dmax/dmin (see issue #4276)
10:15:44 [2019-11-08T15:15:44.133Z] 29: Known Bug: Skipping test: UsingLoadParam/490
10:15:44 [2019-11-08T15:15:44.133Z] 29:     The s390x code generator currently doesn't support dmax/dmin (see issue #4276)
10:15:44 [2019-11-08T15:15:44.133Z] 29: Known Bug: Skipping test: UsingLoadParam/491
10:15:44 [2019-11-08T15:15:44.133Z] 29:     The s390x code generator currently doesn't support dmax/dmin (see issue #4276)
10:15:44 [2019-11-08T15:15:44.133Z] 29: Known Bug: Skipping test: UsingLoadParam/492
10:15:44 [2019-11-08T15:15:44.133Z] 29:     The s390x code generator currently doesn't support dmax/dmin (see issue #4276)
10:15:44 [2019-11-08T15:15:44.133Z] 29: Known Bug: Skipping test: UsingLoadParam/493
10:15:44 [2019-11-08T15:15:44.133Z] 29:     The s390x code generator currently doesn't support dmax/dmin (see issue #4276)
10:15:44 [2019-11-08T15:15:44.133Z] 29: Known Bug: Skipping test: UsingLoadParam/494
10:15:44 [2019-11-08T15:15:44.133Z] 29:     The s390x code generator currently doesn't support dmax/dmin (see issue #4276)
10:15:44 [2019-11-08T15:15:44.133Z] 29: Known Bug: Skipping test: UsingLoadParam/495
10:15:44 [2019-11-08T15:15:44.133Z] 29:     The s390x code generator currently doesn't support dmax/dmin (see issue #4276)
10:15:44 [2019-11-08T15:15:44.133Z] 29: Known Bug: Skipping test: UsingLoadParam/496
10:15:44 [2019-11-08T15:15:44.133Z] 29:     The s390x code generator currently doesn't support dmax/dmin (see issue #4276)
10:15:44 [2019-11-08T15:15:44.133Z] 29: Known Bug: Skipping test: UsingLoadParam/497
10:15:44 [2019-11-08T15:15:44.133Z] 29:     The s390x code generator currently doesn't support dmax/dmin (see issue #4276)
10:15:44 [2019-11-08T15:15:44.133Z] 29: Known Bug: Skipping test: UsingLoadParam/498
10:15:44 [2019-11-08T15:15:44.133Z] 29:     The s390x code generator currently doesn't support dmax/dmin (see issue #4276)
10:15:44 [2019-11-08T15:15:44.133Z] 29: Known Bug: Skipping test: UsingLoadParam/499
10:15:44 [2019-11-08T15:15:44.133Z] 29:     The s390x code generator currently doesn't support dmax/dmin (see issue #4276)
10:15:44 [2019-11-08T15:15:44.133Z] 29: Known Bug: Skipping test: UsingLoadParam/500
10:15:44 [2019-11-08T15:15:44.133Z] 29:     The s390x code generator currently doesn't support dmax/dmin (see issue #4276)
10:15:44 [2019-11-08T15:15:44.133Z] 29: Known Bug: Skipping test: UsingLoadParam/501
10:15:44 [2019-11-08T15:15:44.133Z] 29:     The s390x code generator currently doesn't support dmax/dmin (see issue #4276)
10:15:44 [2019-11-08T15:15:44.133Z] 29: Known Bug: Skipping test: UsingLoadParam/502
10:15:44 [2019-11-08T15:15:44.133Z] 29:     The s390x code generator currently doesn't support dmax/dmin (see issue #4276)
10:15:44 [2019-11-08T15:15:44.133Z] 29: Known Bug: Skipping test: UsingLoadParam/503
10:15:44 [2019-11-08T15:15:44.133Z] 29:     The s390x code generator currently doesn't support dmax/dmin (see issue #4276)
10:15:44 [2019-11-08T15:15:44.133Z] 29: Known Bug: Skipping test: UsingLoadParam/504
10:15:44 [2019-11-08T15:15:44.133Z] 29:     The s390x code generator currently doesn't support dmax/dmin (see issue #4276)
10:15:44 [2019-11-08T15:15:44.133Z] 29: Known Bug: Skipping test: UsingLoadParam/505
10:15:44 [2019-11-08T15:15:44.133Z] 29:     The s390x code generator currently doesn't support dmax/dmin (see issue #4276)
10:15:44 [2019-11-08T15:15:44.133Z] 29: Known Bug: Skipping test: UsingLoadParam/506
10:15:44 [2019-11-08T15:15:44.133Z] 29:     The s390x code generator currently doesn't support dmax/dmin (see issue #4276)
10:15:44 [2019-11-08T15:15:44.133Z] 29: Known Bug: Skipping test: UsingLoadParam/507
10:15:44 [2019-11-08T15:15:44.133Z] 29:     The s390x code generator currently doesn't support dmax/dmin (see issue #4276)
10:15:44 [2019-11-08T15:15:44.133Z] 29: Known Bug: Skipping test: UsingLoadParam/508
10:15:44 [2019-11-08T15:15:44.133Z] 29:     The s390x code generator currently doesn't support dmax/dmin (see issue #4276)
10:15:44 [2019-11-08T15:15:44.133Z] 29: Known Bug: Skipping test: UsingLoadParam/509
10:15:44 [2019-11-08T15:15:44.133Z] 29:     The s390x code generator currently doesn't support dmax/dmin (see issue #4276)
10:15:44 [2019-11-08T15:15:44.133Z] 29: Known Bug: Skipping test: UsingLoadParam/510
10:15:44 [2019-11-08T15:15:44.133Z] 29:     The s390x code generator currently doesn't support dmax/dmin (see issue #4276)
10:15:44 [2019-11-08T15:15:44.133Z] 29: Known Bug: Skipping test: UsingLoadParam/511
10:15:44 [2019-11-08T15:15:44.133Z] 29:     The s390x code generator currently doesn't support dmax/dmin (see issue #4276)
10:15:44 [2019-11-08T15:15:44.133Z] 29: [----------] 1024 tests from MaxMin/DoubleMaxMin (94 ms total)
10:15:44 [2019-11-08T15:15:44.133Z] 29: 
10:15:44 [2019-11-08T15:15:44.133Z] 29: [----------] 2700 tests from CompareTest/Int32Compare
10:15:46 [2019-11-08T15:15:46.199Z] 29: [----------] 2700 tests from CompareTest/Int32Compare (1801 ms total)
10:15:46 [2019-11-08T15:15:46.199Z] 29: 
10:15:46 [2019-11-08T15:15:46.199Z] 29: [----------] 2888 tests from CompareTest/UInt32Compare
10:15:47 [2019-11-08T15:15:47.931Z] 29: [----------] 2888 tests from CompareTest/UInt32Compare (2021 ms total)
10:15:47 [2019-11-08T15:15:47.931Z] 29: 
10:15:47 [2019-11-08T15:15:47.931Z] 29: [----------] 4046 tests from CompareTest/Int64Compare
10:15:50 [2019-11-08T15:15:50.665Z] 29: [----------] 4046 tests from CompareTest/Int64Compare (2738 ms total)
10:15:50 [2019-11-08T15:15:50.665Z] 29: 
10:15:50 [2019-11-08T15:15:50.665Z] 29: [----------] 3528 tests from CompareTest/UInt64Compare
10:15:53 [2019-11-08T15:15:53.401Z] 29: [----------] 3528 tests from CompareTest/UInt64Compare (2385 ms total)
10:15:53 [2019-11-08T15:15:53.401Z] 29: 
10:15:53 [2019-11-08T15:15:53.401Z] 29: [----------] 2700 tests from CompareTest/Int32IfCompare
10:15:56 [2019-11-08T15:15:56.228Z] 29: [----------] 2700 tests from CompareTest/Int32IfCompare (2928 ms total)
10:15:56 [2019-11-08T15:15:56.228Z] 29: 
10:15:56 [2019-11-08T15:15:56.228Z] 29: [----------] 2888 tests from CompareTest/UInt32IfCompare
10:15:59 [2019-11-08T15:15:59.019Z] 29: [----------] 2888 tests from CompareTest/UInt32IfCompare (2907 ms total)
10:15:59 [2019-11-08T15:15:59.019Z] 29: 
10:15:59 [2019-11-08T15:15:59.019Z] 29: [----------] 3468 tests from CompareTest/Int64IfCompare
10:16:02 [2019-11-08T15:16:02.538Z] 29: [----------] 3468 tests from CompareTest/Int64IfCompare (3439 ms total)
10:16:02 [2019-11-08T15:16:02.538Z] 29: 
10:16:02 [2019-11-08T15:16:02.538Z] 29: [----------] 3528 tests from CompareTest/UInt64IfCompare
10:16:06 [2019-11-08T15:16:06.138Z] 29: [----------] 3528 tests from CompareTest/UInt64IfCompare (3639 ms total)
10:16:06 [2019-11-08T15:16:06.138Z] 29: 
10:16:06 [2019-11-08T15:16:06.138Z] 29: [----------] 2700 tests from CompareTest/FloatCompare
10:16:08 [2019-11-08T15:16:08.197Z] 29: [----------] 2700 tests from CompareTest/FloatCompare (1975 ms total)
10:16:08 [2019-11-08T15:16:08.197Z] 29: 
10:16:08 [2019-11-08T15:16:08.197Z] 29: [----------] 3072 tests from CompareTest/DoubleCompare
10:16:10 [2019-11-08T15:16:10.332Z] 29: [----------] 3072 tests from CompareTest/DoubleCompare (2313 ms total)
10:16:10 [2019-11-08T15:16:10.332Z] 29: 
10:16:10 [2019-11-08T15:16:10.332Z] 29: [----------] 2700 tests from CompareTest/FloatIfCompare
10:16:13 [2019-11-08T15:16:13.862Z] 29: [----------] 2700 tests from CompareTest/FloatIfCompare (3350 ms total)
10:16:13 [2019-11-08T15:16:13.862Z] 29: 
10:16:13 [2019-11-08T15:16:13.862Z] 29: [----------] 3072 tests from CompareTest/DoubleIfCompare
10:16:17 [2019-11-08T15:16:17.471Z] 29: [----------] 3072 tests from CompareTest/DoubleIfCompare (3788 ms total)
10:16:17 [2019-11-08T15:16:17.471Z] 29: 
10:16:17 [2019-11-08T15:16:17.471Z] 29: [----------] 18 tests from TypeConversionTest/Int8ToInt32
10:16:17 [2019-11-08T15:16:17.471Z] 29: Known Bug: Skipping test: UsingLoadParam/0
10:16:17 [2019-11-08T15:16:17.471Z] 29:     The Z code generator incorrectly spills sub-integer types arguments (see issue #3525)
10:16:17 [2019-11-08T15:16:17.471Z] 29: Known Bug: Skipping test: UsingLoadParam/1
10:16:17 [2019-11-08T15:16:17.471Z] 29:     The Z code generator incorrectly spills sub-integer types arguments (see issue #3525)
10:16:17 [2019-11-08T15:16:17.471Z] 29: Known Bug: Skipping test: UsingLoadParam/2
10:16:17 [2019-11-08T15:16:17.471Z] 29:     The Z code generator incorrectly spills sub-integer types arguments (see issue #3525)
10:16:17 [2019-11-08T15:16:17.471Z] 29: Known Bug: Skipping test: UsingLoadParam/3
10:16:17 [2019-11-08T15:16:17.471Z] 29:     The Z code generator incorrectly spills sub-integer types arguments (see issue #3525)
10:16:17 [2019-11-08T15:16:17.471Z] 29: Known Bug: Skipping test: UsingLoadParam/4
10:16:17 [2019-11-08T15:16:17.471Z] 29:     The Z code generator incorrectly spills sub-integer types arguments (see issue #3525)
10:16:17 [2019-11-08T15:16:17.471Z] 29: Known Bug: Skipping test: UsingLoadParam/5
10:16:17 [2019-11-08T15:16:17.471Z] 29:     The Z code generator incorrectly spills sub-integer types arguments (see issue #3525)
10:16:17 [2019-11-08T15:16:17.471Z] 29: Known Bug: Skipping test: UsingLoadParam/6
10:16:17 [2019-11-08T15:16:17.471Z] 29:     The Z code generator incorrectly spills sub-integer types arguments (see issue #3525)
10:16:17 [2019-11-08T15:16:17.471Z] 29: Known Bug: Skipping test: UsingLoadParam/7
10:16:17 [2019-11-08T15:16:17.471Z] 29:     The Z code generator incorrectly spills sub-integer types arguments (see issue #3525)
10:16:17 [2019-11-08T15:16:17.471Z] 29: Known Bug: Skipping test: UsingLoadParam/8
10:16:17 [2019-11-08T15:16:17.471Z] 29:     The Z code generator incorrectly spills sub-integer types arguments (see issue #3525)
10:16:17 [2019-11-08T15:16:17.471Z] 29: [----------] 18 tests from TypeConversionTest/Int8ToInt32 (6 ms total)
10:16:17 [2019-11-08T15:16:17.471Z] 29: 
10:16:17 [2019-11-08T15:16:17.471Z] 29: [----------] 18 tests from TypeConversionTest/UInt8ToInt32
10:16:17 [2019-11-08T15:16:17.471Z] 29: Known Bug: Skipping test: UsingLoadParam/0
10:16:17 [2019-11-08T15:16:17.471Z] 29:     The Z code generator incorrectly spills sub-integer types arguments (see issue #3525)
10:16:17 [2019-11-08T15:16:17.471Z] 29: Known Bug: Skipping test: UsingLoadParam/1
10:16:17 [2019-11-08T15:16:17.471Z] 29:     The Z code generator incorrectly spills sub-integer types arguments (see issue #3525)
10:16:17 [2019-11-08T15:16:17.471Z] 29: Known Bug: Skipping test: UsingLoadParam/2
10:16:17 [2019-11-08T15:16:17.471Z] 29:     The Z code generator incorrectly spills sub-integer types arguments (see issue #3525)
10:16:17 [2019-11-08T15:16:17.471Z] 29: Known Bug: Skipping test: UsingLoadParam/3
10:16:17 [2019-11-08T15:16:17.471Z] 29:     The Z code generator incorrectly spills sub-integer types arguments (see issue #3525)
10:16:17 [2019-11-08T15:16:17.471Z] 29: Known Bug: Skipping test: UsingLoadParam/4
10:16:17 [2019-11-08T15:16:17.471Z] 29:     The Z code generator incorrectly spills sub-integer types arguments (see issue #3525)
10:16:17 [2019-11-08T15:16:17.471Z] 29: Known Bug: Skipping test: UsingLoadParam/5
10:16:17 [2019-11-08T15:16:17.471Z] 29:     The Z code generator incorrectly spills sub-integer types arguments (see issue #3525)
10:16:17 [2019-11-08T15:16:17.471Z] 29: Known Bug: Skipping test: UsingLoadParam/6
10:16:17 [2019-11-08T15:16:17.471Z] 29:     The Z code generator incorrectly spills sub-integer types arguments (see issue #3525)
10:16:17 [2019-11-08T15:16:17.471Z] 29: Known Bug: Skipping test: UsingLoadParam/7
10:16:17 [2019-11-08T15:16:17.471Z] 29:     The Z code generator incorrectly spills sub-integer types arguments (see issue #3525)
10:16:17 [2019-11-08T15:16:17.471Z] 29: Known Bug: Skipping test: UsingLoadParam/8
10:16:17 [2019-11-08T15:16:17.471Z] 29:     The Z code generator incorrectly spills sub-integer types arguments (see issue #3525)
10:16:17 [2019-11-08T15:16:17.471Z] 29: [----------] 18 tests from TypeConversionTest/UInt8ToInt32 (6 ms total)
10:16:17 [2019-11-08T15:16:17.471Z] 29: 
10:16:17 [2019-11-08T15:16:17.471Z] 29: [----------] 18 tests from TypeConversionTest/Int8ToInt64
10:16:17 [2019-11-08T15:16:17.471Z] 29: Known Bug: Skipping test: UsingLoadParam/0
10:16:17 [2019-11-08T15:16:17.471Z] 29:     The Z code generator incorrectly spills sub-integer types arguments (see issue #3525)
10:16:17 [2019-11-08T15:16:17.471Z] 29: Known Bug: Skipping test: UsingLoadParam/1
10:16:17 [2019-11-08T15:16:17.471Z] 29:     The Z code generator incorrectly spills sub-integer types arguments (see issue #3525)
10:16:17 [2019-11-08T15:16:17.471Z] 29: Known Bug: Skipping test: UsingLoadParam/2
10:16:17 [2019-11-08T15:16:17.471Z] 29:     The Z code generator incorrectly spills sub-integer types arguments (see issue #3525)
10:16:17 [2019-11-08T15:16:17.471Z] 29: Known Bug: Skipping test: UsingLoadParam/3
10:16:17 [2019-11-08T15:16:17.471Z] 29:     The Z code generator incorrectly spills sub-integer types arguments (see issue #3525)
10:16:17 [2019-11-08T15:16:17.471Z] 29: Known Bug: Skipping test: UsingLoadParam/4
10:16:17 [2019-11-08T15:16:17.471Z] 29:     The Z code generator incorrectly spills sub-integer types arguments (see issue #3525)
10:16:17 [2019-11-08T15:16:17.471Z] 29: Known Bug: Skipping test: UsingLoadParam/5
10:16:17 [2019-11-08T15:16:17.471Z] 29:     The Z code generator incorrectly spills sub-integer types arguments (see issue #3525)
10:16:17 [2019-11-08T15:16:17.471Z] 29: Known Bug: Skipping test: UsingLoadParam/6
10:16:17 [2019-11-08T15:16:17.471Z] 29:     The Z code generator incorrectly spills sub-integer types arguments (see issue #3525)
10:16:17 [2019-11-08T15:16:17.471Z] 29: Known Bug: Skipping test: UsingLoadParam/7
10:16:17 [2019-11-08T15:16:17.471Z] 29:     The Z code generator incorrectly spills sub-integer types arguments (see issue #3525)
10:16:17 [2019-11-08T15:16:17.471Z] 29: Known Bug: Skipping test: UsingLoadParam/8
10:16:17 [2019-11-08T15:16:17.471Z] 29:     The Z code generator incorrectly spills sub-integer types arguments (see issue #3525)
10:16:17 [2019-11-08T15:16:17.471Z] 29: [----------] 18 tests from TypeConversionTest/Int8ToInt64 (5 ms total)
10:16:17 [2019-11-08T15:16:17.471Z] 29: 
10:16:17 [2019-11-08T15:16:17.471Z] 29: [----------] 18 tests from TypeConversionTest/UInt8ToInt64
10:16:17 [2019-11-08T15:16:17.471Z] 29: Known Bug: Skipping test: UsingLoadParam/0
10:16:17 [2019-11-08T15:16:17.471Z] 29:     The Z code generator incorrectly spills sub-integer types arguments (see issue #3525)
10:16:17 [2019-11-08T15:16:17.471Z] 29: Known Bug: Skipping test: UsingLoadParam/1
10:16:17 [2019-11-08T15:16:17.471Z] 29:     The Z code generator incorrectly spills sub-integer types arguments (see issue #3525)
10:16:17 [2019-11-08T15:16:17.471Z] 29: Known Bug: Skipping test: UsingLoadParam/2
10:16:17 [2019-11-08T15:16:17.471Z] 29:     The Z code generator incorrectly spills sub-integer types arguments (see issue #3525)
10:16:17 [2019-11-08T15:16:17.471Z] 29: Known Bug: Skipping test: UsingLoadParam/3
10:16:17 [2019-11-08T15:16:17.471Z] 29:     The Z code generator incorrectly spills sub-integer types arguments (see issue #3525)
10:16:17 [2019-11-08T15:16:17.471Z] 29: Known Bug: Skipping test: UsingLoadParam/4
10:16:17 [2019-11-08T15:16:17.471Z] 29:     The Z code generator incorrectly spills sub-integer types arguments (see issue #3525)
10:16:17 [2019-11-08T15:16:17.471Z] 29: Known Bug: Skipping test: UsingLoadParam/5
10:16:17 [2019-11-08T15:16:17.471Z] 29:     The Z code generator incorrectly spills sub-integer types arguments (see issue #3525)
10:16:17 [2019-11-08T15:16:17.471Z] 29: Known Bug: Skipping test: UsingLoadParam/6
10:16:17 [2019-11-08T15:16:17.471Z] 29:     The Z code generator incorrectly spills sub-integer types arguments (see issue #3525)
10:16:17 [2019-11-08T15:16:17.471Z] 29: Known Bug: Skipping test: UsingLoadParam/7
10:16:17 [2019-11-08T15:16:17.471Z] 29:     The Z code generator incorrectly spills sub-integer types arguments (see issue #3525)
10:16:17 [2019-11-08T15:16:17.471Z] 29: Known Bug: Skipping test: UsingLoadParam/8
10:16:17 [2019-11-08T15:16:17.471Z] 29:     The Z code generator incorrectly spills sub-integer types arguments (see issue #3525)
10:16:17 [2019-11-08T15:16:17.471Z] 29: [----------] 18 tests from TypeConversionTest/UInt8ToInt64 (5 ms total)
10:16:17 [2019-11-08T15:16:17.471Z] 29: 
10:16:17 [2019-11-08T15:16:17.471Z] 29: [----------] 18 tests from TypeConversionTest/Int16ToInt32
10:16:17 [2019-11-08T15:16:17.471Z] 29: Known Bug: Skipping test: UsingLoadParam/0
10:16:17 [2019-11-08T15:16:17.471Z] 29:     The Z code generator incorrectly spills sub-integer types arguments (see issue #3525)
10:16:17 [2019-11-08T15:16:17.471Z] 29: Known Bug: Skipping test: UsingLoadParam/1
10:16:17 [2019-11-08T15:16:17.471Z] 29:     The Z code generator incorrectly spills sub-integer types arguments (see issue #3525)
10:16:17 [2019-11-08T15:16:17.471Z] 29: Known Bug: Skipping test: UsingLoadParam/2
10:16:17 [2019-11-08T15:16:17.471Z] 29:     The Z code generator incorrectly spills sub-integer types arguments (see issue #3525)
10:16:17 [2019-11-08T15:16:17.471Z] 29: Known Bug: Skipping test: UsingLoadParam/3
10:16:17 [2019-11-08T15:16:17.471Z] 29:     The Z code generator incorrectly spills sub-integer types arguments (see issue #3525)
10:16:17 [2019-11-08T15:16:17.471Z] 29: Known Bug: Skipping test: UsingLoadParam/4
10:16:17 [2019-11-08T15:16:17.471Z] 29:     The Z code generator incorrectly spills sub-integer types arguments (see issue #3525)
10:16:17 [2019-11-08T15:16:17.471Z] 29: Known Bug: Skipping test: UsingLoadParam/5
10:16:17 [2019-11-08T15:16:17.471Z] 29:     The Z code generator incorrectly spills sub-integer types arguments (see issue #3525)
10:16:17 [2019-11-08T15:16:17.472Z] 29: Known Bug: Skipping test: UsingLoadParam/6
10:16:17 [2019-11-08T15:16:17.472Z] 29:     The Z code generator incorrectly spills sub-integer types arguments (see issue #3525)
10:16:17 [2019-11-08T15:16:17.472Z] 29: Known Bug: Skipping test: UsingLoadParam/7
10:16:17 [2019-11-08T15:16:17.472Z] 29:     The Z code generator incorrectly spills sub-integer types arguments (see issue #3525)
10:16:17 [2019-11-08T15:16:17.472Z] 29: Known Bug: Skipping test: UsingLoadParam/8
10:16:17 [2019-11-08T15:16:17.472Z] 29:     The Z code generator incorrectly spills sub-integer types arguments (see issue #3525)
10:16:17 [2019-11-08T15:16:17.472Z] 29: [----------] 18 tests from TypeConversionTest/Int16ToInt32 (6 ms total)
10:16:17 [2019-11-08T15:16:17.472Z] 29: 
10:16:17 [2019-11-08T15:16:17.472Z] 29: [----------] 18 tests from TypeConversionTest/UInt16ToInt32
10:16:17 [2019-11-08T15:16:17.472Z] 29: Known Bug: Skipping test: UsingLoadParam/0
10:16:17 [2019-11-08T15:16:17.472Z] 29:     The Z code generator incorrectly spills sub-integer types arguments (see issue #3525)
10:16:17 [2019-11-08T15:16:17.472Z] 29: Known Bug: Skipping test: UsingLoadParam/1
10:16:17 [2019-11-08T15:16:17.472Z] 29:     The Z code generator incorrectly spills sub-integer types arguments (see issue #3525)
10:16:17 [2019-11-08T15:16:17.472Z] 29: Known Bug: Skipping test: UsingLoadParam/2
10:16:17 [2019-11-08T15:16:17.472Z] 29:     The Z code generator incorrectly spills sub-integer types arguments (see issue #3525)
10:16:17 [2019-11-08T15:16:17.472Z] 29: Known Bug: Skipping test: UsingLoadParam/3
10:16:17 [2019-11-08T15:16:17.472Z] 29:     The Z code generator incorrectly spills sub-integer types arguments (see issue #3525)
10:16:17 [2019-11-08T15:16:17.472Z] 29: Known Bug: Skipping test: UsingLoadParam/4
10:16:17 [2019-11-08T15:16:17.472Z] 29:     The Z code generator incorrectly spills sub-integer types arguments (see issue #3525)
10:16:17 [2019-11-08T15:16:17.472Z] 29: Known Bug: Skipping test: UsingLoadParam/5
10:16:17 [2019-11-08T15:16:17.472Z] 29:     The Z code generator incorrectly spills sub-integer types arguments (see issue #3525)
10:16:17 [2019-11-08T15:16:17.472Z] 29: Known Bug: Skipping test: UsingLoadParam/6
10:16:17 [2019-11-08T15:16:17.472Z] 29:     The Z code generator incorrectly spills sub-integer types arguments (see issue #3525)
10:16:17 [2019-11-08T15:16:17.472Z] 29: Known Bug: Skipping test: UsingLoadParam/7
10:16:17 [2019-11-08T15:16:17.472Z] 29:     The Z code generator incorrectly spills sub-integer types arguments (see issue #3525)
10:16:17 [2019-11-08T15:16:17.472Z] 29: Known Bug: Skipping test: UsingLoadParam/8
10:16:17 [2019-11-08T15:16:17.472Z] 29:     The Z code generator incorrectly spills sub-integer types arguments (see issue #3525)
10:16:17 [2019-11-08T15:16:17.472Z] 29: [----------] 18 tests from TypeConversionTest/UInt16ToInt32 (6 ms total)
10:16:17 [2019-11-08T15:16:17.472Z] 29: 
10:16:17 [2019-11-08T15:16:17.472Z] 29: [----------] 18 tests from TypeConversionTest/Int16ToInt64
10:16:17 [2019-11-08T15:16:17.472Z] 29: Known Bug: Skipping test: UsingLoadParam/0
10:16:17 [2019-11-08T15:16:17.472Z] 29:     The Z code generator incorrectly spills sub-integer types arguments (see issue #3525)
10:16:17 [2019-11-08T15:16:17.472Z] 29: Known Bug: Skipping test: UsingLoadParam/1
10:16:17 [2019-11-08T15:16:17.472Z] 29:     The Z code generator incorrectly spills sub-integer types arguments (see issue #3525)
10:16:17 [2019-11-08T15:16:17.472Z] 29: Known Bug: Skipping test: UsingLoadParam/2
10:16:17 [2019-11-08T15:16:17.472Z] 29:     The Z code generator incorrectly spills sub-integer types arguments (see issue #3525)
10:16:17 [2019-11-08T15:16:17.472Z] 29: Known Bug: Skipping test: UsingLoadParam/3
10:16:17 [2019-11-08T15:16:17.472Z] 29:     The Z code generator incorrectly spills sub-integer types arguments (see issue #3525)
10:16:17 [2019-11-08T15:16:17.472Z] 29: Known Bug: Skipping test: UsingLoadParam/4
10:16:17 [2019-11-08T15:16:17.472Z] 29:     The Z code generator incorrectly spills sub-integer types arguments (see issue #3525)
10:16:17 [2019-11-08T15:16:17.472Z] 29: Known Bug: Skipping test: UsingLoadParam/5
10:16:17 [2019-11-08T15:16:17.472Z] 29:     The Z code generator incorrectly spills sub-integer types arguments (see issue #3525)
10:16:17 [2019-11-08T15:16:17.472Z] 29: Known Bug: Skipping test: UsingLoadParam/6
10:16:17 [2019-11-08T15:16:17.472Z] 29:     The Z code generator incorrectly spills sub-integer types arguments (see issue #3525)
10:16:17 [2019-11-08T15:16:17.472Z] 29: Known Bug: Skipping test: UsingLoadParam/7
10:16:17 [2019-11-08T15:16:17.472Z] 29:     The Z code generator incorrectly spills sub-integer types arguments (see issue #3525)
10:16:17 [2019-11-08T15:16:17.472Z] 29: Known Bug: Skipping test: UsingLoadParam/8
10:16:17 [2019-11-08T15:16:17.472Z] 29:     The Z code generator incorrectly spills sub-integer types arguments (see issue #3525)
10:16:17 [2019-11-08T15:16:17.472Z] 29: [----------] 18 tests from TypeConversionTest/Int16ToInt64 (6 ms total)
10:16:17 [2019-11-08T15:16:17.472Z] 29: 
10:16:17 [2019-11-08T15:16:17.472Z] 29: [----------] 18 tests from TypeConversionTest/UInt16ToInt64
10:16:17 [2019-11-08T15:16:17.472Z] 29: Known Bug: Skipping test: UsingLoadParam/0
10:16:17 [2019-11-08T15:16:17.472Z] 29:     The Z code generator incorrectly spills sub-integer types arguments (see issue #3525)
10:16:17 [2019-11-08T15:16:17.472Z] 29: Known Bug: Skipping test: UsingLoadParam/1
10:16:17 [2019-11-08T15:16:17.472Z] 29:     The Z code generator incorrectly spills sub-integer types arguments (see issue #3525)
10:16:17 [2019-11-08T15:16:17.472Z] 29: Known Bug: Skipping test: UsingLoadParam/2
10:16:17 [2019-11-08T15:16:17.472Z] 29:     The Z code generator incorrectly spills sub-integer types arguments (see issue #3525)
10:16:17 [2019-11-08T15:16:17.472Z] 29: Known Bug: Skipping test: UsingLoadParam/3
10:16:17 [2019-11-08T15:16:17.472Z] 29:     The Z code generator incorrectly spills sub-integer types arguments (see issue #3525)
10:16:17 [2019-11-08T15:16:17.472Z] 29: Known Bug: Skipping test: UsingLoadParam/4
10:16:17 [2019-11-08T15:16:17.472Z] 29:     The Z code generator incorrectly spills sub-integer types arguments (see issue #3525)
10:16:17 [2019-11-08T15:16:17.472Z] 29: Known Bug: Skipping test: UsingLoadParam/5
10:16:17 [2019-11-08T15:16:17.472Z] 29:     The Z code generator incorrectly spills sub-integer types arguments (see issue #3525)
10:16:17 [2019-11-08T15:16:17.472Z] 29: Known Bug: Skipping test: UsingLoadParam/6
10:16:17 [2019-11-08T15:16:17.472Z] 29:     The Z code generator incorrectly spills sub-integer types arguments (see issue #3525)
10:16:17 [2019-11-08T15:16:17.472Z] 29: Known Bug: Skipping test: UsingLoadParam/7
10:16:17 [2019-11-08T15:16:17.472Z] 29:     The Z code generator incorrectly spills sub-integer types arguments (see issue #3525)
10:16:17 [2019-11-08T15:16:17.472Z] 29: Known Bug: Skipping test: UsingLoadParam/8
10:16:17 [2019-11-08T15:16:17.472Z] 29:     The Z code generator incorrectly spills sub-integer types arguments (see issue #3525)
10:16:17 [2019-11-08T15:16:17.472Z] 29: [----------] 18 tests from TypeConversionTest/UInt16ToInt64 (6 ms total)
10:16:17 [2019-11-08T15:16:17.472Z] 29: 
10:16:17 [2019-11-08T15:16:17.472Z] 29: [----------] 30 tests from TypeConversionTest/Int32ToInt64
10:16:17 [2019-11-08T15:16:17.472Z] 29: [----------] 30 tests from TypeConversionTest/Int32ToInt64 (17 ms total)
10:16:17 [2019-11-08T15:16:17.472Z] 29: 
10:16:17 [2019-11-08T15:16:17.472Z] 29: [----------] 38 tests from TypeConversionTest/UInt32ToInt64
10:16:17 [2019-11-08T15:16:17.472Z] 29: [----------] 38 tests from TypeConversionTest/UInt32ToInt64 (22 ms total)
10:16:17 [2019-11-08T15:16:17.472Z] 29: 
10:16:17 [2019-11-08T15:16:17.472Z] 29: [----------] 34 tests from TypeConversionTest/Int64ToInt32
10:16:17 [2019-11-08T15:16:17.472Z] 29: [----------] 34 tests from TypeConversionTest/Int64ToInt32 (20 ms total)
10:16:17 [2019-11-08T15:16:17.472Z] 29: 
10:16:17 [2019-11-08T15:16:17.472Z] 29: [----------] 30 tests from TypeConversionTest/Int32ToFloat
10:16:17 [2019-11-08T15:16:17.472Z] 29: [----------] 30 tests from TypeConversionTest/Int32ToFloat (18 ms total)
10:16:17 [2019-11-08T15:16:17.472Z] 29: 
10:16:17 [2019-11-08T15:16:17.472Z] 29: [----------] 34 tests from TypeConversionTest/Int64ToFloat
10:16:17 [2019-11-08T15:16:17.472Z] 29: [----------] 34 tests from TypeConversionTest/Int64ToFloat (26 ms total)
10:16:17 [2019-11-08T15:16:17.472Z] 29: 
10:16:17 [2019-11-08T15:16:17.472Z] 29: [----------] 30 tests from TypeConversionTest/Int32ToDouble
10:16:17 [2019-11-08T15:16:17.472Z] 29: [----------] 30 tests from TypeConversionTest/Int32ToDouble (23 ms total)
10:16:17 [2019-11-08T15:16:17.472Z] 29: 
10:16:17 [2019-11-08T15:16:17.472Z] 29: [----------] 34 tests from TypeConversionTest/Int64ToDouble
10:16:17 [2019-11-08T15:16:17.472Z] 29: [----------] 34 tests from TypeConversionTest/Int64ToDouble (22 ms total)
10:16:17 [2019-11-08T15:16:17.472Z] 29: 
10:16:17 [2019-11-08T15:16:17.472Z] 29: [----------] 20 tests from TypeConversionTest/FloatToInt32
10:16:17 [2019-11-08T15:16:17.472Z] 29: [----------] 20 tests from TypeConversionTest/FloatToInt32 (15 ms total)
10:16:17 [2019-11-08T15:16:17.472Z] 29: 
10:16:17 [2019-11-08T15:16:17.472Z] 29: [----------] 26 tests from TypeConversionTest/FloatToInt64
10:16:17 [2019-11-08T15:16:17.472Z] 29: [----------] 26 tests from TypeConversionTest/FloatToInt64 (16 ms total)
10:16:17 [2019-11-08T15:16:17.472Z] 29: 
10:16:17 [2019-11-08T15:16:17.472Z] 29: [----------] 20 tests from TypeConversionTest/DoubleToInt32
10:16:17 [2019-11-08T15:16:17.472Z] 29: [----------] 20 tests from TypeConversionTest/DoubleToInt32 (12 ms total)
10:16:17 [2019-11-08T15:16:17.472Z] 29: 
10:16:17 [2019-11-08T15:16:17.472Z] 29: [----------] 28 tests from TypeConversionTest/DoubleToInt64
10:16:17 [2019-11-08T15:16:17.472Z] 29: [----------] 28 tests from TypeConversionTest/DoubleToInt64 (24 ms total)
10:16:17 [2019-11-08T15:16:17.472Z] 29: 
10:16:17 [2019-11-08T15:16:17.472Z] 29: [----------] 30 tests from TypeConversionTest/FloatToDouble
10:16:17 [2019-11-08T15:16:17.472Z] 29: [----------] 30 tests from TypeConversionTest/FloatToDouble (21 ms total)
10:16:17 [2019-11-08T15:16:17.472Z] 29: 
10:16:17 [2019-11-08T15:16:17.472Z] 29: [----------] 32 tests from TypeConversionTest/DoubleToFloat
10:16:17 [2019-11-08T15:16:17.963Z] 29: [----------] 32 tests from TypeConversionTest/DoubleToFloat (21 ms total)
10:16:17 [2019-11-08T15:16:17.963Z] 29: 
10:16:17 [2019-11-08T15:16:17.963Z] 29: [----------] 33 tests from TypeConversionTest/FloatNormalizeNan
10:16:17 [2019-11-08T15:16:17.963Z] 29: Known Bug: Skipping test: UsingLoadIndirect/0
10:16:17 [2019-11-08T15:16:17.963Z] 29:     The Z code generator crashes when specifying the mustNormalizeNanValues flag (see issue #4381)
10:16:17 [2019-11-08T15:16:17.963Z] 29: Known Bug: Skipping test: UsingLoadIndirect/1
10:16:17 [2019-11-08T15:16:17.963Z] 29:     The Z code generator crashes when specifying the mustNormalizeNanValues flag (see issue #4381)
10:16:17 [2019-11-08T15:16:17.963Z] 29: Known Bug: Skipping test: UsingLoadIndirect/2
10:16:17 [2019-11-08T15:16:17.963Z] 29:     The Z code generator crashes when specifying the mustNormalizeNanValues flag (see issue #4381)
10:16:17 [2019-11-08T15:16:17.963Z] 29: Known Bug: Skipping test: UsingLoadIndirect/3
10:16:17 [2019-11-08T15:16:17.963Z] 29:     The Z code generator crashes when specifying the mustNormalizeNanValues flag (see issue #4381)
10:16:17 [2019-11-08T15:16:17.963Z] 29: Known Bug: Skipping test: UsingLoadIndirect/4
10:16:17 [2019-11-08T15:16:17.963Z] 29:     The Z code generator crashes when specifying the mustNormalizeNanValues flag (see issue #4381)
10:16:17 [2019-11-08T15:16:17.963Z] 29: Known Bug: Skipping test: UsingLoadIndirect/5
10:16:17 [2019-11-08T15:16:17.963Z] 29:     The Z code generator crashes when specifying the mustNormalizeNanValues flag (see issue #4381)
10:16:17 [2019-11-08T15:16:17.963Z] 29: Known Bug: Skipping test: UsingLoadIndirect/6
10:16:17 [2019-11-08T15:16:17.963Z] 29:     The Z code generator crashes when specifying the mustNormalizeNanValues flag (see issue #4381)
10:16:17 [2019-11-08T15:16:17.963Z] 29: Known Bug: Skipping test: UsingLoadIndirect/7
10:16:17 [2019-11-08T15:16:17.963Z] 29:     The Z code generator crashes when specifying the mustNormalizeNanValues flag (see issue #4381)
10:16:17 [2019-11-08T15:16:17.963Z] 29: Known Bug: Skipping test: UsingLoadIndirect/8
10:16:17 [2019-11-08T15:16:17.963Z] 29:     The Z code generator crashes when specifying the mustNormalizeNanValues flag (see issue #4381)
10:16:17 [2019-11-08T15:16:17.963Z] 29: Known Bug: Skipping test: UsingLoadIndirect/9
10:16:17 [2019-11-08T15:16:17.963Z] 29:     The Z code generator crashes when specifying the mustNormalizeNanValues flag (see issue #4381)
10:16:17 [2019-11-08T15:16:17.963Z] 29: Known Bug: Skipping test: UsingLoadIndirect/10
10:16:17 [2019-11-08T15:16:17.963Z] 29:     The Z code generator crashes when specifying the mustNormalizeNanValues flag (see issue #4381)
10:16:17 [2019-11-08T15:16:17.963Z] 29: Known Bug: Skipping test: UsingLoadParam/0
10:16:17 [2019-11-08T15:16:17.963Z] 29:     The Z code generator crashes when specifying the mustNormalizeNanValues flag (see issue #4381)
10:16:17 [2019-11-08T15:16:17.963Z] 29: Known Bug: Skipping test: UsingLoadParam/1
10:16:17 [2019-11-08T15:16:17.963Z] 29:     The Z code generator crashes when specifying the mustNormalizeNanValues flag (see issue #4381)
10:16:17 [2019-11-08T15:16:17.963Z] 29: Known Bug: Skipping test: UsingLoadParam/2
10:16:17 [2019-11-08T15:16:17.963Z] 29:     The Z code generator crashes when specifying the mustNormalizeNanValues flag (see issue #4381)
10:16:17 [2019-11-08T15:16:17.963Z] 29: Known Bug: Skipping test: UsingLoadParam/3
10:16:17 [2019-11-08T15:16:17.963Z] 29:     The Z code generator crashes when specifying the mustNormalizeNanValues flag (see issue #4381)
10:16:17 [2019-11-08T15:16:17.963Z] 29: Known Bug: Skipping test: UsingLoadParam/4
10:16:17 [2019-11-08T15:16:17.963Z] 29:     The Z code generator crashes when specifying the mustNormalizeNanValues flag (see issue #4381)
10:16:17 [2019-11-08T15:16:17.963Z] 29: Known Bug: Skipping test: UsingLoadParam/5
10:16:17 [2019-11-08T15:16:17.963Z] 29:     The Z code generator crashes when specifying the mustNormalizeNanValues flag (see issue #4381)
10:16:17 [2019-11-08T15:16:17.963Z] 29: Known Bug: Skipping test: UsingLoadParam/6
10:16:17 [2019-11-08T15:16:17.963Z] 29:     The Z code generator crashes when specifying the mustNormalizeNanValues flag (see issue #4381)
10:16:17 [2019-11-08T15:16:17.963Z] 29: Known Bug: Skipping test: UsingLoadParam/7
10:16:17 [2019-11-08T15:16:17.963Z] 29:     The Z code generator crashes when specifying the mustNormalizeNanValues flag (see issue #4381)
10:16:17 [2019-11-08T15:16:17.963Z] 29: Known Bug: Skipping test: UsingLoadParam/8
10:16:17 [2019-11-08T15:16:17.963Z] 29:     The Z code generator crashes when specifying the mustNormalizeNanValues flag (see issue #4381)
10:16:17 [2019-11-08T15:16:17.963Z] 29: Known Bug: Skipping test: UsingLoadParam/9
10:16:17 [2019-11-08T15:16:17.963Z] 29:     The Z code generator crashes when specifying the mustNormalizeNanValues flag (see issue #4381)
10:16:17 [2019-11-08T15:16:17.963Z] 29: Known Bug: Skipping test: UsingLoadParam/10
10:16:17 [2019-11-08T15:16:17.963Z] 29:     The Z code generator crashes when specifying the mustNormalizeNanValues flag (see issue #4381)
10:16:17 [2019-11-08T15:16:17.963Z] 29: Known Bug: Skipping test: UsingLoadConst/0
10:16:17 [2019-11-08T15:16:17.963Z] 29:     The Z code generator crashes when specifying the mustNormalizeNanValues flag (see issue #4381)
10:16:17 [2019-11-08T15:16:17.963Z] 29: Known Bug: Skipping test: UsingLoadConst/1
10:16:17 [2019-11-08T15:16:17.963Z] 29:     The Z code generator crashes when specifying the mustNormalizeNanValues flag (see issue #4381)
10:16:17 [2019-11-08T15:16:17.963Z] 29: Known Bug: Skipping test: UsingLoadConst/2
10:16:17 [2019-11-08T15:16:17.963Z] 29:     The Z code generator crashes when specifying the mustNormalizeNanValues flag (see issue #4381)
10:16:17 [2019-11-08T15:16:17.963Z] 29: Known Bug: Skipping test: UsingLoadConst/3
10:16:17 [2019-11-08T15:16:17.963Z] 29:     The Z code generator crashes when specifying the mustNormalizeNanValues flag (see issue #4381)
10:16:17 [2019-11-08T15:16:17.963Z] 29: Known Bug: Skipping test: UsingLoadConst/4
10:16:17 [2019-11-08T15:16:17.963Z] 29:     The Z code generator crashes when specifying the mustNormalizeNanValues flag (see issue #4381)
10:16:17 [2019-11-08T15:16:17.963Z] 29: Known Bug: Skipping test: UsingLoadConst/5
10:16:17 [2019-11-08T15:16:17.963Z] 29:     The Z code generator crashes when specifying the mustNormalizeNanValues flag (see issue #4381)
10:16:17 [2019-11-08T15:16:17.963Z] 29: Known Bug: Skipping test: UsingLoadConst/6
10:16:17 [2019-11-08T15:16:17.964Z] 29:     The Z code generator crashes when specifying the mustNormalizeNanValues flag (see issue #4381)
10:16:17 [2019-11-08T15:16:17.964Z] 29: Known Bug: Skipping test: UsingLoadConst/7
10:16:17 [2019-11-08T15:16:17.964Z] 29:     The Z code generator crashes when specifying the mustNormalizeNanValues flag (see issue #4381)
10:16:17 [2019-11-08T15:16:17.964Z] 29: Known Bug: Skipping test: UsingLoadConst/8
10:16:17 [2019-11-08T15:16:17.964Z] 29:     The Z code generator crashes when specifying the mustNormalizeNanValues flag (see issue #4381)
10:16:17 [2019-11-08T15:16:17.964Z] 29: Known Bug: Skipping test: UsingLoadConst/9
10:16:17 [2019-11-08T15:16:17.964Z] 29:     The Z code generator crashes when specifying the mustNormalizeNanValues flag (see issue #4381)
10:16:17 [2019-11-08T15:16:17.964Z] 29: Known Bug: Skipping test: UsingLoadConst/10
10:16:17 [2019-11-08T15:16:17.964Z] 29:     The Z code generator crashes when specifying the mustNormalizeNanValues flag (see issue #4381)
10:16:17 [2019-11-08T15:16:17.964Z] 29: [----------] 33 tests from TypeConversionTest/FloatNormalizeNan (3 ms total)
10:16:17 [2019-11-08T15:16:17.964Z] 29: 
10:16:17 [2019-11-08T15:16:17.964Z] 29: [----------] 33 tests from TypeConversionTest/DoubleNormalizeNan
10:16:17 [2019-11-08T15:16:17.964Z] 29: Known Bug: Skipping test: UsingLoadIndirect/0
10:16:17 [2019-11-08T15:16:17.964Z] 29:     The Z code generator crashes when specifying the mustNormalizeNanValues flag (see issue #4381)
10:16:17 [2019-11-08T15:16:17.964Z] 29: Known Bug: Skipping test: UsingLoadIndirect/1
10:16:17 [2019-11-08T15:16:17.964Z] 29:     The Z code generator crashes when specifying the mustNormalizeNanValues flag (see issue #4381)
10:16:17 [2019-11-08T15:16:17.964Z] 29: Known Bug: Skipping test: UsingLoadIndirect/2
10:16:17 [2019-11-08T15:16:17.964Z] 29:     The Z code generator crashes when specifying the mustNormalizeNanValues flag (see issue #4381)
10:16:17 [2019-11-08T15:16:17.964Z] 29: Known Bug: Skipping test: UsingLoadIndirect/3
10:16:17 [2019-11-08T15:16:17.964Z] 29:     The Z code generator crashes when specifying the mustNormalizeNanValues flag (see issue #4381)
10:16:17 [2019-11-08T15:16:17.964Z] 29: Known Bug: Skipping test: UsingLoadIndirect/4
10:16:17 [2019-11-08T15:16:17.964Z] 29:     The Z code generator crashes when specifying the mustNormalizeNanValues flag (see issue #4381)
10:16:17 [2019-11-08T15:16:17.964Z] 29: Known Bug: Skipping test: UsingLoadIndirect/5
10:16:17 [2019-11-08T15:16:17.964Z] 29:     The Z code generator crashes when specifying the mustNormalizeNanValues flag (see issue #4381)
10:16:17 [2019-11-08T15:16:17.964Z] 29: Known Bug: Skipping test: UsingLoadIndirect/6
10:16:17 [2019-11-08T15:16:17.964Z] 29:     The Z code generator crashes when specifying the mustNormalizeNanValues flag (see issue #4381)
10:16:17 [2019-11-08T15:16:17.964Z] 29: Known Bug: Skipping test: UsingLoadIndirect/7
10:16:17 [2019-11-08T15:16:17.964Z] 29:     The Z code generator crashes when specifying the mustNormalizeNanValues flag (see issue #4381)
10:16:17 [2019-11-08T15:16:17.964Z] 29: Known Bug: Skipping test: UsingLoadIndirect/8
10:16:17 [2019-11-08T15:16:17.964Z] 29:     The Z code generator crashes when specifying the mustNormalizeNanValues flag (see issue #4381)
10:16:17 [2019-11-08T15:16:17.964Z] 29: Known Bug: Skipping test: UsingLoadIndirect/9
10:16:17 [2019-11-08T15:16:17.964Z] 29:     The Z code generator crashes when specifying the mustNormalizeNanValues flag (see issue #4381)
10:16:17 [2019-11-08T15:16:17.964Z] 29: Known Bug: Skipping test: UsingLoadIndirect/10
10:16:17 [2019-11-08T15:16:17.964Z] 29:     The Z code generator crashes when specifying the mustNormalizeNanValues flag (see issue #4381)
10:16:17 [2019-11-08T15:16:17.964Z] 29: Known Bug: Skipping test: UsingLoadParam/0
10:16:17 [2019-11-08T15:16:17.964Z] 29:     The Z code generator crashes when specifying the mustNormalizeNanValues flag (see issue #4381)
10:16:17 [2019-11-08T15:16:17.964Z] 29: Known Bug: Skipping test: UsingLoadParam/1
10:16:17 [2019-11-08T15:16:17.964Z] 29:     The Z code generator crashes when specifying the mustNormalizeNanValues flag (see issue #4381)
10:16:17 [2019-11-08T15:16:17.964Z] 29: Known Bug: Skipping test: UsingLoadParam/2
10:16:17 [2019-11-08T15:16:17.964Z] 29:     The Z code generator crashes when specifying the mustNormalizeNanValues flag (see issue #4381)
10:16:17 [2019-11-08T15:16:17.964Z] 29: Known Bug: Skipping test: UsingLoadParam/3
10:16:17 [2019-11-08T15:16:17.964Z] 29:     The Z code generator crashes when specifying the mustNormalizeNanValues flag (see issue #4381)
10:16:17 [2019-11-08T15:16:17.964Z] 29: Known Bug: Skipping test: UsingLoadParam/4
10:16:17 [2019-11-08T15:16:17.964Z] 29:     The Z code generator crashes when specifying the mustNormalizeNanValues flag (see issue #4381)
10:16:17 [2019-11-08T15:16:17.964Z] 29: Known Bug: Skipping test: UsingLoadParam/5
10:16:17 [2019-11-08T15:16:17.964Z] 29:     The Z code generator crashes when specifying the mustNormalizeNanValues flag (see issue #4381)
10:16:17 [2019-11-08T15:16:17.964Z] 29: Known Bug: Skipping test: UsingLoadParam/6
10:16:17 [2019-11-08T15:16:17.964Z] 29:     The Z code generator crashes when specifying the mustNormalizeNanValues flag (see issue #4381)
10:16:17 [2019-11-08T15:16:17.964Z] 29: Known Bug: Skipping test: UsingLoadParam/7
10:16:17 [2019-11-08T15:16:17.964Z] 29:     The Z code generator crashes when specifying the mustNormalizeNanValues flag (see issue #4381)
10:16:17 [2019-11-08T15:16:17.964Z] 29: Known Bug: Skipping test: UsingLoadParam/8
10:16:17 [2019-11-08T15:16:17.964Z] 29:     The Z code generator crashes when specifying the mustNormalizeNanValues flag (see issue #4381)
10:16:17 [2019-11-08T15:16:17.964Z] 29: Known Bug: Skipping test: UsingLoadParam/9
10:16:17 [2019-11-08T15:16:17.964Z] 29:     The Z code generator crashes when specifying the mustNormalizeNanValues flag (see issue #4381)
10:16:17 [2019-11-08T15:16:17.964Z] 29: Known Bug: Skipping test: UsingLoadParam/10
10:16:17 [2019-11-08T15:16:17.964Z] 29:     The Z code generator crashes when specifying the mustNormalizeNanValues flag (see issue #4381)
10:16:17 [2019-11-08T15:16:17.964Z] 29: Known Bug: Skipping test: UsingLoadConst/0
10:16:17 [2019-11-08T15:16:17.964Z] 29:     The Z code generator crashes when specifying the mustNormalizeNanValues flag (see issue #4381)
10:16:17 [2019-11-08T15:16:17.964Z] 29: Known Bug: Skipping test: UsingLoadConst/1
10:16:17 [2019-11-08T15:16:17.964Z] 29:     The Z code generator crashes when specifying the mustNormalizeNanValues flag (see issue #4381)
10:16:17 [2019-11-08T15:16:17.964Z] 29: Known Bug: Skipping test: UsingLoadConst/2
10:16:17 [2019-11-08T15:16:17.964Z] 29:     The Z code generator crashes when specifying the mustNormalizeNanValues flag (see issue #4381)
10:16:17 [2019-11-08T15:16:17.964Z] 29: Known Bug: Skipping test: UsingLoadConst/3
10:16:17 [2019-11-08T15:16:17.964Z] 29:     The Z code generator crashes when specifying the mustNormalizeNanValues flag (see issue #4381)
10:16:17 [2019-11-08T15:16:17.964Z] 29: Known Bug: Skipping test: UsingLoadConst/4
10:16:17 [2019-11-08T15:16:17.964Z] 29:     The Z code generator crashes when specifying the mustNormalizeNanValues flag (see issue #4381)
10:16:17 [2019-11-08T15:16:17.964Z] 29: Known Bug: Skipping test: UsingLoadConst/5
10:16:17 [2019-11-08T15:16:17.964Z] 29:     The Z code generator crashes when specifying the mustNormalizeNanValues flag (see issue #4381)
10:16:17 [2019-11-08T15:16:17.964Z] 29: Known Bug: Skipping test: UsingLoadConst/6
10:16:17 [2019-11-08T15:16:17.964Z] 29:     The Z code generator crashes when specifying the mustNormalizeNanValues flag (see issue #4381)
10:16:17 [2019-11-08T15:16:17.964Z] 29: Known Bug: Skipping test: UsingLoadConst/7
10:16:17 [2019-11-08T15:16:17.964Z] 29:     The Z code generator crashes when specifying the mustNormalizeNanValues flag (see issue #4381)
10:16:17 [2019-11-08T15:16:17.964Z] 29: Known Bug: Skipping test: UsingLoadConst/8
10:16:17 [2019-11-08T15:16:17.964Z] 29:     The Z code generator crashes when specifying the mustNormalizeNanValues flag (see issue #4381)
10:16:17 [2019-11-08T15:16:17.964Z] 29: Known Bug: Skipping test: UsingLoadConst/9
10:16:17 [2019-11-08T15:16:17.964Z] 29:     The Z code generator crashes when specifying the mustNormalizeNanValues flag (see issue #4381)
10:16:17 [2019-11-08T15:16:17.964Z] 29: Known Bug: Skipping test: UsingLoadConst/10
10:16:17 [2019-11-08T15:16:17.964Z] 29:     The Z code generator crashes when specifying the mustNormalizeNanValues flag (see issue #4381)
10:16:17 [2019-11-08T15:16:17.964Z] 29: [----------] 33 tests from TypeConversionTest/DoubleNormalizeNan (2 ms total)
10:16:17 [2019-11-08T15:16:17.964Z] 29: 
10:16:17 [2019-11-08T15:16:17.964Z] 29: [----------] 28 tests from TernaryTest/Int32TernaryInt32CompareTest
10:16:17 [2019-11-08T15:16:17.964Z] 29: Missing Implementation: Skipping test: UsingLoadParam/0
10:16:17 [2019-11-08T15:16:17.964Z] 29:     The Z code generator implementation is missing currently (see issue #3796)
10:16:17 [2019-11-08T15:16:17.964Z] 29: Missing Implementation: Skipping test: UsingLoadParam/1
10:16:17 [2019-11-08T15:16:17.964Z] 29:     The Z code generator implementation is missing currently (see issue #3796)
10:16:17 [2019-11-08T15:16:17.964Z] 29: Missing Implementation: Skipping test: UsingLoadParam/2
10:16:17 [2019-11-08T15:16:17.964Z] 29:     The Z code generator implementation is missing currently (see issue #3796)
10:16:17 [2019-11-08T15:16:17.964Z] 29: Missing Implementation: Skipping test: UsingLoadParam/3
10:16:17 [2019-11-08T15:16:17.964Z] 29:     The Z code generator implementation is missing currently (see issue #3796)
10:16:17 [2019-11-08T15:16:17.964Z] 29: Missing Implementation: Skipping test: UsingLoadParam/4
10:16:17 [2019-11-08T15:16:17.964Z] 29:     The Z code generator implementation is missing currently (see issue #3796)
10:16:17 [2019-11-08T15:16:17.964Z] 29: Missing Implementation: Skipping test: UsingLoadParam/5
10:16:17 [2019-11-08T15:16:17.964Z] 29:     The Z code generator implementation is missing currently (see issue #3796)
10:16:17 [2019-11-08T15:16:17.964Z] 29: Missing Implementation: Skipping test: UsingLoadParam/6
10:16:17 [2019-11-08T15:16:17.964Z] 29:     The Z code generator implementation is missing currently (see issue #3796)
10:16:17 [2019-11-08T15:16:17.964Z] 29: Missing Implementation: Skipping test: UsingLoadParam/7
10:16:17 [2019-11-08T15:16:17.964Z] 29:     The Z code generator implementation is missing currently (see issue #3796)
10:16:17 [2019-11-08T15:16:17.964Z] 29: Missing Implementation: Skipping test: UsingLoadParam/8
10:16:17 [2019-11-08T15:16:17.964Z] 29:     The Z code generator implementation is missing currently (see issue #3796)
10:16:17 [2019-11-08T15:16:17.964Z] 29: Missing Implementation: Skipping test: UsingLoadParam/9
10:16:17 [2019-11-08T15:16:17.964Z] 29:     The Z code generator implementation is missing currently (see issue #3796)
10:16:17 [2019-11-08T15:16:17.964Z] 29: Missing Implementation: Skipping test: UsingLoadParam/10
10:16:17 [2019-11-08T15:16:17.964Z] 29:     The Z code generator implementation is missing currently (see issue #3796)
10:16:17 [2019-11-08T15:16:17.964Z] 29: Missing Implementation: Skipping test: UsingLoadParam/11
10:16:17 [2019-11-08T15:16:17.964Z] 29:     The Z code generator implementation is missing currently (see issue #3796)
10:16:17 [2019-11-08T15:16:17.964Z] 29: Missing Implementation: Skipping test: UsingLoadParam/12
10:16:17 [2019-11-08T15:16:17.964Z] 29:     The Z code generator implementation is missing currently (see issue #3796)
10:16:17 [2019-11-08T15:16:17.964Z] 29: Missing Implementation: Skipping test: UsingLoadParam/13
10:16:17 [2019-11-08T15:16:17.964Z] 29:     The Z code generator implementation is missing currently (see issue #3796)
10:16:17 [2019-11-08T15:16:17.964Z] 29: Missing Implementation: Skipping test: UsingConst/0
10:16:17 [2019-11-08T15:16:17.964Z] 29:     The Z code generator implementation is missing currently (see issue #3796)
10:16:17 [2019-11-08T15:16:17.964Z] 29: Missing Implementation: Skipping test: UsingConst/1
10:16:17 [2019-11-08T15:16:17.964Z] 29:     The Z code generator implementation is missing currently (see issue #3796)
10:16:17 [2019-11-08T15:16:17.964Z] 29: Missing Implementation: Skipping test: UsingConst/2
10:16:17 [2019-11-08T15:16:17.964Z] 29:     The Z code generator implementation is missing currently (see issue #3796)
10:16:17 [2019-11-08T15:16:17.964Z] 29: Missing Implementation: Skipping test: UsingConst/3
10:16:17 [2019-11-08T15:16:17.964Z] 29:     The Z code generator implementation is missing currently (see issue #3796)
10:16:17 [2019-11-08T15:16:17.964Z] 29: Missing Implementation: Skipping test: UsingConst/4
10:16:17 [2019-11-08T15:16:17.964Z] 29:     The Z code generator implementation is missing currently (see issue #3796)
10:16:17 [2019-11-08T15:16:17.964Z] 29: Missing Implementation: Skipping test: UsingConst/5
10:16:17 [2019-11-08T15:16:17.964Z] 29:     The Z code generator implementation is missing currently (see issue #3796)
10:16:17 [2019-11-08T15:16:17.964Z] 29: Missing Implementation: Skipping test: UsingConst/6
10:16:17 [2019-11-08T15:16:17.964Z] 29:     The Z code generator implementation is missing currently (see issue #3796)
10:16:17 [2019-11-08T15:16:17.964Z] 29: Missing Implementation: Skipping test: UsingConst/7
10:16:17 [2019-11-08T15:16:17.964Z] 29:     The Z code generator implementation is missing currently (see issue #3796)
10:16:17 [2019-11-08T15:16:17.964Z] 29: Missing Implementation: Skipping test: UsingConst/8
10:16:17 [2019-11-08T15:16:17.964Z] 29:     The Z code generator implementation is missing currently (see issue #3796)
10:16:17 [2019-11-08T15:16:17.964Z] 29: Missing Implementation: Skipping test: UsingConst/9
10:16:17 [2019-11-08T15:16:17.964Z] 29:     The Z code generator implementation is missing currently (see issue #3796)
10:16:17 [2019-11-08T15:16:17.964Z] 29: Missing Implementation: Skipping test: UsingConst/10
10:16:17 [2019-11-08T15:16:17.964Z] 29:     The Z code generator implementation is missing currently (see issue #3796)
10:16:17 [2019-11-08T15:16:17.964Z] 29: Missing Implementation: Skipping test: UsingConst/11
10:16:17 [2019-11-08T15:16:17.964Z] 29:     The Z code generator implementation is missing currently (see issue #3796)
10:16:17 [2019-11-08T15:16:17.964Z] 29: Missing Implementation: Skipping test: UsingConst/12
10:16:17 [2019-11-08T15:16:17.964Z] 29:     The Z code generator implementation is missing currently (see issue #3796)
10:16:17 [2019-11-08T15:16:17.964Z] 29: Missing Implementation: Skipping test: UsingConst/13
10:16:17 [2019-11-08T15:16:17.964Z] 29:     The Z code generator implementation is missing currently (see issue #3796)
10:16:17 [2019-11-08T15:16:17.964Z] 29: [----------] 28 tests from TernaryTest/Int32TernaryInt32CompareTest (2 ms total)
10:16:17 [2019-11-08T15:16:17.964Z] 29: 
10:16:17 [2019-11-08T15:16:17.964Z] 29: [----------] 28 tests from TernaryTest/Int64TernaryInt64CompareTest
10:16:17 [2019-11-08T15:16:17.964Z] 29: Missing Implementation: Skipping test: UsingLoadParam/0
10:16:17 [2019-11-08T15:16:17.964Z] 29:     The Z code generator implementation is missing currently (see issue #3796)
10:16:17 [2019-11-08T15:16:17.964Z] 29: Missing Implementation: Skipping test: UsingLoadParam/1
10:16:17 [2019-11-08T15:16:17.964Z] 29:     The Z code generator implementation is missing currently (see issue #3796)
10:16:17 [2019-11-08T15:16:17.964Z] 29: Missing Implementation: Skipping test: UsingLoadParam/2
10:16:17 [2019-11-08T15:16:17.964Z] 29:     The Z code generator implementation is missing currently (see issue #3796)
10:16:17 [2019-11-08T15:16:17.964Z] 29: Missing Implementation: Skipping test: UsingLoadParam/3
10:16:17 [2019-11-08T15:16:17.964Z] 29:     The Z code generator implementation is missing currently (see issue #3796)
10:16:17 [2019-11-08T15:16:17.964Z] 29: Missing Implementation: Skipping test: UsingLoadParam/4
10:16:17 [2019-11-08T15:16:17.964Z] 29:     The Z code generator implementation is missing currently (see issue #3796)
10:16:17 [2019-11-08T15:16:17.964Z] 29: Missing Implementation: Skipping test: UsingLoadParam/5
10:16:17 [2019-11-08T15:16:17.964Z] 29:     The Z code generator implementation is missing currently (see issue #3796)
10:16:17 [2019-11-08T15:16:17.964Z] 29: Missing Implementation: Skipping test: UsingLoadParam/6
10:16:17 [2019-11-08T15:16:17.964Z] 29:     The Z code generator implementation is missing currently (see issue #3796)
10:16:17 [2019-11-08T15:16:17.964Z] 29: Missing Implementation: Skipping test: UsingLoadParam/7
10:16:17 [2019-11-08T15:16:17.964Z] 29:     The Z code generator implementation is missing currently (see issue #3796)
10:16:17 [2019-11-08T15:16:17.964Z] 29: Missing Implementation: Skipping test: UsingLoadParam/8
10:16:17 [2019-11-08T15:16:17.964Z] 29:     The Z code generator implementation is missing currently (see issue #3796)
10:16:17 [2019-11-08T15:16:17.964Z] 29: Missing Implementation: Skipping test: UsingLoadParam/9
10:16:17 [2019-11-08T15:16:17.964Z] 29:     The Z code generator implementation is missing currently (see issue #3796)
10:16:17 [2019-11-08T15:16:17.964Z] 29: Missing Implementation: Skipping test: UsingLoadParam/10
10:16:17 [2019-11-08T15:16:17.964Z] 29:     The Z code generator implementation is missing currently (see issue #3796)
10:16:17 [2019-11-08T15:16:17.964Z] 29: Missing Implementation: Skipping test: UsingLoadParam/11
10:16:17 [2019-11-08T15:16:17.964Z] 29:     The Z code generator implementation is missing currently (see issue #3796)
10:16:17 [2019-11-08T15:16:17.964Z] 29: Missing Implementation: Skipping test: UsingLoadParam/12
10:16:17 [2019-11-08T15:16:17.964Z] 29:     The Z code generator implementation is missing currently (see issue #3796)
10:16:17 [2019-11-08T15:16:17.964Z] 29: Missing Implementation: Skipping test: UsingLoadParam/13
10:16:17 [2019-11-08T15:16:17.964Z] 29:     The Z code generator implementation is missing currently (see issue #3796)
10:16:17 [2019-11-08T15:16:17.964Z] 29: Missing Implementation: Skipping test: UsingConst/0
10:16:17 [2019-11-08T15:16:17.964Z] 29:     The Z code generator implementation is missing currently (see issue #3796)
10:16:17 [2019-11-08T15:16:17.964Z] 29: Missing Implementation: Skipping test: UsingConst/1
10:16:17 [2019-11-08T15:16:17.964Z] 29:     The Z code generator implementation is missing currently (see issue #3796)
10:16:17 [2019-11-08T15:16:17.964Z] 29: Missing Implementation: Skipping test: UsingConst/2
10:16:17 [2019-11-08T15:16:17.964Z] 29:     The Z code generator implementation is missing currently (see issue #3796)
10:16:17 [2019-11-08T15:16:17.964Z] 29: Missing Implementation: Skipping test: UsingConst/3
10:16:17 [2019-11-08T15:16:17.964Z] 29:     The Z code generator implementation is missing currently (see issue #3796)
10:16:17 [2019-11-08T15:16:17.964Z] 29: Missing Implementation: Skipping test: UsingConst/4
10:16:17 [2019-11-08T15:16:17.964Z] 29:     The Z code generator implementation is missing currently (see issue #3796)
10:16:17 [2019-11-08T15:16:17.964Z] 29: Missing Implementation: Skipping test: UsingConst/5
10:16:17 [2019-11-08T15:16:17.964Z] 29:     The Z code generator implementation is missing currently (see issue #3796)
10:16:17 [2019-11-08T15:16:17.964Z] 29: Missing Implementation: Skipping test: UsingConst/6
10:16:17 [2019-11-08T15:16:17.964Z] 29:     The Z code generator implementation is missing currently (see issue #3796)
10:16:17 [2019-11-08T15:16:17.964Z] 29: Missing Implementation: Skipping test: UsingConst/7
10:16:17 [2019-11-08T15:16:17.964Z] 29:     The Z code generator implementation is missing currently (see issue #3796)
10:16:17 [2019-11-08T15:16:17.964Z] 29: Missing Implementation: Skipping test: UsingConst/8
10:16:17 [2019-11-08T15:16:17.964Z] 29:     The Z code generator implementation is missing currently (see issue #3796)
10:16:17 [2019-11-08T15:16:17.964Z] 29: Missing Implementation: Skipping test: UsingConst/9
10:16:17 [2019-11-08T15:16:17.964Z] 29:     The Z code generator implementation is missing currently (see issue #3796)
10:16:17 [2019-11-08T15:16:17.964Z] 29: Missing Implementation: Skipping test: UsingConst/10
10:16:17 [2019-11-08T15:16:17.964Z] 29:     The Z code generator implementation is missing currently (see issue #3796)
10:16:17 [2019-11-08T15:16:17.964Z] 29: Missing Implementation: Skipping test: UsingConst/11
10:16:17 [2019-11-08T15:16:17.964Z] 29:     The Z code generator implementation is missing currently (see issue #3796)
10:16:17 [2019-11-08T15:16:17.964Z] 29: Missing Implementation: Skipping test: UsingConst/12
10:16:17 [2019-11-08T15:16:17.964Z] 29:     The Z code generator implementation is missing currently (see issue #3796)
10:16:17 [2019-11-08T15:16:17.964Z] 29: Missing Implementation: Skipping test: UsingConst/13
10:16:17 [2019-11-08T15:16:17.964Z] 29:     The Z code generator implementation is missing currently (see issue #3796)
10:16:17 [2019-11-08T15:16:17.964Z] 29: [----------] 28 tests from TernaryTest/Int64TernaryInt64CompareTest (3 ms total)
10:16:17 [2019-11-08T15:16:17.964Z] 29: 
10:16:17 [2019-11-08T15:16:17.964Z] 29: [----------] 28 tests from TernaryTest/Int64TernaryDoubleCompareTest
10:16:17 [2019-11-08T15:16:17.964Z] 29: Missing Implementation: Skipping test: UsingLoadParam/0
10:16:17 [2019-11-08T15:16:17.964Z] 29:     The Z code generator implementation is missing currently (see issue #3796)
10:16:17 [2019-11-08T15:16:17.964Z] 29: Missing Implementation: Skipping test: UsingLoadParam/1
10:16:17 [2019-11-08T15:16:17.964Z] 29:     The Z code generator implementation is missing currently (see issue #3796)
10:16:17 [2019-11-08T15:16:17.964Z] 29: Missing Implementation: Skipping test: UsingLoadParam/2
10:16:17 [2019-11-08T15:16:17.964Z] 29:     The Z code generator implementation is missing currently (see issue #3796)
10:16:17 [2019-11-08T15:16:17.964Z] 29: Missing Implementation: Skipping test: UsingLoadParam/3
10:16:17 [2019-11-08T15:16:17.964Z] 29:     The Z code generator implementation is missing currently (see issue #3796)
10:16:17 [2019-11-08T15:16:17.964Z] 29: Missing Implementation: Skipping test: UsingLoadParam/4
10:16:17 [2019-11-08T15:16:17.964Z] 29:     The Z code generator implementation is missing currently (see issue #3796)
10:16:17 [2019-11-08T15:16:17.964Z] 29: Missing Implementation: Skipping test: UsingLoadParam/5
10:16:17 [2019-11-08T15:16:17.964Z] 29:     The Z code generator implementation is missing currently (see issue #3796)
10:16:17 [2019-11-08T15:16:17.964Z] 29: Missing Implementation: Skipping test: UsingLoadParam/6
10:16:17 [2019-11-08T15:16:17.964Z] 29:     The Z code generator implementation is missing currently (see issue #3796)
10:16:17 [2019-11-08T15:16:17.964Z] 29: Missing Implementation: Skipping test: UsingLoadParam/7
10:16:17 [2019-11-08T15:16:17.964Z] 29:     The Z code generator implementation is missing currently (see issue #3796)
10:16:17 [2019-11-08T15:16:17.964Z] 29: Missing Implementation: Skipping test: UsingLoadParam/8
10:16:17 [2019-11-08T15:16:17.964Z] 29:     The Z code generator implementation is missing currently (see issue #3796)
10:16:17 [2019-11-08T15:16:17.964Z] 29: Missing Implementation: Skipping test: UsingLoadParam/9
10:16:17 [2019-11-08T15:16:17.964Z] 29:     The Z code generator implementation is missing currently (see issue #3796)
10:16:17 [2019-11-08T15:16:17.964Z] 29: Missing Implementation: Skipping test: UsingLoadParam/10
10:16:17 [2019-11-08T15:16:17.964Z] 29:     The Z code generator implementation is missing currently (see issue #3796)
10:16:17 [2019-11-08T15:16:17.964Z] 29: Missing Implementation: Skipping test: UsingLoadParam/11
10:16:17 [2019-11-08T15:16:17.964Z] 29:     The Z code generator implementation is missing currently (see issue #3796)
10:16:17 [2019-11-08T15:16:17.964Z] 29: Missing Implementation: Skipping test: UsingLoadParam/12
10:16:17 [2019-11-08T15:16:17.964Z] 29:     The Z code generator implementation is missing currently (see issue #3796)
10:16:17 [2019-11-08T15:16:17.964Z] 29: Missing Implementation: Skipping test: UsingLoadParam/13
10:16:17 [2019-11-08T15:16:17.964Z] 29:     The Z code generator implementation is missing currently (see issue #3796)
10:16:17 [2019-11-08T15:16:17.964Z] 29: Missing Implementation: Skipping test: UsingConst/0
10:16:17 [2019-11-08T15:16:17.964Z] 29:     The Z code generator implementation is missing currently (see issue #3796)
10:16:17 [2019-11-08T15:16:17.964Z] 29: Missing Implementation: Skipping test: UsingConst/1
10:16:17 [2019-11-08T15:16:17.964Z] 29:     The Z code generator implementation is missing currently (see issue #3796)
10:16:17 [2019-11-08T15:16:17.964Z] 29: Missing Implementation: Skipping test: UsingConst/2
10:16:17 [2019-11-08T15:16:17.964Z] 29:     The Z code generator implementation is missing currently (see issue #3796)
10:16:17 [2019-11-08T15:16:17.964Z] 29: Missing Implementation: Skipping test: UsingConst/3
10:16:17 [2019-11-08T15:16:17.964Z] 29:     The Z code generator implementation is missing currently (see issue #3796)
10:16:17 [2019-11-08T15:16:17.964Z] 29: Missing Implementation: Skipping test: UsingConst/4
10:16:17 [2019-11-08T15:16:17.964Z] 29:     The Z code generator implementation is missing currently (see issue #3796)
10:16:17 [2019-11-08T15:16:17.964Z] 29: Missing Implementation: Skipping test: UsingConst/5
10:16:17 [2019-11-08T15:16:17.964Z] 29:     The Z code generator implementation is missing currently (see issue #3796)
10:16:17 [2019-11-08T15:16:17.964Z] 29: Missing Implementation: Skipping test: UsingConst/6
10:16:17 [2019-11-08T15:16:17.964Z] 29:     The Z code generator implementation is missing currently (see issue #3796)
10:16:17 [2019-11-08T15:16:17.964Z] 29: Missing Implementation: Skipping test: UsingConst/7
10:16:17 [2019-11-08T15:16:17.964Z] 29:     The Z code generator implementation is missing currently (see issue #3796)
10:16:17 [2019-11-08T15:16:17.964Z] 29: Missing Implementation: Skipping test: UsingConst/8
10:16:17 [2019-11-08T15:16:17.964Z] 29:     The Z code generator implementation is missing currently (see issue #3796)
10:16:17 [2019-11-08T15:16:17.964Z] 29: Missing Implementation: Skipping test: UsingConst/9
10:16:17 [2019-11-08T15:16:17.964Z] 29:     The Z code generator implementation is missing currently (see issue #3796)
10:16:17 [2019-11-08T15:16:17.964Z] 29: Missing Implementation: Skipping test: UsingConst/10
10:16:17 [2019-11-08T15:16:17.964Z] 29:     The Z code generator implementation is missing currently (see issue #3796)
10:16:17 [2019-11-08T15:16:17.964Z] 29: Missing Implementation: Skipping test: UsingConst/11
10:16:17 [2019-11-08T15:16:17.964Z] 29:     The Z code generator implementation is missing currently (see issue #3796)
10:16:17 [2019-11-08T15:16:17.964Z] 29: Missing Implementation: Skipping test: UsingConst/12
10:16:17 [2019-11-08T15:16:17.964Z] 29:     The Z code generator implementation is missing currently (see issue #3796)
10:16:17 [2019-11-08T15:16:17.964Z] 29: Missing Implementation: Skipping test: UsingConst/13
10:16:17 [2019-11-08T15:16:17.964Z] 29:     The Z code generator implementation is missing currently (see issue #3796)
10:16:17 [2019-11-08T15:16:17.965Z] 29: [----------] 28 tests from TernaryTest/Int64TernaryDoubleCompareTest (3 ms total)
10:16:17 [2019-11-08T15:16:17.965Z] 29: 
10:16:17 [2019-11-08T15:16:17.965Z] 29: [----------] 28 tests from TernaryTest/Int32TernaryDoubleCompareTest
10:16:17 [2019-11-08T15:16:17.965Z] 29: Missing Implementation: Skipping test: UsingLoadParam/0
10:16:17 [2019-11-08T15:16:17.965Z] 29:     The Z code generator implementation is missing currently (see issue #3796)
10:16:17 [2019-11-08T15:16:17.965Z] 29: Missing Implementation: Skipping test: UsingLoadParam/1
10:16:17 [2019-11-08T15:16:17.965Z] 29:     The Z code generator implementation is missing currently (see issue #3796)
10:16:17 [2019-11-08T15:16:17.965Z] 29: Missing Implementation: Skipping test: UsingLoadParam/2
10:16:17 [2019-11-08T15:16:17.965Z] 29:     The Z code generator implementation is missing currently (see issue #3796)
10:16:17 [2019-11-08T15:16:17.965Z] 29: Missing Implementation: Skipping test: UsingLoadParam/3
10:16:17 [2019-11-08T15:16:17.965Z] 29:     The Z code generator implementation is missing currently (see issue #3796)
10:16:17 [2019-11-08T15:16:17.965Z] 29: Missing Implementation: Skipping test: UsingLoadParam/4
10:16:17 [2019-11-08T15:16:17.965Z] 29:     The Z code generator implementation is missing currently (see issue #3796)
10:16:17 [2019-11-08T15:16:17.965Z] 29: Missing Implementation: Skipping test: UsingLoadParam/5
10:16:17 [2019-11-08T15:16:17.965Z] 29:     The Z code generator implementation is missing currently (see issue #3796)
10:16:17 [2019-11-08T15:16:17.965Z] 29: Missing Implementation: Skipping test: UsingLoadParam/6
10:16:17 [2019-11-08T15:16:17.965Z] 29:     The Z code generator implementation is missing currently (see issue #3796)
10:16:17 [2019-11-08T15:16:17.965Z] 29: Missing Implementation: Skipping test: UsingLoadParam/7
10:16:17 [2019-11-08T15:16:17.965Z] 29:     The Z code generator implementation is missing currently (see issue #3796)
10:16:17 [2019-11-08T15:16:17.965Z] 29: Missing Implementation: Skipping test: UsingLoadParam/8
10:16:17 [2019-11-08T15:16:17.965Z] 29:     The Z code generator implementation is missing currently (see issue #3796)
10:16:17 [2019-11-08T15:16:17.965Z] 29: Missing Implementation: Skipping test: UsingLoadParam/9
10:16:17 [2019-11-08T15:16:17.965Z] 29:     The Z code generator implementation is missing currently (see issue #3796)
10:16:17 [2019-11-08T15:16:17.965Z] 29: Missing Implementation: Skipping test: UsingLoadParam/10
10:16:17 [2019-11-08T15:16:17.965Z] 29:     The Z code generator implementation is missing currently (see issue #3796)
10:16:17 [2019-11-08T15:16:17.965Z] 29: Missing Implementation: Skipping test: UsingLoadParam/11
10:16:17 [2019-11-08T15:16:17.965Z] 29:     The Z code generator implementation is missing currently (see issue #3796)
10:16:17 [2019-11-08T15:16:17.965Z] 29: Missing Implementation: Skipping test: UsingLoadParam/12
10:16:17 [2019-11-08T15:16:17.965Z] 29:     The Z code generator implementation is missing currently (see issue #3796)
10:16:17 [2019-11-08T15:16:17.965Z] 29: Missing Implementation: Skipping test: UsingLoadParam/13
10:16:17 [2019-11-08T15:16:17.965Z] 29:     The Z code generator implementation is missing currently (see issue #3796)
10:16:17 [2019-11-08T15:16:17.965Z] 29: Missing Implementation: Skipping test: UsingConst/0
10:16:17 [2019-11-08T15:16:17.965Z] 29:     The Z code generator implementation is missing currently (see issue #3796)
10:16:17 [2019-11-08T15:16:17.965Z] 29: Missing Implementation: Skipping test: UsingConst/1
10:16:17 [2019-11-08T15:16:17.965Z] 29:     The Z code generator implementation is missing currently (see issue #3796)
10:16:17 [2019-11-08T15:16:17.965Z] 29: Missing Implementation: Skipping test: UsingConst/2
10:16:17 [2019-11-08T15:16:17.965Z] 29:     The Z code generator implementation is missing currently (see issue #3796)
10:16:17 [2019-11-08T15:16:17.965Z] 29: Missing Implementation: Skipping test: UsingConst/3
10:16:17 [2019-11-08T15:16:17.965Z] 29:     The Z code generator implementation is missing currently (see issue #3796)
10:16:17 [2019-11-08T15:16:17.965Z] 29: Missing Implementation: Skipping test: UsingConst/4
10:16:17 [2019-11-08T15:16:17.965Z] 29:     The Z code generator implementation is missing currently (see issue #3796)
10:16:17 [2019-11-08T15:16:17.965Z] 29: Missing Implementation: Skipping test: UsingConst/5
10:16:17 [2019-11-08T15:16:17.965Z] 29:     The Z code generator implementation is missing currently (see issue #3796)
10:16:17 [2019-11-08T15:16:17.965Z] 29: Missing Implementation: Skipping test: UsingConst/6
10:16:17 [2019-11-08T15:16:17.965Z] 29:     The Z code generator implementation is missing currently (see issue #3796)
10:16:17 [2019-11-08T15:16:17.965Z] 29: Missing Implementation: Skipping test: UsingConst/7
10:16:17 [2019-11-08T15:16:17.965Z] 29:     The Z code generator implementation is missing currently (see issue #3796)
10:16:17 [2019-11-08T15:16:17.965Z] 29: Missing Implementation: Skipping test: UsingConst/8
10:16:17 [2019-11-08T15:16:17.965Z] 29:     The Z code generator implementation is missing currently (see issue #3796)
10:16:17 [2019-11-08T15:16:17.965Z] 29: Missing Implementation: Skipping test: UsingConst/9
10:16:17 [2019-11-08T15:16:17.965Z] 29:     The Z code generator implementation is missing currently (see issue #3796)
10:16:17 [2019-11-08T15:16:17.965Z] 29: Missing Implementation: Skipping test: UsingConst/10
10:16:17 [2019-11-08T15:16:17.965Z] 29:     The Z code generator implementation is missing currently (see issue #3796)
10:16:17 [2019-11-08T15:16:17.965Z] 29: Missing Implementation: Skipping test: UsingConst/11
10:16:17 [2019-11-08T15:16:17.965Z] 29:     The Z code generator implementation is missing currently (see issue #3796)
10:16:17 [2019-11-08T15:16:17.965Z] 29: Missing Implementation: Skipping test: UsingConst/12
10:16:17 [2019-11-08T15:16:17.965Z] 29:     The Z code generator implementation is missing currently (see issue #3796)
10:16:17 [2019-11-08T15:16:17.965Z] 29: Missing Implementation: Skipping test: UsingConst/13
10:16:17 [2019-11-08T15:16:17.965Z] 29:     The Z code generator implementation is missing currently (see issue #3796)
10:16:17 [2019-11-08T15:16:17.965Z] 29: [----------] 28 tests from TernaryTest/Int32TernaryDoubleCompareTest (2 ms total)
10:16:17 [2019-11-08T15:16:17.965Z] 29: 
10:16:17 [2019-11-08T15:16:17.965Z] 29: [----------] 28 tests from TernaryTest/ShortTernaryDoubleCompareTest
10:16:17 [2019-11-08T15:16:17.965Z] 29: Missing Implementation: Skipping test: UsingLoadParam/0
10:16:17 [2019-11-08T15:16:17.965Z] 29:     The Z code generator implementation is missing currently (see issue #3796)
10:16:17 [2019-11-08T15:16:17.965Z] 29: Missing Implementation: Skipping test: UsingLoadParam/1
10:16:17 [2019-11-08T15:16:17.965Z] 29:     The Z code generator implementation is missing currently (see issue #3796)
10:16:17 [2019-11-08T15:16:17.965Z] 29: Missing Implementation: Skipping test: UsingLoadParam/2
10:16:17 [2019-11-08T15:16:17.965Z] 29:     The Z code generator implementation is missing currently (see issue #3796)
10:16:17 [2019-11-08T15:16:17.965Z] 29: Missing Implementation: Skipping test: UsingLoadParam/3
10:16:17 [2019-11-08T15:16:17.965Z] 29:     The Z code generator implementation is missing currently (see issue #3796)
10:16:17 [2019-11-08T15:16:17.965Z] 29: Missing Implementation: Skipping test: UsingLoadParam/4
10:16:17 [2019-11-08T15:16:17.965Z] 29:     The Z code generator implementation is missing currently (see issue #3796)
10:16:17 [2019-11-08T15:16:17.965Z] 29: Missing Implementation: Skipping test: UsingLoadParam/5
10:16:17 [2019-11-08T15:16:17.965Z] 29:     The Z code generator implementation is missing currently (see issue #3796)
10:16:17 [2019-11-08T15:16:17.965Z] 29: Missing Implementation: Skipping test: UsingLoadParam/6
10:16:17 [2019-11-08T15:16:17.965Z] 29:     The Z code generator implementation is missing currently (see issue #3796)
10:16:17 [2019-11-08T15:16:17.965Z] 29: Missing Implementation: Skipping test: UsingLoadParam/7
10:16:17 [2019-11-08T15:16:17.965Z] 29:     The Z code generator implementation is missing currently (see issue #3796)
10:16:17 [2019-11-08T15:16:17.965Z] 29: Missing Implementation: Skipping test: UsingLoadParam/8
10:16:17 [2019-11-08T15:16:17.965Z] 29:     The Z code generator implementation is missing currently (see issue #3796)
10:16:17 [2019-11-08T15:16:17.965Z] 29: Missing Implementation: Skipping test: UsingLoadParam/9
10:16:17 [2019-11-08T15:16:17.965Z] 29:     The Z code generator implementation is missing currently (see issue #3796)
10:16:17 [2019-11-08T15:16:17.965Z] 29: Missing Implementation: Skipping test: UsingLoadParam/10
10:16:17 [2019-11-08T15:16:17.965Z] 29:     The Z code generator implementation is missing currently (see issue #3796)
10:16:17 [2019-11-08T15:16:17.965Z] 29: Missing Implementation: Skipping test: UsingLoadParam/11
10:16:17 [2019-11-08T15:16:17.965Z] 29:     The Z code generator implementation is missing currently (see issue #3796)
10:16:17 [2019-11-08T15:16:17.965Z] 29: Missing Implementation: Skipping test: UsingLoadParam/12
10:16:17 [2019-11-08T15:16:17.965Z] 29:     The Z code generator implementation is missing currently (see issue #3796)
10:16:17 [2019-11-08T15:16:17.965Z] 29: Missing Implementation: Skipping test: UsingLoadParam/13
10:16:17 [2019-11-08T15:16:17.965Z] 29:     The Z code generator implementation is missing currently (see issue #3796)
10:16:17 [2019-11-08T15:16:17.965Z] 29: Missing Implementation: Skipping test: UsingConst/0
10:16:17 [2019-11-08T15:16:17.965Z] 29:     The Z code generator implementation is missing currently (see issue #3796)
10:16:17 [2019-11-08T15:16:17.965Z] 29: Missing Implementation: Skipping test: UsingConst/1
10:16:17 [2019-11-08T15:16:17.965Z] 29:     The Z code generator implementation is missing currently (see issue #3796)
10:16:17 [2019-11-08T15:16:17.965Z] 29: Missing Implementation: Skipping test: UsingConst/2
10:16:17 [2019-11-08T15:16:17.965Z] 29:     The Z code generator implementation is missing currently (see issue #3796)
10:16:17 [2019-11-08T15:16:17.965Z] 29: Missing Implementation: Skipping test: UsingConst/3
10:16:17 [2019-11-08T15:16:17.965Z] 29:     The Z code generator implementation is missing currently (see issue #3796)
10:16:17 [2019-11-08T15:16:17.965Z] 29: Missing Implementation: Skipping test: UsingConst/4
10:16:17 [2019-11-08T15:16:17.965Z] 29:     The Z code generator implementation is missing currently (see issue #3796)
10:16:17 [2019-11-08T15:16:17.965Z] 29: Missing Implementation: Skipping test: UsingConst/5
10:16:17 [2019-11-08T15:16:17.965Z] 29:     The Z code generator implementation is missing currently (see issue #3796)
10:16:17 [2019-11-08T15:16:17.965Z] 29: Missing Implementation: Skipping test: UsingConst/6
10:16:17 [2019-11-08T15:16:17.965Z] 29:     The Z code generator implementation is missing currently (see issue #3796)
10:16:17 [2019-11-08T15:16:17.965Z] 29: Missing Implementation: Skipping test: UsingConst/7
10:16:17 [2019-11-08T15:16:17.965Z] 29:     The Z code generator implementation is missing currently (see issue #3796)
10:16:17 [2019-11-08T15:16:17.965Z] 29: Missing Implementation: Skipping test: UsingConst/8
10:16:17 [2019-11-08T15:16:17.965Z] 29:     The Z code generator implementation is missing currently (see issue #3796)
10:16:17 [2019-11-08T15:16:17.965Z] 29: Missing Implementation: Skipping test: UsingConst/9
10:16:17 [2019-11-08T15:16:17.965Z] 29:     The Z code generator implementation is missing currently (see issue #3796)
10:16:17 [2019-11-08T15:16:17.965Z] 29: Missing Implementation: Skipping test: UsingConst/10
10:16:17 [2019-11-08T15:16:17.965Z] 29:     The Z code generator implementation is missing currently (see issue #3796)
10:16:17 [2019-11-08T15:16:17.965Z] 29: Missing Implementation: Skipping test: UsingConst/11
10:16:17 [2019-11-08T15:16:17.965Z] 29:     The Z code generator implementation is missing currently (see issue #3796)
10:16:17 [2019-11-08T15:16:17.965Z] 29: Missing Implementation: Skipping test: UsingConst/12
10:16:17 [2019-11-08T15:16:17.965Z] 29:     The Z code generator implementation is missing currently (see issue #3796)
10:16:17 [2019-11-08T15:16:17.965Z] 29: Missing Implementation: Skipping test: UsingConst/13
10:16:17 [2019-11-08T15:16:17.965Z] 29:     The Z code generator implementation is missing currently (see issue #3796)
10:16:17 [2019-11-08T15:16:17.965Z] 29: [----------] 28 tests from TernaryTest/ShortTernaryDoubleCompareTest (5 ms total)
10:16:17 [2019-11-08T15:16:17.965Z] 29: 
10:16:17 [2019-11-08T15:16:17.965Z] 29: [==========] 83613 tests from 118 test cases ran. (61753 ms total)
10:16:17 [2019-11-08T15:16:17.965Z] 29: [  PASSED  ] 83613 tests.
10:16:17 [2019-11-08T15:16:17.965Z] 29: [  ALL TESTS PASSED  ] 
10:16:20 [2019-11-08T15:16:20.022Z] 29: 
10:16:20 [2019-11-08T15:16:20.022Z] 29/29 Test #29: comptest ..........................   Passed   64.99 sec
10:16:20 [2019-11-08T15:16:20.022Z] 
10:16:20 [2019-11-08T15:16:20.022Z] 97% tests passed, 1 tests failed out of 29
10:16:20 [2019-11-08T15:16:20.022Z] 
10:16:20 [2019-11-08T15:16:20.023Z] Total Test time (real) = 278.21 sec
10:16:20 [2019-11-08T15:16:20.023Z] 
10:16:20 [2019-11-08T15:16:20.023Z] The following tests FAILED:
10:16:20 [2019-11-08T15:16:20.023Z] 	 14 - porttest (Failed)
10:16:20 [2019-11-08T15:16:20.023Z] Errors while running CTest
[Pipeline] }
[Pipeline] // dir
[Pipeline] }
[Pipeline] // timestamps
[Pipeline] }
[Pipeline] // stage
[Pipeline] stage
[Pipeline] { (Declarative: Post Actions)
[Pipeline] echo
Cleanup workspace
[Pipeline] deleteDir
[Pipeline] }
[Pipeline] // stage
[Pipeline] }
[Pipeline] // withEnv
[Pipeline] }
[Pipeline] // withEnv
[Pipeline] }
[Pipeline] // node
[Pipeline] End of Pipeline
Setting status of 1c4c564b33b04a62c0388b53336141935350023c to FAILURE with url https://ci.eclipse.org/omr/job/PullRequest-linux_390-64/2087/ and message: 'Build finished. '
Using context: continuous-integration/eclipse-omr/pr/linux_390-64
ERROR: script returned exit code 8
Finished: FAILURE