FailedConsole Output

Skipping 702 KB.. Full Log
ullRequest-linux_390-64/compiler/z/codegen/RegisterDependency.hpp:25,
16:23:40 [2019-11-01T20:23:40.900Z]                  from /home/jenkins/jenkins-agent/workspace/PullRequest-linux_390-64/compiler/z/codegen/S390OutOfLineCodeSection.cpp:34:
16:23:40 [2019-11-01T20:23:40.900Z] /home/jenkins/jenkins-agent/workspace/PullRequest-linux_390-64/compiler/codegen/OMRRegisterDependency.hpp: In member function ‘TR::RegisterDependency* OMR::RegisterDependencyMap::getDependencyWithTarget(OMR::RealRegister::RegNum)’:
16:23:40 [2019-11-01T20:23:40.900Z] /home/jenkins/jenkins-agent/workspace/PullRequest-linux_390-64/compiler/codegen/OMRRegisterDependency.hpp:152:55: warning: comparison between ‘enum OMR::RealRegister::RegNum’ and ‘enum OMR::RealRegister::RegDep’ [-Wenum-compare]
16:23:40 [2019-11-01T20:23:40.900Z]        TR_ASSERT(regNum >= 0 && regNum < TR::RealRegister::NumRegisters, "Register number (%d) used as index but out of range!", regNum);
16:23:40 [2019-11-01T20:23:40.900Z]                                                        ^
16:23:40 [2019-11-01T20:23:40.900Z] In file included from /home/jenkins/jenkins-agent/workspace/PullRequest-linux_390-64/compiler/z/codegen/OMRRegisterDependency.hpp:36:0,
16:23:40 [2019-11-01T20:23:40.900Z]                  from /home/jenkins/jenkins-agent/workspace/PullRequest-linux_390-64/compiler/z/codegen/RegisterDependency.hpp:25,
16:23:40 [2019-11-01T20:23:40.900Z]                  from /home/jenkins/jenkins-agent/workspace/PullRequest-linux_390-64/compiler/z/codegen/S390OutOfLineCodeSection.cpp:34:
16:23:40 [2019-11-01T20:23:40.900Z] /home/jenkins/jenkins-agent/workspace/PullRequest-linux_390-64/compiler/codegen/OMRRegisterDependency.hpp:154:41: warning: comparison between ‘enum OMR::RealRegister::RegNum’ and ‘enum OMR::RealRegister::RegDep’ [-Wenum-compare]
16:23:40 [2019-11-01T20:23:40.900Z]        TR_ASSERT(regNum != TR::RealRegister::SpilledReg, "Multiple dependencies can map to 'SpilledReg', can't return just one");
16:23:40 [2019-11-01T20:23:40.900Z]                                          ^
16:23:40 [2019-11-01T20:23:40.900Z] In file included from /home/jenkins/jenkins-agent/workspace/PullRequest-linux_390-64/compiler/z/codegen/OMRRegisterDependency.hpp:36:0,
16:23:40 [2019-11-01T20:23:40.900Z]                  from /home/jenkins/jenkins-agent/workspace/PullRequest-linux_390-64/compiler/z/codegen/RegisterDependency.hpp:25,
16:23:40 [2019-11-01T20:23:40.900Z]                  from /home/jenkins/jenkins-agent/workspace/PullRequest-linux_390-64/compiler/z/codegen/S390OutOfLineCodeSection.cpp:34:
16:23:40 [2019-11-01T20:23:40.900Z] /home/jenkins/jenkins-agent/workspace/PullRequest-linux_390-64/compiler/codegen/OMRRegisterDependency.hpp: In member function ‘void OMR::RegisterDependencyMap::addDependency(OMR::RealRegister::RegNum, TR::RealRegister*, uint32_t)’:
16:23:40 [2019-11-01T20:23:40.900Z] /home/jenkins/jenkins-agent/workspace/PullRequest-linux_390-64/compiler/codegen/OMRRegisterDependency.hpp:194:76: warning: comparison between ‘enum OMR::RealRegister::RegNum’ and ‘enum OMR::RealRegister::RegDep’ [-Wenum-compare]
16:23:40 [2019-11-01T20:23:40.900Z]        if (regNum != TR::RealRegister::NoReg && regNum != TR::RealRegister::SpilledReg && regNum < TR::RealRegister::NumRegisters)
16:23:40 [2019-11-01T20:23:40.900Z]                                                                             ^
16:23:40 [2019-11-01T20:23:40.900Z] /home/jenkins/jenkins-agent/workspace/PullRequest-linux_390-64/compiler/codegen/OMRRegisterDependency.hpp:194:117: warning: comparison between ‘enum OMR::RealRegister::RegNum’ and ‘enum OMR::RealRegister::RegDep’ [-Wenum-compare]
16:23:40 [2019-11-01T20:23:40.900Z]        if (regNum != TR::RealRegister::NoReg && regNum != TR::RealRegister::SpilledReg && regNum < TR::RealRegister::NumRegisters)
16:23:40 [2019-11-01T20:23:40.900Z]                                                                                                                      ^
16:23:40 [2019-11-01T20:23:40.900Z] /home/jenkins/jenkins-agent/workspace/PullRequest-linux_390-64/compiler/codegen/OMRRegisterDependency.hpp:196:58: warning: comparison between ‘enum OMR::RealRegister::RegNum’ and ‘enum OMR::RealRegister::RegDep’ [-Wenum-compare]
16:23:40 [2019-11-01T20:23:40.900Z]           TR_ASSERT(regNum >= 0 && regNum < TR::RealRegister::NumRegisters, "Register number (%d) used as index but out of range!", regNum);
16:23:40 [2019-11-01T20:23:40.900Z]                                                           ^
16:23:40 [2019-11-01T20:23:40.900Z] In file included from /home/jenkins/jenkins-agent/workspace/PullRequest-linux_390-64/compiler/z/codegen/OMRRegisterDependency.hpp:36:0,
16:23:40 [2019-11-01T20:23:40.900Z]                  from /home/jenkins/jenkins-agent/workspace/PullRequest-linux_390-64/compiler/z/codegen/RegisterDependency.hpp:25,
16:23:40 [2019-11-01T20:23:40.900Z]                  from /home/jenkins/jenkins-agent/workspace/PullRequest-linux_390-64/compiler/z/codegen/S390OutOfLineCodeSection.cpp:34:
16:23:40 [2019-11-01T20:23:40.900Z] /home/jenkins/jenkins-agent/workspace/PullRequest-linux_390-64/compiler/codegen/OMRRegisterDependency.hpp:205:52: warning: comparison between ‘enum OMR::RealRegister::RegNum’ and ‘enum OMR::RealRegister::RegDep’ [-Wenum-compare]
16:23:40 [2019-11-01T20:23:40.900Z]           TR_ASSERT(arr >= 0 && arr < TR::RealRegister::NumRegisters, "Register number (%d) used as index but out of range!", arr);
16:23:40 [2019-11-01T20:23:40.900Z]                                                     ^
16:23:40 [2019-11-01T20:23:40.900Z] [ 90%] Building CXX object jitbuilder/CMakeFiles/jitbuilder.dir/__/compiler/z/codegen/S390Snippets.cpp.o
16:23:40 [2019-11-01T20:23:40.900Z] [ 90%] Building CXX object jitbuilder/CMakeFiles/jitbuilder.dir/__/compiler/z/codegen/TranslateEvaluator.cpp.o
16:23:40 [2019-11-01T20:23:40.900Z] In file included from /home/jenkins/jenkins-agent/workspace/PullRequest-linux_390-64/compiler/z/codegen/OMRRegisterDependency.hpp:36:0,
16:23:40 [2019-11-01T20:23:40.900Z]                  from /home/jenkins/jenkins-agent/workspace/PullRequest-linux_390-64/compiler/z/codegen/RegisterDependency.hpp:25,
16:23:40 [2019-11-01T20:23:40.900Z]                  from /home/jenkins/jenkins-agent/workspace/PullRequest-linux_390-64/compiler/z/codegen/OMRRegisterDependency.cpp:43:
16:23:40 [2019-11-01T20:23:40.900Z] /home/jenkins/jenkins-agent/workspace/PullRequest-linux_390-64/compiler/codegen/OMRRegisterDependency.hpp: In member function ‘TR::RegisterDependency* OMR::RegisterDependencyMap::getDependencyWithSourceAssigned(OMR::RealRegister::RegNum)’:
16:23:40 [2019-11-01T20:23:40.900Z] /home/jenkins/jenkins-agent/workspace/PullRequest-linux_390-64/compiler/codegen/OMRRegisterDependency.hpp:136:55: warning: comparison between ‘enum OMR::RealRegister::RegNum’ and ‘enum OMR::RealRegister::RegDep’ [-Wenum-compare]
16:23:40 [2019-11-01T20:23:40.900Z]        TR_ASSERT(regNum >= 0 && regNum < TR::RealRegister::NumRegisters, "Register number (%d) used as index but out of range!", regNum);
16:23:40 [2019-11-01T20:23:40.900Z]                                                        ^
16:23:40 [2019-11-01T20:23:40.900Z] In file included from /home/jenkins/jenkins-agent/workspace/PullRequest-linux_390-64/compiler/z/codegen/OMRRegisterDependency.hpp:36:0,
16:23:40 [2019-11-01T20:23:40.900Z]                  from /home/jenkins/jenkins-agent/workspace/PullRequest-linux_390-64/compiler/z/codegen/RegisterDependency.hpp:25,
16:23:40 [2019-11-01T20:23:40.900Z]                  from /home/jenkins/jenkins-agent/workspace/PullRequest-linux_390-64/compiler/z/codegen/OMRRegisterDependency.cpp:43:
16:23:40 [2019-11-01T20:23:40.900Z] /home/jenkins/jenkins-agent/workspace/PullRequest-linux_390-64/compiler/codegen/OMRRegisterDependency.hpp: In member function ‘TR::RegisterDependency* OMR::RegisterDependencyMap::getDependencyWithTarget(OMR::RealRegister::RegNum)’:
16:23:40 [2019-11-01T20:23:40.900Z] /home/jenkins/jenkins-agent/workspace/PullRequest-linux_390-64/compiler/codegen/OMRRegisterDependency.hpp:152:55: warning: comparison between ‘enum OMR::RealRegister::RegNum’ and ‘enum OMR::RealRegister::RegDep’ [-Wenum-compare]
16:23:40 [2019-11-01T20:23:40.900Z]        TR_ASSERT(regNum >= 0 && regNum < TR::RealRegister::NumRegisters, "Register number (%d) used as index but out of range!", regNum);
16:23:40 [2019-11-01T20:23:40.900Z]                                                        ^
16:23:40 [2019-11-01T20:23:40.900Z] In file included from /home/jenkins/jenkins-agent/workspace/PullRequest-linux_390-64/compiler/z/codegen/OMRRegisterDependency.hpp:36:0,
16:23:40 [2019-11-01T20:23:40.900Z]                  from /home/jenkins/jenkins-agent/workspace/PullRequest-linux_390-64/compiler/z/codegen/RegisterDependency.hpp:25,
16:23:40 [2019-11-01T20:23:40.900Z]                  from /home/jenkins/jenkins-agent/workspace/PullRequest-linux_390-64/compiler/z/codegen/OMRRegisterDependency.cpp:43:
16:23:40 [2019-11-01T20:23:40.900Z] /home/jenkins/jenkins-agent/workspace/PullRequest-linux_390-64/compiler/codegen/OMRRegisterDependency.hpp:154:41: warning: comparison between ‘enum OMR::RealRegister::RegNum’ and ‘enum OMR::RealRegister::RegDep’ [-Wenum-compare]
16:23:40 [2019-11-01T20:23:40.900Z]        TR_ASSERT(regNum != TR::RealRegister::SpilledReg, "Multiple dependencies can map to 'SpilledReg', can't return just one");
16:23:40 [2019-11-01T20:23:40.900Z]                                          ^
16:23:40 [2019-11-01T20:23:40.900Z] In file included from /home/jenkins/jenkins-agent/workspace/PullRequest-linux_390-64/compiler/z/codegen/OMRRegisterDependency.hpp:36:0,
16:23:40 [2019-11-01T20:23:40.900Z]                  from /home/jenkins/jenkins-agent/workspace/PullRequest-linux_390-64/compiler/z/codegen/RegisterDependency.hpp:25,
16:23:40 [2019-11-01T20:23:40.900Z]                  from /home/jenkins/jenkins-agent/workspace/PullRequest-linux_390-64/compiler/z/codegen/OMRRegisterDependency.cpp:43:
16:23:40 [2019-11-01T20:23:40.900Z] /home/jenkins/jenkins-agent/workspace/PullRequest-linux_390-64/compiler/codegen/OMRRegisterDependency.hpp: In member function ‘void OMR::RegisterDependencyMap::addDependency(OMR::RealRegister::RegNum, TR::RealRegister*, uint32_t)’:
16:23:40 [2019-11-01T20:23:40.900Z] /home/jenkins/jenkins-agent/workspace/PullRequest-linux_390-64/compiler/codegen/OMRRegisterDependency.hpp:194:76: warning: comparison between ‘enum OMR::RealRegister::RegNum’ and ‘enum OMR::RealRegister::RegDep’ [-Wenum-compare]
16:23:40 [2019-11-01T20:23:40.900Z]        if (regNum != TR::RealRegister::NoReg && regNum != TR::RealRegister::SpilledReg && regNum < TR::RealRegister::NumRegisters)
16:23:40 [2019-11-01T20:23:40.900Z]                                                                             ^
16:23:40 [2019-11-01T20:23:40.900Z] /home/jenkins/jenkins-agent/workspace/PullRequest-linux_390-64/compiler/codegen/OMRRegisterDependency.hpp:194:117: warning: comparison between ‘enum OMR::RealRegister::RegNum’ and ‘enum OMR::RealRegister::RegDep’ [-Wenum-compare]
16:23:40 [2019-11-01T20:23:40.900Z]        if (regNum != TR::RealRegister::NoReg && regNum != TR::RealRegister::SpilledReg && regNum < TR::RealRegister::NumRegisters)
16:23:40 [2019-11-01T20:23:40.900Z]                                                                                                                      ^
16:23:40 [2019-11-01T20:23:40.900Z] /home/jenkins/jenkins-agent/workspace/PullRequest-linux_390-64/compiler/codegen/OMRRegisterDependency.hpp:196:58: warning: comparison between ‘enum OMR::RealRegister::RegNum’ and ‘enum OMR::RealRegister::RegDep’ [-Wenum-compare]
16:23:40 [2019-11-01T20:23:40.900Z]           TR_ASSERT(regNum >= 0 && regNum < TR::RealRegister::NumRegisters, "Register number (%d) used as index but out of range!", regNum);
16:23:40 [2019-11-01T20:23:40.900Z]                                                           ^
16:23:40 [2019-11-01T20:23:40.900Z] In file included from /home/jenkins/jenkins-agent/workspace/PullRequest-linux_390-64/compiler/z/codegen/OMRRegisterDependency.hpp:36:0,
16:23:40 [2019-11-01T20:23:40.900Z]                  from /home/jenkins/jenkins-agent/workspace/PullRequest-linux_390-64/compiler/z/codegen/RegisterDependency.hpp:25,
16:23:40 [2019-11-01T20:23:40.900Z]                  from /home/jenkins/jenkins-agent/workspace/PullRequest-linux_390-64/compiler/z/codegen/OMRRegisterDependency.cpp:43:
16:23:40 [2019-11-01T20:23:40.900Z] /home/jenkins/jenkins-agent/workspace/PullRequest-linux_390-64/compiler/codegen/OMRRegisterDependency.hpp:205:52: warning: comparison between ‘enum OMR::RealRegister::RegNum’ and ‘enum OMR::RealRegister::RegDep’ [-Wenum-compare]
16:23:40 [2019-11-01T20:23:40.900Z]           TR_ASSERT(arr >= 0 && arr < TR::RealRegister::NumRegisters, "Register number (%d) used as index but out of range!", arr);
16:23:40 [2019-11-01T20:23:40.900Z]                                                     ^
16:23:40 [2019-11-01T20:23:40.900Z] /home/jenkins/jenkins-agent/workspace/PullRequest-linux_390-64/compiler/z/codegen/OMRRegisterDependency.cpp: In member function ‘bool OMR::Z::RegisterDependencyConditions::mayDefineRegister(TR::Register*)’:
16:23:40 [2019-11-01T20:23:40.900Z] /home/jenkins/jenkins-agent/workspace/PullRequest-linux_390-64/compiler/z/codegen/OMRRegisterDependency.cpp:556:93: warning: comparison between ‘enum OMR::RealRegister::RegNum’ and ‘enum OMR::RealRegister::RegDep’ [-Wenum-compare]
16:23:40 [2019-11-01T20:23:40.900Z]            _postConditions->getRegisterDependency(j)->getRealRegister() == TR::RealRegister::MayDefine)
16:23:40 [2019-11-01T20:23:40.900Z]                                                                                              ^
16:23:40 [2019-11-01T20:23:40.900Z] /home/jenkins/jenkins-agent/workspace/PullRequest-linux_390-64/compiler/z/codegen/OMRRegisterDependency.cpp: In member function ‘void TR_S390RegisterDependencyGroup::assignRegisters(TR::Instruction*, TR_RegisterKinds, uint32_t, TR::CodeGenerator*)’:
16:23:40 [2019-11-01T20:23:40.900Z] /home/jenkins/jenkins-agent/workspace/PullRequest-linux_390-64/compiler/z/codegen/OMRRegisterDependency.cpp:668:51: warning: comparison between ‘enum OMR::RealRegister::RegNum’ and ‘enum OMR::RealRegister::RegDep’ [-Wenum-compare]
16:23:40 [2019-11-01T20:23:40.900Z]           if (dependentRegNum == TR::RealRegister::SpilledReg && !_dependencies[i].getRegister()->getRealRegister())
16:23:40 [2019-11-01T20:23:40.900Z]                                                    ^
16:23:40 [2019-11-01T20:23:40.900Z] /home/jenkins/jenkins-agent/workspace/PullRequest-linux_390-64/compiler/z/codegen/OMRRegisterDependency.cpp:759:48: warning: comparison between ‘enum OMR::RealRegister::RegNum’ and ‘enum OMR::RealRegister::RegDep’ [-Wenum-compare]
16:23:40 [2019-11-01T20:23:40.900Z]        if (dependentRegNum != TR::RealRegister::SpilledReg &&
16:23:40 [2019-11-01T20:23:40.900Z]                                                 ^
16:23:40 [2019-11-01T20:23:40.900Z] /home/jenkins/jenkins-agent/workspace/PullRequest-linux_390-64/compiler/z/codegen/OMRRegisterDependency.cpp:760:48: warning: comparison between ‘enum OMR::RealRegister::RegNum’ and ‘enum OMR::RealRegister::RegDep’ [-Wenum-compare]
16:23:40 [2019-11-01T20:23:40.900Z]            dependentRegNum != TR::RealRegister::KillVolHighRegs &&
16:23:40 [2019-11-01T20:23:40.900Z]                                                 ^
16:23:40 [2019-11-01T20:23:40.900Z] /home/jenkins/jenkins-agent/workspace/PullRequest-linux_390-64/compiler/z/codegen/OMRRegisterDependency.cpp:862:68: warning: comparison between ‘enum OMR::RealRegister::RegNum’ and ‘enum OMR::RealRegister::RegDep’ [-Wenum-compare]
16:23:40 [2019-11-01T20:23:40.900Z]        if ( _dependencies[i].getRealRegister() == TR::RealRegister::KillVolHighRegs)
16:23:40 [2019-11-01T20:23:40.900Z]                                                                     ^
16:23:40 [2019-11-01T20:23:40.900Z] /home/jenkins/jenkins-agent/workspace/PullRequest-linux_390-64/compiler/z/codegen/OMRRegisterDependency.cpp:906:48: warning: comparison between ‘enum OMR::RealRegister::RegNum’ and ‘enum OMR::RealRegister::RegDep’ [-Wenum-compare]
16:23:40 [2019-11-01T20:23:40.900Z]        if (dependentRegNum == TR::RealRegister::EvenOddPair
16:23:40 [2019-11-01T20:23:40.900Z]                                                 ^
16:23:40 [2019-11-01T20:23:40.900Z] /home/jenkins/jenkins-agent/workspace/PullRequest-linux_390-64/compiler/z/codegen/OMRRegisterDependency.cpp:907:51: warning: comparison between ‘enum OMR::RealRegister::RegNum’ and ‘enum OMR::RealRegister::RegDep’ [-Wenum-compare]
16:23:40 [2019-11-01T20:23:40.900Z]            || dependentRegNum == TR::RealRegister::FPPair)
16:23:40 [2019-11-01T20:23:40.901Z]                                                    ^
16:23:40 [2019-11-01T20:23:40.901Z] /home/jenkins/jenkins-agent/workspace/PullRequest-linux_390-64/compiler/z/codegen/OMRRegisterDependency.cpp:963:75: warning: comparison between ‘enum OMR::RealRegister::RegNum’ and ‘enum OMR::RealRegister::RegDep’ [-Wenum-compare]
16:23:40 [2019-11-01T20:23:40.901Z]              if (((_dependencies[j].getRealRegister() == TR::RealRegister::LegalEvenOfPair
16:23:40 [2019-11-01T20:23:40.901Z]                                                                            ^
16:23:40 [2019-11-01T20:23:40.901Z] /home/jenkins/jenkins-agent/workspace/PullRequest-linux_390-64/compiler/z/codegen/OMRRegisterDependency.cpp:964:77: warning: comparison between ‘enum OMR::RealRegister::RegNum’ and ‘enum OMR::RealRegister::RegDep’ [-Wenum-compare]
16:23:40 [2019-11-01T20:23:40.901Z]                   || _dependencies[j].getRealRegister() == TR::RealRegister::LegalFirstOfFPPair) &&
16:23:40 [2019-11-01T20:23:40.901Z]                                                                              ^
16:23:40 [2019-11-01T20:23:40.901Z] /home/jenkins/jenkins-agent/workspace/PullRequest-linux_390-64/compiler/z/codegen/OMRRegisterDependency.cpp:966:75: warning: comparison between ‘enum OMR::RealRegister::RegNum’ and ‘enum OMR::RealRegister::RegDep’ [-Wenum-compare]
16:23:40 [2019-11-01T20:23:40.901Z]                  ((_dependencies[j].getRealRegister() == TR::RealRegister::LegalOddOfPair
16:23:40 [2019-11-01T20:23:40.901Z]                                                                            ^
16:23:40 [2019-11-01T20:23:40.901Z] /home/jenkins/jenkins-agent/workspace/PullRequest-linux_390-64/compiler/z/codegen/OMRRegisterDependency.cpp:967:77: warning: comparison between ‘enum OMR::RealRegister::RegNum’ and ‘enum OMR::RealRegister::RegDep’ [-Wenum-compare]
16:23:40 [2019-11-01T20:23:40.901Z]                   || _dependencies[j].getRealRegister() == TR::RealRegister::LegalSecondOfFPPair)  &&
16:23:40 [2019-11-01T20:23:40.901Z]                                                                              ^
16:23:40 [2019-11-01T20:23:40.901Z] /home/jenkins/jenkins-agent/workspace/PullRequest-linux_390-64/compiler/z/codegen/OMRRegisterDependency.cpp:974:74: warning: comparison between ‘enum OMR::RealRegister::RegNum’ and ‘enum OMR::RealRegister::RegDep’ [-Wenum-compare]
16:23:40 [2019-11-01T20:23:40.901Z]              if ((_dependencies[j].getRealRegister() == TR::RealRegister::LegalEvenOfPair
16:23:40 [2019-11-01T20:23:40.901Z]                                                                           ^
16:23:40 [2019-11-01T20:23:40.901Z] /home/jenkins/jenkins-agent/workspace/PullRequest-linux_390-64/compiler/z/codegen/OMRRegisterDependency.cpp:975:76: warning: comparison between ‘enum OMR::RealRegister::RegNum’ and ‘enum OMR::RealRegister::RegDep’ [-Wenum-compare]
16:23:40 [2019-11-01T20:23:40.901Z]                  || _dependencies[j].getRealRegister() == TR::RealRegister::LegalFirstOfFPPair) &&
16:23:40 [2019-11-01T20:23:40.901Z]                                                                             ^
16:23:40 [2019-11-01T20:23:40.901Z] /home/jenkins/jenkins-agent/workspace/PullRequest-linux_390-64/compiler/z/codegen/OMRRegisterDependency.cpp:983:74: warning: comparison between ‘enum OMR::RealRegister::RegNum’ and ‘enum OMR::RealRegister::RegDep’ [-Wenum-compare]
16:23:40 [2019-11-01T20:23:40.901Z]              if ((_dependencies[j].getRealRegister() == TR::RealRegister::LegalOddOfPair
16:23:40 [2019-11-01T20:23:40.901Z]                                                                           ^
16:23:40 [2019-11-01T20:23:40.901Z] /home/jenkins/jenkins-agent/workspace/PullRequest-linux_390-64/compiler/z/codegen/OMRRegisterDependency.cpp:984:76: warning: comparison between ‘enum OMR::RealRegister::RegNum’ and ‘enum OMR::RealRegister::RegDep’ [-Wenum-compare]
16:23:40 [2019-11-01T20:23:40.901Z]                  || _dependencies[j].getRealRegister() == TR::RealRegister::LegalSecondOfFPPair) &&
16:23:40 [2019-11-01T20:23:40.901Z]                                                                             ^
16:23:40 [2019-11-01T20:23:40.901Z] /home/jenkins/jenkins-agent/workspace/PullRequest-linux_390-64/compiler/z/codegen/OMRRegisterDependency.cpp:1012:48: warning: comparison between ‘enum OMR::RealRegister::RegNum’ and ‘enum OMR::RealRegister::RegDep’ [-Wenum-compare]
16:23:40 [2019-11-01T20:23:40.901Z]        if (dependentRegNum == TR::RealRegister::LegalEvenOfPair)
16:23:40 [2019-11-01T20:23:40.901Z]                                                 ^
16:23:40 [2019-11-01T20:23:40.901Z] /home/jenkins/jenkins-agent/workspace/PullRequest-linux_390-64/compiler/z/codegen/OMRRegisterDependency.cpp:1032:48: warning: comparison between ‘enum OMR::RealRegister::RegNum’ and ‘enum OMR::RealRegister::RegDep’ [-Wenum-compare]
16:23:40 [2019-11-01T20:23:40.901Z]        if (dependentRegNum == TR::RealRegister::LegalOddOfPair)
16:23:40 [2019-11-01T20:23:40.901Z]                                                 ^
16:23:40 [2019-11-01T20:23:40.901Z] /home/jenkins/jenkins-agent/workspace/PullRequest-linux_390-64/compiler/z/codegen/OMRRegisterDependency.cpp:1052:48: warning: comparison between ‘enum OMR::RealRegister::RegNum’ and ‘enum OMR::RealRegister::RegDep’ [-Wenum-compare]
16:23:40 [2019-11-01T20:23:40.901Z]        if (dependentRegNum == TR::RealRegister::LegalFirstOfFPPair)
16:23:40 [2019-11-01T20:23:40.901Z]                                                 ^
16:23:40 [2019-11-01T20:23:40.901Z] /home/jenkins/jenkins-agent/workspace/PullRequest-linux_390-64/compiler/z/codegen/OMRRegisterDependency.cpp:1072:48: warning: comparison between ‘enum OMR::RealRegister::RegNum’ and ‘enum OMR::RealRegister::RegDep’ [-Wenum-compare]
16:23:40 [2019-11-01T20:23:40.901Z]        if (dependentRegNum == TR::RealRegister::LegalSecondOfFPPair)
16:23:40 [2019-11-01T20:23:40.901Z]                                                 ^
16:23:40 [2019-11-01T20:23:40.901Z] /home/jenkins/jenkins-agent/workspace/PullRequest-linux_390-64/compiler/z/codegen/OMRRegisterDependency.cpp:1126:51: warning: comparison between ‘enum OMR::RealRegister::RegNum’ and ‘enum OMR::RealRegister::RegDep’ [-Wenum-compare]
16:23:40 [2019-11-01T20:23:40.901Z]               dependentRegNum != TR::RealRegister::AssignAny &&
16:23:40 [2019-11-01T20:23:40.901Z]                                                    ^
16:23:40 [2019-11-01T20:23:40.901Z] /home/jenkins/jenkins-agent/workspace/PullRequest-linux_390-64/compiler/z/codegen/OMRRegisterDependency.cpp:1127:51: warning: comparison between ‘enum OMR::RealRegister::RegNum’ and ‘enum OMR::RealRegister::RegDep’ [-Wenum-compare]
16:23:40 [2019-11-01T20:23:40.901Z]               dependentRegNum != TR::RealRegister::SpilledReg &&
16:23:40 [2019-11-01T20:23:40.901Z]                                                    ^
16:23:40 [2019-11-01T20:23:40.901Z] /home/jenkins/jenkins-agent/workspace/PullRequest-linux_390-64/compiler/z/codegen/OMRRegisterDependency.cpp:1165:51: warning: comparison between ‘enum OMR::RealRegister::RegNum’ and ‘enum OMR::RealRegister::RegDep’ [-Wenum-compare]
16:23:40 [2019-11-01T20:23:40.901Z]               dependentRegNum  != TR::RealRegister::AssignAny &&
16:23:40 [2019-11-01T20:23:40.901Z]                                                    ^
16:23:40 [2019-11-01T20:23:40.901Z] /home/jenkins/jenkins-agent/workspace/PullRequest-linux_390-64/compiler/z/codegen/OMRRegisterDependency.cpp:1166:51: warning: comparison between ‘enum OMR::RealRegister::RegNum’ and ‘enum OMR::RealRegister::RegDep’ [-Wenum-compare]
16:23:40 [2019-11-01T20:23:40.901Z]               dependentRegNum  != TR::RealRegister::SpilledReg)
16:23:40 [2019-11-01T20:23:40.901Z]                                                    ^
16:23:40 [2019-11-01T20:23:40.901Z] /home/jenkins/jenkins-agent/workspace/PullRequest-linux_390-64/compiler/z/codegen/OMRRegisterDependency.cpp:1189:54: warning: comparison between ‘enum OMR::RealRegister::RegNum’ and ‘enum OMR::RealRegister::RegDep’ [-Wenum-compare]
16:23:40 [2019-11-01T20:23:40.901Z]                         aRealNum != TR::RealRegister::AssignAny &&
16:23:40 [2019-11-01T20:23:40.901Z]                                                       ^
16:23:40 [2019-11-01T20:23:40.901Z] /home/jenkins/jenkins-agent/workspace/PullRequest-linux_390-64/compiler/z/codegen/OMRRegisterDependency.cpp:1190:54: warning: comparison between ‘enum OMR::RealRegister::RegNum’ and ‘enum OMR::RealRegister::RegDep’ [-Wenum-compare]
16:23:40 [2019-11-01T20:23:40.901Z]                         aRealNum != TR::RealRegister::SpilledReg &&
16:23:40 [2019-11-01T20:23:40.901Z]                                                       ^
16:23:40 [2019-11-01T20:23:40.901Z] /home/jenkins/jenkins-agent/workspace/PullRequest-linux_390-64/compiler/z/codegen/OMRRegisterDependency.cpp:1223:67: warning: comparison between ‘enum OMR::RealRegister::RegNum’ and ‘enum OMR::RealRegister::RegDep’ [-Wenum-compare]
16:23:40 [2019-11-01T20:23:40.901Z]        if (_dependencies[i].getRealRegister() == TR::RealRegister::AssignAny)
16:23:40 [2019-11-01T20:23:40.901Z]                                                                    ^
16:23:40 [2019-11-01T20:23:40.901Z] /home/jenkins/jenkins-agent/workspace/PullRequest-linux_390-64/compiler/z/codegen/OMRRegisterDependency.cpp:1244:67: warning: comparison between ‘enum OMR::RealRegister::RegNum’ and ‘enum OMR::RealRegister::RegDep’ [-Wenum-compare]
16:23:40 [2019-11-01T20:23:40.901Z]        if (_dependencies[i].getRealRegister() == TR::RealRegister::AssignAny)
16:23:40 [2019-11-01T20:23:40.901Z]                                                                    ^
16:23:40 [2019-11-01T20:23:40.901Z] /home/jenkins/jenkins-agent/workspace/PullRequest-linux_390-64/compiler/z/codegen/OMRRegisterDependency.cpp:1285:76: warning: comparison between ‘enum OMR::RealRegister::RegNum’ and ‘enum OMR::RealRegister::RegDep’ [-Wenum-compare]
16:23:40 [2019-11-01T20:23:40.901Z]            getRegisterDependency(i)->getRealRegister() != TR::RealRegister::SpilledReg
16:23:40 [2019-11-01T20:23:40.901Z]                                                                             ^
16:23:40 [2019-11-01T20:23:40.901Z] /home/jenkins/jenkins-agent/workspace/PullRequest-linux_390-64/compiler/z/codegen/OMRRegisterDependency.cpp:1372:54: warning: comparison between ‘enum OMR::RealRegister::RegNum’ and ‘enum OMR::RealRegister::RegDep’ [-Wenum-compare]
16:23:40 [2019-11-01T20:23:40.901Z]              if (dependentRegNum == TR::RealRegister::SpilledReg)
16:23:40 [2019-11-01T20:23:40.901Z]                                                       ^
16:23:40 [2019-11-01T20:23:40.901Z] /home/jenkins/jenkins-agent/workspace/PullRequest-linux_390-64/compiler/z/codegen/OMRRegisterDependency.cpp: In member function ‘bool OMR::Z::RegisterDependencyConditions::doesConditionExist(TR_S390RegisterDependencyGroup*, TR::Register*, OMR::RealRegister::RegNum, uint32_t, uint32_t, bool)’:
16:23:40 [2019-11-01T20:23:40.901Z] /home/jenkins/jenkins-agent/workspace/PullRequest-linux_390-64/compiler/z/codegen/OMRRegisterDependency.cpp:1447:66: warning: comparison between ‘enum OMR::RealRegister::RegNum’ and ‘enum OMR::RealRegister::RegDep’ [-Wenum-compare]
16:23:40 [2019-11-01T20:23:40.901Z]           else if( regDep->getRealRegister() == TR::RealRegister::AssignAny )
16:23:40 [2019-11-01T20:23:40.901Z]                                                                   ^
16:23:40 [2019-11-01T20:23:40.901Z] /home/jenkins/jenkins-agent/workspace/PullRequest-linux_390-64/compiler/z/codegen/OMRRegisterDependency.cpp:1454:43: warning: comparison between ‘enum OMR::RealRegister::RegNum’ and ‘enum OMR::RealRegister::RegDep’ [-Wenum-compare]
16:23:40 [2019-11-01T20:23:40.901Z]           else if( rr == TR::RealRegister::AssignAny )
16:23:40 [2019-11-01T20:23:40.901Z]                                            ^
16:23:40 [2019-11-01T20:23:40.901Z] [ 90%] Building CXX object jitbuilder/CMakeFiles/jitbuilder.dir/__/compiler/z/codegen/OMRTreeEvaluator.cpp.o
16:23:40 [2019-11-01T20:23:40.901Z] In file included from /home/jenkins/jenkins-agent/workspace/PullRequest-linux_390-64/compiler/z/codegen/OMRRegisterDependency.hpp:36:0,
16:23:40 [2019-11-01T20:23:40.901Z]                  from /home/jenkins/jenkins-agent/workspace/PullRequest-linux_390-64/compiler/z/codegen/RegisterDependency.hpp:25,
16:23:40 [2019-11-01T20:23:40.901Z]                  from /home/jenkins/jenkins-agent/workspace/PullRequest-linux_390-64/compiler/z/codegen/S390Instruction.hpp:47,
16:23:40 [2019-11-01T20:23:40.901Z]                  from /home/jenkins/jenkins-agent/workspace/PullRequest-linux_390-64/compiler/z/codegen/CallSnippet.hpp:32,
16:23:40 [2019-11-01T20:23:40.901Z]                  from /home/jenkins/jenkins-agent/workspace/PullRequest-linux_390-64/compiler/z/codegen/OMRSnippet.cpp:53:
16:23:40 [2019-11-01T20:23:40.901Z] /home/jenkins/jenkins-agent/workspace/PullRequest-linux_390-64/compiler/codegen/OMRRegisterDependency.hpp: In member function ‘TR::RegisterDependency* OMR::RegisterDependencyMap::getDependencyWithSourceAssigned(OMR::RealRegister::RegNum)’:
16:23:40 [2019-11-01T20:23:40.901Z] /home/jenkins/jenkins-agent/workspace/PullRequest-linux_390-64/compiler/codegen/OMRRegisterDependency.hpp:136:55: warning: comparison between ‘enum OMR::RealRegister::RegNum’ and ‘enum OMR::RealRegister::RegDep’ [-Wenum-compare]
16:23:40 [2019-11-01T20:23:40.901Z]        TR_ASSERT(regNum >= 0 && regNum < TR::RealRegister::NumRegisters, "Register number (%d) used as index but out of range!", regNum);
16:23:40 [2019-11-01T20:23:40.901Z]                                                        ^
16:23:40 [2019-11-01T20:23:40.901Z] In file included from /home/jenkins/jenkins-agent/workspace/PullRequest-linux_390-64/compiler/z/codegen/OMRRegisterDependency.hpp:36:0,
16:23:40 [2019-11-01T20:23:40.901Z]                  from /home/jenkins/jenkins-agent/workspace/PullRequest-linux_390-64/compiler/z/codegen/RegisterDependency.hpp:25,
16:23:40 [2019-11-01T20:23:40.901Z]                  from /home/jenkins/jenkins-agent/workspace/PullRequest-linux_390-64/compiler/z/codegen/S390Instruction.hpp:47,
16:23:40 [2019-11-01T20:23:40.901Z]                  from /home/jenkins/jenkins-agent/workspace/PullRequest-linux_390-64/compiler/z/codegen/CallSnippet.hpp:32,
16:23:40 [2019-11-01T20:23:40.901Z]                  from /home/jenkins/jenkins-agent/workspace/PullRequest-linux_390-64/compiler/z/codegen/OMRSnippet.cpp:53:
16:23:40 [2019-11-01T20:23:40.901Z] /home/jenkins/jenkins-agent/workspace/PullRequest-linux_390-64/compiler/codegen/OMRRegisterDependency.hpp: In member function ‘TR::RegisterDependency* OMR::RegisterDependencyMap::getDependencyWithTarget(OMR::RealRegister::RegNum)’:
16:23:40 [2019-11-01T20:23:40.901Z] /home/jenkins/jenkins-agent/workspace/PullRequest-linux_390-64/compiler/codegen/OMRRegisterDependency.hpp:152:55: warning: comparison between ‘enum OMR::RealRegister::RegNum’ and ‘enum OMR::RealRegister::RegDep’ [-Wenum-compare]
16:23:40 [2019-11-01T20:23:40.901Z]        TR_ASSERT(regNum >= 0 && regNum < TR::RealRegister::NumRegisters, "Register number (%d) used as index but out of range!", regNum);
16:23:40 [2019-11-01T20:23:40.901Z]                                                        ^
16:23:40 [2019-11-01T20:23:40.901Z] In file included from /home/jenkins/jenkins-agent/workspace/PullRequest-linux_390-64/compiler/z/codegen/OMRRegisterDependency.hpp:36:0,
16:23:40 [2019-11-01T20:23:40.901Z]                  from /home/jenkins/jenkins-agent/workspace/PullRequest-linux_390-64/compiler/z/codegen/RegisterDependency.hpp:25,
16:23:40 [2019-11-01T20:23:40.902Z]                  from /home/jenkins/jenkins-agent/workspace/PullRequest-linux_390-64/compiler/z/codegen/S390Instruction.hpp:47,
16:23:40 [2019-11-01T20:23:40.902Z]                  from /home/jenkins/jenkins-agent/workspace/PullRequest-linux_390-64/compiler/z/codegen/CallSnippet.hpp:32,
16:23:40 [2019-11-01T20:23:40.902Z]                  from /home/jenkins/jenkins-agent/workspace/PullRequest-linux_390-64/compiler/z/codegen/OMRSnippet.cpp:53:
16:23:40 [2019-11-01T20:23:40.902Z] /home/jenkins/jenkins-agent/workspace/PullRequest-linux_390-64/compiler/codegen/OMRRegisterDependency.hpp:154:41: warning: comparison between ‘enum OMR::RealRegister::RegNum’ and ‘enum OMR::RealRegister::RegDep’ [-Wenum-compare]
16:23:40 [2019-11-01T20:23:40.902Z]        TR_ASSERT(regNum != TR::RealRegister::SpilledReg, "Multiple dependencies can map to 'SpilledReg', can't return just one");
16:23:40 [2019-11-01T20:23:40.902Z]                                          ^
16:23:40 [2019-11-01T20:23:40.902Z] In file included from /home/jenkins/jenkins-agent/workspace/PullRequest-linux_390-64/compiler/z/codegen/OMRRegisterDependency.hpp:36:0,
16:23:40 [2019-11-01T20:23:40.902Z]                  from /home/jenkins/jenkins-agent/workspace/PullRequest-linux_390-64/compiler/z/codegen/RegisterDependency.hpp:25,
16:23:40 [2019-11-01T20:23:40.902Z]                  from /home/jenkins/jenkins-agent/workspace/PullRequest-linux_390-64/compiler/z/codegen/S390Instruction.hpp:47,
16:23:40 [2019-11-01T20:23:40.902Z]                  from /home/jenkins/jenkins-agent/workspace/PullRequest-linux_390-64/compiler/z/codegen/CallSnippet.hpp:32,
16:23:40 [2019-11-01T20:23:40.902Z]                  from /home/jenkins/jenkins-agent/workspace/PullRequest-linux_390-64/compiler/z/codegen/OMRSnippet.cpp:53:
16:23:40 [2019-11-01T20:23:40.902Z] /home/jenkins/jenkins-agent/workspace/PullRequest-linux_390-64/compiler/codegen/OMRRegisterDependency.hpp: In member function ‘void OMR::RegisterDependencyMap::addDependency(OMR::RealRegister::RegNum, TR::RealRegister*, uint32_t)’:
16:23:40 [2019-11-01T20:23:40.902Z] /home/jenkins/jenkins-agent/workspace/PullRequest-linux_390-64/compiler/codegen/OMRRegisterDependency.hpp:194:76: warning: comparison between ‘enum OMR::RealRegister::RegNum’ and ‘enum OMR::RealRegister::RegDep’ [-Wenum-compare]
16:23:40 [2019-11-01T20:23:40.902Z]        if (regNum != TR::RealRegister::NoReg && regNum != TR::RealRegister::SpilledReg && regNum < TR::RealRegister::NumRegisters)
16:23:40 [2019-11-01T20:23:40.902Z]                                                                             ^
16:23:40 [2019-11-01T20:23:40.902Z] /home/jenkins/jenkins-agent/workspace/PullRequest-linux_390-64/compiler/codegen/OMRRegisterDependency.hpp:194:117: warning: comparison between ‘enum OMR::RealRegister::RegNum’ and ‘enum OMR::RealRegister::RegDep’ [-Wenum-compare]
16:23:40 [2019-11-01T20:23:40.902Z]        if (regNum != TR::RealRegister::NoReg && regNum != TR::RealRegister::SpilledReg && regNum < TR::RealRegister::NumRegisters)
16:23:40 [2019-11-01T20:23:40.902Z]                                                                                                                      ^
16:23:40 [2019-11-01T20:23:40.902Z] /home/jenkins/jenkins-agent/workspace/PullRequest-linux_390-64/compiler/codegen/OMRRegisterDependency.hpp:196:58: warning: comparison between ‘enum OMR::RealRegister::RegNum’ and ‘enum OMR::RealRegister::RegDep’ [-Wenum-compare]
16:23:40 [2019-11-01T20:23:40.902Z]           TR_ASSERT(regNum >= 0 && regNum < TR::RealRegister::NumRegisters, "Register number (%d) used as index but out of range!", regNum);
16:23:40 [2019-11-01T20:23:40.902Z]                                                           ^
16:23:40 [2019-11-01T20:23:40.902Z] In file included from /home/jenkins/jenkins-agent/workspace/PullRequest-linux_390-64/compiler/z/codegen/OMRRegisterDependency.hpp:36:0,
16:23:40 [2019-11-01T20:23:40.902Z]                  from /home/jenkins/jenkins-agent/workspace/PullRequest-linux_390-64/compiler/z/codegen/RegisterDependency.hpp:25,
16:23:40 [2019-11-01T20:23:40.902Z]                  from /home/jenkins/jenkins-agent/workspace/PullRequest-linux_390-64/compiler/z/codegen/S390Instruction.hpp:47,
16:23:40 [2019-11-01T20:23:40.902Z]                  from /home/jenkins/jenkins-agent/workspace/PullRequest-linux_390-64/compiler/z/codegen/CallSnippet.hpp:32,
16:23:40 [2019-11-01T20:23:40.902Z]                  from /home/jenkins/jenkins-agent/workspace/PullRequest-linux_390-64/compiler/z/codegen/OMRSnippet.cpp:53:
16:23:40 [2019-11-01T20:23:40.902Z] /home/jenkins/jenkins-agent/workspace/PullRequest-linux_390-64/compiler/codegen/OMRRegisterDependency.hpp:205:52: warning: comparison between ‘enum OMR::RealRegister::RegNum’ and ‘enum OMR::RealRegister::RegDep’ [-Wenum-compare]
16:23:40 [2019-11-01T20:23:40.902Z]           TR_ASSERT(arr >= 0 && arr < TR::RealRegister::NumRegisters, "Register number (%d) used as index but out of range!", arr);
16:23:40 [2019-11-01T20:23:40.902Z]                                                     ^
16:23:40 [2019-11-01T20:23:40.902Z] [ 90%] Building CXX object jitbuilder/CMakeFiles/jitbuilder.dir/__/compiler/z/codegen/UnaryEvaluator.cpp.o
16:23:40 [2019-11-01T20:23:40.902Z] In file included from /home/jenkins/jenkins-agent/workspace/PullRequest-linux_390-64/compiler/z/codegen/OMRRegisterDependency.hpp:36:0,
16:23:40 [2019-11-01T20:23:40.902Z]                  from /home/jenkins/jenkins-agent/workspace/PullRequest-linux_390-64/compiler/z/codegen/RegisterDependency.hpp:25,
16:23:40 [2019-11-01T20:23:40.902Z]                  from /home/jenkins/jenkins-agent/workspace/PullRequest-linux_390-64/compiler/z/codegen/TranslateEvaluator.cpp:32:
16:23:40 [2019-11-01T20:23:40.902Z] /home/jenkins/jenkins-agent/workspace/PullRequest-linux_390-64/compiler/codegen/OMRRegisterDependency.hpp: In member function ‘TR::RegisterDependency* OMR::RegisterDependencyMap::getDependencyWithSourceAssigned(OMR::RealRegister::RegNum)’:
16:23:40 [2019-11-01T20:23:40.902Z] /home/jenkins/jenkins-agent/workspace/PullRequest-linux_390-64/compiler/codegen/OMRRegisterDependency.hpp:136:55: warning: comparison between ‘enum OMR::RealRegister::RegNum’ and ‘enum OMR::RealRegister::RegDep’ [-Wenum-compare]
16:23:40 [2019-11-01T20:23:40.902Z]        TR_ASSERT(regNum >= 0 && regNum < TR::RealRegister::NumRegisters, "Register number (%d) used as index but out of range!", regNum);
16:23:40 [2019-11-01T20:23:40.902Z]                                                        ^
16:23:40 [2019-11-01T20:23:40.902Z] In file included from /home/jenkins/jenkins-agent/workspace/PullRequest-linux_390-64/compiler/z/codegen/OMRRegisterDependency.hpp:36:0,
16:23:40 [2019-11-01T20:23:40.902Z]                  from /home/jenkins/jenkins-agent/workspace/PullRequest-linux_390-64/compiler/z/codegen/RegisterDependency.hpp:25,
16:23:40 [2019-11-01T20:23:40.902Z]                  from /home/jenkins/jenkins-agent/workspace/PullRequest-linux_390-64/compiler/z/codegen/TranslateEvaluator.cpp:32:
16:23:40 [2019-11-01T20:23:40.902Z] /home/jenkins/jenkins-agent/workspace/PullRequest-linux_390-64/compiler/codegen/OMRRegisterDependency.hpp: In member function ‘TR::RegisterDependency* OMR::RegisterDependencyMap::getDependencyWithTarget(OMR::RealRegister::RegNum)’:
16:23:40 [2019-11-01T20:23:40.902Z] /home/jenkins/jenkins-agent/workspace/PullRequest-linux_390-64/compiler/codegen/OMRRegisterDependency.hpp:152:55: warning: comparison between ‘enum OMR::RealRegister::RegNum’ and ‘enum OMR::RealRegister::RegDep’ [-Wenum-compare]
16:23:40 [2019-11-01T20:23:40.902Z]        TR_ASSERT(regNum >= 0 && regNum < TR::RealRegister::NumRegisters, "Register number (%d) used as index but out of range!", regNum);
16:23:40 [2019-11-01T20:23:40.902Z]                                                        ^
16:23:40 [2019-11-01T20:23:40.902Z] In file included from /home/jenkins/jenkins-agent/workspace/PullRequest-linux_390-64/compiler/z/codegen/OMRRegisterDependency.hpp:36:0,
16:23:40 [2019-11-01T20:23:40.902Z]                  from /home/jenkins/jenkins-agent/workspace/PullRequest-linux_390-64/compiler/z/codegen/RegisterDependency.hpp:25,
16:23:40 [2019-11-01T20:23:40.902Z]                  from /home/jenkins/jenkins-agent/workspace/PullRequest-linux_390-64/compiler/z/codegen/TranslateEvaluator.cpp:32:
16:23:40 [2019-11-01T20:23:40.902Z] /home/jenkins/jenkins-agent/workspace/PullRequest-linux_390-64/compiler/codegen/OMRRegisterDependency.hpp:154:41: warning: comparison between ‘enum OMR::RealRegister::RegNum’ and ‘enum OMR::RealRegister::RegDep’ [-Wenum-compare]
16:23:40 [2019-11-01T20:23:40.902Z]        TR_ASSERT(regNum != TR::RealRegister::SpilledReg, "Multiple dependencies can map to 'SpilledReg', can't return just one");
16:23:40 [2019-11-01T20:23:40.902Z]                                          ^
16:23:40 [2019-11-01T20:23:40.902Z] In file included from /home/jenkins/jenkins-agent/workspace/PullRequest-linux_390-64/compiler/z/codegen/OMRRegisterDependency.hpp:36:0,
16:23:40 [2019-11-01T20:23:40.902Z]                  from /home/jenkins/jenkins-agent/workspace/PullRequest-linux_390-64/compiler/z/codegen/RegisterDependency.hpp:25,
16:23:40 [2019-11-01T20:23:40.902Z]                  from /home/jenkins/jenkins-agent/workspace/PullRequest-linux_390-64/compiler/z/codegen/TranslateEvaluator.cpp:32:
16:23:40 [2019-11-01T20:23:40.902Z] /home/jenkins/jenkins-agent/workspace/PullRequest-linux_390-64/compiler/codegen/OMRRegisterDependency.hpp: In member function ‘void OMR::RegisterDependencyMap::addDependency(OMR::RealRegister::RegNum, TR::RealRegister*, uint32_t)’:
16:23:40 [2019-11-01T20:23:40.902Z] /home/jenkins/jenkins-agent/workspace/PullRequest-linux_390-64/compiler/codegen/OMRRegisterDependency.hpp:194:76: warning: comparison between ‘enum OMR::RealRegister::RegNum’ and ‘enum OMR::RealRegister::RegDep’ [-Wenum-compare]
16:23:40 [2019-11-01T20:23:40.902Z]        if (regNum != TR::RealRegister::NoReg && regNum != TR::RealRegister::SpilledReg && regNum < TR::RealRegister::NumRegisters)
16:23:40 [2019-11-01T20:23:40.902Z]                                                                             ^
16:23:40 [2019-11-01T20:23:40.902Z] /home/jenkins/jenkins-agent/workspace/PullRequest-linux_390-64/compiler/codegen/OMRRegisterDependency.hpp:194:117: warning: comparison between ‘enum OMR::RealRegister::RegNum’ and ‘enum OMR::RealRegister::RegDep’ [-Wenum-compare]
16:23:40 [2019-11-01T20:23:40.902Z]        if (regNum != TR::RealRegister::NoReg && regNum != TR::RealRegister::SpilledReg && regNum < TR::RealRegister::NumRegisters)
16:23:40 [2019-11-01T20:23:40.902Z]                                                                                                                      ^
16:23:40 [2019-11-01T20:23:40.902Z] /home/jenkins/jenkins-agent/workspace/PullRequest-linux_390-64/compiler/codegen/OMRRegisterDependency.hpp:196:58: warning: comparison between ‘enum OMR::RealRegister::RegNum’ and ‘enum OMR::RealRegister::RegDep’ [-Wenum-compare]
16:23:40 [2019-11-01T20:23:40.902Z]           TR_ASSERT(regNum >= 0 && regNum < TR::RealRegister::NumRegisters, "Register number (%d) used as index but out of range!", regNum);
16:23:40 [2019-11-01T20:23:40.902Z]                                                           ^
16:23:40 [2019-11-01T20:23:40.902Z] In file included from /home/jenkins/jenkins-agent/workspace/PullRequest-linux_390-64/compiler/z/codegen/OMRRegisterDependency.hpp:36:0,
16:23:40 [2019-11-01T20:23:40.902Z]                  from /home/jenkins/jenkins-agent/workspace/PullRequest-linux_390-64/compiler/z/codegen/RegisterDependency.hpp:25,
16:23:40 [2019-11-01T20:23:40.902Z]                  from /home/jenkins/jenkins-agent/workspace/PullRequest-linux_390-64/compiler/z/codegen/TranslateEvaluator.cpp:32:
16:23:40 [2019-11-01T20:23:40.902Z] /home/jenkins/jenkins-agent/workspace/PullRequest-linux_390-64/compiler/codegen/OMRRegisterDependency.hpp:205:52: warning: comparison between ‘enum OMR::RealRegister::RegNum’ and ‘enum OMR::RealRegister::RegDep’ [-Wenum-compare]
16:23:40 [2019-11-01T20:23:40.902Z]           TR_ASSERT(arr >= 0 && arr < TR::RealRegister::NumRegisters, "Register number (%d) used as index but out of range!", arr);
16:23:40 [2019-11-01T20:23:40.902Z]                                                     ^
16:23:40 [2019-11-01T20:23:40.902Z] [ 90%] Building CXX object jitbuilder/CMakeFiles/jitbuilder.dir/__/compiler/z/codegen/OMRInstruction.cpp.o
16:23:41 [2019-11-01T20:23:41.335Z] In file included from /home/jenkins/jenkins-agent/workspace/PullRequest-linux_390-64/compiler/z/codegen/OMRRegisterDependency.hpp:36:0,
16:23:41 [2019-11-01T20:23:41.335Z]                  from /home/jenkins/jenkins-agent/workspace/PullRequest-linux_390-64/compiler/z/codegen/RegisterDependency.hpp:25,
16:23:41 [2019-11-01T20:23:41.335Z]                  from /home/jenkins/jenkins-agent/workspace/PullRequest-linux_390-64/compiler/z/codegen/OMRLinkage.hpp:49,
16:23:41 [2019-11-01T20:23:41.335Z]                  from /home/jenkins/jenkins-agent/workspace/PullRequest-linux_390-64/compiler/z/codegen/Linkage.hpp:25,
16:23:41 [2019-11-01T20:23:41.336Z]                  from /home/jenkins/jenkins-agent/workspace/PullRequest-linux_390-64/compiler/z/codegen/OMRTreeEvaluator.cpp:42:
16:23:41 [2019-11-01T20:23:41.336Z] /home/jenkins/jenkins-agent/workspace/PullRequest-linux_390-64/compiler/codegen/OMRRegisterDependency.hpp: In member function ‘TR::RegisterDependency* OMR::RegisterDependencyMap::getDependencyWithSourceAssigned(OMR::RealRegister::RegNum)’:
16:23:41 [2019-11-01T20:23:41.336Z] /home/jenkins/jenkins-agent/workspace/PullRequest-linux_390-64/compiler/codegen/OMRRegisterDependency.hpp:136:55: warning: comparison between ‘enum OMR::RealRegister::RegNum’ and ‘enum OMR::RealRegister::RegDep’ [-Wenum-compare]
16:23:41 [2019-11-01T20:23:41.336Z]        TR_ASSERT(regNum >= 0 && regNum < TR::RealRegister::NumRegisters, "Register number (%d) used as index but out of range!", regNum);
16:23:41 [2019-11-01T20:23:41.336Z]                                                        ^
16:23:41 [2019-11-01T20:23:41.336Z] In file included from /home/jenkins/jenkins-agent/workspace/PullRequest-linux_390-64/compiler/z/codegen/OMRRegisterDependency.hpp:36:0,
16:23:41 [2019-11-01T20:23:41.336Z]                  from /home/jenkins/jenkins-agent/workspace/PullRequest-linux_390-64/compiler/z/codegen/RegisterDependency.hpp:25,
16:23:41 [2019-11-01T20:23:41.336Z]                  from /home/jenkins/jenkins-agent/workspace/PullRequest-linux_390-64/compiler/z/codegen/OMRLinkage.hpp:49,
16:23:41 [2019-11-01T20:23:41.336Z]                  from /home/jenkins/jenkins-agent/workspace/PullRequest-linux_390-64/compiler/z/codegen/Linkage.hpp:25,
16:23:41 [2019-11-01T20:23:41.336Z]                  from /home/jenkins/jenkins-agent/workspace/PullRequest-linux_390-64/compiler/z/codegen/OMRTreeEvaluator.cpp:42:
16:23:41 [2019-11-01T20:23:41.336Z] /home/jenkins/jenkins-agent/workspace/PullRequest-linux_390-64/compiler/codegen/OMRRegisterDependency.hpp: In member function ‘TR::RegisterDependency* OMR::RegisterDependencyMap::getDependencyWithTarget(OMR::RealRegister::RegNum)’:
16:23:41 [2019-11-01T20:23:41.336Z] /home/jenkins/jenkins-agent/workspace/PullRequest-linux_390-64/compiler/codegen/OMRRegisterDependency.hpp:152:55: warning: comparison between ‘enum OMR::RealRegister::RegNum’ and ‘enum OMR::RealRegister::RegDep’ [-Wenum-compare]
16:23:41 [2019-11-01T20:23:41.336Z]        TR_ASSERT(regNum >= 0 && regNum < TR::RealRegister::NumRegisters, "Register number (%d) used as index but out of range!", regNum);
16:23:41 [2019-11-01T20:23:41.336Z]                                                        ^
16:23:41 [2019-11-01T20:23:41.336Z] In file included from /home/jenkins/jenkins-agent/workspace/PullRequest-linux_390-64/compiler/z/codegen/OMRRegisterDependency.hpp:36:0,
16:23:41 [2019-11-01T20:23:41.336Z]                  from /home/jenkins/jenkins-agent/workspace/PullRequest-linux_390-64/compiler/z/codegen/RegisterDependency.hpp:25,
16:23:41 [2019-11-01T20:23:41.336Z]                  from /home/jenkins/jenkins-agent/workspace/PullRequest-linux_390-64/compiler/z/codegen/OMRLinkage.hpp:49,
16:23:41 [2019-11-01T20:23:41.336Z]                  from /home/jenkins/jenkins-agent/workspace/PullRequest-linux_390-64/compiler/z/codegen/Linkage.hpp:25,
16:23:41 [2019-11-01T20:23:41.336Z]                  from /home/jenkins/jenkins-agent/workspace/PullRequest-linux_390-64/compiler/z/codegen/OMRTreeEvaluator.cpp:42:
16:23:41 [2019-11-01T20:23:41.336Z] /home/jenkins/jenkins-agent/workspace/PullRequest-linux_390-64/compiler/codegen/OMRRegisterDependency.hpp:154:41: warning: comparison between ‘enum OMR::RealRegister::RegNum’ and ‘enum OMR::RealRegister::RegDep’ [-Wenum-compare]
16:23:41 [2019-11-01T20:23:41.336Z]        TR_ASSERT(regNum != TR::RealRegister::SpilledReg, "Multiple dependencies can map to 'SpilledReg', can't return just one");
16:23:41 [2019-11-01T20:23:41.336Z]                                          ^
16:23:41 [2019-11-01T20:23:41.336Z] In file included from /home/jenkins/jenkins-agent/workspace/PullRequest-linux_390-64/compiler/z/codegen/OMRRegisterDependency.hpp:36:0,
16:23:41 [2019-11-01T20:23:41.336Z]                  from /home/jenkins/jenkins-agent/workspace/PullRequest-linux_390-64/compiler/z/codegen/RegisterDependency.hpp:25,
16:23:41 [2019-11-01T20:23:41.336Z]                  from /home/jenkins/jenkins-agent/workspace/PullRequest-linux_390-64/compiler/z/codegen/OMRLinkage.hpp:49,
16:23:41 [2019-11-01T20:23:41.336Z]                  from /home/jenkins/jenkins-agent/workspace/PullRequest-linux_390-64/compiler/z/codegen/Linkage.hpp:25,
16:23:41 [2019-11-01T20:23:41.336Z]                  from /home/jenkins/jenkins-agent/workspace/PullRequest-linux_390-64/compiler/z/codegen/OMRTreeEvaluator.cpp:42:
16:23:41 [2019-11-01T20:23:41.336Z] /home/jenkins/jenkins-agent/workspace/PullRequest-linux_390-64/compiler/codegen/OMRRegisterDependency.hpp: In member function ‘void OMR::RegisterDependencyMap::addDependency(OMR::RealRegister::RegNum, TR::RealRegister*, uint32_t)’:
16:23:41 [2019-11-01T20:23:41.336Z] /home/jenkins/jenkins-agent/workspace/PullRequest-linux_390-64/compiler/codegen/OMRRegisterDependency.hpp:194:76: warning: comparison between ‘enum OMR::RealRegister::RegNum’ and ‘enum OMR::RealRegister::RegDep’ [-Wenum-compare]
16:23:41 [2019-11-01T20:23:41.336Z]        if (regNum != TR::RealRegister::NoReg && regNum != TR::RealRegister::SpilledReg && regNum < TR::RealRegister::NumRegisters)
16:23:41 [2019-11-01T20:23:41.336Z]                                                                             ^
16:23:41 [2019-11-01T20:23:41.336Z] /home/jenkins/jenkins-agent/workspace/PullRequest-linux_390-64/compiler/codegen/OMRRegisterDependency.hpp:194:117: warning: comparison between ‘enum OMR::RealRegister::RegNum’ and ‘enum OMR::RealRegister::RegDep’ [-Wenum-compare]
16:23:41 [2019-11-01T20:23:41.336Z]        if (regNum != TR::RealRegister::NoReg && regNum != TR::RealRegister::SpilledReg && regNum < TR::RealRegister::NumRegisters)
16:23:41 [2019-11-01T20:23:41.336Z]                                                                                                                      ^
16:23:41 [2019-11-01T20:23:41.336Z] /home/jenkins/jenkins-agent/workspace/PullRequest-linux_390-64/compiler/codegen/OMRRegisterDependency.hpp:196:58: warning: comparison between ‘enum OMR::RealRegister::RegNum’ and ‘enum OMR::RealRegister::RegDep’ [-Wenum-compare]
16:23:41 [2019-11-01T20:23:41.336Z]           TR_ASSERT(regNum >= 0 && regNum < TR::RealRegister::NumRegisters, "Register number (%d) used as index but out of range!", regNum);
16:23:41 [2019-11-01T20:23:41.336Z]                                                           ^
16:23:41 [2019-11-01T20:23:41.336Z] In file included from /home/jenkins/jenkins-agent/workspace/PullRequest-linux_390-64/compiler/z/codegen/OMRRegisterDependency.hpp:36:0,
16:23:41 [2019-11-01T20:23:41.336Z]                  from /home/jenkins/jenkins-agent/workspace/PullRequest-linux_390-64/compiler/z/codegen/RegisterDependency.hpp:25,
16:23:41 [2019-11-01T20:23:41.336Z]                  from /home/jenkins/jenkins-agent/workspace/PullRequest-linux_390-64/compiler/z/codegen/OMRLinkage.hpp:49,
16:23:41 [2019-11-01T20:23:41.336Z]                  from /home/jenkins/jenkins-agent/workspace/PullRequest-linux_390-64/compiler/z/codegen/Linkage.hpp:25,
16:23:41 [2019-11-01T20:23:41.336Z]                  from /home/jenkins/jenkins-agent/workspace/PullRequest-linux_390-64/compiler/z/codegen/OMRTreeEvaluator.cpp:42:
16:23:41 [2019-11-01T20:23:41.336Z] /home/jenkins/jenkins-agent/workspace/PullRequest-linux_390-64/compiler/codegen/OMRRegisterDependency.hpp:205:52: warning: comparison between ‘enum OMR::RealRegister::RegNum’ and ‘enum OMR::RealRegister::RegDep’ [-Wenum-compare]
16:23:41 [2019-11-01T20:23:41.336Z]           TR_ASSERT(arr >= 0 && arr < TR::RealRegister::NumRegisters, "Register number (%d) used as index but out of range!", arr);
16:23:41 [2019-11-01T20:23:41.336Z]                                                     ^
16:23:41 [2019-11-01T20:23:41.336Z] In file included from /home/jenkins/jenkins-agent/workspace/PullRequest-linux_390-64/compiler/z/codegen/OMRRegisterDependency.hpp:36:0,
16:23:41 [2019-11-01T20:23:41.336Z]                  from /home/jenkins/jenkins-agent/workspace/PullRequest-linux_390-64/compiler/z/codegen/RegisterDependency.hpp:25,
16:23:41 [2019-11-01T20:23:41.336Z]                  from /home/jenkins/jenkins-agent/workspace/PullRequest-linux_390-64/compiler/z/codegen/UnaryEvaluator.cpp:32:
16:23:41 [2019-11-01T20:23:41.336Z] /home/jenkins/jenkins-agent/workspace/PullRequest-linux_390-64/compiler/codegen/OMRRegisterDependency.hpp: In member function ‘TR::RegisterDependency* OMR::RegisterDependencyMap::getDependencyWithSourceAssigned(OMR::RealRegister::RegNum)’:
16:23:41 [2019-11-01T20:23:41.336Z] /home/jenkins/jenkins-agent/workspace/PullRequest-linux_390-64/compiler/codegen/OMRRegisterDependency.hpp:136:55: warning: comparison between ‘enum OMR::RealRegister::RegNum’ and ‘enum OMR::RealRegister::RegDep’ [-Wenum-compare]
16:23:41 [2019-11-01T20:23:41.336Z]        TR_ASSERT(regNum >= 0 && regNum < TR::RealRegister::NumRegisters, "Register number (%d) used as index but out of range!", regNum);
16:23:41 [2019-11-01T20:23:41.336Z]                                                        ^
16:23:41 [2019-11-01T20:23:41.336Z] In file included from /home/jenkins/jenkins-agent/workspace/PullRequest-linux_390-64/compiler/z/codegen/OMRRegisterDependency.hpp:36:0,
16:23:41 [2019-11-01T20:23:41.336Z]                  from /home/jenkins/jenkins-agent/workspace/PullRequest-linux_390-64/compiler/z/codegen/RegisterDependency.hpp:25,
16:23:41 [2019-11-01T20:23:41.336Z]                  from /home/jenkins/jenkins-agent/workspace/PullRequest-linux_390-64/compiler/z/codegen/UnaryEvaluator.cpp:32:
16:23:41 [2019-11-01T20:23:41.336Z] /home/jenkins/jenkins-agent/workspace/PullRequest-linux_390-64/compiler/codegen/OMRRegisterDependency.hpp: In member function ‘TR::RegisterDependency* OMR::RegisterDependencyMap::getDependencyWithTarget(OMR::RealRegister::RegNum)’:
16:23:41 [2019-11-01T20:23:41.336Z] /home/jenkins/jenkins-agent/workspace/PullRequest-linux_390-64/compiler/codegen/OMRRegisterDependency.hpp:152:55: warning: comparison between ‘enum OMR::RealRegister::RegNum’ and ‘enum OMR::RealRegister::RegDep’ [-Wenum-compare]
16:23:41 [2019-11-01T20:23:41.336Z]        TR_ASSERT(regNum >= 0 && regNum < TR::RealRegister::NumRegisters, "Register number (%d) used as index but out of range!", regNum);
16:23:41 [2019-11-01T20:23:41.336Z]                                                        ^
16:23:41 [2019-11-01T20:23:41.336Z] In file included from /home/jenkins/jenkins-agent/workspace/PullRequest-linux_390-64/compiler/z/codegen/OMRRegisterDependency.hpp:36:0,
16:23:41 [2019-11-01T20:23:41.336Z]                  from /home/jenkins/jenkins-agent/workspace/PullRequest-linux_390-64/compiler/z/codegen/RegisterDependency.hpp:25,
16:23:41 [2019-11-01T20:23:41.336Z]                  from /home/jenkins/jenkins-agent/workspace/PullRequest-linux_390-64/compiler/z/codegen/UnaryEvaluator.cpp:32:
16:23:41 [2019-11-01T20:23:41.336Z] /home/jenkins/jenkins-agent/workspace/PullRequest-linux_390-64/compiler/codegen/OMRRegisterDependency.hpp:154:41: warning: comparison between ‘enum OMR::RealRegister::RegNum’ and ‘enum OMR::RealRegister::RegDep’ [-Wenum-compare]
16:23:41 [2019-11-01T20:23:41.336Z]        TR_ASSERT(regNum != TR::RealRegister::SpilledReg, "Multiple dependencies can map to 'SpilledReg', can't return just one");
16:23:41 [2019-11-01T20:23:41.336Z]                                          ^
16:23:41 [2019-11-01T20:23:41.336Z] In file included from /home/jenkins/jenkins-agent/workspace/PullRequest-linux_390-64/compiler/z/codegen/OMRRegisterDependency.hpp:36:0,
16:23:41 [2019-11-01T20:23:41.336Z]                  from /home/jenkins/jenkins-agent/workspace/PullRequest-linux_390-64/compiler/z/codegen/RegisterDependency.hpp:25,
16:23:41 [2019-11-01T20:23:41.336Z]                  from /home/jenkins/jenkins-agent/workspace/PullRequest-linux_390-64/compiler/z/codegen/UnaryEvaluator.cpp:32:
16:23:41 [2019-11-01T20:23:41.336Z] /home/jenkins/jenkins-agent/workspace/PullRequest-linux_390-64/compiler/codegen/OMRRegisterDependency.hpp: In member function ‘void OMR::RegisterDependencyMap::addDependency(OMR::RealRegister::RegNum, TR::RealRegister*, uint32_t)’:
16:23:41 [2019-11-01T20:23:41.336Z] /home/jenkins/jenkins-agent/workspace/PullRequest-linux_390-64/compiler/codegen/OMRRegisterDependency.hpp:194:76: warning: comparison between ‘enum OMR::RealRegister::RegNum’ and ‘enum OMR::RealRegister::RegDep’ [-Wenum-compare]
16:23:41 [2019-11-01T20:23:41.336Z]        if (regNum != TR::RealRegister::NoReg && regNum != TR::RealRegister::SpilledReg && regNum < TR::RealRegister::NumRegisters)
16:23:41 [2019-11-01T20:23:41.336Z]                                                                             ^
16:23:41 [2019-11-01T20:23:41.336Z] /home/jenkins/jenkins-agent/workspace/PullRequest-linux_390-64/compiler/codegen/OMRRegisterDependency.hpp:194:117: warning: comparison between ‘enum OMR::RealRegister::RegNum’ and ‘enum OMR::RealRegister::RegDep’ [-Wenum-compare]
16:23:41 [2019-11-01T20:23:41.336Z]        if (regNum != TR::RealRegister::NoReg && regNum != TR::RealRegister::SpilledReg && regNum < TR::RealRegister::NumRegisters)
16:23:41 [2019-11-01T20:23:41.336Z]                                                                                                                      ^
16:23:41 [2019-11-01T20:23:41.336Z] /home/jenkins/jenkins-agent/workspace/PullRequest-linux_390-64/compiler/codegen/OMRRegisterDependency.hpp:196:58: warning: comparison between ‘enum OMR::RealRegister::RegNum’ and ‘enum OMR::RealRegister::RegDep’ [-Wenum-compare]
16:23:41 [2019-11-01T20:23:41.336Z]           TR_ASSERT(regNum >= 0 && regNum < TR::RealRegister::NumRegisters, "Register number (%d) used as index but out of range!", regNum);
16:23:41 [2019-11-01T20:23:41.336Z]                                                           ^
16:23:41 [2019-11-01T20:23:41.336Z] In file included from /home/jenkins/jenkins-agent/workspace/PullRequest-linux_390-64/compiler/z/codegen/OMRRegisterDependency.hpp:36:0,
16:23:41 [2019-11-01T20:23:41.336Z]                  from /home/jenkins/jenkins-agent/workspace/PullRequest-linux_390-64/compiler/z/codegen/RegisterDependency.hpp:25,
16:23:41 [2019-11-01T20:23:41.336Z]                  from /home/jenkins/jenkins-agent/workspace/PullRequest-linux_390-64/compiler/z/codegen/UnaryEvaluator.cpp:32:
16:23:41 [2019-11-01T20:23:41.336Z] /home/jenkins/jenkins-agent/workspace/PullRequest-linux_390-64/compiler/codegen/OMRRegisterDependency.hpp:205:52: warning: comparison between ‘enum OMR::RealRegister::RegNum’ and ‘enum OMR::RealRegister::RegDep’ [-Wenum-compare]
16:23:41 [2019-11-01T20:23:41.336Z]           TR_ASSERT(arr >= 0 && arr < TR::RealRegister::NumRegisters, "Register number (%d) used as index but out of range!", arr);
16:23:41 [2019-11-01T20:23:41.336Z]                                                     ^
16:23:41 [2019-11-01T20:23:41.336Z] [ 91%] Building CXX object jitbuilder/CMakeFiles/jitbuilder.dir/__/compiler/z/codegen/OMRInstructionDelegate.cpp.o
16:23:41 [2019-11-01T20:23:41.336Z] [ 91%] Building CXX object jitbuilder/CMakeFiles/jitbuilder.dir/__/compiler/z/codegen/InstOpCode.cpp.o
16:23:41 [2019-11-01T20:23:41.336Z] In file included from /home/jenkins/jenkins-agent/workspace/PullRequest-linux_390-64/compiler/z/codegen/OMRRegisterDependency.hpp:36:0,
16:23:41 [2019-11-01T20:23:41.336Z]                  from /home/jenkins/jenkins-agent/workspace/PullRequest-linux_390-64/compiler/z/codegen/RegisterDependency.hpp:25,
16:23:41 [2019-11-01T20:23:41.336Z]                  from /home/jenkins/jenkins-agent/workspace/PullRequest-linux_390-64/compiler/z/codegen/OMRLinkage.hpp:49,
16:23:41 [2019-11-01T20:23:41.336Z]                  from /home/jenkins/jenkins-agent/workspace/PullRequest-linux_390-64/compiler/z/codegen/Linkage.hpp:25,
16:23:41 [2019-11-01T20:23:41.336Z]                  from /home/jenkins/jenkins-agent/workspace/PullRequest-linux_390-64/compiler/z/codegen/OMRInstruction.cpp:41:
16:23:41 [2019-11-01T20:23:41.336Z] /home/jenkins/jenkins-agent/workspace/PullRequest-linux_390-64/compiler/codegen/OMRRegisterDependency.hpp: In member function ‘TR::RegisterDependency* OMR::RegisterDependencyMap::getDependencyWithSourceAssigned(OMR::RealRegister::RegNum)’:
16:23:41 [2019-11-01T20:23:41.336Z] /home/jenkins/jenkins-agent/workspace/PullRequest-linux_390-64/compiler/codegen/OMRRegisterDependency.hpp:136:55: warning: comparison between ‘enum OMR::RealRegister::RegNum’ and ‘enum OMR::RealRegister::RegDep’ [-Wenum-compare]
16:23:41 [2019-11-01T20:23:41.337Z]        TR_ASSERT(regNum >= 0 && regNum < TR::RealRegister::NumRegisters, "Register number (%d) used as index but out of range!", regNum);
16:23:41 [2019-11-01T20:23:41.337Z]                                                        ^
16:23:41 [2019-11-01T20:23:41.337Z] In file included from /home/jenkins/jenkins-agent/workspace/PullRequest-linux_390-64/compiler/z/codegen/OMRRegisterDependency.hpp:36:0,
16:23:41 [2019-11-01T20:23:41.337Z]                  from /home/jenkins/jenkins-agent/workspace/PullRequest-linux_390-64/compiler/z/codegen/RegisterDependency.hpp:25,
16:23:41 [2019-11-01T20:23:41.337Z]                  from /home/jenkins/jenkins-agent/workspace/PullRequest-linux_390-64/compiler/z/codegen/OMRLinkage.hpp:49,
16:23:41 [2019-11-01T20:23:41.337Z]                  from /home/jenkins/jenkins-agent/workspace/PullRequest-linux_390-64/compiler/z/codegen/Linkage.hpp:25,
16:23:41 [2019-11-01T20:23:41.337Z]                  from /home/jenkins/jenkins-agent/workspace/PullRequest-linux_390-64/compiler/z/codegen/OMRInstruction.cpp:41:
16:23:41 [2019-11-01T20:23:41.337Z] /home/jenkins/jenkins-agent/workspace/PullRequest-linux_390-64/compiler/codegen/OMRRegisterDependency.hpp: In member function ‘TR::RegisterDependency* OMR::RegisterDependencyMap::getDependencyWithTarget(OMR::RealRegister::RegNum)’:
16:23:41 [2019-11-01T20:23:41.337Z] /home/jenkins/jenkins-agent/workspace/PullRequest-linux_390-64/compiler/codegen/OMRRegisterDependency.hpp:152:55: warning: comparison between ‘enum OMR::RealRegister::RegNum’ and ‘enum OMR::RealRegister::RegDep’ [-Wenum-compare]
16:23:41 [2019-11-01T20:23:41.337Z]        TR_ASSERT(regNum >= 0 && regNum < TR::RealRegister::NumRegisters, "Register number (%d) used as index but out of range!", regNum);
16:23:41 [2019-11-01T20:23:41.337Z]                                                        ^
16:23:41 [2019-11-01T20:23:41.337Z] In file included from /home/jenkins/jenkins-agent/workspace/PullRequest-linux_390-64/compiler/z/codegen/OMRRegisterDependency.hpp:36:0,
16:23:41 [2019-11-01T20:23:41.337Z]                  from /home/jenkins/jenkins-agent/workspace/PullRequest-linux_390-64/compiler/z/codegen/RegisterDependency.hpp:25,
16:23:41 [2019-11-01T20:23:41.337Z]                  from /home/jenkins/jenkins-agent/workspace/PullRequest-linux_390-64/compiler/z/codegen/OMRLinkage.hpp:49,
16:23:41 [2019-11-01T20:23:41.337Z]                  from /home/jenkins/jenkins-agent/workspace/PullRequest-linux_390-64/compiler/z/codegen/Linkage.hpp:25,
16:23:41 [2019-11-01T20:23:41.337Z]                  from /home/jenkins/jenkins-agent/workspace/PullRequest-linux_390-64/compiler/z/codegen/OMRInstruction.cpp:41:
16:23:41 [2019-11-01T20:23:41.337Z] /home/jenkins/jenkins-agent/workspace/PullRequest-linux_390-64/compiler/codegen/OMRRegisterDependency.hpp:154:41: warning: comparison between ‘enum OMR::RealRegister::RegNum’ and ‘enum OMR::RealRegister::RegDep’ [-Wenum-compare]
16:23:41 [2019-11-01T20:23:41.337Z]        TR_ASSERT(regNum != TR::RealRegister::SpilledReg, "Multiple dependencies can map to 'SpilledReg', can't return just one");
16:23:41 [2019-11-01T20:23:41.337Z]                                          ^
16:23:41 [2019-11-01T20:23:41.337Z] In file included from /home/jenkins/jenkins-agent/workspace/PullRequest-linux_390-64/compiler/z/codegen/OMRRegisterDependency.hpp:36:0,
16:23:41 [2019-11-01T20:23:41.337Z]                  from /home/jenkins/jenkins-agent/workspace/PullRequest-linux_390-64/compiler/z/codegen/RegisterDependency.hpp:25,
16:23:41 [2019-11-01T20:23:41.337Z]                  from /home/jenkins/jenkins-agent/workspace/PullRequest-linux_390-64/compiler/z/codegen/OMRLinkage.hpp:49,
16:23:41 [2019-11-01T20:23:41.337Z]                  from /home/jenkins/jenkins-agent/workspace/PullRequest-linux_390-64/compiler/z/codegen/Linkage.hpp:25,
16:23:41 [2019-11-01T20:23:41.337Z]                  from /home/jenkins/jenkins-agent/workspace/PullRequest-linux_390-64/compiler/z/codegen/OMRInstruction.cpp:41:
16:23:41 [2019-11-01T20:23:41.337Z] /home/jenkins/jenkins-agent/workspace/PullRequest-linux_390-64/compiler/codegen/OMRRegisterDependency.hpp: In member function ‘void OMR::RegisterDependencyMap::addDependency(OMR::RealRegister::RegNum, TR::RealRegister*, uint32_t)’:
16:23:41 [2019-11-01T20:23:41.337Z] /home/jenkins/jenkins-agent/workspace/PullRequest-linux_390-64/compiler/codegen/OMRRegisterDependency.hpp:194:76: warning: comparison between ‘enum OMR::RealRegister::RegNum’ and ‘enum OMR::RealRegister::RegDep’ [-Wenum-compare]
16:23:41 [2019-11-01T20:23:41.337Z]        if (regNum != TR::RealRegister::NoReg && regNum != TR::RealRegister::SpilledReg && regNum < TR::RealRegister::NumRegisters)
16:23:41 [2019-11-01T20:23:41.337Z]                                                                             ^
16:23:41 [2019-11-01T20:23:41.337Z] /home/jenkins/jenkins-agent/workspace/PullRequest-linux_390-64/compiler/codegen/OMRRegisterDependency.hpp:194:117: warning: comparison between ‘enum OMR::RealRegister::RegNum’ and ‘enum OMR::RealRegister::RegDep’ [-Wenum-compare]
16:23:41 [2019-11-01T20:23:41.337Z]        if (regNum != TR::RealRegister::NoReg && regNum != TR::RealRegister::SpilledReg && regNum < TR::RealRegister::NumRegisters)
16:23:41 [2019-11-01T20:23:41.337Z]                                                                                                                      ^
16:23:41 [2019-11-01T20:23:41.337Z] /home/jenkins/jenkins-agent/workspace/PullRequest-linux_390-64/compiler/codegen/OMRRegisterDependency.hpp:196:58: warning: comparison between ‘enum OMR::RealRegister::RegNum’ and ‘enum OMR::RealRegister::RegDep’ [-Wenum-compare]
16:23:41 [2019-11-01T20:23:41.337Z]           TR_ASSERT(regNum >= 0 && regNum < TR::RealRegister::NumRegisters, "Register number (%d) used as index but out of range!", regNum);
16:23:41 [2019-11-01T20:23:41.337Z]                                                           ^
16:23:41 [2019-11-01T20:23:41.337Z] In file included from /home/jenkins/jenkins-agent/workspace/PullRequest-linux_390-64/compiler/z/codegen/OMRRegisterDependency.hpp:36:0,
16:23:41 [2019-11-01T20:23:41.337Z]                  from /home/jenkins/jenkins-agent/workspace/PullRequest-linux_390-64/compiler/z/codegen/RegisterDependency.hpp:25,
16:23:41 [2019-11-01T20:23:41.337Z]                  from /home/jenkins/jenkins-agent/workspace/PullRequest-linux_390-64/compiler/z/codegen/OMRLinkage.hpp:49,
16:23:41 [2019-11-01T20:23:41.337Z]                  from /home/jenkins/jenkins-agent/workspace/PullRequest-linux_390-64/compiler/z/codegen/Linkage.hpp:25,
16:23:41 [2019-11-01T20:23:41.337Z]                  from /home/jenkins/jenkins-agent/workspace/PullRequest-linux_390-64/compiler/z/codegen/OMRInstruction.cpp:41:
16:23:41 [2019-11-01T20:23:41.337Z] /home/jenkins/jenkins-agent/workspace/PullRequest-linux_390-64/compiler/codegen/OMRRegisterDependency.hpp:205:52: warning: comparison between ‘enum OMR::RealRegister::RegNum’ and ‘enum OMR::RealRegister::RegDep’ [-Wenum-compare]
16:23:41 [2019-11-01T20:23:41.337Z]           TR_ASSERT(arr >= 0 && arr < TR::RealRegister::NumRegisters, "Register number (%d) used as index but out of range!", arr);
16:23:41 [2019-11-01T20:23:41.337Z]                                                     ^
16:23:41 [2019-11-01T20:23:41.337Z] [ 91%] Building CXX object jitbuilder/CMakeFiles/jitbuilder.dir/__/compiler/z/codegen/OMRRegister.cpp.o
16:23:41 [2019-11-01T20:23:41.784Z] [ 91%] Building CXX object jitbuilder/CMakeFiles/jitbuilder.dir/__/compiler/z/codegen/OMRRealRegister.cpp.o
16:23:41 [2019-11-01T20:23:41.784Z] [ 91%] Building CXX object jitbuilder/CMakeFiles/jitbuilder.dir/__/compiler/z/codegen/OMRCodeGenPhase.cpp.o
16:23:41 [2019-11-01T20:23:41.784Z] [ 91%] Building CXX object jitbuilder/CMakeFiles/jitbuilder.dir/__/compiler/z/codegen/OMRCodeGenerator.cpp.o
16:23:41 [2019-11-01T20:23:41.784Z] [ 91%] Building CXX object jitbuilder/CMakeFiles/jitbuilder.dir/__/compiler/z/codegen/snippet/PPA1Snippet.cpp.o
16:23:41 [2019-11-01T20:23:41.784Z] [ 91%] Building CXX object jitbuilder/CMakeFiles/jitbuilder.dir/__/compiler/z/codegen/snippet/PPA2Snippet.cpp.o
16:23:41 [2019-11-01T20:23:41.784Z] In file included from /home/jenkins/jenkins-agent/workspace/PullRequest-linux_390-64/compiler/z/codegen/OMRRegisterDependency.hpp:36:0,
16:23:41 [2019-11-01T20:23:41.784Z]                  from /home/jenkins/jenkins-agent/workspace/PullRequest-linux_390-64/compiler/z/codegen/RegisterDependency.hpp:25,
16:23:41 [2019-11-01T20:23:41.784Z]                  from /home/jenkins/jenkins-agent/workspace/PullRequest-linux_390-64/compiler/z/codegen/OMRLinkage.hpp:49,
16:23:41 [2019-11-01T20:23:41.784Z]                  from /home/jenkins/jenkins-agent/workspace/PullRequest-linux_390-64/compiler/z/codegen/Linkage.hpp:25,
16:23:41 [2019-11-01T20:23:41.784Z]                  from /home/jenkins/jenkins-agent/workspace/PullRequest-linux_390-64/compiler/z/codegen/snippet/PPA1Snippet.cpp:22:
16:23:41 [2019-11-01T20:23:41.784Z] /home/jenkins/jenkins-agent/workspace/PullRequest-linux_390-64/compiler/codegen/OMRRegisterDependency.hpp: In member function ‘TR::RegisterDependency* OMR::RegisterDependencyMap::getDependencyWithSourceAssigned(OMR::RealRegister::RegNum)’:
16:23:41 [2019-11-01T20:23:41.784Z] /home/jenkins/jenkins-agent/workspace/PullRequest-linux_390-64/compiler/codegen/OMRRegisterDependency.hpp:136:55: warning: comparison between ‘enum OMR::RealRegister::RegNum’ and ‘enum OMR::RealRegister::RegDep’ [-Wenum-compare]
16:23:41 [2019-11-01T20:23:41.784Z]        TR_ASSERT(regNum >= 0 && regNum < TR::RealRegister::NumRegisters, "Register number (%d) used as index but out of range!", regNum);
16:23:41 [2019-11-01T20:23:41.784Z]                                                        ^
16:23:41 [2019-11-01T20:23:41.784Z] In file included from /home/jenkins/jenkins-agent/workspace/PullRequest-linux_390-64/compiler/z/codegen/OMRRegisterDependency.hpp:36:0,
16:23:41 [2019-11-01T20:23:41.784Z]                  from /home/jenkins/jenkins-agent/workspace/PullRequest-linux_390-64/compiler/z/codegen/RegisterDependency.hpp:25,
16:23:41 [2019-11-01T20:23:41.784Z]                  from /home/jenkins/jenkins-agent/workspace/PullRequest-linux_390-64/compiler/z/codegen/OMRLinkage.hpp:49,
16:23:41 [2019-11-01T20:23:41.784Z]                  from /home/jenkins/jenkins-agent/workspace/PullRequest-linux_390-64/compiler/z/codegen/Linkage.hpp:25,
16:23:41 [2019-11-01T20:23:41.784Z]                  from /home/jenkins/jenkins-agent/workspace/PullRequest-linux_390-64/compiler/z/codegen/snippet/PPA1Snippet.cpp:22:
16:23:41 [2019-11-01T20:23:41.784Z] /home/jenkins/jenkins-agent/workspace/PullRequest-linux_390-64/compiler/codegen/OMRRegisterDependency.hpp: In member function ‘TR::RegisterDependency* OMR::RegisterDependencyMap::getDependencyWithTarget(OMR::RealRegister::RegNum)’:
16:23:41 [2019-11-01T20:23:41.784Z] /home/jenkins/jenkins-agent/workspace/PullRequest-linux_390-64/compiler/codegen/OMRRegisterDependency.hpp:152:55: warning: comparison between ‘enum OMR::RealRegister::RegNum’ and ‘enum OMR::RealRegister::RegDep’ [-Wenum-compare]
16:23:41 [2019-11-01T20:23:41.784Z]        TR_ASSERT(regNum >= 0 && regNum < TR::RealRegister::NumRegisters, "Register number (%d) used as index but out of range!", regNum);
16:23:41 [2019-11-01T20:23:41.784Z]                                                        ^
16:23:41 [2019-11-01T20:23:41.784Z] In file included from /home/jenkins/jenkins-agent/workspace/PullRequest-linux_390-64/compiler/z/codegen/OMRRegisterDependency.hpp:36:0,
16:23:41 [2019-11-01T20:23:41.784Z]                  from /home/jenkins/jenkins-agent/workspace/PullRequest-linux_390-64/compiler/z/codegen/RegisterDependency.hpp:25,
16:23:41 [2019-11-01T20:23:41.784Z]                  from /home/jenkins/jenkins-agent/workspace/PullRequest-linux_390-64/compiler/z/codegen/OMRLinkage.hpp:49,
16:23:41 [2019-11-01T20:23:41.784Z]                  from /home/jenkins/jenkins-agent/workspace/PullRequest-linux_390-64/compiler/z/codegen/Linkage.hpp:25,
16:23:41 [2019-11-01T20:23:41.784Z]                  from /home/jenkins/jenkins-agent/workspace/PullRequest-linux_390-64/compiler/z/codegen/snippet/PPA1Snippet.cpp:22:
16:23:41 [2019-11-01T20:23:41.784Z] /home/jenkins/jenkins-agent/workspace/PullRequest-linux_390-64/compiler/codegen/OMRRegisterDependency.hpp:154:41: warning: comparison between ‘enum OMR::RealRegister::RegNum’ and ‘enum OMR::RealRegister::RegDep’ [-Wenum-compare]
16:23:41 [2019-11-01T20:23:41.784Z]        TR_ASSERT(regNum != TR::RealRegister::SpilledReg, "Multiple dependencies can map to 'SpilledReg', can't return just one");
16:23:41 [2019-11-01T20:23:41.784Z]                                          ^
16:23:41 [2019-11-01T20:23:41.784Z] In file included from /home/jenkins/jenkins-agent/workspace/PullRequest-linux_390-64/compiler/z/codegen/OMRRegisterDependency.hpp:36:0,
16:23:41 [2019-11-01T20:23:41.784Z]                  from /home/jenkins/jenkins-agent/workspace/PullRequest-linux_390-64/compiler/z/codegen/RegisterDependency.hpp:25,
16:23:41 [2019-11-01T20:23:41.784Z]                  from /home/jenkins/jenkins-agent/workspace/PullRequest-linux_390-64/compiler/z/codegen/OMRLinkage.hpp:49,
16:23:41 [2019-11-01T20:23:41.784Z]                  from /home/jenkins/jenkins-agent/workspace/PullRequest-linux_390-64/compiler/z/codegen/Linkage.hpp:25,
16:23:41 [2019-11-01T20:23:41.784Z]                  from /home/jenkins/jenkins-agent/workspace/PullRequest-linux_390-64/compiler/z/codegen/snippet/PPA1Snippet.cpp:22:
16:23:41 [2019-11-01T20:23:41.784Z] /home/jenkins/jenkins-agent/workspace/PullRequest-linux_390-64/compiler/codegen/OMRRegisterDependency.hpp: In member function ‘void OMR::RegisterDependencyMap::addDependency(OMR::RealRegister::RegNum, TR::RealRegister*, uint32_t)’:
16:23:41 [2019-11-01T20:23:41.784Z] /home/jenkins/jenkins-agent/workspace/PullRequest-linux_390-64/compiler/codegen/OMRRegisterDependency.hpp:194:76: warning: comparison between ‘enum OMR::RealRegister::RegNum’ and ‘enum OMR::RealRegister::RegDep’ [-Wenum-compare]
16:23:41 [2019-11-01T20:23:41.784Z]        if (regNum != TR::RealRegister::NoReg && regNum != TR::RealRegister::SpilledReg && regNum < TR::RealRegister::NumRegisters)
16:23:41 [2019-11-01T20:23:41.784Z]                                                                             ^
16:23:41 [2019-11-01T20:23:41.784Z] /home/jenkins/jenkins-agent/workspace/PullRequest-linux_390-64/compiler/codegen/OMRRegisterDependency.hpp:194:117: warning: comparison between ‘enum OMR::RealRegister::RegNum’ and ‘enum OMR::RealRegister::RegDep’ [-Wenum-compare]
16:23:41 [2019-11-01T20:23:41.784Z]        if (regNum != TR::RealRegister::NoReg && regNum != TR::RealRegister::SpilledReg && regNum < TR::RealRegister::NumRegisters)
16:23:41 [2019-11-01T20:23:41.784Z]                                                                                                                      ^
16:23:41 [2019-11-01T20:23:41.784Z] /home/jenkins/jenkins-agent/workspace/PullRequest-linux_390-64/compiler/codegen/OMRRegisterDependency.hpp:196:58: warning: comparison between ‘enum OMR::RealRegister::RegNum’ and ‘enum OMR::RealRegister::RegDep’ [-Wenum-compare]
16:23:41 [2019-11-01T20:23:41.784Z]           TR_ASSERT(regNum >= 0 && regNum < TR::RealRegister::NumRegisters, "Register number (%d) used as index but out of range!", regNum);
16:23:41 [2019-11-01T20:23:41.784Z]                                                           ^
16:23:41 [2019-11-01T20:23:41.784Z] In file included from /home/jenkins/jenkins-agent/workspace/PullRequest-linux_390-64/compiler/z/codegen/OMRRegisterDependency.hpp:36:0,
16:23:41 [2019-11-01T20:23:41.784Z]                  from /home/jenkins/jenkins-agent/workspace/PullRequest-linux_390-64/compiler/z/codegen/RegisterDependency.hpp:25,
16:23:41 [2019-11-01T20:23:41.784Z]                  from /home/jenkins/jenkins-agent/workspace/PullRequest-linux_390-64/compiler/z/codegen/OMRLinkage.hpp:49,
16:23:41 [2019-11-01T20:23:41.784Z]                  from /home/jenkins/jenkins-agent/workspace/PullRequest-linux_390-64/compiler/z/codegen/Linkage.hpp:25,
16:23:41 [2019-11-01T20:23:41.784Z]                  from /home/jenkins/jenkins-agent/workspace/PullRequest-linux_390-64/compiler/z/codegen/snippet/PPA1Snippet.cpp:22:
16:23:41 [2019-11-01T20:23:41.784Z] /home/jenkins/jenkins-agent/workspace/PullRequest-linux_390-64/compiler/codegen/OMRRegisterDependency.hpp:205:52: warning: comparison between ‘enum OMR::RealRegister::RegNum’ and ‘enum OMR::RealRegister::RegDep’ [-Wenum-compare]
16:23:41 [2019-11-01T20:23:41.784Z]           TR_ASSERT(arr >= 0 && arr < TR::RealRegister::NumRegisters, "Register number (%d) used as index but out of range!", arr);
16:23:41 [2019-11-01T20:23:41.784Z]                                                     ^
16:23:41 [2019-11-01T20:23:41.784Z] In file included from /home/jenkins/jenkins-agent/workspace/PullRequest-linux_390-64/compiler/z/codegen/OMRRegisterDependency.hpp:36:0,
16:23:41 [2019-11-01T20:23:41.784Z]                  from /home/jenkins/jenkins-agent/workspace/PullRequest-linux_390-64/compiler/z/codegen/RegisterDependency.hpp:25,
16:23:41 [2019-11-01T20:23:41.784Z]                  from /home/jenkins/jenkins-agent/workspace/PullRequest-linux_390-64/compiler/z/codegen/OMRLinkage.hpp:49,
16:23:41 [2019-11-01T20:23:41.784Z]                  from /home/jenkins/jenkins-agent/workspace/PullRequest-linux_390-64/compiler/z/codegen/Linkage.hpp:25,
16:23:41 [2019-11-01T20:23:41.784Z]                  from /home/jenkins/jenkins-agent/workspace/PullRequest-linux_390-64/compiler/z/codegen/OMRCodeGenerator.cpp:47:
16:23:41 [2019-11-01T20:23:41.785Z] /home/jenkins/jenkins-agent/workspace/PullRequest-linux_390-64/compiler/codegen/OMRRegisterDependency.hpp: In member function ‘TR::RegisterDependency* OMR::RegisterDependencyMap::getDependencyWithSourceAssigned(OMR::RealRegister::RegNum)’:
16:23:41 [2019-11-01T20:23:41.785Z] /home/jenkins/jenkins-agent/workspace/PullRequest-linux_390-64/compiler/codegen/OMRRegisterDependency.hpp:136:55: warning: comparison between ‘enum OMR::RealRegister::RegNum’ and ‘enum OMR::RealRegister::RegDep’ [-Wenum-compare]
16:23:41 [2019-11-01T20:23:41.785Z]        TR_ASSERT(regNum >= 0 && regNum < TR::RealRegister::NumRegisters, "Register number (%d) used as index but out of range!", regNum);
16:23:41 [2019-11-01T20:23:41.785Z]                                                        ^
16:23:41 [2019-11-01T20:23:41.785Z] In file included from /home/jenkins/jenkins-agent/workspace/PullRequest-linux_390-64/compiler/z/codegen/OMRRegisterDependency.hpp:36:0,
16:23:41 [2019-11-01T20:23:41.785Z]                  from /home/jenkins/jenkins-agent/workspace/PullRequest-linux_390-64/compiler/z/codegen/RegisterDependency.hpp:25,
16:23:41 [2019-11-01T20:23:41.785Z]                  from /home/jenkins/jenkins-agent/workspace/PullRequest-linux_390-64/compiler/z/codegen/OMRLinkage.hpp:49,
16:23:41 [2019-11-01T20:23:41.785Z]                  from /home/jenkins/jenkins-agent/workspace/PullRequest-linux_390-64/compiler/z/codegen/Linkage.hpp:25,
16:23:41 [2019-11-01T20:23:41.785Z]                  from /home/jenkins/jenkins-agent/workspace/PullRequest-linux_390-64/compiler/z/codegen/OMRCodeGenerator.cpp:47:
16:23:41 [2019-11-01T20:23:41.785Z] /home/jenkins/jenkins-agent/workspace/PullRequest-linux_390-64/compiler/codegen/OMRRegisterDependency.hpp: In member function ‘TR::RegisterDependency* OMR::RegisterDependencyMap::getDependencyWithTarget(OMR::RealRegister::RegNum)’:
16:23:41 [2019-11-01T20:23:41.785Z] /home/jenkins/jenkins-agent/workspace/PullRequest-linux_390-64/compiler/codegen/OMRRegisterDependency.hpp:152:55: warning: comparison between ‘enum OMR::RealRegister::RegNum’ and ‘enum OMR::RealRegister::RegDep’ [-Wenum-compare]
16:23:41 [2019-11-01T20:23:41.785Z]        TR_ASSERT(regNum >= 0 && regNum < TR::RealRegister::NumRegisters, "Register number (%d) used as index but out of range!", regNum);
16:23:41 [2019-11-01T20:23:41.785Z]                                                        ^
16:23:41 [2019-11-01T20:23:41.785Z] In file included from /home/jenkins/jenkins-agent/workspace/PullRequest-linux_390-64/compiler/z/codegen/OMRRegisterDependency.hpp:36:0,
16:23:41 [2019-11-01T20:23:41.785Z]                  from /home/jenkins/jenkins-agent/workspace/PullRequest-linux_390-64/compiler/z/codegen/RegisterDependency.hpp:25,
16:23:41 [2019-11-01T20:23:41.785Z]                  from /home/jenkins/jenkins-agent/workspace/PullRequest-linux_390-64/compiler/z/codegen/OMRLinkage.hpp:49,
16:23:41 [2019-11-01T20:23:41.785Z]                  from /home/jenkins/jenkins-agent/workspace/PullRequest-linux_390-64/compiler/z/codegen/Linkage.hpp:25,
16:23:41 [2019-11-01T20:23:41.785Z]                  from /home/jenkins/jenkins-agent/workspace/PullRequest-linux_390-64/compiler/z/codegen/OMRCodeGenerator.cpp:47:
16:23:41 [2019-11-01T20:23:41.785Z] /home/jenkins/jenkins-agent/workspace/PullRequest-linux_390-64/compiler/codegen/OMRRegisterDependency.hpp:154:41: warning: comparison between ‘enum OMR::RealRegister::RegNum’ and ‘enum OMR::RealRegister::RegDep’ [-Wenum-compare]
16:23:41 [2019-11-01T20:23:41.785Z]        TR_ASSERT(regNum != TR::RealRegister::SpilledReg, "Multiple dependencies can map to 'SpilledReg', can't return just one");
16:23:41 [2019-11-01T20:23:41.785Z]                                          ^
16:23:41 [2019-11-01T20:23:41.785Z] In file included from /home/jenkins/jenkins-agent/workspace/PullRequest-linux_390-64/compiler/z/codegen/OMRRegisterDependency.hpp:36:0,
16:23:41 [2019-11-01T20:23:41.785Z]                  from /home/jenkins/jenkins-agent/workspace/PullRequest-linux_390-64/compiler/z/codegen/RegisterDependency.hpp:25,
16:23:41 [2019-11-01T20:23:41.785Z]                  from /home/jenkins/jenkins-agent/workspace/PullRequest-linux_390-64/compiler/z/codegen/OMRLinkage.hpp:49,
16:23:41 [2019-11-01T20:23:41.785Z]                  from /home/jenkins/jenkins-agent/workspace/PullRequest-linux_390-64/compiler/z/codegen/Linkage.hpp:25,
16:23:41 [2019-11-01T20:23:41.785Z]                  from /home/jenkins/jenkins-agent/workspace/PullRequest-linux_390-64/compiler/z/codegen/OMRCodeGenerator.cpp:47:
16:23:41 [2019-11-01T20:23:41.785Z] /home/jenkins/jenkins-agent/workspace/PullRequest-linux_390-64/compiler/codegen/OMRRegisterDependency.hpp: In member function ‘void OMR::RegisterDependencyMap::addDependency(OMR::RealRegister::RegNum, TR::RealRegister*, uint32_t)’:
16:23:41 [2019-11-01T20:23:41.785Z] /home/jenkins/jenkins-agent/workspace/PullRequest-linux_390-64/compiler/codegen/OMRRegisterDependency.hpp:194:76: warning: comparison between ‘enum OMR::RealRegister::RegNum’ and ‘enum OMR::RealRegister::RegDep’ [-Wenum-compare]
16:23:41 [2019-11-01T20:23:41.785Z]        if (regNum != TR::RealRegister::NoReg && regNum != TR::RealRegister::SpilledReg && regNum < TR::RealRegister::NumRegisters)
16:23:41 [2019-11-01T20:23:41.785Z]                                                                             ^
16:23:41 [2019-11-01T20:23:41.785Z] /home/jenkins/jenkins-agent/workspace/PullRequest-linux_390-64/compiler/codegen/OMRRegisterDependency.hpp:194:117: warning: comparison between ‘enum OMR::RealRegister::RegNum’ and ‘enum OMR::RealRegister::RegDep’ [-Wenum-compare]
16:23:41 [2019-11-01T20:23:41.785Z]        if (regNum != TR::RealRegister::NoReg && regNum != TR::RealRegister::SpilledReg && regNum < TR::RealRegister::NumRegisters)
16:23:41 [2019-11-01T20:23:41.785Z]                                                                                                                      ^
16:23:41 [2019-11-01T20:23:41.785Z] /home/jenkins/jenkins-agent/workspace/PullRequest-linux_390-64/compiler/codegen/OMRRegisterDependency.hpp:196:58: warning: comparison between ‘enum OMR::RealRegister::RegNum’ and ‘enum OMR::RealRegister::RegDep’ [-Wenum-compare]
16:23:41 [2019-11-01T20:23:41.785Z]           TR_ASSERT(regNum >= 0 && regNum < TR::RealRegister::NumRegisters, "Register number (%d) used as index but out of range!", regNum);
16:23:41 [2019-11-01T20:23:41.785Z]                                                           ^
16:23:41 [2019-11-01T20:23:41.785Z] In file included from /home/jenkins/jenkins-agent/workspace/PullRequest-linux_390-64/compiler/z/codegen/OMRRegisterDependency.hpp:36:0,
16:23:41 [2019-11-01T20:23:41.785Z]                  from /home/jenkins/jenkins-agent/workspace/PullRequest-linux_390-64/compiler/z/codegen/RegisterDependency.hpp:25,
16:23:41 [2019-11-01T20:23:41.785Z]                  from /home/jenkins/jenkins-agent/workspace/PullRequest-linux_390-64/compiler/z/codegen/OMRLinkage.hpp:49,
16:23:41 [2019-11-01T20:23:41.785Z]                  from /home/jenkins/jenkins-agent/workspace/PullRequest-linux_390-64/compiler/z/codegen/Linkage.hpp:25,
16:23:41 [2019-11-01T20:23:41.785Z]                  from /home/jenkins/jenkins-agent/workspace/PullRequest-linux_390-64/compiler/z/codegen/OMRCodeGenerator.cpp:47:
16:23:41 [2019-11-01T20:23:41.785Z] /home/jenkins/jenkins-agent/workspace/PullRequest-linux_390-64/compiler/codegen/OMRRegisterDependency.hpp:205:52: warning: comparison between ‘enum OMR::RealRegister::RegNum’ and ‘enum OMR::RealRegister::RegDep’ [-Wenum-compare]
16:23:41 [2019-11-01T20:23:41.785Z]           TR_ASSERT(arr >= 0 && arr < TR::RealRegister::NumRegisters, "Register number (%d) used as index but out of range!", arr);
16:23:41 [2019-11-01T20:23:41.785Z]                                                     ^
16:23:41 [2019-11-01T20:23:41.785Z] [ 91%] Building CXX object jitbuilder/CMakeFiles/jitbuilder.dir/__/compiler/z/codegen/snippet/XPLINKCallDescriptorSnippet.cpp.o
16:23:42 [2019-11-01T20:23:42.213Z] [ 91%] Building CXX object jitbuilder/CMakeFiles/jitbuilder.dir/__/compiler/z/env/OMRCPU.cpp.o
16:23:42 [2019-11-01T20:23:42.213Z] [ 91%] Building CXX object jitbuilder/CMakeFiles/jitbuilder.dir/__/compiler/z/env/OMRDebugEnv.cpp.o
16:23:42 [2019-11-01T20:23:42.213Z] In file included from /home/jenkins/jenkins-agent/workspace/PullRequest-linux_390-64/compiler/z/codegen/OMRRegisterDependency.hpp:36:0,
16:23:42 [2019-11-01T20:23:42.213Z]                  from /home/jenkins/jenkins-agent/workspace/PullRequest-linux_390-64/compiler/z/codegen/RegisterDependency.hpp:25,
16:23:42 [2019-11-01T20:23:42.213Z]                  from /home/jenkins/jenkins-agent/workspace/PullRequest-linux_390-64/compiler/z/codegen/OMRLinkage.hpp:49,
16:23:42 [2019-11-01T20:23:42.213Z]                  from /home/jenkins/jenkins-agent/workspace/PullRequest-linux_390-64/compiler/z/codegen/Linkage.hpp:25,
16:23:42 [2019-11-01T20:23:42.213Z]                  from /home/jenkins/jenkins-agent/workspace/PullRequest-linux_390-64/compiler/z/codegen/snippet/PPA2Snippet.cpp:22:
16:23:42 [2019-11-01T20:23:42.213Z] /home/jenkins/jenkins-agent/workspace/PullRequest-linux_390-64/compiler/codegen/OMRRegisterDependency.hpp: In member function ‘TR::RegisterDependency* OMR::RegisterDependencyMap::getDependencyWithSourceAssigned(OMR::RealRegister::RegNum)’:
16:23:42 [2019-11-01T20:23:42.213Z] /home/jenkins/jenkins-agent/workspace/PullRequest-linux_390-64/compiler/codegen/OMRRegisterDependency.hpp:136:55: warning: comparison between ‘enum OMR::RealRegister::RegNum’ and ‘enum OMR::RealRegister::RegDep’ [-Wenum-compare]
16:23:42 [2019-11-01T20:23:42.213Z]        TR_ASSERT(regNum >= 0 && regNum < TR::RealRegister::NumRegisters, "Register number (%d) used as index but out of range!", regNum);
16:23:42 [2019-11-01T20:23:42.213Z]                                                        ^
16:23:42 [2019-11-01T20:23:42.213Z] In file included from /home/jenkins/jenkins-agent/workspace/PullRequest-linux_390-64/compiler/z/codegen/OMRRegisterDependency.hpp:36:0,
16:23:42 [2019-11-01T20:23:42.213Z]                  from /home/jenkins/jenkins-agent/workspace/PullRequest-linux_390-64/compiler/z/codegen/RegisterDependency.hpp:25,
16:23:42 [2019-11-01T20:23:42.213Z]                  from /home/jenkins/jenkins-agent/workspace/PullRequest-linux_390-64/compiler/z/codegen/OMRLinkage.hpp:49,
16:23:42 [2019-11-01T20:23:42.213Z]                  from /home/jenkins/jenkins-agent/workspace/PullRequest-linux_390-64/compiler/z/codegen/Linkage.hpp:25,
16:23:42 [2019-11-01T20:23:42.213Z]                  from /home/jenkins/jenkins-agent/workspace/PullRequest-linux_390-64/compiler/z/codegen/snippet/PPA2Snippet.cpp:22:
16:23:42 [2019-11-01T20:23:42.213Z] /home/jenkins/jenkins-agent/workspace/PullRequest-linux_390-64/compiler/codegen/OMRRegisterDependency.hpp: In member function ‘TR::RegisterDependency* OMR::RegisterDependencyMap::getDependencyWithTarget(OMR::RealRegister::RegNum)’:
16:23:42 [2019-11-01T20:23:42.213Z] /home/jenkins/jenkins-agent/workspace/PullRequest-linux_390-64/compiler/codegen/OMRRegisterDependency.hpp:152:55: warning: comparison between ‘enum OMR::RealRegister::RegNum’ and ‘enum OMR::RealRegister::RegDep’ [-Wenum-compare]
16:23:42 [2019-11-01T20:23:42.213Z]        TR_ASSERT(regNum >= 0 && regNum < TR::RealRegister::NumRegisters, "Register number (%d) used as index but out of range!", regNum);
16:23:42 [2019-11-01T20:23:42.213Z]                                                        ^
16:23:42 [2019-11-01T20:23:42.213Z] In file included from /home/jenkins/jenkins-agent/workspace/PullRequest-linux_390-64/compiler/z/codegen/OMRRegisterDependency.hpp:36:0,
16:23:42 [2019-11-01T20:23:42.213Z]                  from /home/jenkins/jenkins-agent/workspace/PullRequest-linux_390-64/compiler/z/codegen/RegisterDependency.hpp:25,
16:23:42 [2019-11-01T20:23:42.213Z]                  from /home/jenkins/jenkins-agent/workspace/PullRequest-linux_390-64/compiler/z/codegen/OMRLinkage.hpp:49,
16:23:42 [2019-11-01T20:23:42.213Z]                  from /home/jenkins/jenkins-agent/workspace/PullRequest-linux_390-64/compiler/z/codegen/Linkage.hpp:25,
16:23:42 [2019-11-01T20:23:42.213Z]                  from /home/jenkins/jenkins-agent/workspace/PullRequest-linux_390-64/compiler/z/codegen/snippet/PPA2Snippet.cpp:22:
16:23:42 [2019-11-01T20:23:42.213Z] /home/jenkins/jenkins-agent/workspace/PullRequest-linux_390-64/compiler/codegen/OMRRegisterDependency.hpp:154:41: warning: comparison between ‘enum OMR::RealRegister::RegNum’ and ‘enum OMR::RealRegister::RegDep’ [-Wenum-compare]
16:23:42 [2019-11-01T20:23:42.213Z]        TR_ASSERT(regNum != TR::RealRegister::SpilledReg, "Multiple dependencies can map to 'SpilledReg', can't return just one");
16:23:42 [2019-11-01T20:23:42.213Z]                                          ^
16:23:42 [2019-11-01T20:23:42.213Z] In file included from /home/jenkins/jenkins-agent/workspace/PullRequest-linux_390-64/compiler/z/codegen/OMRRegisterDependency.hpp:36:0,
16:23:42 [2019-11-01T20:23:42.213Z]                  from /home/jenkins/jenkins-agent/workspace/PullRequest-linux_390-64/compiler/z/codegen/RegisterDependency.hpp:25,
16:23:42 [2019-11-01T20:23:42.213Z]                  from /home/jenkins/jenkins-agent/workspace/PullRequest-linux_390-64/compiler/z/codegen/OMRLinkage.hpp:49,
16:23:42 [2019-11-01T20:23:42.213Z]                  from /home/jenkins/jenkins-agent/workspace/PullRequest-linux_390-64/compiler/z/codegen/Linkage.hpp:25,
16:23:42 [2019-11-01T20:23:42.213Z]                  from /home/jenkins/jenkins-agent/workspace/PullRequest-linux_390-64/compiler/z/codegen/snippet/PPA2Snippet.cpp:22:
16:23:42 [2019-11-01T20:23:42.213Z] /home/jenkins/jenkins-agent/workspace/PullRequest-linux_390-64/compiler/codegen/OMRRegisterDependency.hpp: In member function ‘void OMR::RegisterDependencyMap::addDependency(OMR::RealRegister::RegNum, TR::RealRegister*, uint32_t)’:
16:23:42 [2019-11-01T20:23:42.213Z] /home/jenkins/jenkins-agent/workspace/PullRequest-linux_390-64/compiler/codegen/OMRRegisterDependency.hpp:194:76: warning: comparison between ‘enum OMR::RealRegister::RegNum’ and ‘enum OMR::RealRegister::RegDep’ [-Wenum-compare]
16:23:42 [2019-11-01T20:23:42.213Z]        if (regNum != TR::RealRegister::NoReg && regNum != TR::RealRegister::SpilledReg && regNum < TR::RealRegister::NumRegisters)
16:23:42 [2019-11-01T20:23:42.213Z]                                                                             ^
16:23:42 [2019-11-01T20:23:42.213Z] /home/jenkins/jenkins-agent/workspace/PullRequest-linux_390-64/compiler/codegen/OMRRegisterDependency.hpp:194:117: warning: comparison between ‘enum OMR::RealRegister::RegNum’ and ‘enum OMR::RealRegister::RegDep’ [-Wenum-compare]
16:23:42 [2019-11-01T20:23:42.213Z]        if (regNum != TR::RealRegister::NoReg && regNum != TR::RealRegister::SpilledReg && regNum < TR::RealRegister::NumRegisters)
16:23:42 [2019-11-01T20:23:42.213Z]                                                                                                                      ^
16:23:42 [2019-11-01T20:23:42.213Z] /home/jenkins/jenkins-agent/workspace/PullRequest-linux_390-64/compiler/codegen/OMRRegisterDependency.hpp:196:58: warning: comparison between ‘enum OMR::RealRegister::RegNum’ and ‘enum OMR::RealRegister::RegDep’ [-Wenum-compare]
16:23:42 [2019-11-01T20:23:42.213Z]           TR_ASSERT(regNum >= 0 && regNum < TR::RealRegister::NumRegisters, "Register number (%d) used as index but out of range!", regNum);
16:23:42 [2019-11-01T20:23:42.213Z]                                                           ^
16:23:42 [2019-11-01T20:23:42.213Z] In file included from /home/jenkins/jenkins-agent/workspace/PullRequest-linux_390-64/compiler/z/codegen/OMRRegisterDependency.hpp:36:0,
16:23:42 [2019-11-01T20:23:42.213Z]                  from /home/jenkins/jenkins-agent/workspace/PullRequest-linux_390-64/compiler/z/codegen/RegisterDependency.hpp:25,
16:23:42 [2019-11-01T20:23:42.213Z]                  from /home/jenkins/jenkins-agent/workspace/PullRequest-linux_390-64/compiler/z/codegen/OMRLinkage.hpp:49,
16:23:42 [2019-11-01T20:23:42.213Z]                  from /home/jenkins/jenkins-agent/workspace/PullRequest-linux_390-64/compiler/z/codegen/Linkage.hpp:25,
16:23:42 [2019-11-01T20:23:42.213Z]                  from /home/jenkins/jenkins-agent/workspace/PullRequest-linux_390-64/compiler/z/codegen/snippet/PPA2Snippet.cpp:22:
16:23:42 [2019-11-01T20:23:42.213Z] /home/jenkins/jenkins-agent/workspace/PullRequest-linux_390-64/compiler/codegen/OMRRegisterDependency.hpp:205:52: warning: comparison between ‘enum OMR::RealRegister::RegNum’ and ‘enum OMR::RealRegister::RegDep’ [-Wenum-compare]
16:23:42 [2019-11-01T20:23:42.213Z]           TR_ASSERT(arr >= 0 && arr < TR::RealRegister::NumRegisters, "Register number (%d) used as index but out of range!", arr);
16:23:42 [2019-11-01T20:23:42.213Z]                                                     ^
16:23:42 [2019-11-01T20:23:42.213Z] [ 91%] Building CXX object jitbuilder/CMakeFiles/jitbuilder.dir/__/compiler/z/runtime/VirtualGuardRuntime.cpp.o
16:23:42 [2019-11-01T20:23:42.213Z] In file included from /home/jenkins/jenkins-agent/workspace/PullRequest-linux_390-64/compiler/z/codegen/OMRRegisterDependency.hpp:36:0,
16:23:42 [2019-11-01T20:23:42.213Z]                  from /home/jenkins/jenkins-agent/workspace/PullRequest-linux_390-64/compiler/z/codegen/RegisterDependency.hpp:25,
16:23:42 [2019-11-01T20:23:42.213Z]                  from /home/jenkins/jenkins-agent/workspace/PullRequest-linux_390-64/compiler/z/codegen/OMRLinkage.hpp:49,
16:23:42 [2019-11-01T20:23:42.213Z]                  from /home/jenkins/jenkins-agent/workspace/PullRequest-linux_390-64/compiler/z/codegen/Linkage.hpp:25,
16:23:42 [2019-11-01T20:23:42.213Z]                  from /home/jenkins/jenkins-agent/workspace/PullRequest-linux_390-64/compiler/z/codegen/snippet/XPLINKCallDescriptorSnippet.cpp:22:
16:23:42 [2019-11-01T20:23:42.213Z] /home/jenkins/jenkins-agent/workspace/PullRequest-linux_390-64/compiler/codegen/OMRRegisterDependency.hpp: In member function ‘TR::RegisterDependency* OMR::RegisterDependencyMap::getDependencyWithSourceAssigned(OMR::RealRegister::RegNum)’:
16:23:42 [2019-11-01T20:23:42.214Z] /home/jenkins/jenkins-agent/workspace/PullRequest-linux_390-64/compiler/codegen/OMRRegisterDependency.hpp:136:55: warning: comparison between ‘enum OMR::RealRegister::RegNum’ and ‘enum OMR::RealRegister::RegDep’ [-Wenum-compare]
16:23:42 [2019-11-01T20:23:42.214Z]        TR_ASSERT(regNum >= 0 && regNum < TR::RealRegister::NumRegisters, "Register number (%d) used as index but out of range!", regNum);
16:23:42 [2019-11-01T20:23:42.214Z]                                                        ^
16:23:42 [2019-11-01T20:23:42.214Z] In file included from /home/jenkins/jenkins-agent/workspace/PullRequest-linux_390-64/compiler/z/codegen/OMRRegisterDependency.hpp:36:0,
16:23:42 [2019-11-01T20:23:42.214Z]                  from /home/jenkins/jenkins-agent/workspace/PullRequest-linux_390-64/compiler/z/codegen/RegisterDependency.hpp:25,
16:23:42 [2019-11-01T20:23:42.214Z]                  from /home/jenkins/jenkins-agent/workspace/PullRequest-linux_390-64/compiler/z/codegen/OMRLinkage.hpp:49,
16:23:42 [2019-11-01T20:23:42.214Z]                  from /home/jenkins/jenkins-agent/workspace/PullRequest-linux_390-64/compiler/z/codegen/Linkage.hpp:25,
16:23:42 [2019-11-01T20:23:42.214Z]                  from /home/jenkins/jenkins-agent/workspace/PullRequest-linux_390-64/compiler/z/codegen/snippet/XPLINKCallDescriptorSnippet.cpp:22:
16:23:42 [2019-11-01T20:23:42.214Z] /home/jenkins/jenkins-agent/workspace/PullRequest-linux_390-64/compiler/codegen/OMRRegisterDependency.hpp: In member function ‘TR::RegisterDependency* OMR::RegisterDependencyMap::getDependencyWithTarget(OMR::RealRegister::RegNum)’:
16:23:42 [2019-11-01T20:23:42.214Z] /home/jenkins/jenkins-agent/workspace/PullRequest-linux_390-64/compiler/codegen/OMRRegisterDependency.hpp:152:55: warning: comparison between ‘enum OMR::RealRegister::RegNum’ and ‘enum OMR::RealRegister::RegDep’ [-Wenum-compare]
16:23:42 [2019-11-01T20:23:42.214Z]        TR_ASSERT(regNum >= 0 && regNum < TR::RealRegister::NumRegisters, "Register number (%d) used as index but out of range!", regNum);
16:23:42 [2019-11-01T20:23:42.214Z]                                                        ^
16:23:42 [2019-11-01T20:23:42.214Z] In file included from /home/jenkins/jenkins-agent/workspace/PullRequest-linux_390-64/compiler/z/codegen/OMRRegisterDependency.hpp:36:0,
16:23:42 [2019-11-01T20:23:42.214Z]                  from /home/jenkins/jenkins-agent/workspace/PullRequest-linux_390-64/compiler/z/codegen/RegisterDependency.hpp:25,
16:23:42 [2019-11-01T20:23:42.214Z]                  from /home/jenkins/jenkins-agent/workspace/PullRequest-linux_390-64/compiler/z/codegen/OMRLinkage.hpp:49,
16:23:42 [2019-11-01T20:23:42.214Z]                  from /home/jenkins/jenkins-agent/workspace/PullRequest-linux_390-64/compiler/z/codegen/Linkage.hpp:25,
16:23:42 [2019-11-01T20:23:42.214Z]                  from /home/jenkins/jenkins-agent/workspace/PullRequest-linux_390-64/compiler/z/codegen/snippet/XPLINKCallDescriptorSnippet.cpp:22:
16:23:42 [2019-11-01T20:23:42.214Z] /home/jenkins/jenkins-agent/workspace/PullRequest-linux_390-64/compiler/codegen/OMRRegisterDependency.hpp:154:41: warning: comparison between ‘enum OMR::RealRegister::RegNum’ and ‘enum OMR::RealRegister::RegDep’ [-Wenum-compare]
16:23:42 [2019-11-01T20:23:42.214Z]        TR_ASSERT(regNum != TR::RealRegister::SpilledReg, "Multiple dependencies can map to 'SpilledReg', can't return just one");
16:23:42 [2019-11-01T20:23:42.214Z]                                          ^
16:23:42 [2019-11-01T20:23:42.214Z] In file included from /home/jenkins/jenkins-agent/workspace/PullRequest-linux_390-64/compiler/z/codegen/OMRRegisterDependency.hpp:36:0,
16:23:42 [2019-11-01T20:23:42.214Z]                  from /home/jenkins/jenkins-agent/workspace/PullRequest-linux_390-64/compiler/z/codegen/RegisterDependency.hpp:25,
16:23:42 [2019-11-01T20:23:42.214Z]                  from /home/jenkins/jenkins-agent/workspace/PullRequest-linux_390-64/compiler/z/codegen/OMRLinkage.hpp:49,
16:23:42 [2019-11-01T20:23:42.214Z]                  from /home/jenkins/jenkins-agent/workspace/PullRequest-linux_390-64/compiler/z/codegen/Linkage.hpp:25,
16:23:42 [2019-11-01T20:23:42.214Z]                  from /home/jenkins/jenkins-agent/workspace/PullRequest-linux_390-64/compiler/z/codegen/snippet/XPLINKCallDescriptorSnippet.cpp:22:
16:23:42 [2019-11-01T20:23:42.214Z] /home/jenkins/jenkins-agent/workspace/PullRequest-linux_390-64/compiler/codegen/OMRRegisterDependency.hpp: In member function ‘void OMR::RegisterDependencyMap::addDependency(OMR::RealRegister::RegNum, TR::RealRegister*, uint32_t)’:
16:23:42 [2019-11-01T20:23:42.214Z] /home/jenkins/jenkins-agent/workspace/PullRequest-linux_390-64/compiler/codegen/OMRRegisterDependency.hpp:194:76: warning: comparison between ‘enum OMR::RealRegister::RegNum’ and ‘enum OMR::RealRegister::RegDep’ [-Wenum-compare]
16:23:42 [2019-11-01T20:23:42.214Z]        if (regNum != TR::RealRegister::NoReg && regNum != TR::RealRegister::SpilledReg && regNum < TR::RealRegister::NumRegisters)
16:23:42 [2019-11-01T20:23:42.214Z]                                                                             ^
16:23:42 [2019-11-01T20:23:42.214Z] /home/jenkins/jenkins-agent/workspace/PullRequest-linux_390-64/compiler/codegen/OMRRegisterDependency.hpp:194:117: warning: comparison between ‘enum OMR::RealRegister::RegNum’ and ‘enum OMR::RealRegister::RegDep’ [-Wenum-compare]
16:23:42 [2019-11-01T20:23:42.214Z]        if (regNum != TR::RealRegister::NoReg && regNum != TR::RealRegister::SpilledReg && regNum < TR::RealRegister::NumRegisters)
16:23:42 [2019-11-01T20:23:42.214Z]                                                                                                                      ^
16:23:42 [2019-11-01T20:23:42.214Z] /home/jenkins/jenkins-agent/workspace/PullRequest-linux_390-64/compiler/codegen/OMRRegisterDependency.hpp:196:58: warning: comparison between ‘enum OMR::RealRegister::RegNum’ and ‘enum OMR::RealRegister::RegDep’ [-Wenum-compare]
16:23:42 [2019-11-01T20:23:42.214Z]           TR_ASSERT(regNum >= 0 && regNum < TR::RealRegister::NumRegisters, "Register number (%d) used as index but out of range!", regNum);
16:23:42 [2019-11-01T20:23:42.214Z]                                                           ^
16:23:42 [2019-11-01T20:23:42.214Z] In file included from /home/jenkins/jenkins-agent/workspace/PullRequest-linux_390-64/compiler/z/codegen/OMRRegisterDependency.hpp:36:0,
16:23:42 [2019-11-01T20:23:42.214Z]                  from /home/jenkins/jenkins-agent/workspace/PullRequest-linux_390-64/compiler/z/codegen/RegisterDependency.hpp:25,
16:23:42 [2019-11-01T20:23:42.214Z]                  from /home/jenkins/jenkins-agent/workspace/PullRequest-linux_390-64/compiler/z/codegen/OMRLinkage.hpp:49,
16:23:42 [2019-11-01T20:23:42.214Z]                  from /home/jenkins/jenkins-agent/workspace/PullRequest-linux_390-64/compiler/z/codegen/Linkage.hpp:25,
16:23:42 [2019-11-01T20:23:42.214Z]                  from /home/jenkins/jenkins-agent/workspace/PullRequest-linux_390-64/compiler/z/codegen/snippet/XPLINKCallDescriptorSnippet.cpp:22:
16:23:42 [2019-11-01T20:23:42.214Z] /home/jenkins/jenkins-agent/workspace/PullRequest-linux_390-64/compiler/codegen/OMRRegisterDependency.hpp:205:52: warning: comparison between ‘enum OMR::RealRegister::RegNum’ and ‘enum OMR::RealRegister::RegDep’ [-Wenum-compare]
16:23:42 [2019-11-01T20:23:42.214Z]           TR_ASSERT(arr >= 0 && arr < TR::RealRegister::NumRegisters, "Register number (%d) used as index but out of range!", arr);
16:23:42 [2019-11-01T20:23:42.214Z]                                                     ^
16:23:42 [2019-11-01T20:23:42.214Z] /home/jenkins/jenkins-agent/workspace/PullRequest-linux_390-64/compiler/z/runtime/VirtualGuardRuntime.cpp: In function ‘void _patchVirtualGuard(uint8_t*, uint8_t*, int32_t)’:
16:23:42 [2019-11-01T20:23:42.214Z] /home/jenkins/jenkins-agent/workspace/PullRequest-linux_390-64/compiler/z/runtime/VirtualGuardRuntime.cpp:56:258: warning: format ‘%x’ expects argument of type ‘unsigned int’, but argument 3 has type ‘intptrj_t {aka long int}’ [-Wformat=]
16:23:42 [2019-11-01T20:23:42.214Z]        printf("####> Patching VGNOP at locationAddr %p (%x), destinationAddr %p (%x), smpFlag: %d\n", volatileLocationAddr, *reinterpret_cast<volatile intptrj_t*>(volatileLocationAddr), destinationAddr, *reinterpret_cast<intptrj_t*>(destinationAddr), smpFlag);
16:23:42 [2019-11-01T20:23:42.214Z]                                                                                                                                                                                                                                                                   ^
16:23:42 [2019-11-01T20:23:42.214Z] /home/jenkins/jenkins-agent/workspace/PullRequest-linux_390-64/compiler/z/runtime/VirtualGuardRuntime.cpp:56:258: warning: format ‘%x’ expects argument of type ‘unsigned int’, but argument 5 has type ‘intptrj_t {aka long int}’ [-Wformat=]
16:23:42 [2019-11-01T20:23:42.214Z] [ 92%] Linking CXX static library libjitbuilder.a
16:23:42 [2019-11-01T20:23:42.691Z] [ 92%] Built target testcompiler
16:23:42 [2019-11-01T20:23:42.691Z] Scanning dependencies of target tril
16:23:42 [2019-11-01T20:23:42.691Z] [ 92%] Building CXX object fvtest/tril/tril/CMakeFiles/tril.dir/ast.cpp.o
16:23:42 [2019-11-01T20:23:42.691Z] [ 92%] Building CXX object fvtest/tril/tril/CMakeFiles/tril.dir/parser.cpp.o
16:23:42 [2019-11-01T20:23:42.691Z] /home/jenkins/jenkins-agent/workspace/PullRequest-linux_390-64/fvtest/tril/tril/ast.cpp: In function ‘void printASTValueUnion(FILE*, const ASTValue*)’:
16:23:42 [2019-11-01T20:23:42.691Z] /home/jenkins/jenkins-agent/workspace/PullRequest-linux_390-64/fvtest/tril/tril/ast.cpp:105:74: warning: format ‘%llu’ expects argument of type ‘long long unsigned int’, but argument 3 has type ‘ASTValue::Integer_t {aka long unsigned int}’ [-Wformat=]
16:23:42 [2019-11-01T20:23:42.691Z]          case ASTValue::Integer: fprintf(file, "%llu", value->getInteger()); break;
16:23:42 [2019-11-01T20:23:42.691Z]                                                                           ^
16:23:42 [2019-11-01T20:23:42.691Z] Scanning dependencies of target compilertest
16:23:42 [2019-11-01T20:23:42.691Z] [ 92%] Building CXX object fvtest/tril/tril/CMakeFiles/tril.dir/ilgen.cpp.o
16:23:42 [2019-11-01T20:23:42.691Z] [ 92%] Building CXX object fvtest/tril/tril/CMakeFiles/tril.dir/simple_compiler.cpp.o
16:23:42 [2019-11-01T20:23:42.691Z] [ 92%] Building CXX object fvtest/compilertest/CMakeFiles/compilertest.dir/tests/main.cpp.o
16:23:43 [2019-11-01T20:23:43.159Z] [ 92%] Building CXX object fvtest/compilertest/CMakeFiles/compilertest.dir/tests/BuilderTest.cpp.o
16:23:43 [2019-11-01T20:23:43.159Z] [ 92%] Building CXX object fvtest/compilertest/CMakeFiles/compilertest.dir/tests/FooBarTest.cpp.o
16:23:44 [2019-11-01T20:23:44.088Z] [ 92%] Built target jitbuilder
16:23:44 [2019-11-01T20:23:44.088Z] [ 92%] Building CXX object fvtest/compilertest/CMakeFiles/compilertest.dir/tests/LimitFileTest.cpp.o
16:23:44 [2019-11-01T20:23:44.088Z] [ 92%] Linking CXX static library libtril.a
16:23:44 [2019-11-01T20:23:44.088Z] Scanning dependencies of target iterfib
16:23:44 [2019-11-01T20:23:44.088Z] [ 92%] Building CXX object jitbuilder/release/CMakeFiles/iterfib.dir/cpp/samples/IterativeFib.cpp.o
16:23:44 [2019-11-01T20:23:44.088Z] [ 92%] Linking CXX executable iterfib
16:23:44 [2019-11-01T20:23:44.088Z] [ 92%] Built target tril
16:23:44 [2019-11-01T20:23:44.088Z] [ 92%] Building CXX object fvtest/compilertest/CMakeFiles/compilertest.dir/tests/LogFileTest.cpp.o
16:23:44 [2019-11-01T20:23:44.559Z] Scanning dependencies of target isSupportedType
16:23:44 [2019-11-01T20:23:44.559Z] [ 92%] Building CXX object jitbuilder/release/CMakeFiles/isSupportedType.dir/cpp/samples/IsSupportedType.cpp.o
16:23:44 [2019-11-01T20:23:44.559Z] [ 92%] Linking CXX executable isSupportedType
16:23:44 [2019-11-01T20:23:44.559Z] [ 92%] Built target isSupportedType
16:23:44 [2019-11-01T20:23:44.559Z] [ 92%] Building CXX object fvtest/compilertest/CMakeFiles/compilertest.dir/tests/OMRTestEnv.cpp.o
16:23:44 [2019-11-01T20:23:44.559Z] [ 92%] Building CXX object fvtest/compilertest/CMakeFiles/compilertest.dir/tests/OptionSetTest.cpp.o
16:23:44 [2019-11-01T20:23:44.559Z] [ 92%] Building CXX object fvtest/compilertest/CMakeFiles/compilertest.dir/tests/OpCodesTest.cpp.o
16:23:44 [2019-11-01T20:23:44.559Z] [ 92%] Building CXX object fvtest/compilertest/CMakeFiles/compilertest.dir/tests/Qux2Test.cpp.o
16:23:45 [2019-11-01T20:23:45.029Z] [ 92%] Building CXX object fvtest/compilertest/CMakeFiles/compilertest.dir/tests/SimplifierFoldAndTest.cpp.o
16:23:45 [2019-11-01T20:23:45.499Z] [ 92%] Built target iterfib
16:23:45 [2019-11-01T20:23:45.499Z] Scanning dependencies of target conditionals
16:23:45 [2019-11-01T20:23:45.499Z] [ 92%] Building CXX object jitbuilder/release/CMakeFiles/conditionals.dir/cpp/samples/Conditionals.cpp.o
16:23:45 [2019-11-01T20:23:45.499Z] [ 92%] Linking CXX executable conditionals
16:23:45 [2019-11-01T20:23:45.970Z] [ 93%] Building CXX object fvtest/compilertest/CMakeFiles/compilertest.dir/tests/OptTestDriver.cpp.o
16:23:45 [2019-11-01T20:23:45.970Z] [ 93%] Building CXX object fvtest/compilertest/CMakeFiles/compilertest.dir/tests/TestDriver.cpp.o
16:23:45 [2019-11-01T20:23:45.970Z] [ 93%] Building CXX object fvtest/compilertest/CMakeFiles/compilertest.dir/tests/SingleBitContainerTest.cpp.o
16:23:45 [2019-11-01T20:23:45.970Z] [ 93%] Building CXX object fvtest/compilertest/CMakeFiles/compilertest.dir/tests/injectors/BarIlInjector.cpp.o
16:23:46 [2019-11-01T20:23:46.440Z] Scanning dependencies of target simple
16:23:46 [2019-11-01T20:23:46.440Z] [ 93%] Building CXX object jitbuilder/release/CMakeFiles/simple.dir/cpp/samples/Simple.cpp.o
16:23:46 [2019-11-01T20:23:46.440Z] [ 94%] Linking CXX executable simple
16:23:46 [2019-11-01T20:23:46.911Z] [ 94%] Built target conditionals
16:23:46 [2019-11-01T20:23:46.911Z] Scanning dependencies of target nestedloop
16:23:46 [2019-11-01T20:23:46.911Z] [ 94%] Building CXX object jitbuilder/release/CMakeFiles/nestedloop.dir/cpp/samples/NestedLoop.cpp.o
16:23:46 [2019-11-01T20:23:46.911Z] [ 94%] Linking CXX executable nestedloop
16:23:46 [2019-11-01T20:23:46.911Z] [ 94%] Building CXX object fvtest/compilertest/CMakeFiles/compilertest.dir/tests/injectors/BinaryOpIlInjector.cpp.o
16:23:46 [2019-11-01T20:23:46.911Z] [ 94%] Building CXX object fvtest/compilertest/CMakeFiles/compilertest.dir/tests/injectors/CallIlInjector.cpp.o
16:23:46 [2019-11-01T20:23:46.911Z] [ 94%] Building CXX object fvtest/compilertest/CMakeFiles/compilertest.dir/tests/injectors/ChildlessUnaryOpIlInjector.cpp.o
16:23:47 [2019-11-01T20:23:47.378Z] [ 94%] Building CXX object fvtest/compilertest/CMakeFiles/compilertest.dir/tests/injectors/CmpBranchOpIlInjector.cpp.o
16:23:47 [2019-11-01T20:23:47.378Z] [ 94%] Building CXX object fvtest/compilertest/CMakeFiles/compilertest.dir/tests/injectors/FooIlInjector.cpp.o
16:23:47 [2019-11-01T20:23:47.378Z] [ 94%] Building CXX object fvtest/compilertest/CMakeFiles/compilertest.dir/tests/injectors/IndirectLoadIlInjector.cpp.o
16:23:47 [2019-11-01T20:23:47.378Z] [ 94%] Built target simple
16:23:47 [2019-11-01T20:23:47.378Z] Scanning dependencies of target pow2
16:23:47 [2019-11-01T20:23:47.378Z] [ 94%] Building CXX object jitbuilder/release/CMakeFiles/pow2.dir/cpp/samples/Pow2.cpp.o
16:23:47 [2019-11-01T20:23:47.378Z] /home/jenkins/jenkins-agent/workspace/PullRequest-linux_390-64/jitbuilder/release/cpp/samples/Pow2.cpp: In function ‘int main(int, char**)’:
16:23:47 [2019-11-01T20:23:47.378Z] /home/jenkins/jenkins-agent/workspace/PullRequest-linux_390-64/jitbuilder/release/cpp/samples/Pow2.cpp:118:34: warning: format ‘%lld’ expects argument of type ‘long long int’, but argument 2 has type ‘int64_t {aka long int}’ [-Wformat=]
16:23:47 [2019-11-01T20:23:47.378Z]     printf("pow2(45) is %lld\n", r);
16:23:47 [2019-11-01T20:23:47.378Z]                                   ^
16:23:47 [2019-11-01T20:23:47.378Z] [ 94%] Linking CXX executable pow2
16:23:47 [2019-11-01T20:23:47.849Z] [ 94%] Built target nestedloop
16:23:47 [2019-11-01T20:23:47.849Z] Scanning dependencies of target worklist
16:23:47 [2019-11-01T20:23:47.849Z] [ 94%] Building CXX object jitbuilder/release/CMakeFiles/worklist.dir/cpp/samples/Worklist.cpp.o
16:23:47 [2019-11-01T20:23:47.849Z] [ 95%] Linking CXX executable worklist
16:23:47 [2019-11-01T20:23:47.849Z] [ 95%] Building CXX object fvtest/compilertest/CMakeFiles/compilertest.dir/tests/injectors/IndirectStoreIlInjector.cpp.o
16:23:48 [2019-11-01T20:23:48.768Z] [ 95%] Building CXX object fvtest/compilertest/CMakeFiles/compilertest.dir/tests/injectors/OpIlInjector.cpp.o
16:23:48 [2019-11-01T20:23:48.768Z] [ 95%] Built target pow2
16:23:48 [2019-11-01T20:23:48.768Z] Scanning dependencies of target jitbuildertest
16:23:48 [2019-11-01T20:23:48.768Z] [ 95%] Building CXX object fvtest/jitbuildertest/CMakeFiles/jitbuildertest.dir/main.cpp.o
16:23:48 [2019-11-01T20:23:48.768Z] [ 95%] Building CXX object fvtest/jitbuildertest/CMakeFiles/jitbuildertest.dir/selftest.cpp.o
16:23:48 [2019-11-01T20:23:48.768Z] [ 95%] Building CXX object fvtest/compilertest/CMakeFiles/compilertest.dir/tests/injectors/Qux2IlInjector.cpp.o
16:23:48 [2019-11-01T20:23:48.768Z] [ 95%] Building CXX object fvtest/jitbuildertest/CMakeFiles/jitbuildertest.dir/UnionTest.cpp.o
16:23:48 [2019-11-01T20:23:48.768Z] [ 95%] Building CXX object fvtest/jitbuildertest/CMakeFiles/jitbuildertest.dir/FieldAddressTest.cpp.o
16:23:49 [2019-11-01T20:23:49.240Z] [ 95%] Building CXX object fvtest/jitbuildertest/CMakeFiles/jitbuildertest.dir/AnonymousTest.cpp.o
16:23:49 [2019-11-01T20:23:49.240Z] [ 96%] Building CXX object fvtest/compilertest/CMakeFiles/compilertest.dir/tests/injectors/StoreOpIlInjector.cpp.o
16:23:49 [2019-11-01T20:23:49.240Z] [ 96%] Building CXX object fvtest/jitbuildertest/CMakeFiles/jitbuildertest.dir/ControlFlowTest.cpp.o
16:23:49 [2019-11-01T20:23:49.240Z] [ 96%] Building CXX object fvtest/compilertest/CMakeFiles/compilertest.dir/tests/injectors/TernaryOpIlInjector.cpp.o
16:23:49 [2019-11-01T20:23:49.240Z] [ 96%] Building CXX object fvtest/jitbuildertest/CMakeFiles/jitbuildertest.dir/NegateTest.cpp.o
16:23:49 [2019-11-01T20:23:49.240Z] Scanning dependencies of target tril_dumper
16:23:49 [2019-11-01T20:23:49.240Z] [ 96%] Building CXX object fvtest/tril/tril/CMakeFiles/tril_dumper.dir/compiler.cpp.o
16:23:49 [2019-11-01T20:23:49.240Z] [ 96%] Built target worklist
16:23:49 [2019-11-01T20:23:49.240Z] [ 96%] Building CXX object fvtest/compilertest/CMakeFiles/compilertest.dir/tests/injectors/UnaryOpIlInjector.cpp.o
16:23:49 [2019-11-01T20:23:49.240Z] [ 96%] Building CXX object fvtest/jitbuildertest/CMakeFiles/jitbuildertest.dir/SystemLinkageTest.cpp.o
16:23:49 [2019-11-01T20:23:49.240Z] [ 96%] Building CXX object fvtest/jitbuildertest/CMakeFiles/jitbuildertest.dir/WorklistTest.cpp.o
16:23:49 [2019-11-01T20:23:49.240Z] [ 96%] Building CXX object fvtest/compilertest/CMakeFiles/compilertest.dir/tests/S390OpCodesTest.cpp.o
16:23:49 [2019-11-01T20:23:49.240Z] [ 96%] Building CXX object fvtest/jitbuildertest/CMakeFiles/jitbuildertest.dir/FieldNameTest.cpp.o
16:23:49 [2019-11-01T20:23:49.240Z] [ 96%] Building CXX object fvtest/jitbuildertest/CMakeFiles/jitbuildertest.dir/ConvertBitsTest.cpp.o
16:23:49 [2019-11-01T20:23:49.710Z] [ 96%] Building CXX object fvtest/jitbuildertest/CMakeFiles/jitbuildertest.dir/SelectTest.cpp.o
16:23:49 [2019-11-01T20:23:49.710Z] [ 97%] Building CXX object fvtest/jitbuildertest/CMakeFiles/jitbuildertest.dir/UnsignedDivRemTest.cpp.o
16:23:49 [2019-11-01T20:23:49.710Z] [ 97%] Linking CXX executable jitbuildertest
16:23:49 [2019-11-01T20:23:49.710Z] Scanning dependencies of target tril_compiler
16:23:49 [2019-11-01T20:23:49.710Z] [ 97%] Building CXX object fvtest/tril/tril/CMakeFiles/tril_compiler.dir/compiler.cpp.o
16:23:49 [2019-11-01T20:23:49.710Z] [ 97%] Linking CXX executable tril_dumper
16:23:50 [2019-11-01T20:23:50.181Z] [ 98%] Linking CXX executable tril_compiler
16:23:50 [2019-11-01T20:23:50.648Z] [ 98%] Built target jitbuildertest
16:23:51 [2019-11-01T20:23:51.120Z] Scanning dependencies of target triltest
16:23:51 [2019-11-01T20:23:51.120Z] [ 98%] Building CXX object fvtest/tril/test/CMakeFiles/triltest.dir/main.cpp.o
16:23:51 [2019-11-01T20:23:51.120Z] [ 98%] Built target tril_dumper
16:23:51 [2019-11-01T20:23:51.120Z] Scanning dependencies of target incordec
16:23:51 [2019-11-01T20:23:51.120Z] [ 98%] Building CXX object fvtest/tril/examples/incordec/CMakeFiles/incordec.dir/main.cpp.o
16:23:51 [2019-11-01T20:23:51.589Z] [ 98%] Built target tril_compiler
16:23:51 [2019-11-01T20:23:51.589Z] Scanning dependencies of target mandelbrot
16:23:51 [2019-11-01T20:23:51.589Z] [ 98%] Building CXX object fvtest/tril/examples/mandelbrot/CMakeFiles/mandelbrot.dir/main.cpp.o
16:23:51 [2019-11-01T20:23:51.589Z] [ 98%] Linking CXX executable incordec
16:23:51 [2019-11-01T20:23:51.589Z] [ 98%] Building CXX object fvtest/tril/test/CMakeFiles/triltest.dir/ASTTest.cpp.o
16:23:51 [2019-11-01T20:23:51.589Z] [ 98%] Building CXX object fvtest/tril/test/CMakeFiles/triltest.dir/ParserTest.cpp.o
16:23:52 [2019-11-01T20:23:52.059Z] [ 98%] Building CXX object fvtest/tril/test/CMakeFiles/triltest.dir/MethodInfoTest.cpp.o
16:23:52 [2019-11-01T20:23:52.059Z] [ 98%] Linking CXX executable mandelbrot
16:23:52 [2019-11-01T20:23:52.976Z] [ 98%] Building CXX object fvtest/tril/test/CMakeFiles/triltest.dir/IlGenTest.cpp.o
16:23:52 [2019-11-01T20:23:52.976Z] [ 98%] Built target incordec
16:23:52 [2019-11-01T20:23:52.976Z] Scanning dependencies of target comptest
16:23:52 [2019-11-01T20:23:52.976Z] [ 98%] Building CXX object fvtest/compilertriltest/CMakeFiles/comptest.dir/main.cpp.o
16:23:53 [2019-11-01T20:23:53.449Z] [ 98%] Built target mandelbrot
16:23:53 [2019-11-01T20:23:53.449Z] [ 98%] Building CXX object fvtest/compilertriltest/CMakeFiles/comptest.dir/JitTestUtilitiesTest.cpp.o
16:23:53 [2019-11-01T20:23:53.918Z] [ 98%] Building CXX object fvtest/tril/test/CMakeFiles/triltest.dir/CompileTest.cpp.o
16:23:53 [2019-11-01T20:23:53.918Z] [ 98%] Building CXX object fvtest/tril/test/CMakeFiles/triltest.dir/__/__/__/util/main_function/main_function.cpp.o
16:23:53 [2019-11-01T20:23:53.918Z] [ 98%] Building CXX object fvtest/compilertriltest/CMakeFiles/comptest.dir/ILValidatorTest.cpp.o
16:23:54 [2019-11-01T20:23:54.837Z] [ 98%] Linking CXX executable compilertest
16:23:55 [2019-11-01T20:23:55.310Z] [ 98%] Linking CXX executable triltest
16:23:55 [2019-11-01T20:23:55.310Z] [ 98%] Building CXX object fvtest/compilertriltest/CMakeFiles/comptest.dir/ArithmeticTest.cpp.o
16:23:56 [2019-11-01T20:23:56.226Z] [ 98%] Building CXX object fvtest/compilertriltest/CMakeFiles/comptest.dir/ShiftAndRotateTest.cpp.o
16:23:56 [2019-11-01T20:23:56.226Z] [ 98%] Built target compilertest
16:23:56 [2019-11-01T20:23:56.226Z] [ 98%] Building CXX object fvtest/compilertriltest/CMakeFiles/comptest.dir/SimplifierFoldAbsNegTest.cpp.o
16:23:56 [2019-11-01T20:23:56.700Z] [ 98%] Built target triltest
16:23:56 [2019-11-01T20:23:56.700Z] [ 98%] Building CXX object fvtest/compilertriltest/CMakeFiles/comptest.dir/SimplifierFoldAndTest.cpp.o
16:23:58 [2019-11-01T20:23:58.123Z] [ 99%] Building CXX object fvtest/compilertriltest/CMakeFiles/comptest.dir/IfxcmpgeReductionTest.cpp.o
16:23:58 [2019-11-01T20:23:58.123Z] [ 99%] Building CXX object fvtest/compilertriltest/CMakeFiles/comptest.dir/VectorTest.cpp.o
16:23:59 [2019-11-01T20:23:59.547Z] [ 99%] Building CXX object fvtest/compilertriltest/CMakeFiles/comptest.dir/CallTest.cpp.o
16:24:00 [2019-11-01T20:24:00.471Z] [ 99%] Building CXX object fvtest/compilertriltest/CMakeFiles/comptest.dir/LongAndAsRotateTest.cpp.o
16:24:03 [2019-11-01T20:24:03.200Z] /home/jenkins/jenkins-agent/workspace/PullRequest-linux_390-64/fvtest/compilertriltest/IfxcmpgeReductionTest.cpp: In member function ‘virtual void Int64ReductionTest_Reduction_Test::TestBody()’:
16:24:03 [2019-11-01T20:24:03.200Z] /home/jenkins/jenkins-agent/workspace/PullRequest-linux_390-64/fvtest/compilertriltest/IfxcmpgeReductionTest.cpp:375:10: warning: format ‘%lld’ expects argument of type ‘long long int’, but argument 4 has type ‘long int’ [-Wformat=]
16:24:03 [2019-11-01T20:24:03.200Z]           );
16:24:03 [2019-11-01T20:24:03.200Z]           ^
16:24:03 [2019-11-01T20:24:03.200Z] /home/jenkins/jenkins-agent/workspace/PullRequest-linux_390-64/fvtest/compilertriltest/IfxcmpgeReductionTest.cpp:375:10: warning: format ‘%lld’ expects argument of type ‘long long int’, but argument 5 has type ‘long int’ [-Wformat=]
16:24:03 [2019-11-01T20:24:03.200Z] /home/jenkins/jenkins-agent/workspace/PullRequest-linux_390-64/fvtest/compilertriltest/IfxcmpgeReductionTest.cpp:375:10: warning: format ‘%lld’ expects argument of type ‘long long int’, but argument 4 has type ‘long int’ [-Wformat=]
16:24:03 [2019-11-01T20:24:03.200Z] /home/jenkins/jenkins-agent/workspace/PullRequest-linux_390-64/fvtest/compilertriltest/IfxcmpgeReductionTest.cpp:375:10: warning: format ‘%lld’ expects argument of type ‘long long int’, but argument 5 has type ‘long int’ [-Wformat=]
16:24:03 [2019-11-01T20:24:03.200Z] /home/jenkins/jenkins-agent/workspace/PullRequest-linux_390-64/fvtest/compilertriltest/IfxcmpgeReductionTest.cpp: In member function ‘virtual void UInt64ReductionTest_Reduction_Test::TestBody()’:
16:24:03 [2019-11-01T20:24:03.200Z] /home/jenkins/jenkins-agent/workspace/PullRequest-linux_390-64/fvtest/compilertriltest/IfxcmpgeReductionTest.cpp:418:10: warning: format ‘%llu’ expects argument of type ‘long long unsigned int’, but argument 4 has type ‘long unsigned int’ [-Wformat=]
16:24:03 [2019-11-01T20:24:03.200Z]           );
16:24:03 [2019-11-01T20:24:03.200Z]           ^
16:24:03 [2019-11-01T20:24:03.200Z] /home/jenkins/jenkins-agent/workspace/PullRequest-linux_390-64/fvtest/compilertriltest/IfxcmpgeReductionTest.cpp:418:10: warning: format ‘%llu’ expects argument of type ‘long long unsigned int’, but argument 5 has type ‘long unsigned int’ [-Wformat=]
16:24:03 [2019-11-01T20:24:03.200Z] /home/jenkins/jenkins-agent/workspace/PullRequest-linux_390-64/fvtest/compilertriltest/IfxcmpgeReductionTest.cpp:418:10: warning: format ‘%llu’ expects argument of type ‘long long unsigned int’, but argument 4 has type ‘long unsigned int’ [-Wformat=]
16:24:03 [2019-11-01T20:24:03.200Z] /home/jenkins/jenkins-agent/workspace/PullRequest-linux_390-64/fvtest/compilertriltest/IfxcmpgeReductionTest.cpp:418:10: warning: format ‘%llu’ expects argument of type ‘long long unsigned int’, but argument 5 has type ‘long unsigned int’ [-Wformat=]
16:24:03 [2019-11-01T20:24:03.200Z] [ 99%] Building CXX object fvtest/compilertriltest/CMakeFiles/comptest.dir/MockStrategyTest.cpp.o
16:24:03 [2019-11-01T20:24:03.200Z] [ 99%] Building CXX object fvtest/compilertriltest/CMakeFiles/comptest.dir/LogicalTest.cpp.o
16:24:03 [2019-11-01T20:24:03.200Z] /home/jenkins/jenkins-agent/workspace/PullRequest-linux_390-64/fvtest/compilertriltest/LongAndAsRotateTest.cpp: In member function ‘virtual void i2lLongAndAsRotateTest_SimpleTest_Test::TestBody()’:
16:24:03 [2019-11-01T20:24:03.200Z] /home/jenkins/jenkins-agent/workspace/PullRequest-linux_390-64/fvtest/compilertriltest/LongAndAsRotateTest.cpp:124:10: warning: format ‘%llu’ expects argument of type ‘long long unsigned int’, but argument 4 has type ‘long unsigned int’ [-Wformat=]
16:24:03 [2019-11-01T20:24:03.200Z]           );
16:24:03 [2019-11-01T20:24:03.200Z]           ^
16:24:03 [2019-11-01T20:24:03.201Z] /home/jenkins/jenkins-agent/workspace/PullRequest-linux_390-64/fvtest/compilertriltest/LongAndAsRotateTest.cpp:124:10: warning: format ‘%llu’ expects argument of type ‘long long unsigned int’, but argument 4 has type ‘long unsigned int’ [-Wformat=]
16:24:03 [2019-11-01T20:24:03.201Z] /home/jenkins/jenkins-agent/workspace/PullRequest-linux_390-64/fvtest/compilertriltest/LongAndAsRotateTest.cpp: In member function ‘virtual void i2lLongAndAsRotateTest_iConstTest_Test::TestBody()’:
16:24:03 [2019-11-01T20:24:03.201Z] /home/jenkins/jenkins-agent/workspace/PullRequest-linux_390-64/fvtest/compilertriltest/LongAndAsRotateTest.cpp:165:10: warning: format ‘%llu’ expects argument of type ‘long long unsigned int’, but argument 5 has type ‘long unsigned int’ [-Wformat=]
16:24:03 [2019-11-01T20:24:03.201Z]           );
16:24:03 [2019-11-01T20:24:03.201Z]           ^
16:24:03 [2019-11-01T20:24:03.201Z] /home/jenkins/jenkins-agent/workspace/PullRequest-linux_390-64/fvtest/compilertriltest/LongAndAsRotateTest.cpp:165:10: warning: format ‘%llu’ expects argument of type ‘long long unsigned int’, but argument 5 has type ‘long unsigned int’ [-Wformat=]
16:24:03 [2019-11-01T20:24:03.201Z] /home/jenkins/jenkins-agent/workspace/PullRequest-linux_390-64/fvtest/compilertriltest/LongAndAsRotateTest.cpp: In member function ‘virtual void i2lLongAndAsRotateTest_GreaterThanOneRefCount1_Test::TestBody()’:
16:24:03 [2019-11-01T20:24:03.201Z] /home/jenkins/jenkins-agent/workspace/PullRequest-linux_390-64/fvtest/compilertriltest/LongAndAsRotateTest.cpp:213:10: warning: format ‘%llu’ expects argument of type ‘long long unsigned int’, but argument 4 has type ‘long unsigned int’ [-Wformat=]
16:24:03 [2019-11-01T20:24:03.201Z]           );
16:24:03 [2019-11-01T20:24:03.201Z]           ^
16:24:03 [2019-11-01T20:24:03.201Z] /home/jenkins/jenkins-agent/workspace/PullRequest-linux_390-64/fvtest/compilertriltest/LongAndAsRotateTest.cpp:213:10: warning: format ‘%llu’ expects argument of type ‘long long unsigned int’, but argument 5 has type ‘long unsigned int’ [-Wformat=]
16:24:03 [2019-11-01T20:24:03.201Z] /home/jenkins/jenkins-agent/workspace/PullRequest-linux_390-64/fvtest/compilertriltest/LongAndAsRotateTest.cpp:213:10: warning: format ‘%llu’ expects argument of type ‘long long unsigned int’, but argument 4 has type ‘long unsigned int’ [-Wformat=]
16:24:03 [2019-11-01T20:24:03.201Z] /home/jenkins/jenkins-agent/workspace/PullRequest-linux_390-64/fvtest/compilertriltest/LongAndAsRotateTest.cpp:213:10: warning: format ‘%llu’ expects argument of type ‘long long unsigned int’, but argument 5 has type ‘long unsigned int’ [-Wformat=]
16:24:03 [2019-11-01T20:24:03.201Z] /home/jenkins/jenkins-agent/workspace/PullRequest-linux_390-64/fvtest/compilertriltest/LongAndAsRotateTest.cpp: In member function ‘virtual void i2lLongAndAsRotateTest_GreaterThanOneRefCount2_Test::TestBody()’:
16:24:03 [2019-11-01T20:24:03.201Z] /home/jenkins/jenkins-agent/workspace/PullRequest-linux_390-64/fvtest/compilertriltest/LongAndAsRotateTest.cpp:273:10: warning: format ‘%llu’ expects argument of type ‘long long unsigned int’, but argument 5 has type ‘long unsigned int’ [-Wformat=]
16:24:03 [2019-11-01T20:24:03.201Z]           );
16:24:03 [2019-11-01T20:24:03.201Z]           ^
16:24:03 [2019-11-01T20:24:03.201Z] /home/jenkins/jenkins-agent/workspace/PullRequest-linux_390-64/fvtest/compilertriltest/LongAndAsRotateTest.cpp:273:10: warning: format ‘%llu’ expects argument of type ‘long long unsigned int’, but argument 7 has type ‘long unsigned int’ [-Wformat=]
16:24:03 [2019-11-01T20:24:03.201Z] /home/jenkins/jenkins-agent/workspace/PullRequest-linux_390-64/fvtest/compilertriltest/LongAndAsRotateTest.cpp:273:10: warning: format ‘%llu’ expects argument of type ‘long long unsigned int’, but argument 5 has type ‘long unsigned int’ [-Wformat=]
16:24:03 [2019-11-01T20:24:03.201Z] /home/jenkins/jenkins-agent/workspace/PullRequest-linux_390-64/fvtest/compilertriltest/LongAndAsRotateTest.cpp:273:10: warning: format ‘%llu’ expects argument of type ‘long long unsigned int’, but argument 7 has type ‘long unsigned int’ [-Wformat=]
16:24:03 [2019-11-01T20:24:03.201Z] /home/jenkins/jenkins-agent/workspace/PullRequest-linux_390-64/fvtest/compilertriltest/LongAndAsRotateTest.cpp: In member function ‘virtual void iu2lLongAndAsRotateTest_SimpleTest_Test::TestBody()’:
16:24:03 [2019-11-01T20:24:03.201Z] /home/jenkins/jenkins-agent/workspace/PullRequest-linux_390-64/fvtest/compilertriltest/LongAndAsRotateTest.cpp:305:10: warning: format ‘%llu’ expects argument of type ‘long long unsigned int’, but argument 4 has type ‘long unsigned int’ [-Wformat=]
16:24:03 [2019-11-01T20:24:03.201Z]           );
16:24:03 [2019-11-01T20:24:03.201Z]           ^
16:24:03 [2019-11-01T20:24:03.201Z] /home/jenkins/jenkins-agent/workspace/PullRequest-linux_390-64/fvtest/compilertriltest/LongAndAsRotateTest.cpp:305:10: warning: format ‘%llu’ expects argument of type ‘long long unsigned int’, but argument 4 has type ‘long unsigned int’ [-Wformat=]
16:24:03 [2019-11-01T20:24:03.201Z] /home/jenkins/jenkins-agent/workspace/PullRequest-linux_390-64/fvtest/compilertriltest/LongAndAsRotateTest.cpp: In member function ‘virtual void iu2lLongAndAsRotateTest_iConstTest_Test::TestBody()’:
16:24:03 [2019-11-01T20:24:03.201Z] /home/jenkins/jenkins-agent/workspace/PullRequest-linux_390-64/fvtest/compilertriltest/LongAndAsRotateTest.cpp:346:10: warning: format ‘%llu’ expects argument of type ‘long long unsigned int’, but argument 5 has type ‘long unsigned int’ [-Wformat=]
16:24:03 [2019-11-01T20:24:03.201Z]           );
16:24:03 [2019-11-01T20:24:03.201Z]           ^
16:24:03 [2019-11-01T20:24:03.201Z] /home/jenkins/jenkins-agent/workspace/PullRequest-linux_390-64/fvtest/compilertriltest/LongAndAsRotateTest.cpp:346:10: warning: format ‘%llu’ expects argument of type ‘long long unsigned int’, but argument 5 has type ‘long unsigned int’ [-Wformat=]
16:24:03 [2019-11-01T20:24:03.201Z] /home/jenkins/jenkins-agent/workspace/PullRequest-linux_390-64/fvtest/compilertriltest/LongAndAsRotateTest.cpp: In member function ‘virtual void iu2lLongAndAsRotateTest_GreaterThanOneRefCount1_Test::TestBody()’:
16:24:03 [2019-11-01T20:24:03.201Z] /home/jenkins/jenkins-agent/workspace/PullRequest-linux_390-64/fvtest/compilertriltest/LongAndAsRotateTest.cpp:393:10: warning: format ‘%llu’ expects argument of type ‘long long unsigned int’, but argument 4 has type ‘long unsigned int’ [-Wformat=]
16:24:03 [2019-11-01T20:24:03.201Z]           );
16:24:03 [2019-11-01T20:24:03.201Z]           ^
16:24:03 [2019-11-01T20:24:03.201Z] /home/jenkins/jenkins-agent/workspace/PullRequest-linux_390-64/fvtest/compilertriltest/LongAndAsRotateTest.cpp:393:10: warning: format ‘%llu’ expects argument of type ‘long long unsigned int’, but argument 5 has type ‘long unsigned int’ [-Wformat=]
16:24:03 [2019-11-01T20:24:03.201Z] /home/jenkins/jenkins-agent/workspace/PullRequest-linux_390-64/fvtest/compilertriltest/LongAndAsRotateTest.cpp:393:10: warning: format ‘%llu’ expects argument of type ‘long long unsigned int’, but argument 4 has type ‘long unsigned int’ [-Wformat=]
16:24:03 [2019-11-01T20:24:03.201Z] /home/jenkins/jenkins-agent/workspace/PullRequest-linux_390-64/fvtest/compilertriltest/LongAndAsRotateTest.cpp:393:10: warning: format ‘%llu’ expects argument of type ‘long long unsigned int’, but argument 5 has type ‘long unsigned int’ [-Wformat=]
16:24:03 [2019-11-01T20:24:03.201Z] /home/jenkins/jenkins-agent/workspace/PullRequest-linux_390-64/fvtest/compilertriltest/LongAndAsRotateTest.cpp: In member function ‘virtual void iu2lLongAndAsRotateTest_GreaterThanOneRefCount2_Test::TestBody()’:
16:24:03 [2019-11-01T20:24:03.201Z] /home/jenkins/jenkins-agent/workspace/PullRequest-linux_390-64/fvtest/compilertriltest/LongAndAsRotateTest.cpp:452:10: warning: format ‘%llu’ expects argument of type ‘long long unsigned int’, but argument 5 has type ‘long unsigned int’ [-Wformat=]
16:24:03 [2019-11-01T20:24:03.201Z]           );
16:24:03 [2019-11-01T20:24:03.201Z]           ^
16:24:03 [2019-11-01T20:24:03.201Z] /home/jenkins/jenkins-agent/workspace/PullRequest-linux_390-64/fvtest/compilertriltest/LongAndAsRotateTest.cpp:452:10: warning: format ‘%llu’ expects argument of type ‘long long unsigned int’, but argument 7 has type ‘long unsigned int’ [-Wformat=]
16:24:03 [2019-11-01T20:24:03.201Z] /home/jenkins/jenkins-agent/workspace/PullRequest-linux_390-64/fvtest/compilertriltest/LongAndAsRotateTest.cpp:452:10: warning: format ‘%llu’ expects argument of type ‘long long unsigned int’, but argument 5 has type ‘long unsigned int’ [-Wformat=]
16:24:03 [2019-11-01T20:24:03.201Z] /home/jenkins/jenkins-agent/workspace/PullRequest-linux_390-64/fvtest/compilertriltest/LongAndAsRotateTest.cpp:452:10: warning: format ‘%llu’ expects argument of type ‘long long unsigned int’, but argument 7 has type ‘long unsigned int’ [-Wformat=]
16:24:03 [2019-11-01T20:24:03.201Z] [ 99%] Building CXX object fvtest/compilertriltest/CMakeFiles/comptest.dir/LinkageTest.cpp.o
16:24:04 [2019-11-01T20:24:04.114Z] [ 99%] Building CXX object fvtest/compilertriltest/CMakeFiles/comptest.dir/BitPermuteTest.cpp.o
16:24:05 [2019-11-01T20:24:05.027Z] /home/jenkins/jenkins-agent/workspace/PullRequest-linux_390-64/fvtest/compilertriltest/LinkageTest.cpp: In instantiation of ‘void LinkageTest_SystemLinkageJitedToJitedParameterPassingFourArg_Test<gtest_TypeParam_>::TestBody() [with gtest_TypeParam_ = double]’:
16:24:05 [2019-11-01T20:24:05.027Z] /home/jenkins/jenkins-agent/workspace/PullRequest-linux_390-64/fvtest/tril/tril/simple_compiler.hpp:34:7:   required from here
16:24:05 [2019-11-01T20:24:05.027Z] /home/jenkins/jenkins-agent/workspace/PullRequest-linux_390-64/fvtest/compilertriltest/LinkageTest.cpp:224:51: warning: format ‘%jX’ expects argument of type ‘uintmax_t’, but argument 11 has type ‘double (*)(double, double, double, double)’ [-Wformat=]
16:24:05 [2019-11-01T20:24:05.027Z]                                                    );
16:24:05 [2019-11-01T20:24:05.027Z]                                                    ^
16:24:05 [2019-11-01T20:24:05.027Z] /home/jenkins/jenkins-agent/workspace/PullRequest-linux_390-64/fvtest/compilertriltest/LinkageTest.cpp:224:51: warning: format ‘%jX’ expects argument of type ‘uintmax_t’, but argument 11 has type ‘double (*)(double, double, double, double)’ [-Wformat=]
16:24:05 [2019-11-01T20:24:05.027Z] /home/jenkins/jenkins-agent/workspace/PullRequest-linux_390-64/fvtest/compilertriltest/LinkageTest.cpp: In instantiation of ‘void LinkageTest_SystemLinkageJitedToJitedParameterPassingFourArg_Test<gtest_TypeParam_>::TestBody() [with gtest_TypeParam_ = float]’:
16:24:05 [2019-11-01T20:24:05.027Z] /home/jenkins/jenkins-agent/workspace/PullRequest-linux_390-64/fvtest/tril/tril/simple_compiler.hpp:34:7:   required from here
16:24:05 [2019-11-01T20:24:05.027Z] /home/jenkins/jenkins-agent/workspace/PullRequest-linux_390-64/fvtest/compilertriltest/LinkageTest.cpp:224:51: warning: format ‘%jX’ expects argument of type ‘uintmax_t’, but argument 11 has type ‘float (*)(float, float, float, float)’ [-Wformat=]
16:24:05 [2019-11-01T20:24:05.027Z] /home/jenkins/jenkins-agent/workspace/PullRequest-linux_390-64/fvtest/compilertriltest/LinkageTest.cpp:224:51: warning: format ‘%jX’ expects argument of type ‘uintmax_t’, but argument 11 has type ‘float (*)(float, float, float, float)’ [-Wformat=]
16:24:05 [2019-11-01T20:24:05.027Z] /home/jenkins/jenkins-agent/workspace/PullRequest-linux_390-64/fvtest/compilertriltest/LinkageTest.cpp: In instantiation of ‘void LinkageTest_SystemLinkageJitedToJitedParameterPassingFourArg_Test<gtest_TypeParam_>::TestBody() [with gtest_TypeParam_ = long int]’:
16:24:05 [2019-11-01T20:24:05.027Z] /home/jenkins/jenkins-agent/workspace/PullRequest-linux_390-64/fvtest/tril/tril/simple_compiler.hpp:34:7:   required from here
16:24:05 [2019-11-01T20:24:05.027Z] /home/jenkins/jenkins-agent/workspace/PullRequest-linux_390-64/fvtest/compilertriltest/LinkageTest.cpp:224:51: warning: format ‘%jX’ expects argument of type ‘uintmax_t’, but argument 11 has type ‘long int (*)(long int, long int, long int, long int)’ [-Wformat=]
16:24:05 [2019-11-01T20:24:05.027Z] /home/jenkins/jenkins-agent/workspace/PullRequest-linux_390-64/fvtest/compilertriltest/LinkageTest.cpp:224:51: warning: format ‘%jX’ expects argument of type ‘uintmax_t’, but argument 11 has type ‘long int (*)(long int, long int, long int, long int)’ [-Wformat=]
16:24:05 [2019-11-01T20:24:05.027Z] /home/jenkins/jenkins-agent/workspace/PullRequest-linux_390-64/fvtest/compilertriltest/LinkageTest.cpp: In instantiation of ‘void LinkageTest_SystemLinkageJitedToJitedParameterPassingFourArg_Test<gtest_TypeParam_>::TestBody() [with gtest_TypeParam_ = int]’:
16:24:05 [2019-11-01T20:24:05.027Z] /home/jenkins/jenkins-agent/workspace/PullRequest-linux_390-64/fvtest/tril/tril/simple_compiler.hpp:34:7:   required from here
16:24:05 [2019-11-01T20:24:05.027Z] /home/jenkins/jenkins-agent/workspace/PullRequest-linux_390-64/fvtest/compilertriltest/LinkageTest.cpp:224:51: warning: format ‘%jX’ expects argument of type ‘uintmax_t’, but argument 11 has type ‘int (*)(int, int, int, int)’ [-Wformat=]
16:24:05 [2019-11-01T20:24:05.027Z] /home/jenkins/jenkins-agent/workspace/PullRequest-linux_390-64/fvtest/compilertriltest/LinkageTest.cpp:224:51: warning: format ‘%jX’ expects argument of type ‘uintmax_t’, but argument 11 has type ‘int (*)(int, int, int, int)’ [-Wformat=]
16:24:05 [2019-11-01T20:24:05.027Z] [ 99%] Building CXX object fvtest/compilertriltest/CMakeFiles/comptest.dir/MaxMinTest.cpp.o
16:24:06 [2019-11-01T20:24:06.457Z] [ 99%] Building CXX object fvtest/compilertriltest/CMakeFiles/comptest.dir/CompareTest.cpp.o
16:24:07 [2019-11-01T20:24:07.376Z] [ 99%] Building CXX object fvtest/compilertriltest/CMakeFiles/comptest.dir/TypeConversionTest.cpp.o
16:24:08 [2019-11-01T20:24:08.295Z] [ 99%] Building CXX object fvtest/compilertriltest/CMakeFiles/comptest.dir/TernaryTest.cpp.o
16:24:08 [2019-11-01T20:24:08.295Z] [ 99%] Building CXX object fvtest/compilertriltest/CMakeFiles/comptest.dir/MinimalTest.cpp.o
16:24:09 [2019-11-01T20:24:09.723Z] /home/jenkins/jenkins-agent/workspace/PullRequest-linux_390-64/fvtest/compilertriltest/MinimalTest.cpp: In instantiation of ‘S* StaticSignatureMethodBuilder<S>::Compile() [with S = int(); StaticSignatureMethodBuilder<S>::FunctionPtr = int (*)()]’:
16:24:09 [2019-11-01T20:24:09.723Z] /home/jenkins/jenkins-agent/workspace/PullRequest-linux_390-64/fvtest/compilertriltest/MinimalTest.cpp:313:21:   required from ‘typename M::FunctionPtr compile() [with M = MeaningOfLifeMethod; typename M::FunctionPtr = int (*)()]’
16:24:09 [2019-11-01T20:24:09.723Z] /home/jenkins/jenkins-agent/workspace/PullRequest-linux_390-64/fvtest/compilertriltest/MinimalTest.cpp:318:46:   required from here
16:24:09 [2019-11-01T20:24:09.723Z] /home/jenkins/jenkins-agent/workspace/PullRequest-linux_390-64/fvtest/compilertriltest/MinimalTest.cpp:57:45: error: ‘TR::ResolvedMethod resolvedMethod’ has incomplete type
16:24:09 [2019-11-01T20:24:09.723Z]        TR::ResolvedMethod resolvedMethod(this);
16:24:09 [2019-11-01T20:24:09.723Z]                                              ^
16:24:09 [2019-11-01T20:24:09.723Z] /home/jenkins/jenkins-agent/workspace/PullRequest-linux_390-64/fvtest/compilertriltest/MinimalTest.cpp: In instantiation of ‘S* StaticSignatureMethodBuilder<S>::Compile() [with S = int(int); StaticSignatureMethodBuilder<S>::FunctionPtr = int (*)(int)]’:
16:24:09 [2019-11-01T20:24:09.723Z] /home/jenkins/jenkins-agent/workspace/PullRequest-linux_390-64/fvtest/compilertriltest/MinimalTest.cpp:313:21:   required from ‘typename M::FunctionPtr compile() [with M = ReturnArgI32Method; typename M::FunctionPtr = int (*)(int)]’
16:24:09 [2019-11-01T20:24:09.723Z] /home/jenkins/jenkins-agent/workspace/PullRequest-linux_390-64/fvtest/compilertriltest/MinimalTest.cpp:325:45:   required from here
16:24:09 [2019-11-01T20:24:09.723Z] /home/jenkins/jenkins-agent/workspace/PullRequest-linux_390-64/fvtest/compilertriltest/MinimalTest.cpp:57:45: error: ‘TR::ResolvedMethod resolvedMethod’ has incomplete type
16:24:09 [2019-11-01T20:24:09.723Z] /home/jenkins/jenkins-agent/workspace/PullRequest-linux_390-64/fvtest/compilertriltest/MinimalTest.cpp: In instantiation of ‘S* StaticSignatureMethodBuilder<S>::Compile() [with S = int(int, int); StaticSignatureMethodBuilder<S>::FunctionPtr = int (*)(int, int)]’:
16:24:09 [2019-11-01T20:24:09.723Z] /home/jenkins/jenkins-agent/workspace/PullRequest-linux_390-64/fvtest/compilertriltest/MinimalTest.cpp:313:21:   required from ‘typename M::FunctionPtr compile() [with M = MaxIfThenMethod; typename M::FunctionPtr = int (*)(int, int)]’
16:24:09 [2019-11-01T20:24:09.723Z] /home/jenkins/jenkins-agent/workspace/PullRequest-linux_390-64/fvtest/compilertriltest/MinimalTest.cpp:333:42:   required from here
16:24:09 [2019-11-01T20:24:09.723Z] /home/jenkins/jenkins-agent/workspace/PullRequest-linux_390-64/fvtest/compilertriltest/MinimalTest.cpp:57:45: error: ‘TR::ResolvedMethod resolvedMethod’ has incomplete type
16:24:09 [2019-11-01T20:24:09.723Z] fvtest/compilertriltest/CMakeFiles/comptest.dir/build.make:518: recipe for target 'fvtest/compilertriltest/CMakeFiles/comptest.dir/MinimalTest.cpp.o' failed
16:24:09 [2019-11-01T20:24:09.723Z] make[2]: *** [fvtest/compilertriltest/CMakeFiles/comptest.dir/MinimalTest.cpp.o] Error 1
16:24:09 [2019-11-01T20:24:09.723Z] make[2]: *** Waiting for unfinished jobs....
16:24:12 [2019-11-01T20:24:12.389Z] /home/jenkins/jenkins-agent/workspace/PullRequest-linux_390-64/fvtest/compilertriltest/CompareTest.cpp: In member function ‘virtual void Int64Compare_UsingConst_Test::TestBody()’:
16:24:12 [2019-11-01T20:24:12.389Z] /home/jenkins/jenkins-agent/workspace/PullRequest-linux_390-64/fvtest/compilertriltest/CompareTest.cpp:236:50: warning: format ‘%lld’ expects argument of type ‘long long int’, but argument 5 has type ‘long int’ [-Wformat=]
16:24:12 [2019-11-01T20:24:12.389Z]         param.opcode.c_str(), param.lhs, param.rhs);
16:24:12 [2019-11-01T20:24:12.389Z]                                                   ^
16:24:12 [2019-11-01T20:24:12.389Z] /home/jenkins/jenkins-agent/workspace/PullRequest-linux_390-64/fvtest/compilertriltest/CompareTest.cpp:236:50: warning: format ‘%lld’ expects argument of type ‘long long int’, but argument 6 has type ‘long int’ [-Wformat=]
16:24:12 [2019-11-01T20:24:12.389Z] /home/jenkins/jenkins-agent/workspace/PullRequest-linux_390-64/fvtest/compilertriltest/CompareTest.cpp:236:50: warning: format ‘%lld’ expects argument of type ‘long long int’, but argument 5 has type ‘long int’ [-Wformat=]
16:24:12 [2019-11-01T20:24:12.389Z] /home/jenkins/jenkins-agent/workspace/PullRequest-linux_390-64/fvtest/compilertriltest/CompareTest.cpp:236:50: warning: format ‘%lld’ expects argument of type ‘long long int’, but argument 6 has type ‘long int’ [-Wformat=]
16:24:12 [2019-11-01T20:24:12.389Z] /home/jenkins/jenkins-agent/workspace/PullRequest-linux_390-64/fvtest/compilertriltest/CompareTest.cpp: In member function ‘virtual void UInt64Compare_UsingConst_Test::TestBody()’:
16:24:12 [2019-11-01T20:24:12.389Z] /home/jenkins/jenkins-agent/workspace/PullRequest-linux_390-64/fvtest/compilertriltest/CompareTest.cpp:319:50: warning: format ‘%lld’ expects argument of type ‘long long int’, but argument 5 has type ‘long unsigned int’ [-Wformat=]
16:24:12 [2019-11-01T20:24:12.389Z]         param.opcode.c_str(), param.lhs, param.rhs);
16:24:12 [2019-11-01T20:24:12.389Z]                                                   ^
16:24:12 [2019-11-01T20:24:12.389Z] /home/jenkins/jenkins-agent/workspace/PullRequest-linux_390-64/fvtest/compilertriltest/CompareTest.cpp:319:50: warning: format ‘%lld’ expects argument of type ‘long long int’, but argument 6 has type ‘long unsigned int’ [-Wformat=]
16:24:12 [2019-11-01T20:24:12.389Z] /home/jenkins/jenkins-agent/workspace/PullRequest-linux_390-64/fvtest/compilertriltest/CompareTest.cpp:319:50: warning: format ‘%lld’ expects argument of type ‘long long int’, but argument 5 has type ‘long unsigned int’ [-Wformat=]
16:24:12 [2019-11-01T20:24:12.389Z] /home/jenkins/jenkins-agent/workspace/PullRequest-linux_390-64/fvtest/compilertriltest/CompareTest.cpp:319:50: warning: format ‘%lld’ expects argument of type ‘long long int’, but argument 6 has type ‘long unsigned int’ [-Wformat=]
16:24:12 [2019-11-01T20:24:12.389Z] /home/jenkins/jenkins-agent/workspace/PullRequest-linux_390-64/fvtest/compilertriltest/CompareTest.cpp: In member function ‘virtual void Int64IfCompare_UsingConst_Test::TestBody()’:
16:24:12 [2019-11-01T20:24:12.389Z] /home/jenkins/jenkins-agent/workspace/PullRequest-linux_390-64/fvtest/compilertriltest/CompareTest.cpp:587:84: warning: format ‘%lld’ expects argument of type ‘long long int’, but argument 5 has type ‘long int’ [-Wformat=]
16:24:12 [2019-11-01T20:24:12.389Z]          param.opcode.c_str(), param.lhs, param.rhs, IFCMP_FALSE_NUM, IFCMP_TRUE_NUM);
16:24:12 [2019-11-01T20:24:12.389Z]                                                                                     ^
16:24:12 [2019-11-01T20:24:12.389Z] /home/jenkins/jenkins-agent/workspace/PullRequest-linux_390-64/fvtest/compilertriltest/CompareTest.cpp:587:84: warning: format ‘%lld’ expects argument of type ‘long long int’, but argument 6 has type ‘long int’ [-Wformat=]
16:24:12 [2019-11-01T20:24:12.389Z] /home/jenkins/jenkins-agent/workspace/PullRequest-linux_390-64/fvtest/compilertriltest/CompareTest.cpp:587:84: warning: format ‘%lld’ expects argument of type ‘long long int’, but argument 5 has type ‘long int’ [-Wformat=]
16:24:12 [2019-11-01T20:24:12.389Z] /home/jenkins/jenkins-agent/workspace/PullRequest-linux_390-64/fvtest/compilertriltest/CompareTest.cpp:587:84: warning: format ‘%lld’ expects argument of type ‘long long int’, but argument 6 has type ‘long int’ [-Wformat=]
16:24:12 [2019-11-01T20:24:12.389Z] /home/jenkins/jenkins-agent/workspace/PullRequest-linux_390-64/fvtest/compilertriltest/CompareTest.cpp: In member function ‘virtual void UInt64IfCompare_UsingConst_Test::TestBody()’:
16:24:12 [2019-11-01T20:24:12.389Z] /home/jenkins/jenkins-agent/workspace/PullRequest-linux_390-64/fvtest/compilertriltest/CompareTest.cpp:672:84: warning: format ‘%lld’ expects argument of type ‘long long int’, but argument 5 has type ‘long unsigned int’ [-Wformat=]
16:24:12 [2019-11-01T20:24:12.390Z]          param.opcode.c_str(), param.lhs, param.rhs, IFCMP_FALSE_NUM, IFCMP_TRUE_NUM);
16:24:12 [2019-11-01T20:24:12.390Z]                                                                                     ^
16:24:12 [2019-11-01T20:24:12.390Z] /home/jenkins/jenkins-agent/workspace/PullRequest-linux_390-64/fvtest/compilertriltest/CompareTest.cpp:672:84: warning: format ‘%lld’ expects argument of type ‘long long int’, but argument 6 has type ‘long unsigned int’ [-Wformat=]
16:24:12 [2019-11-01T20:24:12.390Z] /home/jenkins/jenkins-agent/workspace/PullRequest-linux_390-64/fvtest/compilertriltest/CompareTest.cpp:672:84: warning: format ‘%lld’ expects argument of type ‘long long int’, but argument 5 has type ‘long unsigned int’ [-Wformat=]
16:24:12 [2019-11-01T20:24:12.390Z] /home/jenkins/jenkins-agent/workspace/PullRequest-linux_390-64/fvtest/compilertriltest/CompareTest.cpp:672:84: warning: format ‘%lld’ expects argument of type ‘long long int’, but argument 6 has type ‘long unsigned int’ [-Wformat=]
16:24:18 [2019-11-01T20:24:18.980Z] /home/jenkins/jenkins-agent/workspace/PullRequest-linux_390-64/fvtest/compilertriltest/TypeConversionTest.cpp: In member function ‘virtual void Int64ToInt32_UsingConst_Test::TestBody()’:
16:24:18 [2019-11-01T20:24:18.980Z] /home/jenkins/jenkins-agent/workspace/PullRequest-linux_390-64/fvtest/compilertriltest/TypeConversionTest.cpp:699:20: warning: format ‘%lld’ expects argument of type ‘long long int’, but argument 4 has type ‘long int’ [-Wformat=]
16:24:18 [2019-11-01T20:24:18.980Z]          param.value);
16:24:18 [2019-11-01T20:24:18.980Z]                     ^
16:24:18 [2019-11-01T20:24:18.980Z] /home/jenkins/jenkins-agent/workspace/PullRequest-linux_390-64/fvtest/compilertriltest/TypeConversionTest.cpp:699:20: warning: format ‘%lld’ expects argument of type ‘long long int’, but argument 4 has type ‘long int’ [-Wformat=]
16:24:18 [2019-11-01T20:24:18.980Z] /home/jenkins/jenkins-agent/workspace/PullRequest-linux_390-64/fvtest/compilertriltest/TypeConversionTest.cpp: In member function ‘virtual void Int64ToFloat_UsingConst_Test::TestBody()’:
16:24:18 [2019-11-01T20:24:18.980Z] /home/jenkins/jenkins-agent/workspace/PullRequest-linux_390-64/fvtest/compilertriltest/TypeConversionTest.cpp:828:20: warning: format ‘%lld’ expects argument of type ‘long long int’, but argument 4 has type ‘long int’ [-Wformat=]
16:24:18 [2019-11-01T20:24:18.980Z]          param.value);
16:24:18 [2019-11-01T20:24:18.980Z]                     ^
16:24:18 [2019-11-01T20:24:18.980Z] /home/jenkins/jenkins-agent/workspace/PullRequest-linux_390-64/fvtest/compilertriltest/TypeConversionTest.cpp:828:20: warning: format ‘%lld’ expects argument of type ‘long long int’, but argument 4 has type ‘long int’ [-Wformat=]
16:24:18 [2019-11-01T20:24:18.980Z] /home/jenkins/jenkins-agent/workspace/PullRequest-linux_390-64/fvtest/compilertriltest/TypeConversionTest.cpp: In member function ‘virtual void Int64ToDouble_UsingConst_Test::TestBody()’:
16:24:18 [2019-11-01T20:24:18.980Z] /home/jenkins/jenkins-agent/workspace/PullRequest-linux_390-64/fvtest/compilertriltest/TypeConversionTest.cpp:940:20: warning: format ‘%lld’ expects argument of type ‘long long int’, but argument 4 has type ‘long int’ [-Wformat=]
16:24:18 [2019-11-01T20:24:18.980Z]          param.value);
16:24:18 [2019-11-01T20:24:18.980Z]                     ^
16:24:18 [2019-11-01T20:24:18.980Z] /home/jenkins/jenkins-agent/workspace/PullRequest-linux_390-64/fvtest/compilertriltest/TypeConversionTest.cpp:940:20: warning: format ‘%lld’ expects argument of type ‘long long int’, but argument 4 has type ‘long int’ [-Wformat=]
16:24:18 [2019-11-01T20:24:18.980Z] CMakeFiles/Makefile2:5011: recipe for target 'fvtest/compilertriltest/CMakeFiles/comptest.dir/all' failed
16:24:18 [2019-11-01T20:24:18.980Z] make[1]: *** [fvtest/compilertriltest/CMakeFiles/comptest.dir/all] Error 2
16:24:18 [2019-11-01T20:24:18.980Z] Makefile:138: recipe for target 'all' failed
16:24:18 [2019-11-01T20:24:18.980Z] make: *** [all] Error 2
[Pipeline] }
[Pipeline] // dir
[Pipeline] }
[Pipeline] // timestamps
[Pipeline] }
[Pipeline] // stage
[Pipeline] stage
[Pipeline] { (Test)
Stage "Test" skipped due to earlier failure(s)
[Pipeline] }
[Pipeline] // stage
[Pipeline] stage
[Pipeline] { (Declarative: Post Actions)
[Pipeline] echo
Cleanup workspace
[Pipeline] deleteDir
[Pipeline] }
[Pipeline] // stage
[Pipeline] }
[Pipeline] // withEnv
[Pipeline] }
[Pipeline] // withEnv
[Pipeline] }
[Pipeline] // node
[Pipeline] End of Pipeline
Setting status of 025f927b832f81e43cd9791f92edb3fd871b47e3 to FAILURE with url https://ci.eclipse.org/omr/job/PullRequest-linux_390-64/2077/ and message: 'Build finished. '
Using context: continuous-integration/eclipse-omr/pr/linux_390-64
ERROR: script returned exit code 2
Finished: FAILURE