Console Output

Skipping 6,443 KB.. Full Log
Discouraged access: The type 'CommonTestUtil' is not API (restriction on classpath entry '/home/jenkins/agent/workspace/mylyn-tasks-nightly/.repository/p2/osgi/bundle/org.eclipse.mylyn.commons.sdk.util/3.26.0.N20200810-0516/org.eclipse.mylyn.commons.sdk.util-3.26.0.N20200810-0516.jar')
[WARNING] /home/jenkins/agent/workspace/mylyn-tasks-nightly/connector-bugzilla-rest/org.eclipse.mylyn.bugzilla.rest.core.tests/src/org/eclipse/mylyn/bugzilla/rest/test/support/BugzillaRestTestFixture.java:[19] 
	import org.eclipse.mylyn.commons.sdk.util.CommonTestUtil.PrivilegeLevel;
	       ^^^^^^^^^^^^^^^^^^^^^^^^^^^^^^^^^^^^^^^^^^^^^^^^^^^^^^^^^^^^^^^^
Discouraged access: The type 'CommonTestUtil.PrivilegeLevel' is not API (restriction on classpath entry '/home/jenkins/agent/workspace/mylyn-tasks-nightly/.repository/p2/osgi/bundle/org.eclipse.mylyn.commons.sdk.util/3.26.0.N20200810-0516/org.eclipse.mylyn.commons.sdk.util-3.26.0.N20200810-0516.jar')
[WARNING] /home/jenkins/agent/workspace/mylyn-tasks-nightly/connector-bugzilla-rest/org.eclipse.mylyn.bugzilla.rest.core.tests/src/org/eclipse/mylyn/bugzilla/rest/test/support/BugzillaRestTestFixture.java:[20] 
	import org.eclipse.mylyn.commons.sdk.util.FixtureConfiguration;
	       ^^^^^^^^^^^^^^^^^^^^^^^^^^^^^^^^^^^^^^^^^^^^^^^^^^^^^^^
Discouraged access: The type 'FixtureConfiguration' is not API (restriction on classpath entry '/home/jenkins/agent/workspace/mylyn-tasks-nightly/.repository/p2/osgi/bundle/org.eclipse.mylyn.commons.sdk.util/3.26.0.N20200810-0516/org.eclipse.mylyn.commons.sdk.util-3.26.0.N20200810-0516.jar')
[WARNING] /home/jenkins/agent/workspace/mylyn-tasks-nightly/connector-bugzilla-rest/org.eclipse.mylyn.bugzilla.rest.core.tests/src/org/eclipse/mylyn/bugzilla/rest/test/support/BugzillaRestTestFixture.java:[21] 
	import org.eclipse.mylyn.commons.sdk.util.RepositoryTestFixture;
	       ^^^^^^^^^^^^^^^^^^^^^^^^^^^^^^^^^^^^^^^^^^^^^^^^^^^^^^^^
Discouraged access: The type 'RepositoryTestFixture' is not API (restriction on classpath entry '/home/jenkins/agent/workspace/mylyn-tasks-nightly/.repository/p2/osgi/bundle/org.eclipse.mylyn.commons.sdk.util/3.26.0.N20200810-0516/org.eclipse.mylyn.commons.sdk.util-3.26.0.N20200810-0516.jar')
[WARNING] /home/jenkins/agent/workspace/mylyn-tasks-nightly/connector-bugzilla-rest/org.eclipse.mylyn.bugzilla.rest.core.tests/src/org/eclipse/mylyn/bugzilla/rest/test/support/BugzillaRestTestFixture.java:[22] 
	import org.eclipse.mylyn.commons.sdk.util.TestConfiguration;
	       ^^^^^^^^^^^^^^^^^^^^^^^^^^^^^^^^^^^^^^^^^^^^^^^^^^^^
Discouraged access: The type 'TestConfiguration' is not API (restriction on classpath entry '/home/jenkins/agent/workspace/mylyn-tasks-nightly/.repository/p2/osgi/bundle/org.eclipse.mylyn.commons.sdk.util/3.26.0.N20200810-0516/org.eclipse.mylyn.commons.sdk.util-3.26.0.N20200810-0516.jar')
[WARNING] /home/jenkins/agent/workspace/mylyn-tasks-nightly/connector-bugzilla-rest/org.eclipse.mylyn.bugzilla.rest.core.tests/src/org/eclipse/mylyn/bugzilla/rest/test/support/BugzillaRestTestFixture.java:[30] 
	public class BugzillaRestTestFixture extends RepositoryTestFixture {
	                                             ^^^^^^^^^^^^^^^^^^^^^
Discouraged access: The type 'RepositoryTestFixture' is not API (restriction on classpath entry '/home/jenkins/agent/workspace/mylyn-tasks-nightly/.repository/p2/osgi/bundle/org.eclipse.mylyn.commons.sdk.util/3.26.0.N20200810-0516/org.eclipse.mylyn.commons.sdk.util-3.26.0.N20200810-0516.jar')
[WARNING] /home/jenkins/agent/workspace/mylyn-tasks-nightly/connector-bugzilla-rest/org.eclipse.mylyn.bugzilla.rest.core.tests/src/org/eclipse/mylyn/bugzilla/rest/test/support/BugzillaRestTestFixture.java:[48] 
	return TestConfiguration.getDefault().discoverDefault(BugzillaRestTestFixture.class, "bugzillaREST");
	       ^^^^^^^^^^^^^^^^^
Discouraged access: The type 'TestConfiguration' is not API (restriction on classpath entry '/home/jenkins/agent/workspace/mylyn-tasks-nightly/.repository/p2/osgi/bundle/org.eclipse.mylyn.commons.sdk.util/3.26.0.N20200810-0516/org.eclipse.mylyn.commons.sdk.util-3.26.0.N20200810-0516.jar')
[WARNING] /home/jenkins/agent/workspace/mylyn-tasks-nightly/connector-bugzilla-rest/org.eclipse.mylyn.bugzilla.rest.core.tests/src/org/eclipse/mylyn/bugzilla/rest/test/support/BugzillaRestTestFixture.java:[48] 
	return TestConfiguration.getDefault().discoverDefault(BugzillaRestTestFixture.class, "bugzillaREST");
	                         ^^^^^^^^^^
Discouraged access: The method 'TestConfiguration.getDefault()' is not API (restriction on classpath entry '/home/jenkins/agent/workspace/mylyn-tasks-nightly/.repository/p2/osgi/bundle/org.eclipse.mylyn.commons.sdk.util/3.26.0.N20200810-0516/org.eclipse.mylyn.commons.sdk.util-3.26.0.N20200810-0516.jar')
[WARNING] /home/jenkins/agent/workspace/mylyn-tasks-nightly/connector-bugzilla-rest/org.eclipse.mylyn.bugzilla.rest.core.tests/src/org/eclipse/mylyn/bugzilla/rest/test/support/BugzillaRestTestFixture.java:[48] 
	return TestConfiguration.getDefault().discoverDefault(BugzillaRestTestFixture.class, "bugzillaREST");
	                                      ^^^^^^^^^^^^^^^
Discouraged access: The method 'TestConfiguration.discoverDefault(Class<BugzillaRestTestFixture>, String)' is not API (restriction on classpath entry '/home/jenkins/agent/workspace/mylyn-tasks-nightly/.repository/p2/osgi/bundle/org.eclipse.mylyn.commons.sdk.util/3.26.0.N20200810-0516/org.eclipse.mylyn.commons.sdk.util-3.26.0.N20200810-0516.jar')
[WARNING] /home/jenkins/agent/workspace/mylyn-tasks-nightly/connector-bugzilla-rest/org.eclipse.mylyn.bugzilla.rest.core.tests/src/org/eclipse/mylyn/bugzilla/rest/test/support/BugzillaRestTestFixture.java:[71] 
	public BugzillaRestTestFixture(FixtureConfiguration configuration) {
	                               ^^^^^^^^^^^^^^^^^^^^
Discouraged access: The type 'FixtureConfiguration' is not API (restriction on classpath entry '/home/jenkins/agent/workspace/mylyn-tasks-nightly/.repository/p2/osgi/bundle/org.eclipse.mylyn.commons.sdk.util/3.26.0.N20200810-0516/org.eclipse.mylyn.commons.sdk.util-3.26.0.N20200810-0516.jar')
[WARNING] /home/jenkins/agent/workspace/mylyn-tasks-nightly/connector-bugzilla-rest/org.eclipse.mylyn.bugzilla.rest.core.tests/src/org/eclipse/mylyn/bugzilla/rest/test/support/BugzillaRestTestFixture.java:[72] 
	super(BugzillaRestCore.CONNECTOR_KIND, configuration.getUrl());
	^^^^^^^^^^^^^^^^^^^^^^^^^^^^^^^^^^^^^^^^^^^^^^^^^^^^^^^^^^^^^^^
Discouraged access: The constructor 'RepositoryTestFixture(String, String)' is not API (restriction on classpath entry '/home/jenkins/agent/workspace/mylyn-tasks-nightly/.repository/p2/osgi/bundle/org.eclipse.mylyn.commons.sdk.util/3.26.0.N20200810-0516/org.eclipse.mylyn.commons.sdk.util-3.26.0.N20200810-0516.jar')
[WARNING] /home/jenkins/agent/workspace/mylyn-tasks-nightly/connector-bugzilla-rest/org.eclipse.mylyn.bugzilla.rest.core.tests/src/org/eclipse/mylyn/bugzilla/rest/test/support/BugzillaRestTestFixture.java:[72] 
	super(BugzillaRestCore.CONNECTOR_KIND, configuration.getUrl());
	                                                     ^^^^^^
Discouraged access: The method 'FixtureConfiguration.getUrl()' is not API (restriction on classpath entry '/home/jenkins/agent/workspace/mylyn-tasks-nightly/.repository/p2/osgi/bundle/org.eclipse.mylyn.commons.sdk.util/3.26.0.N20200810-0516/org.eclipse.mylyn.commons.sdk.util-3.26.0.N20200810-0516.jar')
[WARNING] /home/jenkins/agent/workspace/mylyn-tasks-nightly/connector-bugzilla-rest/org.eclipse.mylyn.bugzilla.rest.core.tests/src/org/eclipse/mylyn/bugzilla/rest/test/support/BugzillaRestTestFixture.java:[73] 
	version = configuration.getVersion();
	                        ^^^^^^^^^^
Discouraged access: The method 'FixtureConfiguration.getVersion()' is not API (restriction on classpath entry '/home/jenkins/agent/workspace/mylyn-tasks-nightly/.repository/p2/osgi/bundle/org.eclipse.mylyn.commons.sdk.util/3.26.0.N20200810-0516/org.eclipse.mylyn.commons.sdk.util-3.26.0.N20200810-0516.jar')
[WARNING] /home/jenkins/agent/workspace/mylyn-tasks-nightly/connector-bugzilla-rest/org.eclipse.mylyn.bugzilla.rest.core.tests/src/org/eclipse/mylyn/bugzilla/rest/test/support/BugzillaRestTestFixture.java:[74] 
	setInfo("Bugzilla", configuration.getVersion(), configuration.getInfo());
	^^^^^^^
Discouraged access: The method 'AbstractTestFixture.setInfo(String, String, String)' is not API (restriction on classpath entry '/home/jenkins/agent/workspace/mylyn-tasks-nightly/.repository/p2/osgi/bundle/org.eclipse.mylyn.commons.sdk.util/3.26.0.N20200810-0516/org.eclipse.mylyn.commons.sdk.util-3.26.0.N20200810-0516.jar')
[WARNING] /home/jenkins/agent/workspace/mylyn-tasks-nightly/connector-bugzilla-rest/org.eclipse.mylyn.bugzilla.rest.core.tests/src/org/eclipse/mylyn/bugzilla/rest/test/support/BugzillaRestTestFixture.java:[74] 
	setInfo("Bugzilla", configuration.getVersion(), configuration.getInfo());
	                                  ^^^^^^^^^^
Discouraged access: The method 'FixtureConfiguration.getVersion()' is not API (restriction on classpath entry '/home/jenkins/agent/workspace/mylyn-tasks-nightly/.repository/p2/osgi/bundle/org.eclipse.mylyn.commons.sdk.util/3.26.0.N20200810-0516/org.eclipse.mylyn.commons.sdk.util-3.26.0.N20200810-0516.jar')
[WARNING] /home/jenkins/agent/workspace/mylyn-tasks-nightly/connector-bugzilla-rest/org.eclipse.mylyn.bugzilla.rest.core.tests/src/org/eclipse/mylyn/bugzilla/rest/test/support/BugzillaRestTestFixture.java:[74] 
	setInfo("Bugzilla", configuration.getVersion(), configuration.getInfo());
	                                                              ^^^^^^^
Discouraged access: The method 'FixtureConfiguration.getInfo()' is not API (restriction on classpath entry '/home/jenkins/agent/workspace/mylyn-tasks-nightly/.repository/p2/osgi/bundle/org.eclipse.mylyn.commons.sdk.util/3.26.0.N20200810-0516/org.eclipse.mylyn.commons.sdk.util-3.26.0.N20200810-0516.jar')
[WARNING] /home/jenkins/agent/workspace/mylyn-tasks-nightly/connector-bugzilla-rest/org.eclipse.mylyn.bugzilla.rest.core.tests/src/org/eclipse/mylyn/bugzilla/rest/test/support/BugzillaRestTestFixture.java:[75] 
	setDefaultproperties(configuration.getProperties());
	^^^^^^^^^^^^^^^^^^^^
Discouraged access: The method 'AbstractTestFixture.setDefaultproperties(Map<String,String>)' is not API (restriction on classpath entry '/home/jenkins/agent/workspace/mylyn-tasks-nightly/.repository/p2/osgi/bundle/org.eclipse.mylyn.commons.sdk.util/3.26.0.N20200810-0516/org.eclipse.mylyn.commons.sdk.util-3.26.0.N20200810-0516.jar')
[WARNING] /home/jenkins/agent/workspace/mylyn-tasks-nightly/connector-bugzilla-rest/org.eclipse.mylyn.bugzilla.rest.core.tests/src/org/eclipse/mylyn/bugzilla/rest/test/support/BugzillaRestTestFixture.java:[75] 
	setDefaultproperties(configuration.getProperties());
	                                   ^^^^^^^^^^^^^
Discouraged access: The method 'FixtureConfiguration.getProperties()' is not API (restriction on classpath entry '/home/jenkins/agent/workspace/mylyn-tasks-nightly/.repository/p2/osgi/bundle/org.eclipse.mylyn.commons.sdk.util/3.26.0.N20200810-0516/org.eclipse.mylyn.commons.sdk.util-3.26.0.N20200810-0516.jar')
[WARNING] /home/jenkins/agent/workspace/mylyn-tasks-nightly/connector-bugzilla-rest/org.eclipse.mylyn.bugzilla.rest.core.tests/src/org/eclipse/mylyn/bugzilla/rest/test/support/BugzillaRestTestFixture.java:[86] 
	repository = new TaskRepository(getConnectorKind(), getRepositoryUrl());
	                                ^^^^^^^^^^^^^^^^
Discouraged access: The method 'AbstractTestFixture.getConnectorKind()' is not API (restriction on classpath entry '/home/jenkins/agent/workspace/mylyn-tasks-nightly/.repository/p2/osgi/bundle/org.eclipse.mylyn.commons.sdk.util/3.26.0.N20200810-0516/org.eclipse.mylyn.commons.sdk.util-3.26.0.N20200810-0516.jar')
[WARNING] /home/jenkins/agent/workspace/mylyn-tasks-nightly/connector-bugzilla-rest/org.eclipse.mylyn.bugzilla.rest.core.tests/src/org/eclipse/mylyn/bugzilla/rest/test/support/BugzillaRestTestFixture.java:[86] 
	repository = new TaskRepository(getConnectorKind(), getRepositoryUrl());
	                                                    ^^^^^^^^^^^^^^^^
Discouraged access: The method 'AbstractTestFixture.getRepositoryUrl()' is not API (restriction on classpath entry '/home/jenkins/agent/workspace/mylyn-tasks-nightly/.repository/p2/osgi/bundle/org.eclipse.mylyn.commons.sdk.util/3.26.0.N20200810-0516/org.eclipse.mylyn.commons.sdk.util-3.26.0.N20200810-0516.jar')
[WARNING] /home/jenkins/agent/workspace/mylyn-tasks-nightly/connector-bugzilla-rest/org.eclipse.mylyn.bugzilla.rest.core.tests/src/org/eclipse/mylyn/bugzilla/rest/test/support/BugzillaRestTestFixture.java:[87] 
	UserCredentials credentials = CommonTestUtil.getCredentials(PrivilegeLevel.USER);
	^^^^^^^^^^^^^^^
Discouraged access: The type 'UserCredentials' is not API (restriction on classpath entry '/home/jenkins/agent/workspace/mylyn-tasks-nightly/.repository/p2/osgi/bundle/org.eclipse.mylyn.commons.repositories.core/1.18.0.N20190930-2131/org.eclipse.mylyn.commons.repositories.core-1.18.0.N20190930-2131.jar')
[WARNING] /home/jenkins/agent/workspace/mylyn-tasks-nightly/connector-bugzilla-rest/org.eclipse.mylyn.bugzilla.rest.core.tests/src/org/eclipse/mylyn/bugzilla/rest/test/support/BugzillaRestTestFixture.java:[87] 
	UserCredentials credentials = CommonTestUtil.getCredentials(PrivilegeLevel.USER);
	                              ^^^^^^^^^^^^^^
Discouraged access: The type 'CommonTestUtil' is not API (restriction on classpath entry '/home/jenkins/agent/workspace/mylyn-tasks-nightly/.repository/p2/osgi/bundle/org.eclipse.mylyn.commons.sdk.util/3.26.0.N20200810-0516/org.eclipse.mylyn.commons.sdk.util-3.26.0.N20200810-0516.jar')
[WARNING] /home/jenkins/agent/workspace/mylyn-tasks-nightly/connector-bugzilla-rest/org.eclipse.mylyn.bugzilla.rest.core.tests/src/org/eclipse/mylyn/bugzilla/rest/test/support/BugzillaRestTestFixture.java:[87] 
	UserCredentials credentials = CommonTestUtil.getCredentials(PrivilegeLevel.USER);
	                                             ^^^^^^^^^^^^^^
Discouraged access: The method 'CommonTestUtil.getCredentials(CommonTestUtil.PrivilegeLevel)' is not API (restriction on classpath entry '/home/jenkins/agent/workspace/mylyn-tasks-nightly/.repository/p2/osgi/bundle/org.eclipse.mylyn.commons.sdk.util/3.26.0.N20200810-0516/org.eclipse.mylyn.commons.sdk.util-3.26.0.N20200810-0516.jar')
[WARNING] /home/jenkins/agent/workspace/mylyn-tasks-nightly/connector-bugzilla-rest/org.eclipse.mylyn.bugzilla.rest.core.tests/src/org/eclipse/mylyn/bugzilla/rest/test/support/BugzillaRestTestFixture.java:[87] 
	UserCredentials credentials = CommonTestUtil.getCredentials(PrivilegeLevel.USER);
	                                                            ^^^^^^^^^^^^^^^^^^^
Discouraged access: The type 'CommonTestUtil.PrivilegeLevel' is not API (restriction on classpath entry '/home/jenkins/agent/workspace/mylyn-tasks-nightly/.repository/p2/osgi/bundle/org.eclipse.mylyn.commons.sdk.util/3.26.0.N20200810-0516/org.eclipse.mylyn.commons.sdk.util-3.26.0.N20200810-0516.jar')
[WARNING] /home/jenkins/agent/workspace/mylyn-tasks-nightly/connector-bugzilla-rest/org.eclipse.mylyn.bugzilla.rest.core.tests/src/org/eclipse/mylyn/bugzilla/rest/test/support/BugzillaRestTestFixture.java:[87] 
	UserCredentials credentials = CommonTestUtil.getCredentials(PrivilegeLevel.USER);
	                                                                           ^^^^
Discouraged access: The field 'CommonTestUtil.PrivilegeLevel.USER' is not API (restriction on classpath entry '/home/jenkins/agent/workspace/mylyn-tasks-nightly/.repository/p2/osgi/bundle/org.eclipse.mylyn.commons.sdk.util/3.26.0.N20200810-0516/org.eclipse.mylyn.commons.sdk.util-3.26.0.N20200810-0516.jar')
[WARNING] /home/jenkins/agent/workspace/mylyn-tasks-nightly/connector-bugzilla-rest/org.eclipse.mylyn.bugzilla.rest.core.tests/src/org/eclipse/mylyn/bugzilla/rest/test/support/BugzillaRestTestFixture.java:[91] 
	userAPIKeyMap.getOrDefault(credentials.getUserName(), ""));
	                                       ^^^^^^^^^^^
Discouraged access: The method 'UserCredentials.getUserName()' is not API (restriction on classpath entry '/home/jenkins/agent/workspace/mylyn-tasks-nightly/.repository/p2/osgi/bundle/org.eclipse.mylyn.commons.repositories.core/1.18.0.N20190930-2131/org.eclipse.mylyn.commons.repositories.core-1.18.0.N20190930-2131.jar')
[WARNING] /home/jenkins/agent/workspace/mylyn-tasks-nightly/connector-bugzilla-rest/org.eclipse.mylyn.bugzilla.rest.core.tests/src/org/eclipse/mylyn/bugzilla/rest/test/support/BugzillaRestTestFixture.java:[93] 
	new AuthenticationCredentials(credentials.getUserName(), ""), false);
	                                          ^^^^^^^^^^^
Discouraged access: The method 'UserCredentials.getUserName()' is not API (restriction on classpath entry '/home/jenkins/agent/workspace/mylyn-tasks-nightly/.repository/p2/osgi/bundle/org.eclipse.mylyn.commons.repositories.core/1.18.0.N20190930-2131/org.eclipse.mylyn.commons.repositories.core-1.18.0.N20190930-2131.jar')
[WARNING] /home/jenkins/agent/workspace/mylyn-tasks-nightly/connector-bugzilla-rest/org.eclipse.mylyn.bugzilla.rest.core.tests/src/org/eclipse/mylyn/bugzilla/rest/test/support/BugzillaRestTestFixture.java:[96] 
	new AuthenticationCredentials(credentials.getUserName(), credentials.getPassword()), true);
	                                          ^^^^^^^^^^^
Discouraged access: The method 'UserCredentials.getUserName()' is not API (restriction on classpath entry '/home/jenkins/agent/workspace/mylyn-tasks-nightly/.repository/p2/osgi/bundle/org.eclipse.mylyn.commons.repositories.core/1.18.0.N20190930-2131/org.eclipse.mylyn.commons.repositories.core-1.18.0.N20190930-2131.jar')
[WARNING] /home/jenkins/agent/workspace/mylyn-tasks-nightly/connector-bugzilla-rest/org.eclipse.mylyn.bugzilla.rest.core.tests/src/org/eclipse/mylyn/bugzilla/rest/test/support/BugzillaRestTestFixture.java:[96] 
	new AuthenticationCredentials(credentials.getUserName(), credentials.getPassword()), true);
	                                                                     ^^^^^^^^^^^
Discouraged access: The method 'UserCredentials.getPassword()' is not API (restriction on classpath entry '/home/jenkins/agent/workspace/mylyn-tasks-nightly/.repository/p2/osgi/bundle/org.eclipse.mylyn.commons.repositories.core/1.18.0.N20190930-2131/org.eclipse.mylyn.commons.repositories.core-1.18.0.N20190930-2131.jar')
[WARNING] /home/jenkins/agent/workspace/mylyn-tasks-nightly/connector-bugzilla-rest/org.eclipse.mylyn.bugzilla.rest.core.tests/src/org/eclipse/mylyn/bugzilla/rest/test/support/BugzillaRestTestFixture.java:[102] 
	return Boolean.parseBoolean(getProperty(API_KEY_ENABLED_PROPERTY));
	                            ^^^^^^^^^^^
Discouraged access: The method 'AbstractTestFixture.getProperty(String)' is not API (restriction on classpath entry '/home/jenkins/agent/workspace/mylyn-tasks-nightly/.repository/p2/osgi/bundle/org.eclipse.mylyn.commons.sdk.util/3.26.0.N20200810-0516/org.eclipse.mylyn.commons.sdk.util-3.26.0.N20200810-0516.jar')
[WARNING] /home/jenkins/agent/workspace/mylyn-tasks-nightly/connector-bugzilla-rest/org.eclipse.mylyn.bugzilla.rest.core.tests/src/org/eclipse/mylyn/bugzilla/rest/test/support/BugzillaRestTestFixture.java:[110] 
	return "testdata/" + getProperty("testdataVersion");
	                     ^^^^^^^^^^^
Discouraged access: The method 'AbstractTestFixture.getProperty(String)' is not API (restriction on classpath entry '/home/jenkins/agent/workspace/mylyn-tasks-nightly/.repository/p2/osgi/bundle/org.eclipse.mylyn.commons.sdk.util/3.26.0.N20200810-0516/org.eclipse.mylyn.commons.sdk.util-3.26.0.N20200810-0516.jar')
[WARNING] /home/jenkins/agent/workspace/mylyn-tasks-nightly/connector-bugzilla-rest/org.eclipse.mylyn.bugzilla.rest.core.tests/src/org/eclipse/mylyn/bugzilla/rest/core/tests/AllBugzillaRestCoreTests.java:[18] 
	import org.eclipse.mylyn.commons.sdk.util.CommonTestUtil;
	       ^^^^^^^^^^^^^^^^^^^^^^^^^^^^^^^^^^^^^^^^^^^^^^^^^
Discouraged access: The type 'CommonTestUtil' is not API (restriction on classpath entry '/home/jenkins/agent/workspace/mylyn-tasks-nightly/.repository/p2/osgi/bundle/org.eclipse.mylyn.commons.sdk.util/3.26.0.N20200810-0516/org.eclipse.mylyn.commons.sdk.util-3.26.0.N20200810-0516.jar')
[WARNING] /home/jenkins/agent/workspace/mylyn-tasks-nightly/connector-bugzilla-rest/org.eclipse.mylyn.bugzilla.rest.core.tests/src/org/eclipse/mylyn/bugzilla/rest/core/tests/AllBugzillaRestCoreTests.java:[19] 
	import org.eclipse.mylyn.commons.sdk.util.ManagedSuite;
	       ^^^^^^^^^^^^^^^^^^^^^^^^^^^^^^^^^^^^^^^^^^^^^^^
Discouraged access: The type 'ManagedSuite' is not API (restriction on classpath entry '/home/jenkins/agent/workspace/mylyn-tasks-nightly/.repository/p2/osgi/bundle/org.eclipse.mylyn.commons.sdk.util/3.26.0.N20200810-0516/org.eclipse.mylyn.commons.sdk.util-3.26.0.N20200810-0516.jar')
[WARNING] /home/jenkins/agent/workspace/mylyn-tasks-nightly/connector-bugzilla-rest/org.eclipse.mylyn.bugzilla.rest.core.tests/src/org/eclipse/mylyn/bugzilla/rest/core/tests/AllBugzillaRestCoreTests.java:[20] 
	import org.eclipse.mylyn.commons.sdk.util.ManagedSuite.SuiteClassProvider;
	       ^^^^^^^^^^^^^^^^^^^^^^^^^^^^^^^^^^^^^^^^^^^^^^^^^^^^^^^^^^^^^^^^^^
Discouraged access: The type 'ManagedSuite.SuiteClassProvider' is not API (restriction on classpath entry '/home/jenkins/agent/workspace/mylyn-tasks-nightly/.repository/p2/osgi/bundle/org.eclipse.mylyn.commons.sdk.util/3.26.0.N20200810-0516/org.eclipse.mylyn.commons.sdk.util-3.26.0.N20200810-0516.jar')
[WARNING] /home/jenkins/agent/workspace/mylyn-tasks-nightly/connector-bugzilla-rest/org.eclipse.mylyn.bugzilla.rest.core.tests/src/org/eclipse/mylyn/bugzilla/rest/core/tests/AllBugzillaRestCoreTests.java:[21] 
	import org.eclipse.mylyn.commons.sdk.util.ManagedSuite.TestConfigurationProperty;
	       ^^^^^^^^^^^^^^^^^^^^^^^^^^^^^^^^^^^^^^^^^^^^^^^^^^^^^^^^^^^^^^^^^^^^^^^^^
Discouraged access: The type 'ManagedSuite.TestConfigurationProperty' is not API (restriction on classpath entry '/home/jenkins/agent/workspace/mylyn-tasks-nightly/.repository/p2/osgi/bundle/org.eclipse.mylyn.commons.sdk.util/3.26.0.N20200810-0516/org.eclipse.mylyn.commons.sdk.util-3.26.0.N20200810-0516.jar')
[WARNING] /home/jenkins/agent/workspace/mylyn-tasks-nightly/connector-bugzilla-rest/org.eclipse.mylyn.bugzilla.rest.core.tests/src/org/eclipse/mylyn/bugzilla/rest/core/tests/AllBugzillaRestCoreTests.java:[22] 
	import org.eclipse.mylyn.commons.sdk.util.TestConfiguration;
	       ^^^^^^^^^^^^^^^^^^^^^^^^^^^^^^^^^^^^^^^^^^^^^^^^^^^^
Discouraged access: The type 'TestConfiguration' is not API (restriction on classpath entry '/home/jenkins/agent/workspace/mylyn-tasks-nightly/.repository/p2/osgi/bundle/org.eclipse.mylyn.commons.sdk.util/3.26.0.N20200810-0516/org.eclipse.mylyn.commons.sdk.util-3.26.0.N20200810-0516.jar')
[WARNING] /home/jenkins/agent/workspace/mylyn-tasks-nightly/connector-bugzilla-rest/org.eclipse.mylyn.bugzilla.rest.core.tests/src/org/eclipse/mylyn/bugzilla/rest/core/tests/AllBugzillaRestCoreTests.java:[26] 
	@RunWith(ManagedSuite.class)
	         ^^^^^^^^^^^^
Discouraged access: The type 'ManagedSuite' is not API (restriction on classpath entry '/home/jenkins/agent/workspace/mylyn-tasks-nightly/.repository/p2/osgi/bundle/org.eclipse.mylyn.commons.sdk.util/3.26.0.N20200810-0516/org.eclipse.mylyn.commons.sdk.util-3.26.0.N20200810-0516.jar')
[WARNING] /home/jenkins/agent/workspace/mylyn-tasks-nightly/connector-bugzilla-rest/org.eclipse.mylyn.bugzilla.rest.core.tests/src/org/eclipse/mylyn/bugzilla/rest/core/tests/AllBugzillaRestCoreTests.java:[29] 
	@TestConfigurationProperty()
	 ^^^^^^^^^^^^^^^^^^^^^^^^^
Discouraged access: The type 'ManagedSuite.TestConfigurationProperty' is not API (restriction on classpath entry '/home/jenkins/agent/workspace/mylyn-tasks-nightly/.repository/p2/osgi/bundle/org.eclipse.mylyn.commons.sdk.util/3.26.0.N20200810-0516/org.eclipse.mylyn.commons.sdk.util-3.26.0.N20200810-0516.jar')
[WARNING] /home/jenkins/agent/workspace/mylyn-tasks-nightly/connector-bugzilla-rest/org.eclipse.mylyn.bugzilla.rest.core.tests/src/org/eclipse/mylyn/bugzilla/rest/core/tests/AllBugzillaRestCoreTests.java:[32] 
	if (CommonTestUtil.fixProxyConfiguration()) {
	    ^^^^^^^^^^^^^^
Discouraged access: The type 'CommonTestUtil' is not API (restriction on classpath entry '/home/jenkins/agent/workspace/mylyn-tasks-nightly/.repository/p2/osgi/bundle/org.eclipse.mylyn.commons.sdk.util/3.26.0.N20200810-0516/org.eclipse.mylyn.commons.sdk.util-3.26.0.N20200810-0516.jar')
[WARNING] /home/jenkins/agent/workspace/mylyn-tasks-nightly/connector-bugzilla-rest/org.eclipse.mylyn.bugzilla.rest.core.tests/src/org/eclipse/mylyn/bugzilla/rest/core/tests/AllBugzillaRestCoreTests.java:[32] 
	if (CommonTestUtil.fixProxyConfiguration()) {
	                   ^^^^^^^^^^^^^^^^^^^^^
Discouraged access: The method 'CommonTestUtil.fixProxyConfiguration()' is not API (restriction on classpath entry '/home/jenkins/agent/workspace/mylyn-tasks-nightly/.repository/p2/osgi/bundle/org.eclipse.mylyn.commons.sdk.util/3.26.0.N20200810-0516/org.eclipse.mylyn.commons.sdk.util-3.26.0.N20200810-0516.jar')
[WARNING] /home/jenkins/agent/workspace/mylyn-tasks-nightly/connector-bugzilla-rest/org.eclipse.mylyn.bugzilla.rest.core.tests/src/org/eclipse/mylyn/bugzilla/rest/core/tests/AllBugzillaRestCoreTests.java:[33] 
	CommonTestUtil.dumpSystemInfo(System.err);
	^^^^^^^^^^^^^^
Discouraged access: The type 'CommonTestUtil' is not API (restriction on classpath entry '/home/jenkins/agent/workspace/mylyn-tasks-nightly/.repository/p2/osgi/bundle/org.eclipse.mylyn.commons.sdk.util/3.26.0.N20200810-0516/org.eclipse.mylyn.commons.sdk.util-3.26.0.N20200810-0516.jar')
[WARNING] /home/jenkins/agent/workspace/mylyn-tasks-nightly/connector-bugzilla-rest/org.eclipse.mylyn.bugzilla.rest.core.tests/src/org/eclipse/mylyn/bugzilla/rest/core/tests/AllBugzillaRestCoreTests.java:[33] 
	CommonTestUtil.dumpSystemInfo(System.err);
	               ^^^^^^^^^^^^^^
Discouraged access: The method 'CommonTestUtil.dumpSystemInfo(PrintStream)' is not API (restriction on classpath entry '/home/jenkins/agent/workspace/mylyn-tasks-nightly/.repository/p2/osgi/bundle/org.eclipse.mylyn.commons.sdk.util/3.26.0.N20200810-0516/org.eclipse.mylyn.commons.sdk.util-3.26.0.N20200810-0516.jar')
[WARNING] /home/jenkins/agent/workspace/mylyn-tasks-nightly/connector-bugzilla-rest/org.eclipse.mylyn.bugzilla.rest.core.tests/src/org/eclipse/mylyn/bugzilla/rest/core/tests/AllBugzillaRestCoreTests.java:[37] 
	@SuiteClassProvider
	 ^^^^^^^^^^^^^^^^^^
Discouraged access: The type 'ManagedSuite.SuiteClassProvider' is not API (restriction on classpath entry '/home/jenkins/agent/workspace/mylyn-tasks-nightly/.repository/p2/osgi/bundle/org.eclipse.mylyn.commons.sdk.util/3.26.0.N20200810-0516/org.eclipse.mylyn.commons.sdk.util-3.26.0.N20200810-0516.jar')
[WARNING] /home/jenkins/agent/workspace/mylyn-tasks-nightly/connector-bugzilla-rest/org.eclipse.mylyn.bugzilla.rest.core.tests/src/org/eclipse/mylyn/bugzilla/rest/core/tests/AllBugzillaRestCoreTests.java:[38] 
	public static void add2SuiteClasses(List<Class<?>> suiteClassList, TestConfiguration testConfiguration) {
	                                                                   ^^^^^^^^^^^^^^^^^
Discouraged access: The type 'TestConfiguration' is not API (restriction on classpath entry '/home/jenkins/agent/workspace/mylyn-tasks-nightly/.repository/p2/osgi/bundle/org.eclipse.mylyn.commons.sdk.util/3.26.0.N20200810-0516/org.eclipse.mylyn.commons.sdk.util-3.26.0.N20200810-0516.jar')
[WARNING] /home/jenkins/agent/workspace/mylyn-tasks-nightly/connector-bugzilla-rest/org.eclipse.mylyn.bugzilla.rest.core.tests/src/org/eclipse/mylyn/bugzilla/rest/core/tests/AllBugzillaRestCoreTests.java:[39] 
	if (!testConfiguration.isLocalOnly()) {
	                       ^^^^^^^^^^^
Discouraged access: The method 'TestConfiguration.isLocalOnly()' is not API (restriction on classpath entry '/home/jenkins/agent/workspace/mylyn-tasks-nightly/.repository/p2/osgi/bundle/org.eclipse.mylyn.commons.sdk.util/3.26.0.N20200810-0516/org.eclipse.mylyn.commons.sdk.util-3.26.0.N20200810-0516.jar')
155 problems (155 warnings)
[INFO] 
[INFO] --- tycho-source-plugin:1.5.0:plugin-source (attach-source) @ org.eclipse.mylyn.bugzilla.rest.core.tests ---
[INFO] Building jar: /home/jenkins/agent/workspace/mylyn-tasks-nightly/connector-bugzilla-rest/org.eclipse.mylyn.bugzilla.rest.core.tests/target/org.eclipse.mylyn.bugzilla.rest.core.tests-1.0.0-SNAPSHOT-sources.jar
[INFO] 
[INFO] --- maven-resources-plugin:2.4.1:testResources (default-testResources) @ org.eclipse.mylyn.bugzilla.rest.core.tests ---
[INFO] Using 'ISO-8859-1' encoding to copy filtered resources.
[INFO] skip non existing resourceDirectory /home/jenkins/agent/workspace/mylyn-tasks-nightly/connector-bugzilla-rest/org.eclipse.mylyn.bugzilla.rest.core.tests/src/test/resources
[INFO] 
[INFO] --- target-platform-configuration:1.5.0:target-platform (default-target-platform) @ org.eclipse.mylyn.bugzilla.rest.core.tests ---
[INFO] 
[INFO] --- tycho-packaging-plugin:1.5.0:package-plugin (default-package-plugin) @ org.eclipse.mylyn.bugzilla.rest.core.tests ---
[INFO] Building jar: /home/jenkins/agent/workspace/mylyn-tasks-nightly/connector-bugzilla-rest/org.eclipse.mylyn.bugzilla.rest.core.tests/target/org.eclipse.mylyn.bugzilla.rest.core.tests-1.0.0-SNAPSHOT.jar
[INFO] 
[INFO] --- tycho-p2-plugin:1.5.0:p2-metadata-default (default-p2-metadata-default) @ org.eclipse.mylyn.bugzilla.rest.core.tests ---
[INFO] 
[INFO] --- tycho-surefire-plugin:1.5.0:test (default-test) @ org.eclipse.mylyn.bugzilla.rest.core.tests ---
[INFO] Expected eclipse log file: /home/jenkins/agent/workspace/mylyn-tasks-nightly/connector-bugzilla-rest/org.eclipse.mylyn.bugzilla.rest.core.tests/target/work/data/.metadata/.log
[INFO] Command line:
	[/opt/tools/java/oracle/jdk-8/1.8.0_202/jre/bin/java, -Dosgi.noShutdown=false, -Dosgi.os=linux, -Dosgi.ws=gtk, -Dosgi.arch=x86_64, -Xmx512m, -Djava.io.tmpdir=/home/jenkins/agent/workspace/mylyn-tasks-nightly/connector-bugzilla-rest/org.eclipse.mylyn.bugzilla.rest.core.tests/target, -ea, -Dorg.eclipse.mylyn.wikitext.tests.disableOutput=true, -Dosgi.clean=true, -jar, /home/jenkins/agent/workspace/mylyn-tasks-nightly/.repository/p2/osgi/bundle/org.eclipse.equinox.launcher/1.5.600.v20191014-2022/org.eclipse.equinox.launcher-1.5.600.v20191014-2022.jar, -data, /home/jenkins/agent/workspace/mylyn-tasks-nightly/connector-bugzilla-rest/org.eclipse.mylyn.bugzilla.rest.core.tests/target/work/data, -install, /home/jenkins/agent/workspace/mylyn-tasks-nightly/connector-bugzilla-rest/org.eclipse.mylyn.bugzilla.rest.core.tests/target/work, -configuration, /home/jenkins/agent/workspace/mylyn-tasks-nightly/connector-bugzilla-rest/org.eclipse.mylyn.bugzilla.rest.core.tests/target/work/configuration, -application, org.eclipse.tycho.surefire.osgibooter.uitest, -testproperties, /home/jenkins/agent/workspace/mylyn-tasks-nightly/connector-bugzilla-rest/org.eclipse.mylyn.bugzilla.rest.core.tests/target/surefire.properties, -testApplication, org.eclipse.ui.ide.workbench, -product, org.eclipse.sdk.ide, -eclipse.keyring, /home/jenkins/agent/workspace/mylyn-tasks-nightly/connector-bugzilla-rest/org.eclipse.mylyn.bugzilla.rest.core.tests/target/.eclipse.keyring, -eclipse.password, /home/jenkins/agent/workspace/mylyn-tasks-nightly/connector-bugzilla-rest/org.eclipse.mylyn.bugzilla.rest.core.tests/target/../../.gitignore, -timeout, 10800000]
Launching application org.eclipse.ui.ide.workbench...
Running org.eclipse.mylyn.bugzilla.rest.core.tests.AllBugzillaRestCoreTests
Forcing manual proxy configuration
System: Linux 5.13.12-200.fc34.x86_64 (amd64) / linux-x86_64-gtk / Oracle Corporation Java HotSpot(TM) 64-Bit Server VM 1.8.0_202
HTTP Proxy : null (Platform) / [DIRECT] (Java)
HTTPS Proxy : null (Platform) / [DIRECT] (Java)

Running testRepositoryKey(org.eclipse.mylyn.bugzilla.rest.core.tests.RepositoryKeyTest)
Running testReadFromJson(org.eclipse.mylyn.bugzilla.rest.core.tests.BugzillaRestFlagMapperTest)
Running testWrite2Json(org.eclipse.mylyn.bugzilla.rest.core.tests.BugzillaRestFlagMapperTest)
Running testCreateFromTaskAttribute1(org.eclipse.mylyn.bugzilla.rest.core.tests.BugzillaRestFlagMapperTest)
Running testApplyToTaskAttribute1(org.eclipse.mylyn.bugzilla.rest.core.tests.BugzillaRestFlagMapperTest)
Running testWrite2Json1(org.eclipse.mylyn.bugzilla.rest.core.tests.BugzillaRestFlagMapperTest)
Running testReadFromJson1(org.eclipse.mylyn.bugzilla.rest.core.tests.BugzillaRestFlagMapperTest)
Running testApplyToTaskAttribute(org.eclipse.mylyn.bugzilla.rest.core.tests.BugzillaRestFlagMapperTest)
Running testCreateFromTaskAttribute(org.eclipse.mylyn.bugzilla.rest.core.tests.BugzillaRestFlagMapperTest)
Running testHasNotTaskChangedEmptyModificationDate(org.eclipse.mylyn.bugzilla.rest.core.tests.BugzillaRestConnectorNoFixtureTest)
Running testGetTaskUrl(org.eclipse.mylyn.bugzilla.rest.core.tests.BugzillaRestConnectorNoFixtureTest)
Running testTaskDataAndTaskWithodModdate(org.eclipse.mylyn.bugzilla.rest.core.tests.BugzillaRestConnectorNoFixtureTest)
Running testHasNotTaskChanged(org.eclipse.mylyn.bugzilla.rest.core.tests.BugzillaRestConnectorNoFixtureTest)
Running testGetRepositoryUrlFromTaskUrl(org.eclipse.mylyn.bugzilla.rest.core.tests.BugzillaRestConnectorNoFixtureTest)
Running testHasTaskChangedEmptyModificationDate(org.eclipse.mylyn.bugzilla.rest.core.tests.BugzillaRestConnectorNoFixtureTest)
Running testHasTaskChanged(org.eclipse.mylyn.bugzilla.rest.core.tests.BugzillaRestConnectorNoFixtureTest)
Running testCreateBlocksAttribute(org.eclipse.mylyn.bugzilla.rest.core.tests.BugzillaRestClientTest)
Running testPostTaskDataFromTaskdata(org.eclipse.mylyn.bugzilla.rest.core.tests.BugzillaRestClientTest)
Running testFlagsSet(org.eclipse.mylyn.bugzilla.rest.core.tests.BugzillaRestClientTest)
Running testCreateCCAttribute(org.eclipse.mylyn.bugzilla.rest.core.tests.BugzillaRestClientTest)
Running testCreateDependsOnAttribute(org.eclipse.mylyn.bugzilla.rest.core.tests.BugzillaRestClientTest)
Running testNoUserValidate(org.eclipse.mylyn.bugzilla.rest.core.tests.BugzillaRestClientTest)
Running testConnectorClientCache(org.eclipse.mylyn.bugzilla.rest.core.tests.BugzillaRestClientTest)
Running testDependsOnAttributeV1(org.eclipse.mylyn.bugzilla.rest.core.tests.BugzillaRestClientTest)
Running testDependsOnAttributeV2(org.eclipse.mylyn.bugzilla.rest.core.tests.BugzillaRestClientTest)
Running testUpdateTaskData(org.eclipse.mylyn.bugzilla.rest.core.tests.BugzillaRestClientTest)
Running testCCAttribute(org.eclipse.mylyn.bugzilla.rest.core.tests.BugzillaRestClientTest)
Running testValidate(org.eclipse.mylyn.bugzilla.rest.core.tests.BugzillaRestClientTest)
Running testinitializeTaskData(org.eclipse.mylyn.bugzilla.rest.core.tests.BugzillaRestClientTest)
Ignored testInvalidApikeyValidate
Running testGifAttachment(org.eclipse.mylyn.bugzilla.rest.core.tests.BugzillaRestClientTest)
Running testGetConfiguration(org.eclipse.mylyn.bugzilla.rest.core.tests.BugzillaRestClientTest)
[FAILURE]
Running testPostTaskData(org.eclipse.mylyn.bugzilla.rest.core.tests.BugzillaRestClientTest)
Running testPostTaskDataWithoutProduct(org.eclipse.mylyn.bugzilla.rest.core.tests.BugzillaRestClientTest)
Running testFlagsReset(org.eclipse.mylyn.bugzilla.rest.core.tests.BugzillaRestClientTest)
Running testGetVersion(org.eclipse.mylyn.bugzilla.rest.core.tests.BugzillaRestClientTest)
Ignored testApikeyValidate
Running testGetTaskData(org.eclipse.mylyn.bugzilla.rest.core.tests.BugzillaRestClientTest)
Running testTextAttachment(org.eclipse.mylyn.bugzilla.rest.core.tests.BugzillaRestClientTest)
Running testBlocksAttributeV1(org.eclipse.mylyn.bugzilla.rest.core.tests.BugzillaRestClientTest)
Running testBlocksAttributeV2(org.eclipse.mylyn.bugzilla.rest.core.tests.BugzillaRestClientTest)
Running testTextAttachmentWithFlags(org.eclipse.mylyn.bugzilla.rest.core.tests.BugzillaRestClientTest)
Running testInvalidUserValidate(org.eclipse.mylyn.bugzilla.rest.core.tests.BugzillaRestClientTest)
Running testInvalidPasswordValidate(org.eclipse.mylyn.bugzilla.rest.core.tests.BugzillaRestClientTest)
Running testFlagsChange(org.eclipse.mylyn.bugzilla.rest.core.tests.BugzillaRestClientTest)
Running testPostTaskDataWithoutMilestone(org.eclipse.mylyn.bugzilla.rest.core.tests.BugzillaRestClientTest)
Running testAddComment(org.eclipse.mylyn.bugzilla.rest.core.tests.BugzillaRestClientTest)
Running testConfigurationFromConnector(org.eclipse.mylyn.bugzilla.rest.core.tests.BugzillaRestConfigurationTest)
[FAILURE]
Running testReloadCache(org.eclipse.mylyn.bugzilla.rest.core.tests.BugzillaRestConnectorTest)
Running testUpdateTaskFromTaskData(org.eclipse.mylyn.bugzilla.rest.core.tests.BugzillaRestConnectorTest)
Running testRepositoryCacheChanged(org.eclipse.mylyn.bugzilla.rest.core.tests.BugzillaRestConnectorTest)
[2022-01-31T10-3-34] Status ERROR: org.eclipse.mylyn.bugzilla.rest.core code=0 Could not get the Configuration org.eclipse.mylyn.internal.bugzilla.rest.core.BugzillaRestException: Unauthorized, Exception:
org.eclipse.mylyn.internal.bugzilla.rest.core.BugzillaRestException: Unauthorized
	at org.eclipse.mylyn.internal.bugzilla.rest.core.BugzillaRestRequest.run(BugzillaRestRequest.java:118)
	at org.eclipse.mylyn.internal.bugzilla.rest.core.BugzillaRestClient.retrieveItems(BugzillaRestClient.java:134)
	at org.eclipse.mylyn.internal.bugzilla.rest.core.BugzillaRestClient.getFields(BugzillaRestClient.java:144)
	at org.eclipse.mylyn.internal.bugzilla.rest.core.BugzillaRestClient.getConfiguration(BugzillaRestClient.java:120)
	at org.eclipse.mylyn.internal.bugzilla.rest.core.BugzillaRestConnector$4.load(BugzillaRestConnector.java:147)
	at org.eclipse.mylyn.internal.bugzilla.rest.core.BugzillaRestConnector$4.load(BugzillaRestConnector.java:1)
	at com.google.common.cache.LocalCache$LoadingValueReference.loadFuture(LocalCache.java:3716)
	at com.google.common.cache.LocalCache$Segment.loadSync(LocalCache.java:2424)
	at com.google.common.cache.LocalCache$Segment.lockedGetOrLoad(LocalCache.java:2298)
	at com.google.common.cache.LocalCache$Segment.get(LocalCache.java:2211)
	at com.google.common.cache.LocalCache.get(LocalCache.java:4154)
	at com.google.common.cache.LocalCache.getOrLoad(LocalCache.java:4158)
	at com.google.common.cache.LocalCache$LocalLoadingCache.get(LocalCache.java:5147)
	at org.eclipse.mylyn.internal.bugzilla.rest.core.BugzillaRestConnector.getRepositoryConfiguration(BugzillaRestConnector.java:428)
	at org.eclipse.mylyn.bugzilla.rest.core.tests.BugzillaRestConnectorTest.testRepositoryCacheChanged(BugzillaRestConnectorTest.java:161)
	at sun.reflect.NativeMethodAccessorImpl.invoke0(Native Method)
	at sun.reflect.NativeMethodAccessorImpl.invoke(NativeMethodAccessorImpl.java:62)
	at sun.reflect.DelegatingMethodAccessorImpl.invoke(DelegatingMethodAccessorImpl.java:43)
	at java.lang.reflect.Method.invoke(Method.java:498)
	at org.junit.runners.model.FrameworkMethod$1.runReflectiveCall(FrameworkMethod.java:50)
	at org.junit.internal.runners.model.ReflectiveCallable.run(ReflectiveCallable.java:12)
	at org.junit.runners.model.FrameworkMethod.invokeExplosively(FrameworkMethod.java:47)
	at org.junit.internal.runners.statements.InvokeMethod.evaluate(InvokeMethod.java:17)
	at org.junit.internal.runners.statements.RunBefores.evaluate(RunBefores.java:26)
	at org.eclipse.mylyn.commons.sdk.util.Junit4TestFixtureRunner$TestClassRunnerForFixture.runTest(Junit4TestFixtureRunner.java:147)
	at org.eclipse.mylyn.commons.sdk.util.Junit4TestFixtureRunner$TestClassRunnerForFixture.runChild(Junit4TestFixtureRunner.java:137)
	at org.junit.runners.BlockJUnit4ClassRunner.runChild(BlockJUnit4ClassRunner.java:57)
	at org.junit.runners.ParentRunner$3.run(ParentRunner.java:290)
	at org.junit.runners.ParentRunner$1.schedule(ParentRunner.java:71)
	at org.junit.runners.ParentRunner.runChildren(ParentRunner.java:288)
	at org.junit.runners.ParentRunner.access$000(ParentRunner.java:58)
	at org.junit.runners.ParentRunner$2.evaluate(ParentRunner.java:268)
	at org.junit.runners.ParentRunner.run(ParentRunner.java:363)
	at org.junit.runners.Suite.runChild(Suite.java:128)
	at org.junit.runners.Suite.runChild(Suite.java:27)
	at org.junit.runners.ParentRunner$3.run(ParentRunner.java:290)
	at org.junit.runners.ParentRunner$1.schedule(ParentRunner.java:71)
	at org.junit.runners.ParentRunner.runChildren(ParentRunner.java:288)
	at org.junit.runners.ParentRunner.access$000(ParentRunner.java:58)
	at org.junit.runners.ParentRunner$2.evaluate(ParentRunner.java:268)
	at org.junit.runners.ParentRunner.run(ParentRunner.java:363)
	at org.junit.runners.Suite.runChild(Suite.java:128)
	at org.junit.runners.Suite.runChild(Suite.java:27)
	at org.junit.runners.ParentRunner$3.run(ParentRunner.java:290)
	at org.junit.runners.ParentRunner$1.schedule(ParentRunner.java:71)
	at org.junit.runners.ParentRunner.runChildren(ParentRunner.java:288)
	at org.junit.runners.ParentRunner.access$000(ParentRunner.java:58)
	at org.junit.runners.ParentRunner$2.evaluate(ParentRunner.java:268)
	at org.junit.runners.ParentRunner.run(ParentRunner.java:363)
	at org.eclipse.mylyn.commons.sdk.util.ManagedSuite.run(ManagedSuite.java:122)
	at org.apache.maven.surefire.junit4.JUnit4Provider.execute(JUnit4Provider.java:365)
	at org.apache.maven.surefire.junit4.JUnit4Provider.executeWithRerun(JUnit4Provider.java:273)
	at org.apache.maven.surefire.junit4.JUnit4Provider.executeTestSet(JUnit4Provider.java:238)
	at org.apache.maven.surefire.junit4.JUnit4Provider.invoke(JUnit4Provider.java:159)
	at sun.reflect.NativeMethodAccessorImpl.invoke0(Native Method)
	at sun.reflect.NativeMethodAccessorImpl.invoke(NativeMethodAccessorImpl.java:62)
	at sun.reflect.DelegatingMethodAccessorImpl.invoke(DelegatingMethodAccessorImpl.java:43)
	at java.lang.reflect.Method.invoke(Method.java:498)
	at org.apache.maven.surefire.util.ReflectionUtils.invokeMethodWithArray2(ReflectionUtils.java:206)
	at org.apache.maven.surefire.booter.ProviderFactory$ProviderProxy.invoke(ProviderFactory.java:161)
	at org.apache.maven.surefire.booter.ProviderFactory.invokeProvider(ProviderFactory.java:84)
	at org.eclipse.tycho.surefire.osgibooter.OsgiSurefireBooter.run(OsgiSurefireBooter.java:113)
	at org.eclipse.tycho.surefire.osgibooter.AbstractUITestApplication$1.run(AbstractUITestApplication.java:35)
	at org.eclipse.swt.widgets.RunnableLock.run(RunnableLock.java:40)
	at org.eclipse.swt.widgets.Synchronizer.runAsyncMessages(Synchronizer.java:185)
	at org.eclipse.swt.widgets.Display.runAsyncMessages(Display.java:4910)
	at org.eclipse.swt.widgets.Display.readAndDispatch(Display.java:4432)
	at org.eclipse.e4.ui.internal.workbench.swt.PartRenderingEngine$5.run(PartRenderingEngine.java:1160)
	at org.eclipse.core.databinding.observable.Realm.runWithDefault(Realm.java:338)
	at org.eclipse.e4.ui.internal.workbench.swt.PartRenderingEngine.run(PartRenderingEngine.java:1049)
	at org.eclipse.e4.ui.internal.workbench.E4Workbench.createAndRunUI(E4Workbench.java:155)
	at org.eclipse.ui.internal.Workbench.lambda$3(Workbench.java:660)
	at org.eclipse.core.databinding.observable.Realm.runWithDefault(Realm.java:338)
	at org.eclipse.ui.internal.Workbench.createAndRunWorkbench(Workbench.java:559)
	at org.eclipse.ui.PlatformUI.createAndRunWorkbench(PlatformUI.java:154)
	at org.eclipse.ui.internal.ide.application.IDEApplication.start(IDEApplication.java:150)
	at org.eclipse.tycho.surefire.osgibooter.UITestApplication.runApplication(UITestApplication.java:31)
	at org.eclipse.tycho.surefire.osgibooter.AbstractUITestApplication.run(AbstractUITestApplication.java:120)
	at org.eclipse.tycho.surefire.osgibooter.UITestApplication.start(UITestApplication.java:37)
	at org.eclipse.equinox.internal.app.EclipseAppHandle.run(EclipseAppHandle.java:203)
	at org.eclipse.core.runtime.internal.adaptor.EclipseAppLauncher.runApplication(EclipseAppLauncher.java:137)
	at org.eclipse.core.runtime.internal.adaptor.EclipseAppLauncher.start(EclipseAppLauncher.java:107)
	at org.eclipse.core.runtime.adaptor.EclipseStarter.run(EclipseStarter.java:401)
	at org.eclipse.core.runtime.adaptor.EclipseStarter.run(EclipseStarter.java:255)
	at sun.reflect.NativeMethodAccessorImpl.invoke0(Native Method)
	at sun.reflect.NativeMethodAccessorImpl.invoke(NativeMethodAccessorImpl.java:62)
	at sun.reflect.DelegatingMethodAccessorImpl.invoke(DelegatingMethodAccessorImpl.java:43)
	at java.lang.reflect.Method.invoke(Method.java:498)
	at org.eclipse.equinox.launcher.Main.invokeFramework(Main.java:657)
	at org.eclipse.equinox.launcher.Main.basicRun(Main.java:594)
	at org.eclipse.equinox.launcher.Main.run(Main.java:1465)
	at org.eclipse.equinox.launcher.Main.main(Main.java:1438)
Caused by: org.eclipse.mylyn.commons.repositories.core.auth.AuthenticationException: Unauthorized
	at org.eclipse.mylyn.commons.repositories.http.core.CommonHttpClient.validate(CommonHttpClient.java:200)
	at org.eclipse.mylyn.commons.repositories.http.core.CommonHttpOperation.validate(CommonHttpOperation.java:157)
	at org.eclipse.mylyn.internal.bugzilla.rest.core.BugzillaRestRequest.validate(BugzillaRestRequest.java:161)
	at org.eclipse.mylyn.commons.repositories.http.core.CommonHttpOperation.executeOnce(CommonHttpOperation.java:127)
	at org.eclipse.mylyn.commons.repositories.http.core.CommonHttpOperation.execute(CommonHttpOperation.java:72)
	at org.eclipse.mylyn.internal.bugzilla.rest.core.BugzillaRestRequest.execute(BugzillaRestRequest.java:66)
	at org.eclipse.mylyn.internal.bugzilla.rest.core.BugzillaRestRequest.run(BugzillaRestRequest.java:116)
	... 91 more

Running testRepositoryCacheNotChanged(org.eclipse.mylyn.bugzilla.rest.core.tests.BugzillaRestConnectorTest)
[2022-01-31T10-3-49] Status ERROR: org.eclipse.mylyn.bugzilla.rest.core code=0 Could not get the Configuration org.eclipse.mylyn.internal.bugzilla.rest.core.BugzillaRestException: Unauthorized, Exception:
org.eclipse.mylyn.internal.bugzilla.rest.core.BugzillaRestException: Unauthorized
	at org.eclipse.mylyn.internal.bugzilla.rest.core.BugzillaRestRequest.run(BugzillaRestRequest.java:118)
	at org.eclipse.mylyn.internal.bugzilla.rest.core.BugzillaRestClient.retrieveItems(BugzillaRestClient.java:134)
	at org.eclipse.mylyn.internal.bugzilla.rest.core.BugzillaRestClient.getFields(BugzillaRestClient.java:144)
	at org.eclipse.mylyn.internal.bugzilla.rest.core.BugzillaRestClient.getConfiguration(BugzillaRestClient.java:120)
	at org.eclipse.mylyn.internal.bugzilla.rest.core.BugzillaRestConnector$4.load(BugzillaRestConnector.java:147)
	at org.eclipse.mylyn.internal.bugzilla.rest.core.BugzillaRestConnector$4.load(BugzillaRestConnector.java:1)
	at com.google.common.cache.LocalCache$LoadingValueReference.loadFuture(LocalCache.java:3716)
	at com.google.common.cache.LocalCache$Segment.loadSync(LocalCache.java:2424)
	at com.google.common.cache.LocalCache$Segment.lockedGetOrLoad(LocalCache.java:2298)
	at com.google.common.cache.LocalCache$Segment.get(LocalCache.java:2211)
	at com.google.common.cache.LocalCache.get(LocalCache.java:4154)
	at com.google.common.cache.LocalCache.getOrLoad(LocalCache.java:4158)
	at com.google.common.cache.LocalCache$LocalLoadingCache.get(LocalCache.java:5147)
	at org.eclipse.mylyn.internal.bugzilla.rest.core.BugzillaRestConnector.getRepositoryConfiguration(BugzillaRestConnector.java:428)
	at org.eclipse.mylyn.bugzilla.rest.core.tests.BugzillaRestConnectorTest.testRepositoryCacheNotChanged(BugzillaRestConnectorTest.java:108)
	at sun.reflect.NativeMethodAccessorImpl.invoke0(Native Method)
	at sun.reflect.NativeMethodAccessorImpl.invoke(NativeMethodAccessorImpl.java:62)
	at sun.reflect.DelegatingMethodAccessorImpl.invoke(DelegatingMethodAccessorImpl.java:43)
	at java.lang.reflect.Method.invoke(Method.java:498)
	at org.junit.runners.model.FrameworkMethod$1.runReflectiveCall(FrameworkMethod.java:50)
	at org.junit.internal.runners.model.ReflectiveCallable.run(ReflectiveCallable.java:12)
	at org.junit.runners.model.FrameworkMethod.invokeExplosively(FrameworkMethod.java:47)
	at org.junit.internal.runners.statements.InvokeMethod.evaluate(InvokeMethod.java:17)
	at org.junit.internal.runners.statements.RunBefores.evaluate(RunBefores.java:26)
	at org.eclipse.mylyn.commons.sdk.util.Junit4TestFixtureRunner$TestClassRunnerForFixture.runTest(Junit4TestFixtureRunner.java:147)
	at org.eclipse.mylyn.commons.sdk.util.Junit4TestFixtureRunner$TestClassRunnerForFixture.runChild(Junit4TestFixtureRunner.java:137)
	at org.junit.runners.BlockJUnit4ClassRunner.runChild(BlockJUnit4ClassRunner.java:57)
	at org.junit.runners.ParentRunner$3.run(ParentRunner.java:290)
	at org.junit.runners.ParentRunner$1.schedule(ParentRunner.java:71)
	at org.junit.runners.ParentRunner.runChildren(ParentRunner.java:288)
	at org.junit.runners.ParentRunner.access$000(ParentRunner.java:58)
	at org.junit.runners.ParentRunner$2.evaluate(ParentRunner.java:268)
	at org.junit.runners.ParentRunner.run(ParentRunner.java:363)
	at org.junit.runners.Suite.runChild(Suite.java:128)
	at org.junit.runners.Suite.runChild(Suite.java:27)
	at org.junit.runners.ParentRunner$3.run(ParentRunner.java:290)
	at org.junit.runners.ParentRunner$1.schedule(ParentRunner.java:71)
	at org.junit.runners.ParentRunner.runChildren(ParentRunner.java:288)
	at org.junit.runners.ParentRunner.access$000(ParentRunner.java:58)
	at org.junit.runners.ParentRunner$2.evaluate(ParentRunner.java:268)
	at org.junit.runners.ParentRunner.run(ParentRunner.java:363)
	at org.junit.runners.Suite.runChild(Suite.java:128)
	at org.junit.runners.Suite.runChild(Suite.java:27)
	at org.junit.runners.ParentRunner$3.run(ParentRunner.java:290)
	at org.junit.runners.ParentRunner$1.schedule(ParentRunner.java:71)
	at org.junit.runners.ParentRunner.runChildren(ParentRunner.java:288)
	at org.junit.runners.ParentRunner.access$000(ParentRunner.java:58)
	at org.junit.runners.ParentRunner$2.evaluate(ParentRunner.java:268)
	at org.junit.runners.ParentRunner.run(ParentRunner.java:363)
	at org.eclipse.mylyn.commons.sdk.util.ManagedSuite.run(ManagedSuite.java:122)
	at org.apache.maven.surefire.junit4.JUnit4Provider.execute(JUnit4Provider.java:365)
	at org.apache.maven.surefire.junit4.JUnit4Provider.executeWithRerun(JUnit4Provider.java:273)
	at org.apache.maven.surefire.junit4.JUnit4Provider.executeTestSet(JUnit4Provider.java:238)
	at org.apache.maven.surefire.junit4.JUnit4Provider.invoke(JUnit4Provider.java:159)
	at sun.reflect.NativeMethodAccessorImpl.invoke0(Native Method)
	at sun.reflect.NativeMethodAccessorImpl.invoke(NativeMethodAccessorImpl.java:62)
	at sun.reflect.DelegatingMethodAccessorImpl.invoke(DelegatingMethodAccessorImpl.java:43)
	at java.lang.reflect.Method.invoke(Method.java:498)
	at org.apache.maven.surefire.util.ReflectionUtils.invokeMethodWithArray2(ReflectionUtils.java:206)
	at org.apache.maven.surefire.booter.ProviderFactory$ProviderProxy.invoke(ProviderFactory.java:161)
	at org.apache.maven.surefire.booter.ProviderFactory.invokeProvider(ProviderFactory.java:84)
	at org.eclipse.tycho.surefire.osgibooter.OsgiSurefireBooter.run(OsgiSurefireBooter.java:113)
	at org.eclipse.tycho.surefire.osgibooter.AbstractUITestApplication$1.run(AbstractUITestApplication.java:35)
	at org.eclipse.swt.widgets.RunnableLock.run(RunnableLock.java:40)
	at org.eclipse.swt.widgets.Synchronizer.runAsyncMessages(Synchronizer.java:185)
	at org.eclipse.swt.widgets.Display.runAsyncMessages(Display.java:4910)
	at org.eclipse.swt.widgets.Display.readAndDispatch(Display.java:4432)
	at org.eclipse.e4.ui.internal.workbench.swt.PartRenderingEngine$5.run(PartRenderingEngine.java:1160)
	at org.eclipse.core.databinding.observable.Realm.runWithDefault(Realm.java:338)
	at org.eclipse.e4.ui.internal.workbench.swt.PartRenderingEngine.run(PartRenderingEngine.java:1049)
	at org.eclipse.e4.ui.internal.workbench.E4Workbench.createAndRunUI(E4Workbench.java:155)
	at org.eclipse.ui.internal.Workbench.lambda$3(Workbench.java:660)
	at org.eclipse.core.databinding.observable.Realm.runWithDefault(Realm.java:338)
	at org.eclipse.ui.internal.Workbench.createAndRunWorkbench(Workbench.java:559)
	at org.eclipse.ui.PlatformUI.createAndRunWorkbench(PlatformUI.java:154)
	at org.eclipse.ui.internal.ide.application.IDEApplication.start(IDEApplication.java:150)
	at org.eclipse.tycho.surefire.osgibooter.UITestApplication.runApplication(UITestApplication.java:31)
	at org.eclipse.tycho.surefire.osgibooter.AbstractUITestApplication.run(AbstractUITestApplication.java:120)
	at org.eclipse.tycho.surefire.osgibooter.UITestApplication.start(UITestApplication.java:37)
	at org.eclipse.equinox.internal.app.EclipseAppHandle.run(EclipseAppHandle.java:203)
	at org.eclipse.core.runtime.internal.adaptor.EclipseAppLauncher.runApplication(EclipseAppLauncher.java:137)
	at org.eclipse.core.runtime.internal.adaptor.EclipseAppLauncher.start(EclipseAppLauncher.java:107)
	at org.eclipse.core.runtime.adaptor.EclipseStarter.run(EclipseStarter.java:401)
	at org.eclipse.core.runtime.adaptor.EclipseStarter.run(EclipseStarter.java:255)
	at sun.reflect.NativeMethodAccessorImpl.invoke0(Native Method)
	at sun.reflect.NativeMethodAccessorImpl.invoke(NativeMethodAccessorImpl.java:62)
	at sun.reflect.DelegatingMethodAccessorImpl.invoke(DelegatingMethodAccessorImpl.java:43)
	at java.lang.reflect.Method.invoke(Method.java:498)
	at org.eclipse.equinox.launcher.Main.invokeFramework(Main.java:657)
	at org.eclipse.equinox.launcher.Main.basicRun(Main.java:594)
	at org.eclipse.equinox.launcher.Main.run(Main.java:1465)
	at org.eclipse.equinox.launcher.Main.main(Main.java:1438)
Caused by: org.eclipse.mylyn.commons.repositories.core.auth.AuthenticationException: Unauthorized
	at org.eclipse.mylyn.commons.repositories.http.core.CommonHttpClient.validate(CommonHttpClient.java:200)
	at org.eclipse.mylyn.commons.repositories.http.core.CommonHttpOperation.validate(CommonHttpOperation.java:157)
	at org.eclipse.mylyn.internal.bugzilla.rest.core.BugzillaRestRequest.validate(BugzillaRestRequest.java:161)
	at org.eclipse.mylyn.commons.repositories.http.core.CommonHttpOperation.executeOnce(CommonHttpOperation.java:127)
	at org.eclipse.mylyn.commons.repositories.http.core.CommonHttpOperation.execute(CommonHttpOperation.java:72)
	at org.eclipse.mylyn.internal.bugzilla.rest.core.BugzillaRestRequest.execute(BugzillaRestRequest.java:66)
	at org.eclipse.mylyn.internal.bugzilla.rest.core.BugzillaRestRequest.run(BugzillaRestRequest.java:116)
	... 91 more

Running testLoadCacheWrongRepository(org.eclipse.mylyn.bugzilla.rest.core.tests.BugzillaRestConnectorTest)
[2022-01-31T10-3-52] Status ERROR: org.eclipse.mylyn.bugzilla.rest.core code=0 Could not get the Configuration org.eclipse.mylyn.internal.bugzilla.rest.core.BugzillaRestResourceNotFoundException: Requested resource '/bugzilla-rest-trunk-wrong//rest.cgi/field/bug' does not exist, Exception:
org.eclipse.mylyn.internal.bugzilla.rest.core.BugzillaRestResourceNotFoundException: Requested resource '/bugzilla-rest-trunk-wrong//rest.cgi/field/bug' does not exist
	at org.eclipse.mylyn.internal.bugzilla.rest.core.BugzillaRestRequest.validate(BugzillaRestRequest.java:141)
	at org.eclipse.mylyn.internal.bugzilla.rest.core.BugzillaRestRequest.doValidate(BugzillaRestRequest.java:133)
	at org.eclipse.mylyn.internal.bugzilla.rest.core.BugzillaRestRequest.processAndRelease(BugzillaRestRequest.java:152)
	at org.eclipse.mylyn.internal.bugzilla.rest.core.BugzillaRestRequest.execute(BugzillaRestRequest.java:67)
	at org.eclipse.mylyn.internal.bugzilla.rest.core.BugzillaRestRequest.run(BugzillaRestRequest.java:116)
	at org.eclipse.mylyn.internal.bugzilla.rest.core.BugzillaRestClient.retrieveItems(BugzillaRestClient.java:134)
	at org.eclipse.mylyn.internal.bugzilla.rest.core.BugzillaRestClient.getFields(BugzillaRestClient.java:144)
	at org.eclipse.mylyn.internal.bugzilla.rest.core.BugzillaRestClient.getConfiguration(BugzillaRestClient.java:120)
	at org.eclipse.mylyn.internal.bugzilla.rest.core.BugzillaRestConnector$4.load(BugzillaRestConnector.java:147)
	at org.eclipse.mylyn.internal.bugzilla.rest.core.BugzillaRestConnector$4.load(BugzillaRestConnector.java:1)
	at com.google.common.cache.LocalCache$LoadingValueReference.loadFuture(LocalCache.java:3716)
	at com.google.common.cache.LocalCache$Segment.loadSync(LocalCache.java:2424)
	at com.google.common.cache.LocalCache$Segment.lockedGetOrLoad(LocalCache.java:2298)
	at com.google.common.cache.LocalCache$Segment.get(LocalCache.java:2211)
	at com.google.common.cache.LocalCache.get(LocalCache.java:4154)
	at com.google.common.cache.LocalCache.getOrLoad(LocalCache.java:4158)
	at com.google.common.cache.LocalCache$LocalLoadingCache.get(LocalCache.java:5147)
	at org.eclipse.mylyn.internal.bugzilla.rest.core.BugzillaRestConnector.getRepositoryConfiguration(BugzillaRestConnector.java:428)
	at org.eclipse.mylyn.bugzilla.rest.core.tests.BugzillaRestConnectorTest.testLoadCacheWrongRepository(BugzillaRestConnectorTest.java:185)
	at sun.reflect.NativeMethodAccessorImpl.invoke0(Native Method)
	at sun.reflect.NativeMethodAccessorImpl.invoke(NativeMethodAccessorImpl.java:62)
	at sun.reflect.DelegatingMethodAccessorImpl.invoke(DelegatingMethodAccessorImpl.java:43)
	at java.lang.reflect.Method.invoke(Method.java:498)
	at org.junit.runners.model.FrameworkMethod$1.runReflectiveCall(FrameworkMethod.java:50)
	at org.junit.internal.runners.model.ReflectiveCallable.run(ReflectiveCallable.java:12)
	at org.junit.runners.model.FrameworkMethod.invokeExplosively(FrameworkMethod.java:47)
	at org.junit.internal.runners.statements.InvokeMethod.evaluate(InvokeMethod.java:17)
	at org.junit.internal.runners.statements.RunBefores.evaluate(RunBefores.java:26)
	at org.eclipse.mylyn.commons.sdk.util.Junit4TestFixtureRunner$TestClassRunnerForFixture.runTest(Junit4TestFixtureRunner.java:147)
	at org.eclipse.mylyn.commons.sdk.util.Junit4TestFixtureRunner$TestClassRunnerForFixture.runChild(Junit4TestFixtureRunner.java:137)
	at org.junit.runners.BlockJUnit4ClassRunner.runChild(BlockJUnit4ClassRunner.java:57)
	at org.junit.runners.ParentRunner$3.run(ParentRunner.java:290)
	at org.junit.runners.ParentRunner$1.schedule(ParentRunner.java:71)
	at org.junit.runners.ParentRunner.runChildren(ParentRunner.java:288)
	at org.junit.runners.ParentRunner.access$000(ParentRunner.java:58)
	at org.junit.runners.ParentRunner$2.evaluate(ParentRunner.java:268)
	at org.junit.runners.ParentRunner.run(ParentRunner.java:363)
	at org.junit.runners.Suite.runChild(Suite.java:128)
	at org.junit.runners.Suite.runChild(Suite.java:27)
	at org.junit.runners.ParentRunner$3.run(ParentRunner.java:290)
	at org.junit.runners.ParentRunner$1.schedule(ParentRunner.java:71)
	at org.junit.runners.ParentRunner.runChildren(ParentRunner.java:288)
	at org.junit.runners.ParentRunner.access$000(ParentRunner.java:58)
	at org.junit.runners.ParentRunner$2.evaluate(ParentRunner.java:268)
	at org.junit.runners.ParentRunner.run(ParentRunner.java:363)
	at org.junit.runners.Suite.runChild(Suite.java:128)
	at org.junit.runners.Suite.runChild(Suite.java:27)
	at org.junit.runners.ParentRunner$3.run(ParentRunner.java:290)
	at org.junit.runners.ParentRunner$1.schedule(ParentRunner.java:71)
	at org.junit.runners.ParentRunner.runChildren(ParentRunner.java:288)
	at org.junit.runners.ParentRunner.access$000(ParentRunner.java:58)
	at org.junit.runners.ParentRunner$2.evaluate(ParentRunner.java:268)
	at org.junit.runners.ParentRunner.run(ParentRunner.java:363)
	at org.eclipse.mylyn.commons.sdk.util.ManagedSuite.run(ManagedSuite.java:122)
	at org.apache.maven.surefire.junit4.JUnit4Provider.execute(JUnit4Provider.java:365)
	at org.apache.maven.surefire.junit4.JUnit4Provider.executeWithRerun(JUnit4Provider.java:273)
	at org.apache.maven.surefire.junit4.JUnit4Provider.executeTestSet(JUnit4Provider.java:238)
	at org.apache.maven.surefire.junit4.JUnit4Provider.invoke(JUnit4Provider.java:159)
	at sun.reflect.NativeMethodAccessorImpl.invoke0(Native Method)
	at sun.reflect.NativeMethodAccessorImpl.invoke(NativeMethodAccessorImpl.java:62)
	at sun.reflect.DelegatingMethodAccessorImpl.invoke(DelegatingMethodAccessorImpl.java:43)
	at java.lang.reflect.Method.invoke(Method.java:498)
	at org.apache.maven.surefire.util.ReflectionUtils.invokeMethodWithArray2(ReflectionUtils.java:206)
	at org.apache.maven.surefire.booter.ProviderFactory$ProviderProxy.invoke(ProviderFactory.java:161)
	at org.apache.maven.surefire.booter.ProviderFactory.invokeProvider(ProviderFactory.java:84)
	at org.eclipse.tycho.surefire.osgibooter.OsgiSurefireBooter.run(OsgiSurefireBooter.java:113)
	at org.eclipse.tycho.surefire.osgibooter.AbstractUITestApplication$1.run(AbstractUITestApplication.java:35)
	at org.eclipse.swt.widgets.RunnableLock.run(RunnableLock.java:40)
	at org.eclipse.swt.widgets.Synchronizer.runAsyncMessages(Synchronizer.java:185)
	at org.eclipse.swt.widgets.Display.runAsyncMessages(Display.java:4910)
	at org.eclipse.swt.widgets.Display.readAndDispatch(Display.java:4432)
	at org.eclipse.e4.ui.internal.workbench.swt.PartRenderingEngine$5.run(PartRenderingEngine.java:1160)
	at org.eclipse.core.databinding.observable.Realm.runWithDefault(Realm.java:338)
	at org.eclipse.e4.ui.internal.workbench.swt.PartRenderingEngine.run(PartRenderingEngine.java:1049)
	at org.eclipse.e4.ui.internal.workbench.E4Workbench.createAndRunUI(E4Workbench.java:155)
	at org.eclipse.ui.internal.Workbench.lambda$3(Workbench.java:660)
	at org.eclipse.core.databinding.observable.Realm.runWithDefault(Realm.java:338)
	at org.eclipse.ui.internal.Workbench.createAndRunWorkbench(Workbench.java:559)
	at org.eclipse.ui.PlatformUI.createAndRunWorkbench(PlatformUI.java:154)
	at org.eclipse.ui.internal.ide.application.IDEApplication.start(IDEApplication.java:150)
	at org.eclipse.tycho.surefire.osgibooter.UITestApplication.runApplication(UITestApplication.java:31)
	at org.eclipse.tycho.surefire.osgibooter.AbstractUITestApplication.run(AbstractUITestApplication.java:120)
	at org.eclipse.tycho.surefire.osgibooter.UITestApplication.start(UITestApplication.java:37)
	at org.eclipse.equinox.internal.app.EclipseAppHandle.run(EclipseAppHandle.java:203)
	at org.eclipse.core.runtime.internal.adaptor.EclipseAppLauncher.runApplication(EclipseAppLauncher.java:137)
	at org.eclipse.core.runtime.internal.adaptor.EclipseAppLauncher.start(EclipseAppLauncher.java:107)
	at org.eclipse.core.runtime.adaptor.EclipseStarter.run(EclipseStarter.java:401)
	at org.eclipse.core.runtime.adaptor.EclipseStarter.run(EclipseStarter.java:255)
	at sun.reflect.NativeMethodAccessorImpl.invoke0(Native Method)
	at sun.reflect.NativeMethodAccessorImpl.invoke(NativeMethodAccessorImpl.java:62)
	at sun.reflect.DelegatingMethodAccessorImpl.invoke(DelegatingMethodAccessorImpl.java:43)
	at java.lang.reflect.Method.invoke(Method.java:498)
	at org.eclipse.equinox.launcher.Main.invokeFramework(Main.java:657)
	at org.eclipse.equinox.launcher.Main.basicRun(Main.java:594)
	at org.eclipse.equinox.launcher.Main.run(Main.java:1465)
	at org.eclipse.equinox.launcher.Main.main(Main.java:1438)

Running testLoadCache(org.eclipse.mylyn.bugzilla.rest.core.tests.BugzillaRestConnectorTest)
Tests run: 54, Failures: 2, Errors: 0, Skipped: 2, Time elapsed: 269.599 s <<< FAILURE! - in org.eclipse.mylyn.bugzilla.rest.core.tests.AllBugzillaRestCoreTests
testRepositoryKey(org.eclipse.mylyn.bugzilla.rest.core.tests.RepositoryKeyTest)  Time elapsed: 0.003 s
testReadFromJson(org.eclipse.mylyn.bugzilla.rest.core.tests.BugzillaRestFlagMapperTest)  Time elapsed: 0.006 s
testWrite2Json(org.eclipse.mylyn.bugzilla.rest.core.tests.BugzillaRestFlagMapperTest)  Time elapsed: 0.001 s
testCreateFromTaskAttribute1(org.eclipse.mylyn.bugzilla.rest.core.tests.BugzillaRestFlagMapperTest)  Time elapsed: 0.002 s
testApplyToTaskAttribute1(org.eclipse.mylyn.bugzilla.rest.core.tests.BugzillaRestFlagMapperTest)  Time elapsed: 0 s
testWrite2Json1(org.eclipse.mylyn.bugzilla.rest.core.tests.BugzillaRestFlagMapperTest)  Time elapsed: 0.001 s
testReadFromJson1(org.eclipse.mylyn.bugzilla.rest.core.tests.BugzillaRestFlagMapperTest)  Time elapsed: 0 s
testApplyToTaskAttribute(org.eclipse.mylyn.bugzilla.rest.core.tests.BugzillaRestFlagMapperTest)  Time elapsed: 0.001 s
testCreateFromTaskAttribute(org.eclipse.mylyn.bugzilla.rest.core.tests.BugzillaRestFlagMapperTest)  Time elapsed: 0 s
testHasNotTaskChangedEmptyModificationDate(org.eclipse.mylyn.bugzilla.rest.core.tests.BugzillaRestConnectorNoFixtureTest)  Time elapsed: 0.005 s
testGetTaskUrl(org.eclipse.mylyn.bugzilla.rest.core.tests.BugzillaRestConnectorNoFixtureTest)  Time elapsed: 0.001 s
testTaskDataAndTaskWithodModdate(org.eclipse.mylyn.bugzilla.rest.core.tests.BugzillaRestConnectorNoFixtureTest)  Time elapsed: 0 s
testHasNotTaskChanged(org.eclipse.mylyn.bugzilla.rest.core.tests.BugzillaRestConnectorNoFixtureTest)  Time elapsed: 0.001 s
testGetRepositoryUrlFromTaskUrl(org.eclipse.mylyn.bugzilla.rest.core.tests.BugzillaRestConnectorNoFixtureTest)  Time elapsed: 0 s
testHasTaskChangedEmptyModificationDate(org.eclipse.mylyn.bugzilla.rest.core.tests.BugzillaRestConnectorNoFixtureTest)  Time elapsed: 0 s
testHasTaskChanged(org.eclipse.mylyn.bugzilla.rest.core.tests.BugzillaRestConnectorNoFixtureTest)  Time elapsed: 0 s
testCreateBlocksAttribute(org.eclipse.mylyn.bugzilla.rest.core.tests.BugzillaRestClientTest)  Time elapsed: 11.878 s
testPostTaskDataFromTaskdata(org.eclipse.mylyn.bugzilla.rest.core.tests.BugzillaRestClientTest)  Time elapsed: 1.115 s
testFlagsSet(org.eclipse.mylyn.bugzilla.rest.core.tests.BugzillaRestClientTest)  Time elapsed: 8.865 s
testCreateCCAttribute(org.eclipse.mylyn.bugzilla.rest.core.tests.BugzillaRestClientTest)  Time elapsed: 4.43 s
testCreateDependsOnAttribute(org.eclipse.mylyn.bugzilla.rest.core.tests.BugzillaRestClientTest)  Time elapsed: 8.296 s
testNoUserValidate(org.eclipse.mylyn.bugzilla.rest.core.tests.BugzillaRestClientTest)  Time elapsed: 0.003 s
testConnectorClientCache(org.eclipse.mylyn.bugzilla.rest.core.tests.BugzillaRestClientTest)  Time elapsed: 0 s
testDependsOnAttributeV1(org.eclipse.mylyn.bugzilla.rest.core.tests.BugzillaRestClientTest)  Time elapsed: 17.352 s
testDependsOnAttributeV2(org.eclipse.mylyn.bugzilla.rest.core.tests.BugzillaRestClientTest)  Time elapsed: 17.324 s
testUpdateTaskData(org.eclipse.mylyn.bugzilla.rest.core.tests.BugzillaRestClientTest)  Time elapsed: 9.05 s
testCCAttribute(org.eclipse.mylyn.bugzilla.rest.core.tests.BugzillaRestClientTest)  Time elapsed: 14.236 s
testValidate(org.eclipse.mylyn.bugzilla.rest.core.tests.BugzillaRestClientTest)  Time elapsed: 2.335 s
testinitializeTaskData(org.eclipse.mylyn.bugzilla.rest.core.tests.BugzillaRestClientTest)  Time elapsed: 0.002 s
testInvalidApikeyValidate(org.eclipse.mylyn.bugzilla.rest.core.tests.BugzillaRestClientTest) skipped
testGifAttachment(org.eclipse.mylyn.bugzilla.rest.core.tests.BugzillaRestClientTest)  Time elapsed: 10.23 s
testGetConfiguration(org.eclipse.mylyn.bugzilla.rest.core.tests.BugzillaRestClientTest)  Time elapsed: 3.585 s  <<< FAILURE!
org.junit.ComparisonFailure: expected:<...ria":"1","urlbase":"[]","use_see_also":"1"...> but was:<...ria":"1","urlbase":"[http://dummy.url/]","use_see_also":"1"...>
	at org.eclipse.mylyn.bugzilla.rest.core.tests.BugzillaRestClientTest.testGetConfiguration(BugzillaRestClientTest.java:242)

testPostTaskData(org.eclipse.mylyn.bugzilla.rest.core.tests.BugzillaRestClientTest)  Time elapsed: 1.338 s
testPostTaskDataWithoutProduct(org.eclipse.mylyn.bugzilla.rest.core.tests.BugzillaRestClientTest)  Time elapsed: 1.191 s
testFlagsReset(org.eclipse.mylyn.bugzilla.rest.core.tests.BugzillaRestClientTest)  Time elapsed: 14.603 s
testGetVersion(org.eclipse.mylyn.bugzilla.rest.core.tests.BugzillaRestClientTest)  Time elapsed: 1.01 s
testApikeyValidate(org.eclipse.mylyn.bugzilla.rest.core.tests.BugzillaRestClientTest) skipped
testGetTaskData(org.eclipse.mylyn.bugzilla.rest.core.tests.BugzillaRestClientTest)  Time elapsed: 4.651 s
testTextAttachment(org.eclipse.mylyn.bugzilla.rest.core.tests.BugzillaRestClientTest)  Time elapsed: 10.093 s
testBlocksAttributeV1(org.eclipse.mylyn.bugzilla.rest.core.tests.BugzillaRestClientTest)  Time elapsed: 17.86 s
testBlocksAttributeV2(org.eclipse.mylyn.bugzilla.rest.core.tests.BugzillaRestClientTest)  Time elapsed: 19.167 s
testTextAttachmentWithFlags(org.eclipse.mylyn.bugzilla.rest.core.tests.BugzillaRestClientTest)  Time elapsed: 10.615 s
testInvalidUserValidate(org.eclipse.mylyn.bugzilla.rest.core.tests.BugzillaRestClientTest)  Time elapsed: 1.152 s
testInvalidPasswordValidate(org.eclipse.mylyn.bugzilla.rest.core.tests.BugzillaRestClientTest)  Time elapsed: 1.179 s
testFlagsChange(org.eclipse.mylyn.bugzilla.rest.core.tests.BugzillaRestClientTest)  Time elapsed: 13.801 s
testPostTaskDataWithoutMilestone(org.eclipse.mylyn.bugzilla.rest.core.tests.BugzillaRestClientTest)  Time elapsed: 1.203 s
testAddComment(org.eclipse.mylyn.bugzilla.rest.core.tests.BugzillaRestClientTest)  Time elapsed: 9.04 s
testConfigurationFromConnector(org.eclipse.mylyn.bugzilla.rest.core.tests.BugzillaRestConfigurationTest)  Time elapsed: 3.494 s  <<< FAILURE!
org.junit.ComparisonFailure: expected:<...ria":"1","urlbase":"[]","use_see_also":"1"...> but was:<...ria":"1","urlbase":"[http://dummy.url/]","use_see_also":"1"...>
	at org.eclipse.mylyn.bugzilla.rest.core.tests.BugzillaRestConfigurationTest.testConfigurationFromConnector(BugzillaRestConfigurationTest.java:73)

testReloadCache(org.eclipse.mylyn.bugzilla.rest.core.tests.BugzillaRestConnectorTest)  Time elapsed: 12.894 s
testUpdateTaskFromTaskData(org.eclipse.mylyn.bugzilla.rest.core.tests.BugzillaRestConnectorTest)  Time elapsed: 0.001 s
testRepositoryCacheChanged(org.eclipse.mylyn.bugzilla.rest.core.tests.BugzillaRestConnectorTest)  Time elapsed: 15.392 s
testRepositoryCacheNotChanged(org.eclipse.mylyn.bugzilla.rest.core.tests.BugzillaRestConnectorTest)  Time elapsed: 8.101 s
testLoadCacheWrongRepository(org.eclipse.mylyn.bugzilla.rest.core.tests.BugzillaRestConnectorTest)  Time elapsed: 0.115 s
testLoadCache(org.eclipse.mylyn.bugzilla.rest.core.tests.BugzillaRestConnectorTest)  Time elapsed: 12.668 s

Failures: 
  testGetConfiguration(org.eclipse.mylyn.bugzilla.rest.core.tests.BugzillaRestClientTest): expected:<...ria":"1","urlbase":"[]","use_see_also":"1"...> but was:<...ria":"1","urlbase":"[http://dummy.url/]","use_see_also":"1"...>
  testConfigurationFromConnector(org.eclipse.mylyn.bugzilla.rest.core.tests.BugzillaRestConfigurationTest): expected:<...ria":"1","urlbase":"[]","use_see_also":"1"...> but was:<...ria":"1","urlbase":"[http://dummy.url/]","use_see_also":"1"...>
Error: 

Ignored: 
  testInvalidApikeyValidate
  testApikeyValidate

2 out of 54 tests failed (2 tests skipped)

Results:

Failures: 
  BugzillaRestClientTest.testGetConfiguration:242 expected:<...ria":"1","urlbase":"[]","use_see_also":"1"...> but was:<...ria":"1","urlbase":"[http://dummy.url/]","use_see_also":"1"...>
  BugzillaRestConfigurationTest.testConfigurationFromConnector:73 expected:<...ria":"1","urlbase":"[]","use_see_also":"1"...> but was:<...ria":"1","urlbase":"[http://dummy.url/]","use_see_also":"1"...>

Tests run: 54, Failures: 2, Errors: 0, Skipped: 2

[INFO] 
[INFO] ---< org.eclipse.mylyn.tasks:org.eclipse.mylyn.bugzilla.rest.tests >----
[INFO] Building org.eclipse.mylyn.bugzilla.rest.tests 1.0.0-SNAPSHOT    [38/41]
[INFO] ------------------------[ eclipse-test-plugin ]-------------------------
[INFO] 
[INFO] --- maven-clean-plugin:2.5:clean (default-clean) @ org.eclipse.mylyn.bugzilla.rest.tests ---
[INFO] 
[INFO] --- tycho-packaging-plugin:1.5.0:build-qualifier (default-build-qualifier) @ org.eclipse.mylyn.bugzilla.rest.tests ---
[INFO] The project's OSGi version is 1.0.0.N20190930-2129
[INFO] 
[INFO] --- tycho-packaging-plugin:1.5.0:validate-id (default-validate-id) @ org.eclipse.mylyn.bugzilla.rest.tests ---
[INFO] 
[INFO] --- tycho-packaging-plugin:1.5.0:validate-version (default-validate-version) @ org.eclipse.mylyn.bugzilla.rest.tests ---
[INFO] 
[INFO] --- jacoco-maven-plugin:0.5.6.201201232323:prepare-agent (default) @ org.eclipse.mylyn.bugzilla.rest.tests ---
[INFO] Skipping JaCoCo execution
[INFO] 
[INFO] --- maven-resources-plugin:2.4.1:resources (default-resources) @ org.eclipse.mylyn.bugzilla.rest.tests ---
[INFO] Using 'ISO-8859-1' encoding to copy filtered resources.
[INFO] skip non existing resourceDirectory /home/jenkins/agent/workspace/mylyn-tasks-nightly/connector-bugzilla-rest/org.eclipse.mylyn.bugzilla.rest.tests/src/main/resources
[INFO] 
[INFO] --- tycho-compiler-plugin:1.5.0:compile (default-compile) @ org.eclipse.mylyn.bugzilla.rest.tests ---
[INFO] Compiling 5 source files to /home/jenkins/agent/workspace/mylyn-tasks-nightly/connector-bugzilla-rest/org.eclipse.mylyn.bugzilla.rest.tests/target/classes
[WARNING] /home/jenkins/agent/workspace/mylyn-tasks-nightly/connector-bugzilla-rest/org.eclipse.mylyn.bugzilla.rest.tests/src/org/eclipse/mylyn/bugzilla/rest/tests/AbstractTckTest.java:[5] 
	import org.eclipse.mylyn.commons.sdk.util.Junit4TestFixtureRunner;
	       ^^^^^^^^^^^^^^^^^^^^^^^^^^^^^^^^^^^^^^^^^^^^^^^^^^^^^^^^^^
Discouraged access: The type 'Junit4TestFixtureRunner' is not API (restriction on classpath entry '/home/jenkins/agent/workspace/mylyn-tasks-nightly/.repository/p2/osgi/bundle/org.eclipse.mylyn.commons.sdk.util/3.26.0.N20200810-0516/org.eclipse.mylyn.commons.sdk.util-3.26.0.N20200810-0516.jar')
[WARNING] /home/jenkins/agent/workspace/mylyn-tasks-nightly/connector-bugzilla-rest/org.eclipse.mylyn.bugzilla.rest.tests/src/org/eclipse/mylyn/bugzilla/rest/tests/AbstractTckTest.java:[6] 
	import org.eclipse.mylyn.commons.sdk.util.Junit4TestFixtureRunner.FixtureDefinition;
	       ^^^^^^^^^^^^^^^^^^^^^^^^^^^^^^^^^^^^^^^^^^^^^^^^^^^^^^^^^^^^^^^^^^^^^^^^^^^^
Discouraged access: The type 'Junit4TestFixtureRunner.FixtureDefinition' is not API (restriction on classpath entry '/home/jenkins/agent/workspace/mylyn-tasks-nightly/.repository/p2/osgi/bundle/org.eclipse.mylyn.commons.sdk.util/3.26.0.N20200810-0516/org.eclipse.mylyn.commons.sdk.util-3.26.0.N20200810-0516.jar')
[WARNING] /home/jenkins/agent/workspace/mylyn-tasks-nightly/connector-bugzilla-rest/org.eclipse.mylyn.bugzilla.rest.tests/src/org/eclipse/mylyn/bugzilla/rest/tests/AbstractTckTest.java:[9] 
	@RunWith(Junit4TestFixtureRunner.class)
	         ^^^^^^^^^^^^^^^^^^^^^^^
Discouraged access: The type 'Junit4TestFixtureRunner' is not API (restriction on classpath entry '/home/jenkins/agent/workspace/mylyn-tasks-nightly/.repository/p2/osgi/bundle/org.eclipse.mylyn.commons.sdk.util/3.26.0.N20200810-0516/org.eclipse.mylyn.commons.sdk.util-3.26.0.N20200810-0516.jar')
[WARNING] /home/jenkins/agent/workspace/mylyn-tasks-nightly/connector-bugzilla-rest/org.eclipse.mylyn.bugzilla.rest.tests/src/org/eclipse/mylyn/bugzilla/rest/tests/AbstractTckTest.java:[10] 
	@FixtureDefinition(fixtureClass = TckFixture.class, fixtureType = "bugzillaREST")
	 ^^^^^^^^^^^^^^^^^
Discouraged access: The type 'Junit4TestFixtureRunner.FixtureDefinition' is not API (restriction on classpath entry '/home/jenkins/agent/workspace/mylyn-tasks-nightly/.repository/p2/osgi/bundle/org.eclipse.mylyn.commons.sdk.util/3.26.0.N20200810-0516/org.eclipse.mylyn.commons.sdk.util-3.26.0.N20200810-0516.jar')
[WARNING] /home/jenkins/agent/workspace/mylyn-tasks-nightly/connector-bugzilla-rest/org.eclipse.mylyn.bugzilla.rest.tests/src/org/eclipse/mylyn/bugzilla/rest/tests/TckFixture.java:[3] 
	import org.eclipse.mylyn.commons.sdk.util.AbstractTestFixture;
	       ^^^^^^^^^^^^^^^^^^^^^^^^^^^^^^^^^^^^^^^^^^^^^^^^^^^^^^
Discouraged access: The type 'AbstractTestFixture' is not API (restriction on classpath entry '/home/jenkins/agent/workspace/mylyn-tasks-nightly/.repository/p2/osgi/bundle/org.eclipse.mylyn.commons.sdk.util/3.26.0.N20200810-0516/org.eclipse.mylyn.commons.sdk.util-3.26.0.N20200810-0516.jar')
[WARNING] /home/jenkins/agent/workspace/mylyn-tasks-nightly/connector-bugzilla-rest/org.eclipse.mylyn.bugzilla.rest.tests/src/org/eclipse/mylyn/bugzilla/rest/tests/TckFixture.java:[4] 
	import org.eclipse.mylyn.commons.sdk.util.FixtureConfiguration;
	       ^^^^^^^^^^^^^^^^^^^^^^^^^^^^^^^^^^^^^^^^^^^^^^^^^^^^^^^
Discouraged access: The type 'FixtureConfiguration' is not API (restriction on classpath entry '/home/jenkins/agent/workspace/mylyn-tasks-nightly/.repository/p2/osgi/bundle/org.eclipse.mylyn.commons.sdk.util/3.26.0.N20200810-0516/org.eclipse.mylyn.commons.sdk.util-3.26.0.N20200810-0516.jar')
[WARNING] /home/jenkins/agent/workspace/mylyn-tasks-nightly/connector-bugzilla-rest/org.eclipse.mylyn.bugzilla.rest.tests/src/org/eclipse/mylyn/bugzilla/rest/tests/TckFixture.java:[8] 
	public class TckFixture extends AbstractTestFixture {
	                                ^^^^^^^^^^^^^^^^^^^
Discouraged access: The type 'AbstractTestFixture' is not API (restriction on classpath entry '/home/jenkins/agent/workspace/mylyn-tasks-nightly/.repository/p2/osgi/bundle/org.eclipse.mylyn.commons.sdk.util/3.26.0.N20200810-0516/org.eclipse.mylyn.commons.sdk.util-3.26.0.N20200810-0516.jar')
[WARNING] /home/jenkins/agent/workspace/mylyn-tasks-nightly/connector-bugzilla-rest/org.eclipse.mylyn.bugzilla.rest.tests/src/org/eclipse/mylyn/bugzilla/rest/tests/TckFixture.java:[10] 
	private final FixtureConfiguration config;
	              ^^^^^^^^^^^^^^^^^^^^
Discouraged access: The type 'FixtureConfiguration' is not API (restriction on classpath entry '/home/jenkins/agent/workspace/mylyn-tasks-nightly/.repository/p2/osgi/bundle/org.eclipse.mylyn.commons.sdk.util/3.26.0.N20200810-0516/org.eclipse.mylyn.commons.sdk.util-3.26.0.N20200810-0516.jar')
[WARNING] /home/jenkins/agent/workspace/mylyn-tasks-nightly/connector-bugzilla-rest/org.eclipse.mylyn.bugzilla.rest.tests/src/org/eclipse/mylyn/bugzilla/rest/tests/TckFixture.java:[12] 
	public TckFixture(FixtureConfiguration config) {
	                  ^^^^^^^^^^^^^^^^^^^^
Discouraged access: The type 'FixtureConfiguration' is not API (restriction on classpath entry '/home/jenkins/agent/workspace/mylyn-tasks-nightly/.repository/p2/osgi/bundle/org.eclipse.mylyn.commons.sdk.util/3.26.0.N20200810-0516/org.eclipse.mylyn.commons.sdk.util-3.26.0.N20200810-0516.jar')
[WARNING] /home/jenkins/agent/workspace/mylyn-tasks-nightly/connector-bugzilla-rest/org.eclipse.mylyn.bugzilla.rest.tests/src/org/eclipse/mylyn/bugzilla/rest/tests/TckFixture.java:[13] 
	super("org.eclipse.mylyn.bugzilla.rest", config);
	^^^^^^^^^^^^^^^^^^^^^^^^^^^^^^^^^^^^^^^^^^^^^^^^^
Discouraged access: The constructor 'AbstractTestFixture(String, FixtureConfiguration)' is not API (restriction on classpath entry '/home/jenkins/agent/workspace/mylyn-tasks-nightly/.repository/p2/osgi/bundle/org.eclipse.mylyn.commons.sdk.util/3.26.0.N20200810-0516/org.eclipse.mylyn.commons.sdk.util-3.26.0.N20200810-0516.jar')
[WARNING] /home/jenkins/agent/workspace/mylyn-tasks-nightly/connector-bugzilla-rest/org.eclipse.mylyn.bugzilla.rest.tests/src/org/eclipse/mylyn/bugzilla/rest/tests/TckFixture.java:[15] 
	setInfo("Bugzilla", config.getVersion(), config.getInfo());
	^^^^^^^
Discouraged access: The method 'AbstractTestFixture.setInfo(String, String, String)' is not API (restriction on classpath entry '/home/jenkins/agent/workspace/mylyn-tasks-nightly/.repository/p2/osgi/bundle/org.eclipse.mylyn.commons.sdk.util/3.26.0.N20200810-0516/org.eclipse.mylyn.commons.sdk.util-3.26.0.N20200810-0516.jar')
[WARNING] /home/jenkins/agent/workspace/mylyn-tasks-nightly/connector-bugzilla-rest/org.eclipse.mylyn.bugzilla.rest.tests/src/org/eclipse/mylyn/bugzilla/rest/tests/TckFixture.java:[15] 
	setInfo("Bugzilla", config.getVersion(), config.getInfo());
	                           ^^^^^^^^^^
Discouraged access: The method 'FixtureConfiguration.getVersion()' is not API (restriction on classpath entry '/home/jenkins/agent/workspace/mylyn-tasks-nightly/.repository/p2/osgi/bundle/org.eclipse.mylyn.commons.sdk.util/3.26.0.N20200810-0516/org.eclipse.mylyn.commons.sdk.util-3.26.0.N20200810-0516.jar')
[WARNING] /home/jenkins/agent/workspace/mylyn-tasks-nightly/connector-bugzilla-rest/org.eclipse.mylyn.bugzilla.rest.tests/src/org/eclipse/mylyn/bugzilla/rest/tests/TckFixture.java:[15] 
	setInfo("Bugzilla", config.getVersion(), config.getInfo());
	                                                ^^^^^^^
Discouraged access: The method 'FixtureConfiguration.getInfo()' is not API (restriction on classpath entry '/home/jenkins/agent/workspace/mylyn-tasks-nightly/.repository/p2/osgi/bundle/org.eclipse.mylyn.commons.sdk.util/3.26.0.N20200810-0516/org.eclipse.mylyn.commons.sdk.util-3.26.0.N20200810-0516.jar')
[WARNING] /home/jenkins/agent/workspace/mylyn-tasks-nightly/connector-bugzilla-rest/org.eclipse.mylyn.bugzilla.rest.tests/src/org/eclipse/mylyn/bugzilla/rest/tests/TckFixture.java:[19] 
	return config.getVersion();
	              ^^^^^^^^^^
Discouraged access: The method 'FixtureConfiguration.getVersion()' is not API (restriction on classpath entry '/home/jenkins/agent/workspace/mylyn-tasks-nightly/.repository/p2/osgi/bundle/org.eclipse.mylyn.commons.sdk.util/3.26.0.N20200810-0516/org.eclipse.mylyn.commons.sdk.util-3.26.0.N20200810-0516.jar')
[WARNING] /home/jenkins/agent/workspace/mylyn-tasks-nightly/connector-bugzilla-rest/org.eclipse.mylyn.bugzilla.rest.tests/src/org/eclipse/mylyn/bugzilla/rest/tests/TckFixture.java:[23] 
	protected AbstractTestFixture getDefault() {
	          ^^^^^^^^^^^^^^^^^^^
Discouraged access: The type 'AbstractTestFixture' is not API (restriction on classpath entry '/home/jenkins/agent/workspace/mylyn-tasks-nightly/.repository/p2/osgi/bundle/org.eclipse.mylyn.commons.sdk.util/3.26.0.N20200810-0516/org.eclipse.mylyn.commons.sdk.util-3.26.0.N20200810-0516.jar')
[WARNING] /home/jenkins/agent/workspace/mylyn-tasks-nightly/connector-bugzilla-rest/org.eclipse.mylyn.bugzilla.rest.tests/src/org/eclipse/mylyn/bugzilla/rest/tests/TckFixture.java:[28] 
	return new TaskRepository(getConnectorKind(), getRepositoryUrl());
	                          ^^^^^^^^^^^^^^^^
Discouraged access: The method 'AbstractTestFixture.getConnectorKind()' is not API (restriction on classpath entry '/home/jenkins/agent/workspace/mylyn-tasks-nightly/.repository/p2/osgi/bundle/org.eclipse.mylyn.commons.sdk.util/3.26.0.N20200810-0516/org.eclipse.mylyn.commons.sdk.util-3.26.0.N20200810-0516.jar')
[WARNING] /home/jenkins/agent/workspace/mylyn-tasks-nightly/connector-bugzilla-rest/org.eclipse.mylyn.bugzilla.rest.tests/src/org/eclipse/mylyn/bugzilla/rest/tests/TckFixture.java:[28] 
	return new TaskRepository(getConnectorKind(), getRepositoryUrl());
	                                              ^^^^^^^^^^^^^^^^
Discouraged access: The method 'AbstractTestFixture.getRepositoryUrl()' is not API (restriction on classpath entry '/home/jenkins/agent/workspace/mylyn-tasks-nightly/.repository/p2/osgi/bundle/org.eclipse.mylyn.commons.sdk.util/3.26.0.N20200810-0516/org.eclipse.mylyn.commons.sdk.util-3.26.0.N20200810-0516.jar')
[WARNING] /home/jenkins/agent/workspace/mylyn-tasks-nightly/connector-bugzilla-rest/org.eclipse.mylyn.bugzilla.rest.tests/src/org/eclipse/mylyn/bugzilla/rest/tests/TckFixture.java:[31] 
	@SuppressWarnings("restriction")
	                  ^^^^^^^^^^^^^
Unnecessary @SuppressWarnings("restriction")
[WARNING] /home/jenkins/agent/workspace/mylyn-tasks-nightly/connector-bugzilla-rest/org.eclipse.mylyn.bugzilla.rest.tests/src/org/eclipse/mylyn/bugzilla/rest/tests/tck/AbstractRepositoryConnectorTest.java:[21] 
	import org.eclipse.mylyn.commons.sdk.util.Junit4TestFixtureRunner.FixtureDefinition;
	       ^^^^^^^^^^^^^^^^^^^^^^^^^^^^^^^^^^^^^^^^^^^^^^^^^^^^^^^^^^^^^^^^^^^^^^^^^^^^
Discouraged access: The type 'Junit4TestFixtureRunner.FixtureDefinition' is not API (restriction on classpath entry '/home/jenkins/agent/workspace/mylyn-tasks-nightly/.repository/p2/osgi/bundle/org.eclipse.mylyn.commons.sdk.util/3.26.0.N20200810-0516/org.eclipse.mylyn.commons.sdk.util-3.26.0.N20200810-0516.jar')
[WARNING] /home/jenkins/agent/workspace/mylyn-tasks-nightly/connector-bugzilla-rest/org.eclipse.mylyn.bugzilla.rest.tests/src/org/eclipse/mylyn/bugzilla/rest/tests/tck/AbstractRepositoryConnectorTest.java:[22] 
	import org.eclipse.mylyn.commons.sdk.util.Junit4TestFixtureRunner.RunOnlyWhenProperty;
	       ^^^^^^^^^^^^^^^^^^^^^^^^^^^^^^^^^^^^^^^^^^^^^^^^^^^^^^^^^^^^^^^^^^^^^^^^^^^^^^
Discouraged access: The type 'Junit4TestFixtureRunner.RunOnlyWhenProperty' is not API (restriction on classpath entry '/home/jenkins/agent/workspace/mylyn-tasks-nightly/.repository/p2/osgi/bundle/org.eclipse.mylyn.commons.sdk.util/3.26.0.N20200810-0516/org.eclipse.mylyn.commons.sdk.util-3.26.0.N20200810-0516.jar')
[WARNING] /home/jenkins/agent/workspace/mylyn-tasks-nightly/connector-bugzilla-rest/org.eclipse.mylyn.bugzilla.rest.tests/src/org/eclipse/mylyn/bugzilla/rest/tests/tck/AbstractRepositoryConnectorTest.java:[26] 
	@FixtureDefinition(fixtureClass = TckFixture.class, fixtureType = "bugzillaREST")
	 ^^^^^^^^^^^^^^^^^
Discouraged access: The type 'Junit4TestFixtureRunner.FixtureDefinition' is not API (restriction on classpath entry '/home/jenkins/agent/workspace/mylyn-tasks-nightly/.repository/p2/osgi/bundle/org.eclipse.mylyn.commons.sdk.util/3.26.0.N20200810-0516/org.eclipse.mylyn.commons.sdk.util-3.26.0.N20200810-0516.jar')
[WARNING] /home/jenkins/agent/workspace/mylyn-tasks-nightly/connector-bugzilla-rest/org.eclipse.mylyn.bugzilla.rest.tests/src/org/eclipse/mylyn/bugzilla/rest/tests/tck/AbstractRepositoryConnectorTest.java:[27] 
	@RunOnlyWhenProperty(property = "default", value = "1")
	 ^^^^^^^^^^^^^^^^^^^
Discouraged access: The type 'Junit4TestFixtureRunner.RunOnlyWhenProperty' is not API (restriction on classpath entry '/home/jenkins/agent/workspace/mylyn-tasks-nightly/.repository/p2/osgi/bundle/org.eclipse.mylyn.commons.sdk.util/3.26.0.N20200810-0516/org.eclipse.mylyn.commons.sdk.util-3.26.0.N20200810-0516.jar')
[WARNING] /home/jenkins/agent/workspace/mylyn-tasks-nightly/connector-bugzilla-rest/org.eclipse.mylyn.bugzilla.rest.tests/src/org/eclipse/mylyn/bugzilla/rest/tests/tck/ui/AbstractRepositorySettingsPageTest.java:[19] 
	import org.eclipse.mylyn.commons.sdk.util.Junit4TestFixtureRunner.FixtureDefinition;
	       ^^^^^^^^^^^^^^^^^^^^^^^^^^^^^^^^^^^^^^^^^^^^^^^^^^^^^^^^^^^^^^^^^^^^^^^^^^^^
Discouraged access: The type 'Junit4TestFixtureRunner.FixtureDefinition' is not API (restriction on classpath entry '/home/jenkins/agent/workspace/mylyn-tasks-nightly/.repository/p2/osgi/bundle/org.eclipse.mylyn.commons.sdk.util/3.26.0.N20200810-0516/org.eclipse.mylyn.commons.sdk.util-3.26.0.N20200810-0516.jar')
[WARNING] /home/jenkins/agent/workspace/mylyn-tasks-nightly/connector-bugzilla-rest/org.eclipse.mylyn.bugzilla.rest.tests/src/org/eclipse/mylyn/bugzilla/rest/tests/tck/ui/AbstractRepositorySettingsPageTest.java:[20] 
	import org.eclipse.mylyn.commons.sdk.util.Junit4TestFixtureRunner.RunOnlyWhenProperty;
	       ^^^^^^^^^^^^^^^^^^^^^^^^^^^^^^^^^^^^^^^^^^^^^^^^^^^^^^^^^^^^^^^^^^^^^^^^^^^^^^
Discouraged access: The type 'Junit4TestFixtureRunner.RunOnlyWhenProperty' is not API (restriction on classpath entry '/home/jenkins/agent/workspace/mylyn-tasks-nightly/.repository/p2/osgi/bundle/org.eclipse.mylyn.commons.sdk.util/3.26.0.N20200810-0516/org.eclipse.mylyn.commons.sdk.util-3.26.0.N20200810-0516.jar')
[WARNING] /home/jenkins/agent/workspace/mylyn-tasks-nightly/connector-bugzilla-rest/org.eclipse.mylyn.bugzilla.rest.tests/src/org/eclipse/mylyn/bugzilla/rest/tests/tck/ui/AbstractRepositorySettingsPageTest.java:[23] 
	import org.eclipse.mylyn.internal.tasks.ui.wizards.EditRepositoryWizard;
	       ^^^^^^^^^^^^^^^^^^^^^^^^^^^^^^^^^^^^^^^^^^^^^^^^^^^^^^^^^^^^^^^^
Discouraged access: The type 'EditRepositoryWizard' is not API (restriction on classpath entry '/home/jenkins/agent/workspace/mylyn-tasks-nightly/org.eclipse.mylyn.tasks.ui/target/classes')
[WARNING] /home/jenkins/agent/workspace/mylyn-tasks-nightly/connector-bugzilla-rest/org.eclipse.mylyn.bugzilla.rest.tests/src/org/eclipse/mylyn/bugzilla/rest/tests/tck/ui/AbstractRepositorySettingsPageTest.java:[31] 
	@FixtureDefinition(fixtureClass = TckFixture.class, fixtureType = "bugzillaREST")
	 ^^^^^^^^^^^^^^^^^
Discouraged access: The type 'Junit4TestFixtureRunner.FixtureDefinition' is not API (restriction on classpath entry '/home/jenkins/agent/workspace/mylyn-tasks-nightly/.repository/p2/osgi/bundle/org.eclipse.mylyn.commons.sdk.util/3.26.0.N20200810-0516/org.eclipse.mylyn.commons.sdk.util-3.26.0.N20200810-0516.jar')
[WARNING] /home/jenkins/agent/workspace/mylyn-tasks-nightly/connector-bugzilla-rest/org.eclipse.mylyn.bugzilla.rest.tests/src/org/eclipse/mylyn/bugzilla/rest/tests/tck/ui/AbstractRepositorySettingsPageTest.java:[32] 
	@RunOnlyWhenProperty(property = "default", value = "1")
	 ^^^^^^^^^^^^^^^^^^^
Discouraged access: The type 'Junit4TestFixtureRunner.RunOnlyWhenProperty' is not API (restriction on classpath entry '/home/jenkins/agent/workspace/mylyn-tasks-nightly/.repository/p2/osgi/bundle/org.eclipse.mylyn.commons.sdk.util/3.26.0.N20200810-0516/org.eclipse.mylyn.commons.sdk.util-3.26.0.N20200810-0516.jar')
[WARNING] /home/jenkins/agent/workspace/mylyn-tasks-nightly/connector-bugzilla-rest/org.eclipse.mylyn.bugzilla.rest.tests/src/org/eclipse/mylyn/bugzilla/rest/tests/tck/ui/AbstractRepositorySettingsPageTest.java:[56] 
	EditRepositoryWizard wizard = new EditRepositoryWizard(repository, connectorUi);
	^^^^^^^^^^^^^^^^^^^^
Discouraged access: The type 'EditRepositoryWizard' is not API (restriction on classpath entry '/home/jenkins/agent/workspace/mylyn-tasks-nightly/org.eclipse.mylyn.tasks.ui/target/classes')
[WARNING] /home/jenkins/agent/workspace/mylyn-tasks-nightly/connector-bugzilla-rest/org.eclipse.mylyn.bugzilla.rest.tests/src/org/eclipse/mylyn/bugzilla/rest/tests/tck/ui/AbstractRepositorySettingsPageTest.java:[56] 
	EditRepositoryWizard wizard = new EditRepositoryWizard(repository, connectorUi);
	                                  ^^^^^^^^^^^^^^^^^^^^
Discouraged access: The type 'EditRepositoryWizard' is not API (restriction on classpath entry '/home/jenkins/agent/workspace/mylyn-tasks-nightly/org.eclipse.mylyn.tasks.ui/target/classes')
[WARNING] /home/jenkins/agent/workspace/mylyn-tasks-nightly/connector-bugzilla-rest/org.eclipse.mylyn.bugzilla.rest.tests/src/org/eclipse/mylyn/bugzilla/rest/tests/tck/ui/AbstractRepositorySettingsPageTest.java:[56] 
	EditRepositoryWizard wizard = new EditRepositoryWizard(repository, connectorUi);
	                                  ^^^^^^^^^^^^^^^^^^^^
Discouraged access: The constructor 'EditRepositoryWizard(TaskRepository, AbstractRepositoryConnectorUi)' is not API (restriction on classpath entry '/home/jenkins/agent/workspace/mylyn-tasks-nightly/org.eclipse.mylyn.tasks.ui/target/classes')
[WARNING] /home/jenkins/agent/workspace/mylyn-tasks-nightly/connector-bugzilla-rest/org.eclipse.mylyn.bugzilla.rest.tests/src/org/eclipse/mylyn/bugzilla/rest/tests/tck/ui/AbstractRepositorySettingsPageTest.java:[59] 
	ITaskRepositoryPage page = wizard.getSettingsPage();
	                                  ^^^^^^^^^^^^^^^
Discouraged access: The method 'EditRepositoryWizard.getSettingsPage()' is not API (restriction on classpath entry '/home/jenkins/agent/workspace/mylyn-tasks-nightly/org.eclipse.mylyn.tasks.ui/target/classes')
[WARNING] /home/jenkins/agent/workspace/mylyn-tasks-nightly/connector-bugzilla-rest/org.eclipse.mylyn.bugzilla.rest.tests/src/org/eclipse/mylyn/bugzilla/rest/tests/tck/ValidationTest.java:[9] 
	import org.eclipse.mylyn.commons.sdk.util.Junit4TestFixtureRunner.FixtureDefinition;
	       ^^^^^^^^^^^^^^^^^^^^^^^^^^^^^^^^^^^^^^^^^^^^^^^^^^^^^^^^^^^^^^^^^^^^^^^^^^^^
Discouraged access: The type 'Junit4TestFixtureRunner.FixtureDefinition' is not API (restriction on classpath entry '/home/jenkins/agent/workspace/mylyn-tasks-nightly/.repository/p2/osgi/bundle/org.eclipse.mylyn.commons.sdk.util/3.26.0.N20200810-0516/org.eclipse.mylyn.commons.sdk.util-3.26.0.N20200810-0516.jar')
[WARNING] /home/jenkins/agent/workspace/mylyn-tasks-nightly/connector-bugzilla-rest/org.eclipse.mylyn.bugzilla.rest.tests/src/org/eclipse/mylyn/bugzilla/rest/tests/tck/ValidationTest.java:[16] 
	@FixtureDefinition(fixtureClass = TckFixture.class, fixtureType = "bugzillaREST")
	 ^^^^^^^^^^^^^^^^^
Discouraged access: The type 'Junit4TestFixtureRunner.FixtureDefinition' is not API (restriction on classpath entry '/home/jenkins/agent/workspace/mylyn-tasks-nightly/.repository/p2/osgi/bundle/org.eclipse.mylyn.commons.sdk.util/3.26.0.N20200810-0516/org.eclipse.mylyn.commons.sdk.util-3.26.0.N20200810-0516.jar')
33 problems (33 warnings)
[INFO] 
[INFO] --- tycho-source-plugin:1.5.0:plugin-source (attach-source) @ org.eclipse.mylyn.bugzilla.rest.tests ---
[INFO] Building jar: /home/jenkins/agent/workspace/mylyn-tasks-nightly/connector-bugzilla-rest/org.eclipse.mylyn.bugzilla.rest.tests/target/org.eclipse.mylyn.bugzilla.rest.tests-1.0.0-SNAPSHOT-sources.jar
[INFO] 
[INFO] --- maven-resources-plugin:2.4.1:testResources (default-testResources) @ org.eclipse.mylyn.bugzilla.rest.tests ---
[INFO] Using 'ISO-8859-1' encoding to copy filtered resources.
[INFO] skip non existing resourceDirectory /home/jenkins/agent/workspace/mylyn-tasks-nightly/connector-bugzilla-rest/org.eclipse.mylyn.bugzilla.rest.tests/src/test/resources
[INFO] 
[INFO] --- target-platform-configuration:1.5.0:target-platform (default-target-platform) @ org.eclipse.mylyn.bugzilla.rest.tests ---
[INFO] 
[INFO] --- tycho-packaging-plugin:1.5.0:package-plugin (default-package-plugin) @ org.eclipse.mylyn.bugzilla.rest.tests ---
[INFO] Building jar: /home/jenkins/agent/workspace/mylyn-tasks-nightly/connector-bugzilla-rest/org.eclipse.mylyn.bugzilla.rest.tests/target/org.eclipse.mylyn.bugzilla.rest.tests-1.0.0-SNAPSHOT.jar
[INFO] 
[INFO] --- tycho-p2-plugin:1.5.0:p2-metadata-default (default-p2-metadata-default) @ org.eclipse.mylyn.bugzilla.rest.tests ---
[INFO] 
[INFO] --- tycho-surefire-plugin:1.5.0:test (default-test) @ org.eclipse.mylyn.bugzilla.rest.tests ---
[INFO] Expected eclipse log file: /home/jenkins/agent/workspace/mylyn-tasks-nightly/connector-bugzilla-rest/org.eclipse.mylyn.bugzilla.rest.tests/target/work/data/.metadata/.log
[INFO] Command line:
	[/opt/tools/java/oracle/jdk-8/1.8.0_202/jre/bin/java, -Dosgi.noShutdown=false, -Dosgi.os=linux, -Dosgi.ws=gtk, -Dosgi.arch=x86_64, -Xmx512m, -Djava.io.tmpdir=/home/jenkins/agent/workspace/mylyn-tasks-nightly/connector-bugzilla-rest/org.eclipse.mylyn.bugzilla.rest.tests/target, -ea, -Dorg.eclipse.mylyn.wikitext.tests.disableOutput=true, -Dosgi.clean=true, -jar, /home/jenkins/agent/workspace/mylyn-tasks-nightly/.repository/p2/osgi/bundle/org.eclipse.equinox.launcher/1.5.600.v20191014-2022/org.eclipse.equinox.launcher-1.5.600.v20191014-2022.jar, -data, /home/jenkins/agent/workspace/mylyn-tasks-nightly/connector-bugzilla-rest/org.eclipse.mylyn.bugzilla.rest.tests/target/work/data, -install, /home/jenkins/agent/workspace/mylyn-tasks-nightly/connector-bugzilla-rest/org.eclipse.mylyn.bugzilla.rest.tests/target/work, -configuration, /home/jenkins/agent/workspace/mylyn-tasks-nightly/connector-bugzilla-rest/org.eclipse.mylyn.bugzilla.rest.tests/target/work/configuration, -application, org.eclipse.tycho.surefire.osgibooter.uitest, -testproperties, /home/jenkins/agent/workspace/mylyn-tasks-nightly/connector-bugzilla-rest/org.eclipse.mylyn.bugzilla.rest.tests/target/surefire.properties, -testApplication, org.eclipse.ui.ide.workbench, -product, org.eclipse.sdk.ide, -eclipse.keyring, /home/jenkins/agent/workspace/mylyn-tasks-nightly/connector-bugzilla-rest/org.eclipse.mylyn.bugzilla.rest.tests/target/.eclipse.keyring, -eclipse.password, /home/jenkins/agent/workspace/mylyn-tasks-nightly/connector-bugzilla-rest/org.eclipse.mylyn.bugzilla.rest.tests/target/../../.gitignore, -timeout, 10800000]
Launching application org.eclipse.ui.ide.workbench...
java.lang.RuntimeException: Bundle org.eclipse.mylyn.bugzilla.rest.tests is not found
	at org.eclipse.tycho.surefire.osgibooter.OsgiSurefireBooter.getBundleClassLoader(OsgiSurefireBooter.java:175)
	at org.eclipse.tycho.surefire.osgibooter.OsgiSurefireBooter.createCombinedClassLoader(OsgiSurefireBooter.java:120)
	at org.eclipse.tycho.surefire.osgibooter.OsgiSurefireBooter.run(OsgiSurefireBooter.java:113)
	at org.eclipse.tycho.surefire.osgibooter.AbstractUITestApplication$1.run(AbstractUITestApplication.java:35)
	at org.eclipse.swt.widgets.RunnableLock.run(RunnableLock.java:40)
	at org.eclipse.swt.widgets.Synchronizer.runAsyncMessages(Synchronizer.java:185)
	at org.eclipse.swt.widgets.Display.runAsyncMessages(Display.java:4910)
	at org.eclipse.swt.widgets.Display.readAndDispatch(Display.java:4432)
	at org.eclipse.e4.ui.internal.workbench.swt.PartRenderingEngine$5.run(PartRenderingEngine.java:1160)
	at org.eclipse.core.databinding.observable.Realm.runWithDefault(Realm.java:338)
	at org.eclipse.e4.ui.internal.workbench.swt.PartRenderingEngine.run(PartRenderingEngine.java:1049)
	at org.eclipse.e4.ui.internal.workbench.E4Workbench.createAndRunUI(E4Workbench.java:155)
	at org.eclipse.ui.internal.Workbench.lambda$3(Workbench.java:660)
	at org.eclipse.core.databinding.observable.Realm.runWithDefault(Realm.java:338)
	at org.eclipse.ui.internal.Workbench.createAndRunWorkbench(Workbench.java:559)
	at org.eclipse.ui.PlatformUI.createAndRunWorkbench(PlatformUI.java:154)
	at org.eclipse.ui.internal.ide.application.IDEApplication.start(IDEApplication.java:150)
	at org.eclipse.tycho.surefire.osgibooter.UITestApplication.runApplication(UITestApplication.java:31)
	at org.eclipse.tycho.surefire.osgibooter.AbstractUITestApplication.run(AbstractUITestApplication.java:120)
	at org.eclipse.tycho.surefire.osgibooter.UITestApplication.start(UITestApplication.java:37)
	at org.eclipse.equinox.internal.app.EclipseAppHandle.run(EclipseAppHandle.java:203)
	at org.eclipse.core.runtime.internal.adaptor.EclipseAppLauncher.runApplication(EclipseAppLauncher.java:137)
	at org.eclipse.core.runtime.internal.adaptor.EclipseAppLauncher.start(EclipseAppLauncher.java:107)
	at org.eclipse.core.runtime.adaptor.EclipseStarter.run(EclipseStarter.java:401)
	at org.eclipse.core.runtime.adaptor.EclipseStarter.run(EclipseStarter.java:255)
	at sun.reflect.NativeMethodAccessorImpl.invoke0(Native Method)
	at sun.reflect.NativeMethodAccessorImpl.invoke(NativeMethodAccessorImpl.java:62)
	at sun.reflect.DelegatingMethodAccessorImpl.invoke(DelegatingMethodAccessorImpl.java:43)
	at java.lang.reflect.Method.invoke(Method.java:498)
	at org.eclipse.equinox.launcher.Main.invokeFramework(Main.java:657)
	at org.eclipse.equinox.launcher.Main.basicRun(Main.java:594)
	at org.eclipse.equinox.launcher.Main.run(Main.java:1465)
	at org.eclipse.equinox.launcher.Main.main(Main.java:1438)
[INFO] 
[INFO] --< org.eclipse.mylyn.tasks:org.eclipse.mylyn.bugzilla.rest.ui.tests >--
[INFO] Building org.eclipse.mylyn.bugzilla.rest.ui.tests 1.0.0-SNAPSHOT [39/41]
[INFO] ------------------------[ eclipse-test-plugin ]-------------------------
[INFO] 
[INFO] --- maven-clean-plugin:2.5:clean (default-clean) @ org.eclipse.mylyn.bugzilla.rest.ui.tests ---
[INFO] 
[INFO] --- tycho-packaging-plugin:1.5.0:build-qualifier (default-build-qualifier) @ org.eclipse.mylyn.bugzilla.rest.ui.tests ---
[INFO] The project's OSGi version is 1.0.0.N20190930-2129
[INFO] 
[INFO] --- tycho-packaging-plugin:1.5.0:validate-id (default-validate-id) @ org.eclipse.mylyn.bugzilla.rest.ui.tests ---
[INFO] 
[INFO] --- tycho-packaging-plugin:1.5.0:validate-version (default-validate-version) @ org.eclipse.mylyn.bugzilla.rest.ui.tests ---
[INFO] 
[INFO] --- jacoco-maven-plugin:0.5.6.201201232323:prepare-agent (default) @ org.eclipse.mylyn.bugzilla.rest.ui.tests ---
[INFO] Skipping JaCoCo execution
[INFO] 
[INFO] --- maven-resources-plugin:2.4.1:resources (default-resources) @ org.eclipse.mylyn.bugzilla.rest.ui.tests ---
[INFO] Using 'ISO-8859-1' encoding to copy filtered resources.
[INFO] skip non existing resourceDirectory /home/jenkins/agent/workspace/mylyn-tasks-nightly/connector-bugzilla-rest/org.eclipse.mylyn.bugzilla.rest.ui.tests/src/main/resources
[INFO] 
[INFO] --- tycho-compiler-plugin:1.5.0:compile (default-compile) @ org.eclipse.mylyn.bugzilla.rest.ui.tests ---
[INFO] Compiling 1 source file to /home/jenkins/agent/workspace/mylyn-tasks-nightly/connector-bugzilla-rest/org.eclipse.mylyn.bugzilla.rest.ui.tests/target/classes
[INFO] 
[INFO] --- tycho-source-plugin:1.5.0:plugin-source (attach-source) @ org.eclipse.mylyn.bugzilla.rest.ui.tests ---
[INFO] Building jar: /home/jenkins/agent/workspace/mylyn-tasks-nightly/connector-bugzilla-rest/org.eclipse.mylyn.bugzilla.rest.ui.tests/target/org.eclipse.mylyn.bugzilla.rest.ui.tests-1.0.0-SNAPSHOT-sources.jar
[INFO] 
[INFO] --- maven-resources-plugin:2.4.1:testResources (default-testResources) @ org.eclipse.mylyn.bugzilla.rest.ui.tests ---
[INFO] Using 'ISO-8859-1' encoding to copy filtered resources.
[INFO] skip non existing resourceDirectory /home/jenkins/agent/workspace/mylyn-tasks-nightly/connector-bugzilla-rest/org.eclipse.mylyn.bugzilla.rest.ui.tests/src/test/resources
[INFO] 
[INFO] --- target-platform-configuration:1.5.0:target-platform (default-target-platform) @ org.eclipse.mylyn.bugzilla.rest.ui.tests ---
[INFO] 
[INFO] --- tycho-packaging-plugin:1.5.0:package-plugin (default-package-plugin) @ org.eclipse.mylyn.bugzilla.rest.ui.tests ---
[INFO] Building jar: /home/jenkins/agent/workspace/mylyn-tasks-nightly/connector-bugzilla-rest/org.eclipse.mylyn.bugzilla.rest.ui.tests/target/org.eclipse.mylyn.bugzilla.rest.ui.tests-1.0.0-SNAPSHOT.jar
[INFO] 
[INFO] --- tycho-p2-plugin:1.5.0:p2-metadata-default (default-p2-metadata-default) @ org.eclipse.mylyn.bugzilla.rest.ui.tests ---
[INFO] 
[INFO] --- tycho-surefire-plugin:1.5.0:test (default-test) @ org.eclipse.mylyn.bugzilla.rest.ui.tests ---
[INFO] Fetching org.eclipse.mylyn.monitor.core_3.24.2.v20180904-2231.jar.pack.gz from http://download.eclipse.org/releases/2019-12/201912181000/plugins/ (26.46kB)
[INFO] Fetching org.eclipse.mylyn.monitor.core_3.24.2.v20180904-2231.jar.pack.gz from http://download.eclipse.org/releases/2019-12/201912181000/plugins/ (26.46kB)
[INFO] Fetching org.eclipse.mylyn.commons.workbench_3.24.2.v20180904-2231.jar.pack.gz from http://download.eclipse.org/releases/2019-12/201912181000/plugins/ (104.32kB)
[INFO] Fetching org.eclipse.mylyn.commons.workbench_3.24.2.v20180904-2231.jar.pack.gz from http://download.eclipse.org/releases/2019-12/201912181000/plugins/ (104.32kB)
[INFO] Expected eclipse log file: /home/jenkins/agent/workspace/mylyn-tasks-nightly/connector-bugzilla-rest/org.eclipse.mylyn.bugzilla.rest.ui.tests/target/work/data/.metadata/.log
[INFO] Command line:
	[/opt/tools/java/oracle/jdk-8/1.8.0_202/jre/bin/java, -Dosgi.noShutdown=false, -Dosgi.os=linux, -Dosgi.ws=gtk, -Dosgi.arch=x86_64, -Xmx512m, -Djava.io.tmpdir=/home/jenkins/agent/workspace/mylyn-tasks-nightly/connector-bugzilla-rest/org.eclipse.mylyn.bugzilla.rest.ui.tests/target, -ea, -Dorg.eclipse.mylyn.wikitext.tests.disableOutput=true, -Dosgi.clean=true, -jar, /home/jenkins/agent/workspace/mylyn-tasks-nightly/.repository/p2/osgi/bundle/org.eclipse.equinox.launcher/1.5.600.v20191014-2022/org.eclipse.equinox.launcher-1.5.600.v20191014-2022.jar, -data, /home/jenkins/agent/workspace/mylyn-tasks-nightly/connector-bugzilla-rest/org.eclipse.mylyn.bugzilla.rest.ui.tests/target/work/data, -install, /home/jenkins/agent/workspace/mylyn-tasks-nightly/connector-bugzilla-rest/org.eclipse.mylyn.bugzilla.rest.ui.tests/target/work, -configuration, /home/jenkins/agent/workspace/mylyn-tasks-nightly/connector-bugzilla-rest/org.eclipse.mylyn.bugzilla.rest.ui.tests/target/work/configuration, -application, org.eclipse.tycho.surefire.osgibooter.uitest, -testproperties, /home/jenkins/agent/workspace/mylyn-tasks-nightly/connector-bugzilla-rest/org.eclipse.mylyn.bugzilla.rest.ui.tests/target/surefire.properties, -testApplication, org.eclipse.ui.ide.workbench, -product, org.eclipse.sdk.ide, -eclipse.keyring, /home/jenkins/agent/workspace/mylyn-tasks-nightly/connector-bugzilla-rest/org.eclipse.mylyn.bugzilla.rest.ui.tests/target/.eclipse.keyring, -eclipse.password, /home/jenkins/agent/workspace/mylyn-tasks-nightly/connector-bugzilla-rest/org.eclipse.mylyn.bugzilla.rest.ui.tests/target/../../.gitignore, -timeout, 10800000]
Launching application org.eclipse.ui.ide.workbench...
Running org.eclipse.mylyn.internal.bugzilla.rest.ui.tests.DummyTest
Tests run: 1, Failures: 0, Errors: 0, Skipped: 0, Time elapsed: 0.014 s - in org.eclipse.mylyn.internal.bugzilla.rest.ui.tests.DummyTest
test(org.eclipse.mylyn.internal.bugzilla.rest.ui.tests.DummyTest)  Time elapsed: 0.001 s

Results:

Tests run: 1, Failures: 0, Errors: 0, Skipped: 0

[INFO] All tests passed!
[INFO] ------------------------------------------------------------------------
[INFO] Reactor Summary:
[INFO] 
[INFO] Mylyn Tasks 3.26.0-SNAPSHOT ........................ SUCCESS [  0.849 s]
[INFO] org.eclipse.mylyn.tasks.core 3.26.0-SNAPSHOT ....... SUCCESS [  5.948 s]
[INFO] org.eclipse.mylyn.tasks.index.core 3.26.0-SNAPSHOT . SUCCESS [  0.367 s]
[INFO] org.eclipse.mylyn.tasks.ui 3.26.0-SNAPSHOT ......... SUCCESS [  2.633 s]
[INFO] org.eclipse.mylyn.tasks.index.ui 3.26.0-SNAPSHOT ... SUCCESS [  0.359 s]
[INFO] org.eclipse.mylyn.tasks.search 3.26.0-SNAPSHOT ..... SUCCESS [  0.328 s]
[INFO] org.eclipse.mylyn_feature 3.26.0-SNAPSHOT .......... SUCCESS [  0.207 s]
[INFO] org.eclipse.mylyn.bugzilla.core 3.26.0-SNAPSHOT .... SUCCESS [  0.462 s]
[INFO] org.eclipse.mylyn.bugzilla.ui 3.26.0-SNAPSHOT ...... SUCCESS [  0.509 s]
[INFO] org.eclipse.mylyn.bugzilla_feature 3.26.0-SNAPSHOT . SUCCESS [  0.082 s]
[INFO] org.eclipse.mylyn.tests.util 3.26.0-SNAPSHOT ....... SUCCESS [  0.159 s]
[INFO] org.eclipse.mylyn.bugzilla.tests 3.26.0-SNAPSHOT ... SUCCESS [10:09 min]
[INFO] org.eclipse.mylyn.help.sdk 3.26.0-SNAPSHOT ......... SUCCESS [  0.034 s]
[INFO] org.eclipse.mylyn.help.ui 3.26.0-SNAPSHOT .......... SUCCESS [  0.126 s]
[INFO] org.eclipse.mylyn.trac.core 3.26.0-SNAPSHOT ........ SUCCESS [  0.248 s]
[INFO] org.eclipse.mylyn.trac.ui 3.26.0-SNAPSHOT .......... SUCCESS [  0.247 s]
[INFO] org.eclipse.mylyn.trac_feature 3.26.0-SNAPSHOT ..... SUCCESS [  0.069 s]
[INFO] org.eclipse.mylyn.tasks.bugs 3.26.0-SNAPSHOT ....... SUCCESS [  0.238 s]
[INFO] org.eclipse.mylyn.sdk_feature 3.26.0-SNAPSHOT ...... SUCCESS [  1.696 s]
[INFO] org.eclipse.mylyn.tasks.core.tests 3.26.0-SNAPSHOT . SUCCESS [ 18.238 s]
[INFO] org.eclipse.mylyn.tasks.tests 3.26.0-SNAPSHOT ...... SUCCESS [ 25.927 s]
[INFO] org.eclipse.mylyn.tasks.index.tests 3.26.0-SNAPSHOT  SUCCESS [  7.727 s]
[INFO] org.eclipse.mylyn.tasks.ui.tests 3.26.0-SNAPSHOT ... SUCCESS [ 17.561 s]
[INFO] org.eclipse.mylyn.trac.tests 3.26.0-SNAPSHOT ....... FAILURE [  6.301 s]
[INFO] org.eclipse.mylyn.trac.core.tests 3.26.0-SNAPSHOT .. SUCCESS [  5.568 s]
[INFO] org.eclipse.mylyn.trac.ui.tests 3.26.0-SNAPSHOT .... FAILURE [  6.173 s]
[INFO] org.eclipse.mylyn.test_feature 3.26.0-SNAPSHOT ..... SKIPPED
[INFO] org.eclipse.mylyn.tasks.index 3.26.0-SNAPSHOT ...... SUCCESS [  0.049 s]
[INFO] org.eclipse.mylyn.tasks.ide 3.26.0-SNAPSHOT ........ SUCCESS [  0.054 s]
[INFO] Mylyn Tasks 3.26.0-SNAPSHOT ........................ SKIPPED
[INFO] org.eclipse.mylyn.tasks-target 3.26.0-SNAPSHOT ..... SUCCESS [  0.603 s]
[INFO] org.eclipse.mylyn.tasks.activity.core 3.26.0-SNAPSHOT SUCCESS [  0.144 s]
[INFO] org.eclipse.mylyn.tasks.activity.ui 3.26.0-SNAPSHOT  SUCCESS [  0.154 s]
[INFO] org.eclipse.mylyn.tasks.activity.tests 3.26.0-SNAPSHOT SUCCESS [ 13.197 s]
[INFO] org.eclipse.mylyn.tasks.connector-bugzilla-rest 3.26.0-SNAPSHOT SUCCESS [  0.002 s]
[INFO] org.eclipse.mylyn.bugzilla.rest.core 1.0.0-SNAPSHOT  SUCCESS [  0.262 s]
[INFO] org.eclipse.mylyn.bugzilla.rest.ui 1.0.0-SNAPSHOT .. SUCCESS [  0.266 s]
[INFO] org.eclipse.mylyn.bugzilla.rest 1.0.0-SNAPSHOT ..... SUCCESS [  0.085 s]
[INFO] org.eclipse.mylyn.bugzilla.rest.core.tests 1.0.0-SNAPSHOT FAILURE [04:35 min]
[INFO] org.eclipse.mylyn.bugzilla.rest.tests 1.0.0-SNAPSHOT FAILURE [  5.971 s]
[INFO] org.eclipse.mylyn.bugzilla.rest.ui.tests 1.0.0-SNAPSHOT SUCCESS [  6.253 s]
[INFO] ------------------------------------------------------------------------
[INFO] BUILD FAILURE
[INFO] ------------------------------------------------------------------------
[INFO] Total time:  18:52 min
[INFO] Finished at: 2022-01-31T22:04:18Z
[INFO] ------------------------------------------------------------------------
[ERROR] Failed to execute goal org.eclipse.tycho:tycho-surefire-plugin:1.5.0:test (default-test) on project org.eclipse.mylyn.trac.tests: There are test failures.
[ERROR] 
[ERROR] Please refer to /home/jenkins/agent/workspace/mylyn-tasks-nightly/org.eclipse.mylyn.trac.tests/target/surefire-reports for the individual test results.
[ERROR] -> [Help 1]
org.apache.maven.lifecycle.LifecycleExecutionException: Failed to execute goal org.eclipse.tycho:tycho-surefire-plugin:1.5.0:test (default-test) on project org.eclipse.mylyn.trac.tests: There are test failures.

Please refer to /home/jenkins/agent/workspace/mylyn-tasks-nightly/org.eclipse.mylyn.trac.tests/target/surefire-reports for the individual test results.
    at org.apache.maven.lifecycle.internal.MojoExecutor.execute (MojoExecutor.java:215)
    at org.apache.maven.lifecycle.internal.MojoExecutor.execute (MojoExecutor.java:156)
    at org.apache.maven.lifecycle.internal.MojoExecutor.execute (MojoExecutor.java:148)
    at org.apache.maven.lifecycle.internal.LifecycleModuleBuilder.buildProject (LifecycleModuleBuilder.java:117)
    at org.apache.maven.lifecycle.internal.LifecycleModuleBuilder.buildProject (LifecycleModuleBuilder.java:81)
    at org.apache.maven.lifecycle.internal.builder.singlethreaded.SingleThreadedBuilder.build (SingleThreadedBuilder.java:56)
    at org.apache.maven.lifecycle.internal.LifecycleStarter.execute (LifecycleStarter.java:128)
    at org.apache.maven.DefaultMaven.doExecute (DefaultMaven.java:305)
    at org.apache.maven.DefaultMaven.doExecute (DefaultMaven.java:192)
    at org.apache.maven.DefaultMaven.execute (DefaultMaven.java:105)
    at org.apache.maven.cli.MavenCli.execute (MavenCli.java:972)
    at org.apache.maven.cli.MavenCli.doMain (MavenCli.java:293)
    at org.apache.maven.cli.MavenCli.main (MavenCli.java:196)
    at sun.reflect.NativeMethodAccessorImpl.invoke0 (Native Method)
    at sun.reflect.NativeMethodAccessorImpl.invoke (NativeMethodAccessorImpl.java:62)
    at sun.reflect.DelegatingMethodAccessorImpl.invoke (DelegatingMethodAccessorImpl.java:43)
    at java.lang.reflect.Method.invoke (Method.java:498)
    at org.codehaus.plexus.classworlds.launcher.Launcher.launchEnhanced (Launcher.java:282)
    at org.codehaus.plexus.classworlds.launcher.Launcher.launch (Launcher.java:225)
    at org.codehaus.plexus.classworlds.launcher.Launcher.mainWithExitCode (Launcher.java:406)
    at org.codehaus.plexus.classworlds.launcher.Launcher.main (Launcher.java:347)
Caused by: org.apache.maven.plugin.MojoFailureException: There are test failures.

Please refer to /home/jenkins/agent/workspace/mylyn-tasks-nightly/org.eclipse.mylyn.trac.tests/target/surefire-reports for the individual test results.
    at org.eclipse.tycho.surefire.TestMojo.runTest (TestMojo.java:1050)
    at org.eclipse.tycho.surefire.TestMojo.execute (TestMojo.java:702)
    at org.apache.maven.plugin.DefaultBuildPluginManager.executeMojo (DefaultBuildPluginManager.java:137)
    at org.apache.maven.lifecycle.internal.MojoExecutor.execute (MojoExecutor.java:210)
    at org.apache.maven.lifecycle.internal.MojoExecutor.execute (MojoExecutor.java:156)
    at org.apache.maven.lifecycle.internal.MojoExecutor.execute (MojoExecutor.java:148)
    at org.apache.maven.lifecycle.internal.LifecycleModuleBuilder.buildProject (LifecycleModuleBuilder.java:117)
    at org.apache.maven.lifecycle.internal.LifecycleModuleBuilder.buildProject (LifecycleModuleBuilder.java:81)
    at org.apache.maven.lifecycle.internal.builder.singlethreaded.SingleThreadedBuilder.build (SingleThreadedBuilder.java:56)
    at org.apache.maven.lifecycle.internal.LifecycleStarter.execute (LifecycleStarter.java:128)
    at org.apache.maven.DefaultMaven.doExecute (DefaultMaven.java:305)
    at org.apache.maven.DefaultMaven.doExecute (DefaultMaven.java:192)
    at org.apache.maven.DefaultMaven.execute (DefaultMaven.java:105)
    at org.apache.maven.cli.MavenCli.execute (MavenCli.java:972)
    at org.apache.maven.cli.MavenCli.doMain (MavenCli.java:293)
    at org.apache.maven.cli.MavenCli.main (MavenCli.java:196)
    at sun.reflect.NativeMethodAccessorImpl.invoke0 (Native Method)
    at sun.reflect.NativeMethodAccessorImpl.invoke (NativeMethodAccessorImpl.java:62)
    at sun.reflect.DelegatingMethodAccessorImpl.invoke (DelegatingMethodAccessorImpl.java:43)
    at java.lang.reflect.Method.invoke (Method.java:498)
    at org.codehaus.plexus.classworlds.launcher.Launcher.launchEnhanced (Launcher.java:282)
    at org.codehaus.plexus.classworlds.launcher.Launcher.launch (Launcher.java:225)
    at org.codehaus.plexus.classworlds.launcher.Launcher.mainWithExitCode (Launcher.java:406)
    at org.codehaus.plexus.classworlds.launcher.Launcher.main (Launcher.java:347)
[ERROR] Failed to execute goal org.eclipse.tycho:tycho-surefire-plugin:1.5.0:test (default-test) on project org.eclipse.mylyn.trac.ui.tests: There are test failures.
[ERROR] 
[ERROR] Please refer to /home/jenkins/agent/workspace/mylyn-tasks-nightly/org.eclipse.mylyn.trac.ui.tests/target/surefire-reports for the individual test results.
[ERROR] -> [Help 1]
org.apache.maven.lifecycle.LifecycleExecutionException: Failed to execute goal org.eclipse.tycho:tycho-surefire-plugin:1.5.0:test (default-test) on project org.eclipse.mylyn.trac.ui.tests: There are test failures.

Please refer to /home/jenkins/agent/workspace/mylyn-tasks-nightly/org.eclipse.mylyn.trac.ui.tests/target/surefire-reports for the individual test results.
    at org.apache.maven.lifecycle.internal.MojoExecutor.execute (MojoExecutor.java:215)
    at org.apache.maven.lifecycle.internal.MojoExecutor.execute (MojoExecutor.java:156)
    at org.apache.maven.lifecycle.internal.MojoExecutor.execute (MojoExecutor.java:148)
    at org.apache.maven.lifecycle.internal.LifecycleModuleBuilder.buildProject (LifecycleModuleBuilder.java:117)
    at org.apache.maven.lifecycle.internal.LifecycleModuleBuilder.buildProject (LifecycleModuleBuilder.java:81)
    at org.apache.maven.lifecycle.internal.builder.singlethreaded.SingleThreadedBuilder.build (SingleThreadedBuilder.java:56)
    at org.apache.maven.lifecycle.internal.LifecycleStarter.execute (LifecycleStarter.java:128)
    at org.apache.maven.DefaultMaven.doExecute (DefaultMaven.java:305)
    at org.apache.maven.DefaultMaven.doExecute (DefaultMaven.java:192)
    at org.apache.maven.DefaultMaven.execute (DefaultMaven.java:105)
    at org.apache.maven.cli.MavenCli.execute (MavenCli.java:972)
    at org.apache.maven.cli.MavenCli.doMain (MavenCli.java:293)
    at org.apache.maven.cli.MavenCli.main (MavenCli.java:196)
    at sun.reflect.NativeMethodAccessorImpl.invoke0 (Native Method)
    at sun.reflect.NativeMethodAccessorImpl.invoke (NativeMethodAccessorImpl.java:62)
    at sun.reflect.DelegatingMethodAccessorImpl.invoke (DelegatingMethodAccessorImpl.java:43)
    at java.lang.reflect.Method.invoke (Method.java:498)
    at org.codehaus.plexus.classworlds.launcher.Launcher.launchEnhanced (Launcher.java:282)
    at org.codehaus.plexus.classworlds.launcher.Launcher.launch (Launcher.java:225)
    at org.codehaus.plexus.classworlds.launcher.Launcher.mainWithExitCode (Launcher.java:406)
    at org.codehaus.plexus.classworlds.launcher.Launcher.main (Launcher.java:347)
Caused by: org.apache.maven.plugin.MojoFailureException: There are test failures.

Please refer to /home/jenkins/agent/workspace/mylyn-tasks-nightly/org.eclipse.mylyn.trac.ui.tests/target/surefire-reports for the individual test results.
    at org.eclipse.tycho.surefire.TestMojo.runTest (TestMojo.java:1050)
    at org.eclipse.tycho.surefire.TestMojo.execute (TestMojo.java:702)
    at org.apache.maven.plugin.DefaultBuildPluginManager.executeMojo (DefaultBuildPluginManager.java:137)
    at org.apache.maven.lifecycle.internal.MojoExecutor.execute (MojoExecutor.java:210)
    at org.apache.maven.lifecycle.internal.MojoExecutor.execute (MojoExecutor.java:156)
    at org.apache.maven.lifecycle.internal.MojoExecutor.execute (MojoExecutor.java:148)
    at org.apache.maven.lifecycle.internal.LifecycleModuleBuilder.buildProject (LifecycleModuleBuilder.java:117)
    at org.apache.maven.lifecycle.internal.LifecycleModuleBuilder.buildProject (LifecycleModuleBuilder.java:81)
    at org.apache.maven.lifecycle.internal.builder.singlethreaded.SingleThreadedBuilder.build (SingleThreadedBuilder.java:56)
    at org.apache.maven.lifecycle.internal.LifecycleStarter.execute (LifecycleStarter.java:128)
    at org.apache.maven.DefaultMaven.doExecute (DefaultMaven.java:305)
    at org.apache.maven.DefaultMaven.doExecute (DefaultMaven.java:192)
    at org.apache.maven.DefaultMaven.execute (DefaultMaven.java:105)
    at org.apache.maven.cli.MavenCli.execute (MavenCli.java:972)
    at org.apache.maven.cli.MavenCli.doMain (MavenCli.java:293)
    at org.apache.maven.cli.MavenCli.main (MavenCli.java:196)
    at sun.reflect.NativeMethodAccessorImpl.invoke0 (Native Method)
    at sun.reflect.NativeMethodAccessorImpl.invoke (NativeMethodAccessorImpl.java:62)
    at sun.reflect.DelegatingMethodAccessorImpl.invoke (DelegatingMethodAccessorImpl.java:43)
    at java.lang.reflect.Method.invoke (Method.java:498)
    at org.codehaus.plexus.classworlds.launcher.Launcher.launchEnhanced (Launcher.java:282)
    at org.codehaus.plexus.classworlds.launcher.Launcher.launch (Launcher.java:225)
    at org.codehaus.plexus.classworlds.launcher.Launcher.mainWithExitCode (Launcher.java:406)
    at org.codehaus.plexus.classworlds.launcher.Launcher.main (Launcher.java:347)
[ERROR] Failed to execute goal org.eclipse.tycho:tycho-surefire-plugin:1.5.0:test (default-test) on project org.eclipse.mylyn.bugzilla.rest.core.tests: There are test failures.
[ERROR] 
[ERROR] Please refer to /home/jenkins/agent/workspace/mylyn-tasks-nightly/connector-bugzilla-rest/org.eclipse.mylyn.bugzilla.rest.core.tests/target/surefire-reports for the individual test results.
[ERROR] -> [Help 1]
org.apache.maven.lifecycle.LifecycleExecutionException: Failed to execute goal org.eclipse.tycho:tycho-surefire-plugin:1.5.0:test (default-test) on project org.eclipse.mylyn.bugzilla.rest.core.tests: There are test failures.

Please refer to /home/jenkins/agent/workspace/mylyn-tasks-nightly/connector-bugzilla-rest/org.eclipse.mylyn.bugzilla.rest.core.tests/target/surefire-reports for the individual test results.
    at org.apache.maven.lifecycle.internal.MojoExecutor.execute (MojoExecutor.java:215)
    at org.apache.maven.lifecycle.internal.MojoExecutor.execute (MojoExecutor.java:156)
    at org.apache.maven.lifecycle.internal.MojoExecutor.execute (MojoExecutor.java:148)
    at org.apache.maven.lifecycle.internal.LifecycleModuleBuilder.buildProject (LifecycleModuleBuilder.java:117)
    at org.apache.maven.lifecycle.internal.LifecycleModuleBuilder.buildProject (LifecycleModuleBuilder.java:81)
    at org.apache.maven.lifecycle.internal.builder.singlethreaded.SingleThreadedBuilder.build (SingleThreadedBuilder.java:56)
    at org.apache.maven.lifecycle.internal.LifecycleStarter.execute (LifecycleStarter.java:128)
    at org.apache.maven.DefaultMaven.doExecute (DefaultMaven.java:305)
    at org.apache.maven.DefaultMaven.doExecute (DefaultMaven.java:192)
    at org.apache.maven.DefaultMaven.execute (DefaultMaven.java:105)
    at org.apache.maven.cli.MavenCli.execute (MavenCli.java:972)
    at org.apache.maven.cli.MavenCli.doMain (MavenCli.java:293)
    at org.apache.maven.cli.MavenCli.main (MavenCli.java:196)
    at sun.reflect.NativeMethodAccessorImpl.invoke0 (Native Method)
    at sun.reflect.NativeMethodAccessorImpl.invoke (NativeMethodAccessorImpl.java:62)
    at sun.reflect.DelegatingMethodAccessorImpl.invoke (DelegatingMethodAccessorImpl.java:43)
    at java.lang.reflect.Method.invoke (Method.java:498)
    at org.codehaus.plexus.classworlds.launcher.Launcher.launchEnhanced (Launcher.java:282)
    at org.codehaus.plexus.classworlds.launcher.Launcher.launch (Launcher.java:225)
    at org.codehaus.plexus.classworlds.launcher.Launcher.mainWithExitCode (Launcher.java:406)
    at org.codehaus.plexus.classworlds.launcher.Launcher.main (Launcher.java:347)
Caused by: org.apache.maven.plugin.MojoFailureException: There are test failures.

Please refer to /home/jenkins/agent/workspace/mylyn-tasks-nightly/connector-bugzilla-rest/org.eclipse.mylyn.bugzilla.rest.core.tests/target/surefire-reports for the individual test results.
    at org.eclipse.tycho.surefire.TestMojo.runTest (TestMojo.java:1050)
    at org.eclipse.tycho.surefire.TestMojo.execute (TestMojo.java:702)
    at org.apache.maven.plugin.DefaultBuildPluginManager.executeMojo (DefaultBuildPluginManager.java:137)
    at org.apache.maven.lifecycle.internal.MojoExecutor.execute (MojoExecutor.java:210)
    at org.apache.maven.lifecycle.internal.MojoExecutor.execute (MojoExecutor.java:156)
    at org.apache.maven.lifecycle.internal.MojoExecutor.execute (MojoExecutor.java:148)
    at org.apache.maven.lifecycle.internal.LifecycleModuleBuilder.buildProject (LifecycleModuleBuilder.java:117)
    at org.apache.maven.lifecycle.internal.LifecycleModuleBuilder.buildProject (LifecycleModuleBuilder.java:81)
    at org.apache.maven.lifecycle.internal.builder.singlethreaded.SingleThreadedBuilder.build (SingleThreadedBuilder.java:56)
    at org.apache.maven.lifecycle.internal.LifecycleStarter.execute (LifecycleStarter.java:128)
    at org.apache.maven.DefaultMaven.doExecute (DefaultMaven.java:305)
    at org.apache.maven.DefaultMaven.doExecute (DefaultMaven.java:192)
    at org.apache.maven.DefaultMaven.execute (DefaultMaven.java:105)
    at org.apache.maven.cli.MavenCli.execute (MavenCli.java:972)
    at org.apache.maven.cli.MavenCli.doMain (MavenCli.java:293)
    at org.apache.maven.cli.MavenCli.main (MavenCli.java:196)
    at sun.reflect.NativeMethodAccessorImpl.invoke0 (Native Method)
    at sun.reflect.NativeMethodAccessorImpl.invoke (NativeMethodAccessorImpl.java:62)
    at sun.reflect.DelegatingMethodAccessorImpl.invoke (DelegatingMethodAccessorImpl.java:43)
    at java.lang.reflect.Method.invoke (Method.java:498)
    at org.codehaus.plexus.classworlds.launcher.Launcher.launchEnhanced (Launcher.java:282)
    at org.codehaus.plexus.classworlds.launcher.Launcher.launch (Launcher.java:225)
    at org.codehaus.plexus.classworlds.launcher.Launcher.mainWithExitCode (Launcher.java:406)
    at org.codehaus.plexus.classworlds.launcher.Launcher.main (Launcher.java:347)
[ERROR] Failed to execute goal org.eclipse.tycho:tycho-surefire-plugin:1.5.0:test (default-test) on project org.eclipse.mylyn.bugzilla.rest.tests: There are test failures.
[ERROR] 
[ERROR] Please refer to /home/jenkins/agent/workspace/mylyn-tasks-nightly/connector-bugzilla-rest/org.eclipse.mylyn.bugzilla.rest.tests/target/surefire-reports for the individual test results.
[ERROR] -> [Help 1]
org.apache.maven.lifecycle.LifecycleExecutionException: Failed to execute goal org.eclipse.tycho:tycho-surefire-plugin:1.5.0:test (default-test) on project org.eclipse.mylyn.bugzilla.rest.tests: There are test failures.

Please refer to /home/jenkins/agent/workspace/mylyn-tasks-nightly/connector-bugzilla-rest/org.eclipse.mylyn.bugzilla.rest.tests/target/surefire-reports for the individual test results.
    at org.apache.maven.lifecycle.internal.MojoExecutor.execute (MojoExecutor.java:215)
    at org.apache.maven.lifecycle.internal.MojoExecutor.execute (MojoExecutor.java:156)
    at org.apache.maven.lifecycle.internal.MojoExecutor.execute (MojoExecutor.java:148)
    at org.apache.maven.lifecycle.internal.LifecycleModuleBuilder.buildProject (LifecycleModuleBuilder.java:117)
    at org.apache.maven.lifecycle.internal.LifecycleModuleBuilder.buildProject (LifecycleModuleBuilder.java:81)
    at org.apache.maven.lifecycle.internal.builder.singlethreaded.SingleThreadedBuilder.build (SingleThreadedBuilder.java:56)
    at org.apache.maven.lifecycle.internal.LifecycleStarter.execute (LifecycleStarter.java:128)
    at org.apache.maven.DefaultMaven.doExecute (DefaultMaven.java:305)
    at org.apache.maven.DefaultMaven.doExecute (DefaultMaven.java:192)
    at org.apache.maven.DefaultMaven.execute (DefaultMaven.java:105)
    at org.apache.maven.cli.MavenCli.execute (MavenCli.java:972)
    at org.apache.maven.cli.MavenCli.doMain (MavenCli.java:293)
    at org.apache.maven.cli.MavenCli.main (MavenCli.java:196)
    at sun.reflect.NativeMethodAccessorImpl.invoke0 (Native Method)
    at sun.reflect.NativeMethodAccessorImpl.invoke (NativeMethodAccessorImpl.java:62)
    at sun.reflect.DelegatingMethodAccessorImpl.invoke (DelegatingMethodAccessorImpl.java:43)
    at java.lang.reflect.Method.invoke (Method.java:498)
    at org.codehaus.plexus.classworlds.launcher.Launcher.launchEnhanced (Launcher.java:282)
    at org.codehaus.plexus.classworlds.launcher.Launcher.launch (Launcher.java:225)
    at org.codehaus.plexus.classworlds.launcher.Launcher.mainWithExitCode (Launcher.java:406)
    at org.codehaus.plexus.classworlds.launcher.Launcher.main (Launcher.java:347)
Caused by: org.apache.maven.plugin.MojoFailureException: There are test failures.

Please refer to /home/jenkins/agent/workspace/mylyn-tasks-nightly/connector-bugzilla-rest/org.eclipse.mylyn.bugzilla.rest.tests/target/surefire-reports for the individual test results.
    at org.eclipse.tycho.surefire.TestMojo.runTest (TestMojo.java:1050)
    at org.eclipse.tycho.surefire.TestMojo.execute (TestMojo.java:702)
    at org.apache.maven.plugin.DefaultBuildPluginManager.executeMojo (DefaultBuildPluginManager.java:137)
    at org.apache.maven.lifecycle.internal.MojoExecutor.execute (MojoExecutor.java:210)
    at org.apache.maven.lifecycle.internal.MojoExecutor.execute (MojoExecutor.java:156)
    at org.apache.maven.lifecycle.internal.MojoExecutor.execute (MojoExecutor.java:148)
    at org.apache.maven.lifecycle.internal.LifecycleModuleBuilder.buildProject (LifecycleModuleBuilder.java:117)
    at org.apache.maven.lifecycle.internal.LifecycleModuleBuilder.buildProject (LifecycleModuleBuilder.java:81)
    at org.apache.maven.lifecycle.internal.builder.singlethreaded.SingleThreadedBuilder.build (SingleThreadedBuilder.java:56)
    at org.apache.maven.lifecycle.internal.LifecycleStarter.execute (LifecycleStarter.java:128)
    at org.apache.maven.DefaultMaven.doExecute (DefaultMaven.java:305)
    at org.apache.maven.DefaultMaven.doExecute (DefaultMaven.java:192)
    at org.apache.maven.DefaultMaven.execute (DefaultMaven.java:105)
    at org.apache.maven.cli.MavenCli.execute (MavenCli.java:972)
    at org.apache.maven.cli.MavenCli.doMain (MavenCli.java:293)
    at org.apache.maven.cli.MavenCli.main (MavenCli.java:196)
    at sun.reflect.NativeMethodAccessorImpl.invoke0 (Native Method)
    at sun.reflect.NativeMethodAccessorImpl.invoke (NativeMethodAccessorImpl.java:62)
    at sun.reflect.DelegatingMethodAccessorImpl.invoke (DelegatingMethodAccessorImpl.java:43)
    at java.lang.reflect.Method.invoke (Method.java:498)
    at org.codehaus.plexus.classworlds.launcher.Launcher.launchEnhanced (Launcher.java:282)
    at org.codehaus.plexus.classworlds.launcher.Launcher.launch (Launcher.java:225)
    at org.codehaus.plexus.classworlds.launcher.Launcher.mainWithExitCode (Launcher.java:406)
    at org.codehaus.plexus.classworlds.launcher.Launcher.main (Launcher.java:347)
[ERROR] 
[ERROR] Re-run Maven using the -X switch to enable full debug logging.
[ERROR] 
[ERROR] For more information about the errors and possible solutions, please read the following articles:
[ERROR] [Help 1] http://cwiki.apache.org/confluence/display/MAVEN/MojoFailureException
[ERROR] 
[ERROR] After correcting the problems, you can resume the build with the command
[ERROR]   mvn <args> -rf :org.eclipse.mylyn.trac.tests
Build step 'Invoke top-level Maven targets' marked build as failure
Terminating xvnc.
Archiving artifacts
Recording test results
[Checks API] No suitable checks publisher found.
Recording fingerprints
Finished: FAILURE