Console Output

Skipping 14 KB.. Full Log
[INFO] Tests run: 2, Failures: 0, Errors: 0, Skipped: 0, Time elapsed: 0.001 s - in org.eclipse.mylyn.wikitext.parser.builder.event.LineBreakEventTest
[INFO] Running org.eclipse.mylyn.wikitext.parser.builder.event.BeginBlockEventTest
[INFO] Tests run: 2, Failures: 0, Errors: 0, Skipped: 0, Time elapsed: 0.001 s - in org.eclipse.mylyn.wikitext.parser.builder.event.BeginBlockEventTest
[INFO] Running org.eclipse.mylyn.wikitext.parser.builder.event.EndBlockEventTest
[INFO] Tests run: 2, Failures: 0, Errors: 0, Skipped: 0, Time elapsed: 0.001 s - in org.eclipse.mylyn.wikitext.parser.builder.event.EndBlockEventTest
[INFO] Running org.eclipse.mylyn.wikitext.parser.builder.event.ImageEventTest
[INFO] Tests run: 2, Failures: 0, Errors: 0, Skipped: 0, Time elapsed: 0.001 s - in org.eclipse.mylyn.wikitext.parser.builder.event.ImageEventTest
[INFO] Running org.eclipse.mylyn.wikitext.parser.builder.event.EntityReferenceEventTest
[INFO] Tests run: 2, Failures: 0, Errors: 0, Skipped: 0, Time elapsed: 0.001 s - in org.eclipse.mylyn.wikitext.parser.builder.event.EntityReferenceEventTest
[INFO] Running org.eclipse.mylyn.wikitext.parser.builder.event.DocumentBuilderEventsTest
[INFO] Tests run: 4, Failures: 0, Errors: 0, Skipped: 0, Time elapsed: 0.001 s - in org.eclipse.mylyn.wikitext.parser.builder.event.DocumentBuilderEventsTest
[INFO] Running org.eclipse.mylyn.wikitext.parser.builder.event.ImageLinkEventTest
[INFO] Tests run: 2, Failures: 0, Errors: 0, Skipped: 0, Time elapsed: 0.001 s - in org.eclipse.mylyn.wikitext.parser.builder.event.ImageLinkEventTest
[INFO] Running org.eclipse.mylyn.wikitext.parser.builder.event.BeginHeadingEventTest
[INFO] Tests run: 2, Failures: 0, Errors: 0, Skipped: 0, Time elapsed: 0.001 s - in org.eclipse.mylyn.wikitext.parser.builder.event.BeginHeadingEventTest
[INFO] Running org.eclipse.mylyn.wikitext.parser.builder.event.BeginSpanEventTest
[INFO] Tests run: 2, Failures: 0, Errors: 0, Skipped: 0, Time elapsed: 0.001 s - in org.eclipse.mylyn.wikitext.parser.builder.event.BeginSpanEventTest
[INFO] Running org.eclipse.mylyn.wikitext.parser.builder.event.EndSpanEventTest
[INFO] Tests run: 2, Failures: 0, Errors: 0, Skipped: 0, Time elapsed: 0.001 s - in org.eclipse.mylyn.wikitext.parser.builder.event.EndSpanEventTest
[INFO] Running org.eclipse.mylyn.wikitext.parser.builder.event.HorizontalRuleEventTest
[INFO] Tests run: 2, Failures: 0, Errors: 0, Skipped: 0, Time elapsed: 0.001 s - in org.eclipse.mylyn.wikitext.parser.builder.event.HorizontalRuleEventTest
[INFO] Running org.eclipse.mylyn.wikitext.parser.builder.MultiplexingDocumentBuilderTest
[INFO] Tests run: 20, Failures: 0, Errors: 0, Skipped: 0, Time elapsed: 0.001 s - in org.eclipse.mylyn.wikitext.parser.builder.MultiplexingDocumentBuilderTest
[INFO] Running org.eclipse.mylyn.wikitext.parser.builder.XslfoDocumentBuilderTest
[INFO] Tests run: 5, Failures: 0, Errors: 0, Skipped: 0, Time elapsed: 0.002 s - in org.eclipse.mylyn.wikitext.parser.builder.XslfoDocumentBuilderTest
[INFO] Running org.eclipse.mylyn.wikitext.parser.builder.EventDocumentBuilderTest
[INFO] Tests run: 18, Failures: 0, Errors: 0, Skipped: 0, Time elapsed: 0.002 s - in org.eclipse.mylyn.wikitext.parser.builder.EventDocumentBuilderTest
[INFO] Running org.eclipse.mylyn.wikitext.parser.builder.HtmlDocumentBuilderTest
[INFO] Tests run: 22, Failures: 0, Errors: 0, Skipped: 0, Time elapsed: 0.099 s - in org.eclipse.mylyn.wikitext.parser.builder.HtmlDocumentBuilderTest
[INFO] Running org.eclipse.mylyn.wikitext.parser.builder.DocBookDocumentBuilderTest
[INFO] Tests run: 16, Failures: 0, Errors: 0, Skipped: 0, Time elapsed: 0.007 s - in org.eclipse.mylyn.wikitext.parser.builder.DocBookDocumentBuilderTest
[INFO] Running org.eclipse.mylyn.wikitext.parser.builder.HtmlEntitiesTest
[INFO] Tests run: 3, Failures: 0, Errors: 0, Skipped: 0, Time elapsed: 0.001 s - in org.eclipse.mylyn.wikitext.parser.builder.HtmlEntitiesTest
[INFO] Running org.eclipse.mylyn.wikitext.parser.builder.EntityReferencesTest
[INFO] Tests run: 6, Failures: 0, Errors: 0, Skipped: 0, Time elapsed: 0.001 s - in org.eclipse.mylyn.wikitext.parser.builder.EntityReferencesTest
[INFO] Running org.eclipse.mylyn.wikitext.parser.css.CssParserTest
[INFO] Tests run: 12, Failures: 0, Errors: 0, Skipped: 0, Time elapsed: 0.008 s - in org.eclipse.mylyn.wikitext.parser.css.CssParserTest
[INFO] Running org.eclipse.mylyn.wikitext.parser.css.SparseCharSequenceTest
[INFO] Tests run: 6, Failures: 0, Errors: 0, Skipped: 0, Time elapsed: 0.002 s - in org.eclipse.mylyn.wikitext.parser.css.SparseCharSequenceTest
[INFO] Running org.eclipse.mylyn.wikitext.parser.IdGeneratorTest
[INFO] Tests run: 3, Failures: 0, Errors: 0, Skipped: 0, Time elapsed: 0.003 s - in org.eclipse.mylyn.wikitext.parser.IdGeneratorTest
[INFO] Running org.eclipse.mylyn.wikitext.parser.AttributesTest
[INFO] Tests run: 1, Failures: 0, Errors: 0, Skipped: 0, Time elapsed: 0 s - in org.eclipse.mylyn.wikitext.parser.AttributesTest
[INFO] Running org.eclipse.mylyn.wikitext.parser.HtmlParserTest
[INFO] Tests run: 7, Failures: 0, Errors: 0, Skipped: 0, Time elapsed: 0.065 s - in org.eclipse.mylyn.wikitext.parser.HtmlParserTest
[INFO] Running org.eclipse.mylyn.wikitext.parser.markup.MarkupLanguageProviderTest
[INFO] Tests run: 4, Failures: 0, Errors: 0, Skipped: 0, Time elapsed: 0.003 s - in org.eclipse.mylyn.wikitext.parser.markup.MarkupLanguageProviderTest
[INFO] Running org.eclipse.mylyn.wikitext.validation.StandaloneMarkupValidatorTest
[INFO] Tests run: 3, Failures: 0, Errors: 0, Skipped: 0, Time elapsed: 0.011 s - in org.eclipse.mylyn.wikitext.validation.StandaloneMarkupValidatorTest
[INFO] Running org.eclipse.mylyn.wikitext.internal.parser.html.DocumentProcessorTest
[INFO] Tests run: 1, Failures: 0, Errors: 0, Skipped: 0, Time elapsed: 0.001 s - in org.eclipse.mylyn.wikitext.internal.parser.html.DocumentProcessorTest
[INFO] Running org.eclipse.mylyn.wikitext.internal.parser.html.XHtmlParserTest
[INFO] Tests run: 27, Failures: 0, Errors: 0, Skipped: 0, Time elapsed: 0.02 s - in org.eclipse.mylyn.wikitext.internal.parser.html.XHtmlParserTest
[INFO] Running org.eclipse.mylyn.wikitext.internal.parser.html.HtmlParserTest
[INFO] Tests run: 27, Failures: 0, Errors: 0, Skipped: 0, Time elapsed: 0.028 s - in org.eclipse.mylyn.wikitext.internal.parser.html.HtmlParserTest
[INFO] Running org.eclipse.mylyn.wikitext.internal.parser.html.HtmlCleanerTest
[INFO] Tests run: 43, Failures: 0, Errors: 0, Skipped: 0, Time elapsed: 0.009 s - in org.eclipse.mylyn.wikitext.internal.parser.html.HtmlCleanerTest
[INFO] Running org.eclipse.mylyn.wikitext.internal.util.LocationTrackingReaderTest
[INFO] Tests run: 4, Failures: 0, Errors: 0, Skipped: 0, Time elapsed: 0.001 s - in org.eclipse.mylyn.wikitext.internal.util.LocationTrackingReaderTest
[INFO] Running org.eclipse.mylyn.wikitext.util.ServiceLocatorTest
[INFO] Tests run: 14, Failures: 0, Errors: 0, Skipped: 0, Time elapsed: 0.222 s - in org.eclipse.mylyn.wikitext.util.ServiceLocatorTest
[INFO] Running org.eclipse.mylyn.wikitext.util.XmlStreamWriterAdapterTest
[INFO] Tests run: 17, Failures: 0, Errors: 0, Skipped: 0, Time elapsed: 0.013 s - in org.eclipse.mylyn.wikitext.util.XmlStreamWriterAdapterTest
[INFO] Running org.eclipse.mylyn.wikitext.util.DefaultXmlStreamWriterTest
[INFO] Tests run: 19, Failures: 0, Errors: 0, Skipped: 0, Time elapsed: 0.002 s - in org.eclipse.mylyn.wikitext.util.DefaultXmlStreamWriterTest
[INFO] Running org.eclipse.mylyn.wikitext.util.FormattingXMLStreamWriterTest
[INFO] Tests run: 8, Failures: 0, Errors: 0, Skipped: 0, Time elapsed: 0.001 s - in org.eclipse.mylyn.wikitext.util.FormattingXMLStreamWriterTest
[INFO] Running org.eclipse.mylyn.wikitext.splitter.DefaultSplittingStrategyTest
[INFO] Tests run: 10, Failures: 0, Errors: 0, Skipped: 0, Time elapsed: 0.006 s - in org.eclipse.mylyn.wikitext.splitter.DefaultSplittingStrategyTest
[INFO] 
[INFO] Results:
[INFO] 
[INFO] Tests run: 335, Failures: 0, Errors: 0, Skipped: 0
[INFO] 
[INFO] 
[INFO] --- maven-bundle-plugin:3.2.0:bundle (default-bundle) @ org.eclipse.mylyn.wikitext ---
[INFO] 
[INFO] --- maven-source-plugin:3.0.1:jar-no-fork (attach-sources) @ org.eclipse.mylyn.wikitext ---
[INFO] Building jar: /jobs/genie.mylyn/mylyn-integration-connectors/workspace/org.eclipse.mylyn.docs/wikitext/core/org.eclipse.mylyn.wikitext/target/org.eclipse.mylyn.wikitext-3.0.25-SNAPSHOT-sources.jar
[INFO] 
[INFO] -----< org.eclipse.mylyn.docs:org.eclipse.mylyn.wikitext.toolkit >------
[INFO] Building Mylyn WikiText Toolkit 3.0.25-SNAPSHOT                   [3/28]
[INFO] -------------------------------[ bundle ]-------------------------------
[INFO] 
[INFO] --- maven-clean-plugin:2.5:clean (default-clean) @ org.eclipse.mylyn.wikitext.toolkit ---
[INFO] 
[INFO] --- maven-resources-plugin:3.0.1:resources (default-resources) @ org.eclipse.mylyn.wikitext.toolkit ---
[INFO] Using 'UTF-8' encoding to copy filtered resources.
[INFO] Copying 0 resource
[INFO] skip non existing resourceDirectory /jobs/genie.mylyn/mylyn-integration-connectors/workspace/org.eclipse.mylyn.docs/wikitext/core/org.eclipse.mylyn.wikitext.toolkit/src/main/resources
[INFO] Copying 0 resource
[INFO] 
[INFO] --- maven-compiler-plugin:3.6.0:compile (default-compile) @ org.eclipse.mylyn.wikitext.toolkit ---
[INFO] Changes detected - recompiling the module!
[INFO] Compiling 5 source files to /jobs/genie.mylyn/mylyn-integration-connectors/workspace/org.eclipse.mylyn.docs/wikitext/core/org.eclipse.mylyn.wikitext.toolkit/target/classes
[INFO] 
[INFO] --- maven-resources-plugin:3.0.1:testResources (default-testResources) @ org.eclipse.mylyn.wikitext.toolkit ---
[INFO] Using 'UTF-8' encoding to copy filtered resources.
[INFO] skip non existing resourceDirectory /jobs/genie.mylyn/mylyn-integration-connectors/workspace/org.eclipse.mylyn.docs/wikitext/core/org.eclipse.mylyn.wikitext.toolkit/src/test/java
[INFO] skip non existing resourceDirectory /jobs/genie.mylyn/mylyn-integration-connectors/workspace/org.eclipse.mylyn.docs/wikitext/core/org.eclipse.mylyn.wikitext.toolkit/src/test/resources
[INFO] 
[INFO] --- maven-compiler-plugin:3.6.0:testCompile (default-testCompile) @ org.eclipse.mylyn.wikitext.toolkit ---
[INFO] No sources to compile
[INFO] 
[INFO] --- maven-surefire-plugin:3.0.0-M4:test (default-test) @ org.eclipse.mylyn.wikitext.toolkit ---
[INFO] No tests to run.
[INFO] 
[INFO] --- maven-bundle-plugin:3.2.0:bundle (default-bundle) @ org.eclipse.mylyn.wikitext.toolkit ---
[WARNING] Bundle org.eclipse.mylyn.docs:org.eclipse.mylyn.wikitext.toolkit:bundle:3.0.25-SNAPSHOT : Unused Export-Package instructions: [org.eclipse.mylyn.wikitext.toolkit.internal*] 
[INFO] 
[INFO] --- maven-source-plugin:3.0.1:jar-no-fork (attach-sources) @ org.eclipse.mylyn.wikitext.toolkit ---
[INFO] Building jar: /jobs/genie.mylyn/mylyn-integration-connectors/workspace/org.eclipse.mylyn.docs/wikitext/core/org.eclipse.mylyn.wikitext.toolkit/target/org.eclipse.mylyn.wikitext.toolkit-3.0.25-SNAPSHOT-sources.jar
[INFO] 
[INFO] -----< org.eclipse.mylyn.docs:org.eclipse.mylyn.wikitext.textile >------
[INFO] Building Mylyn WikiText Textile 3.0.25-SNAPSHOT                   [4/28]
[INFO] -------------------------------[ bundle ]-------------------------------
[INFO] 
[INFO] --- maven-clean-plugin:2.5:clean (default-clean) @ org.eclipse.mylyn.wikitext.textile ---
[INFO] 
[INFO] --- maven-resources-plugin:3.0.1:resources (default-resources) @ org.eclipse.mylyn.wikitext.textile ---
[INFO] Using 'UTF-8' encoding to copy filtered resources.
[INFO] Copying 4 resources
[INFO] Copying 1 resource
[INFO] Copying 2 resources
[INFO] 
[INFO] --- maven-compiler-plugin:3.6.0:compile (default-compile) @ org.eclipse.mylyn.wikitext.textile ---
[INFO] Changes detected - recompiling the module!
[INFO] Compiling 29 source files to /jobs/genie.mylyn/mylyn-integration-connectors/workspace/org.eclipse.mylyn.docs/wikitext/core/org.eclipse.mylyn.wikitext.textile/target/classes
[INFO] 
[INFO] --- maven-resources-plugin:3.0.1:testResources (default-testResources) @ org.eclipse.mylyn.wikitext.textile ---
[INFO] Using 'UTF-8' encoding to copy filtered resources.
[INFO] Copying 0 resource
[INFO] skip non existing resourceDirectory /jobs/genie.mylyn/mylyn-integration-connectors/workspace/org.eclipse.mylyn.docs/wikitext/core/org.eclipse.mylyn.wikitext.textile/src/test/resources
[INFO] 
[INFO] --- maven-compiler-plugin:3.6.0:testCompile (default-testCompile) @ org.eclipse.mylyn.wikitext.textile ---
[INFO] Changes detected - recompiling the module!
[INFO] Compiling 13 source files to /jobs/genie.mylyn/mylyn-integration-connectors/workspace/org.eclipse.mylyn.docs/wikitext/core/org.eclipse.mylyn.wikitext.textile/target/test-classes
[INFO] 
[INFO] --- maven-surefire-plugin:3.0.0-M4:test (default-test) @ org.eclipse.mylyn.wikitext.textile ---
[INFO] 
[INFO] -------------------------------------------------------
[INFO]  T E S T S
[INFO] -------------------------------------------------------
[INFO] Running org.eclipse.mylyn.wikitext.textile.TextileLanguageDefinitionListTest
[INFO] Tests run: 23, Failures: 0, Errors: 0, Skipped: 0, Time elapsed: 0.118 s - in org.eclipse.mylyn.wikitext.textile.TextileLanguageDefinitionListTest
[INFO] Running org.eclipse.mylyn.wikitext.textile.internal.block.CommentBlockTest
[INFO] Tests run: 1, Failures: 0, Errors: 0, Skipped: 0, Time elapsed: 0.001 s - in org.eclipse.mylyn.wikitext.textile.internal.block.CommentBlockTest
[INFO] Running org.eclipse.mylyn.wikitext.textile.internal.TextileDocumentBuilderTest
[INFO] Tests run: 65, Failures: 0, Errors: 0, Skipped: 0, Time elapsed: 0.023 s - in org.eclipse.mylyn.wikitext.textile.internal.TextileDocumentBuilderTest
[INFO] Running org.eclipse.mylyn.wikitext.textile.internal.phrase.EscapeTextilePhraseModifierTest
[INFO] Tests run: 1, Failures: 0, Errors: 0, Skipped: 0, Time elapsed: 0.001 s - in org.eclipse.mylyn.wikitext.textile.internal.phrase.EscapeTextilePhraseModifierTest
[INFO] Running org.eclipse.mylyn.wikitext.textile.internal.phrase.TagEscapeTextilePhraseModifierTest
[INFO] Tests run: 1, Failures: 0, Errors: 0, Skipped: 0, Time elapsed: 0 s - in org.eclipse.mylyn.wikitext.textile.internal.phrase.TagEscapeTextilePhraseModifierTest
[INFO] Running org.eclipse.mylyn.wikitext.textile.internal.TextileDocumentBuilderEntityReferenceTest
[INFO] Tests run: 8, Failures: 0, Errors: 0, Skipped: 0, Time elapsed: 0.128 s - in org.eclipse.mylyn.wikitext.textile.internal.TextileDocumentBuilderEntityReferenceTest
[INFO] Running org.eclipse.mylyn.wikitext.textile.internal.TextileDocumentBuilderDefinitionListTest
[INFO] Tests run: 3, Failures: 0, Errors: 0, Skipped: 0, Time elapsed: 0.003 s - in org.eclipse.mylyn.wikitext.textile.internal.TextileDocumentBuilderDefinitionListTest
[INFO] Running org.eclipse.mylyn.wikitext.textile.internal.TextileTest
[INFO] Tests run: 12, Failures: 0, Errors: 0, Skipped: 0, Time elapsed: 0.002 s - in org.eclipse.mylyn.wikitext.textile.internal.TextileTest
[INFO] Running org.eclipse.mylyn.wikitext.textile.internal.validation.BlockWhitespaceRuleTest
[INFO] Tests run: 6, Failures: 0, Errors: 0, Skipped: 0, Time elapsed: 0.003 s - in org.eclipse.mylyn.wikitext.textile.internal.validation.BlockWhitespaceRuleTest
[INFO] Running org.eclipse.mylyn.wikitext.textile.internal.validation.TextileReferenceValidationRuleTest
[INFO] Tests run: 4, Failures: 0, Errors: 0, Skipped: 0, Time elapsed: 0.006 s - in org.eclipse.mylyn.wikitext.textile.internal.validation.TextileReferenceValidationRuleTest
[INFO] Running org.eclipse.mylyn.wikitext.textile.TextileCommentBlockTest
[INFO] Tests run: 5, Failures: 0, Errors: 0, Skipped: 0, Time elapsed: 0.003 s - in org.eclipse.mylyn.wikitext.textile.TextileCommentBlockTest
[INFO] Running org.eclipse.mylyn.wikitext.textile.TextileNoTextileTest
[INFO] Tests run: 5, Failures: 0, Errors: 0, Skipped: 0, Time elapsed: 0.002 s - in org.eclipse.mylyn.wikitext.textile.TextileNoTextileTest
[INFO] Running org.eclipse.mylyn.wikitext.textile.TextileLanguageTest
[INFO] Tests run: 176, Failures: 0, Errors: 0, Skipped: 0, Time elapsed: 0.111 s - in org.eclipse.mylyn.wikitext.textile.TextileLanguageTest
[INFO] 
[INFO] Results:
[INFO] 
[INFO] Tests run: 310, Failures: 0, Errors: 0, Skipped: 0
[INFO] 
[INFO] 
[INFO] --- maven-bundle-plugin:3.2.0:bundle (default-bundle) @ org.eclipse.mylyn.wikitext.textile ---
[INFO] 
[INFO] --- maven-source-plugin:3.0.1:jar-no-fork (attach-sources) @ org.eclipse.mylyn.wikitext.textile ---
[INFO] Building jar: /jobs/genie.mylyn/mylyn-integration-connectors/workspace/org.eclipse.mylyn.docs/wikitext/core/org.eclipse.mylyn.wikitext.textile/target/org.eclipse.mylyn.wikitext.textile-3.0.25-SNAPSHOT-sources.jar
[INFO] 
[INFO] -------< org.eclipse.mylyn.docs:org.eclipse.mylyn.wikitext.html >-------
[INFO] Building Mylyn WikiText HTML 3.0.25-SNAPSHOT                      [5/28]
[INFO] -------------------------------[ bundle ]-------------------------------
[INFO] 
[INFO] --- maven-clean-plugin:2.5:clean (default-clean) @ org.eclipse.mylyn.wikitext.html ---
[INFO] 
[INFO] --- maven-resources-plugin:3.0.1:resources (default-resources) @ org.eclipse.mylyn.wikitext.html ---
[INFO] Using 'UTF-8' encoding to copy filtered resources.
[INFO] Copying 0 resource
[INFO] Copying 1 resource
[INFO] Copying 1 resource
[INFO] 
[INFO] --- maven-compiler-plugin:3.6.0:compile (default-compile) @ org.eclipse.mylyn.wikitext.html ---
[INFO] Changes detected - recompiling the module!
[INFO] Compiling 24 source files to /jobs/genie.mylyn/mylyn-integration-connectors/workspace/org.eclipse.mylyn.docs/wikitext/core/org.eclipse.mylyn.wikitext.html/target/classes
[INFO] 
[INFO] --- maven-resources-plugin:3.0.1:testResources (default-testResources) @ org.eclipse.mylyn.wikitext.html ---
[INFO] Using 'UTF-8' encoding to copy filtered resources.
[INFO] Copying 4 resources
[INFO] skip non existing resourceDirectory /jobs/genie.mylyn/mylyn-integration-connectors/workspace/org.eclipse.mylyn.docs/wikitext/core/org.eclipse.mylyn.wikitext.html/src/test/resources
[INFO] 
[INFO] --- maven-compiler-plugin:3.6.0:testCompile (default-testCompile) @ org.eclipse.mylyn.wikitext.html ---
[INFO] Changes detected - recompiling the module!
[INFO] Compiling 13 source files to /jobs/genie.mylyn/mylyn-integration-connectors/workspace/org.eclipse.mylyn.docs/wikitext/core/org.eclipse.mylyn.wikitext.html/target/test-classes
[INFO] 
[INFO] --- maven-surefire-plugin:3.0.0-M4:test (default-test) @ org.eclipse.mylyn.wikitext.html ---
[INFO] 
[INFO] -------------------------------------------------------
[INFO]  T E S T S
[INFO] -------------------------------------------------------
[INFO] Running org.eclipse.mylyn.wikitext.html.internal.HtmlSubsetDocumentBuilderXhtmlStrictTest
[INFO] Tests run: 25, Failures: 0, Errors: 0, Skipped: 0, Time elapsed: 0.096 s - in org.eclipse.mylyn.wikitext.html.internal.HtmlSubsetDocumentBuilderXhtmlStrictTest
[INFO] Running org.eclipse.mylyn.wikitext.html.internal.CompositeSpanStrategyTest
[INFO] Tests run: 2, Failures: 0, Errors: 0, Skipped: 0, Time elapsed: 0.031 s - in org.eclipse.mylyn.wikitext.html.internal.CompositeSpanStrategyTest
[INFO] Running org.eclipse.mylyn.wikitext.html.internal.BlockStrategiesTest
[INFO] Tests run: 13, Failures: 0, Errors: 0, Skipped: 0, Time elapsed: 0.002 s - in org.eclipse.mylyn.wikitext.html.internal.BlockStrategiesTest
[INFO] Running org.eclipse.mylyn.wikitext.html.internal.SubstitutionBlockStrategyTest
[INFO] Tests run: 1, Failures: 0, Errors: 0, Skipped: 0, Time elapsed: 0.001 s - in org.eclipse.mylyn.wikitext.html.internal.SubstitutionBlockStrategyTest
[INFO] Running org.eclipse.mylyn.wikitext.html.internal.HtmlSubsetDocumentBuilderTest
[INFO] Tests run: 94, Failures: 0, Errors: 0, Skipped: 0, Time elapsed: 0.053 s - in org.eclipse.mylyn.wikitext.html.internal.HtmlSubsetDocumentBuilderTest
[INFO] Running org.eclipse.mylyn.wikitext.html.internal.SpanStrategiesTest
[INFO] Tests run: 10, Failures: 0, Errors: 0, Skipped: 0, Time elapsed: 0.004 s - in org.eclipse.mylyn.wikitext.html.internal.SpanStrategiesTest
[INFO] Running org.eclipse.mylyn.wikitext.html.internal.SubstitutionSpanStrategyTest
[INFO] Tests run: 1, Failures: 0, Errors: 0, Skipped: 0, Time elapsed: 0.003 s - in org.eclipse.mylyn.wikitext.html.internal.SubstitutionSpanStrategyTest
[INFO] Running org.eclipse.mylyn.wikitext.html.internal.HtmlLanguageIntegrationTest
[INFO] Tests run: 2, Failures: 0, Errors: 0, Skipped: 0, Time elapsed: 0.062 s - in org.eclipse.mylyn.wikitext.html.internal.HtmlLanguageIntegrationTest
[INFO] Running org.eclipse.mylyn.wikitext.html.internal.HtmlSubsetLanguageTest
[INFO] Tests run: 16, Failures: 0, Errors: 0, Skipped: 0, Time elapsed: 0.007 s - in org.eclipse.mylyn.wikitext.html.internal.HtmlSubsetLanguageTest
[INFO] Running org.eclipse.mylyn.wikitext.html.internal.FontElementStrategyTest
[INFO] Tests run: 12, Failures: 0, Errors: 0, Skipped: 0, Time elapsed: 0.003 s - in org.eclipse.mylyn.wikitext.html.internal.FontElementStrategyTest
[INFO] Running org.eclipse.mylyn.wikitext.html.internal.SubstitutionWithoutCssSpanStrategyTest
[INFO] Tests run: 2, Failures: 0, Errors: 0, Skipped: 0, Time elapsed: 0.003 s - in org.eclipse.mylyn.wikitext.html.internal.SubstitutionWithoutCssSpanStrategyTest
[INFO] Running org.eclipse.mylyn.wikitext.html.HtmlLanguageBuilderTest
[INFO] Tests run: 34, Failures: 0, Errors: 0, Skipped: 0, Time elapsed: 0.008 s - in org.eclipse.mylyn.wikitext.html.HtmlLanguageBuilderTest
[INFO] Running org.eclipse.mylyn.wikitext.html.HtmlLanguageTest
[INFO] Tests run: 15, Failures: 0, Errors: 0, Skipped: 0, Time elapsed: 0.014 s - in org.eclipse.mylyn.wikitext.html.HtmlLanguageTest
[INFO] 
[INFO] Results:
[INFO] 
[INFO] Tests run: 227, Failures: 0, Errors: 0, Skipped: 0
[INFO] 
[INFO] 
[INFO] --- maven-bundle-plugin:3.2.0:bundle (default-bundle) @ org.eclipse.mylyn.wikitext.html ---
[INFO] 
[INFO] --- maven-source-plugin:3.0.1:jar-no-fork (attach-sources) @ org.eclipse.mylyn.wikitext.html ---
[INFO] Building jar: /jobs/genie.mylyn/mylyn-integration-connectors/workspace/org.eclipse.mylyn.docs/wikitext/core/org.eclipse.mylyn.wikitext.html/target/org.eclipse.mylyn.wikitext.html-3.0.25-SNAPSHOT-sources.jar
[INFO] 
[INFO] ----< org.eclipse.mylyn.docs:org.eclipse.mylyn.wikitext.confluence >----
[INFO] Building Mylyn WikiText Confluence 3.0.25-SNAPSHOT                [6/28]
[INFO] -------------------------------[ bundle ]-------------------------------
[INFO] 
[INFO] --- maven-clean-plugin:2.5:clean (default-clean) @ org.eclipse.mylyn.wikitext.confluence ---
[INFO] 
[INFO] --- maven-resources-plugin:3.0.1:resources (default-resources) @ org.eclipse.mylyn.wikitext.confluence ---
[INFO] Using 'UTF-8' encoding to copy filtered resources.
[INFO] Copying 0 resource
[INFO] Copying 1 resource
[INFO] Copying 2 resources
[INFO] 
[INFO] --- maven-compiler-plugin:3.6.0:compile (default-compile) @ org.eclipse.mylyn.wikitext.confluence ---
[INFO] Changes detected - recompiling the module!
[INFO] Compiling 31 source files to /jobs/genie.mylyn/mylyn-integration-connectors/workspace/org.eclipse.mylyn.docs/wikitext/core/org.eclipse.mylyn.wikitext.confluence/target/classes
[INFO] 
[INFO] --- maven-resources-plugin:3.0.1:testResources (default-testResources) @ org.eclipse.mylyn.wikitext.confluence ---
[INFO] Using 'UTF-8' encoding to copy filtered resources.
[INFO] Copying 3 resources
[INFO] skip non existing resourceDirectory /jobs/genie.mylyn/mylyn-integration-connectors/workspace/org.eclipse.mylyn.docs/wikitext/core/org.eclipse.mylyn.wikitext.confluence/src/test/resources
[INFO] 
[INFO] --- maven-compiler-plugin:3.6.0:testCompile (default-testCompile) @ org.eclipse.mylyn.wikitext.confluence ---
[INFO] Changes detected - recompiling the module!
[INFO] Compiling 7 source files to /jobs/genie.mylyn/mylyn-integration-connectors/workspace/org.eclipse.mylyn.docs/wikitext/core/org.eclipse.mylyn.wikitext.confluence/target/test-classes
[INFO] 
[INFO] --- maven-surefire-plugin:3.0.0-M4:test (default-test) @ org.eclipse.mylyn.wikitext.confluence ---
[INFO] 
[INFO] -------------------------------------------------------
[INFO]  T E S T S
[INFO] -------------------------------------------------------
[INFO] Running org.eclipse.mylyn.wikitext.confluence.internal.util.ColorsTest
[INFO] Tests run: 3, Failures: 0, Errors: 0, Skipped: 0, Time elapsed: 0.048 s - in org.eclipse.mylyn.wikitext.confluence.internal.util.ColorsTest
[INFO] Running org.eclipse.mylyn.wikitext.confluence.internal.block.TableBlockTest
[INFO] Tests run: 1, Failures: 0, Errors: 0, Skipped: 0, Time elapsed: 0.002 s - in org.eclipse.mylyn.wikitext.confluence.internal.block.TableBlockTest
[INFO] Running org.eclipse.mylyn.wikitext.confluence.internal.ConfluenceDocumentBuilderTest
[INFO] Tests run: 112, Failures: 0, Errors: 0, Skipped: 0, Time elapsed: 0.176 s - in org.eclipse.mylyn.wikitext.confluence.internal.ConfluenceDocumentBuilderTest
[INFO] Running org.eclipse.mylyn.wikitext.confluence.ConfluenceCodeBlockTest
[INFO] Tests run: 5, Failures: 0, Errors: 0, Skipped: 0, Time elapsed: 0.029 s - in org.eclipse.mylyn.wikitext.confluence.ConfluenceCodeBlockTest
[INFO] Running org.eclipse.mylyn.wikitext.confluence.ConfluenceLanguageTest
[INFO] Tests run: 147, Failures: 0, Errors: 0, Skipped: 0, Time elapsed: 0.133 s - in org.eclipse.mylyn.wikitext.confluence.ConfluenceLanguageTest
[INFO] Running org.eclipse.mylyn.wikitext.confluence.ConfluenceLanguageIntegrationTest
[INFO] Tests run: 7, Failures: 0, Errors: 0, Skipped: 0, Time elapsed: 0.062 s - in org.eclipse.mylyn.wikitext.confluence.ConfluenceLanguageIntegrationTest
[INFO] Running org.eclipse.mylyn.wikitext.confluence.ConfluenceLineBreakTest
[INFO] Tests run: 8, Failures: 0, Errors: 0, Skipped: 0, Time elapsed: 0.003 s - in org.eclipse.mylyn.wikitext.confluence.ConfluenceLineBreakTest
[INFO] 
[INFO] Results:
[INFO] 
[INFO] Tests run: 283, Failures: 0, Errors: 0, Skipped: 0
[INFO] 
[INFO] 
[INFO] --- maven-bundle-plugin:3.2.0:bundle (default-bundle) @ org.eclipse.mylyn.wikitext.confluence ---
[INFO] 
[INFO] --- maven-source-plugin:3.0.1:jar-no-fork (attach-sources) @ org.eclipse.mylyn.wikitext.confluence ---
[INFO] Building jar: /jobs/genie.mylyn/mylyn-integration-connectors/workspace/org.eclipse.mylyn.docs/wikitext/core/org.eclipse.mylyn.wikitext.confluence/target/org.eclipse.mylyn.wikitext.confluence-3.0.25-SNAPSHOT-sources.jar
[INFO] 
[INFO] ----< org.eclipse.mylyn.docs:org.eclipse.mylyn.wikitext.mediawiki >-----
[INFO] Building Mylyn WikiText MediaWiki 3.0.25-SNAPSHOT                 [7/28]
[INFO] -------------------------------[ bundle ]-------------------------------
[INFO] 
[INFO] --- maven-clean-plugin:2.5:clean (default-clean) @ org.eclipse.mylyn.wikitext.mediawiki ---
[INFO] 
[INFO] --- maven-resources-plugin:3.0.1:resources (default-resources) @ org.eclipse.mylyn.wikitext.mediawiki ---
[INFO] Using 'UTF-8' encoding to copy filtered resources.
[INFO] Copying 2 resources
[INFO] Copying 1 resource
[INFO] Copying 2 resources
[INFO] 
[INFO] --- maven-compiler-plugin:3.6.0:compile (default-compile) @ org.eclipse.mylyn.wikitext.mediawiki ---
[INFO] Changes detected - recompiling the module!
[INFO] Compiling 34 source files to /jobs/genie.mylyn/mylyn-integration-connectors/workspace/org.eclipse.mylyn.docs/wikitext/core/org.eclipse.mylyn.wikitext.mediawiki/target/classes
[INFO] 
[INFO] --- maven-resources-plugin:3.0.1:testResources (default-testResources) @ org.eclipse.mylyn.wikitext.mediawiki ---
[INFO] Using 'UTF-8' encoding to copy filtered resources.
[INFO] Copying 1 resource
[INFO] skip non existing resourceDirectory /jobs/genie.mylyn/mylyn-integration-connectors/workspace/org.eclipse.mylyn.docs/wikitext/core/org.eclipse.mylyn.wikitext.mediawiki/src/test/resources
[INFO] 
[INFO] --- maven-compiler-plugin:3.6.0:testCompile (default-testCompile) @ org.eclipse.mylyn.wikitext.mediawiki ---
[INFO] Changes detected - recompiling the module!
[INFO] Compiling 6 source files to /jobs/genie.mylyn/mylyn-integration-connectors/workspace/org.eclipse.mylyn.docs/wikitext/core/org.eclipse.mylyn.wikitext.mediawiki/target/test-classes
[INFO] 
[INFO] --- maven-surefire-plugin:3.0.0-M4:test (default-test) @ org.eclipse.mylyn.wikitext.mediawiki ---
[INFO] 
[INFO] -------------------------------------------------------
[INFO]  T E S T S
[INFO] -------------------------------------------------------
[INFO] Running org.eclipse.mylyn.wikitext.mediawiki.internal.MediaWikiLanguageTest
[INFO] Tests run: 146, Failures: 0, Errors: 0, Skipped: 0, Time elapsed: 0.318 s - in org.eclipse.mylyn.wikitext.mediawiki.internal.MediaWikiLanguageTest
[INFO] Running org.eclipse.mylyn.wikitext.mediawiki.internal.TemplateProcessorTest
[INFO] Tests run: 27, Failures: 0, Errors: 0, Skipped: 0, Time elapsed: 0.008 s - in org.eclipse.mylyn.wikitext.mediawiki.internal.TemplateProcessorTest
[INFO] Running org.eclipse.mylyn.wikitext.mediawiki.internal.MediaWikiIdGenerationStrategyTest
[INFO] Tests run: 3, Failures: 0, Errors: 0, Skipped: 0, Time elapsed: 0.001 s - in org.eclipse.mylyn.wikitext.mediawiki.internal.MediaWikiIdGenerationStrategyTest
[INFO] Running org.eclipse.mylyn.wikitext.mediawiki.internal.validation.CommentValidationRuleTest
[INFO] Tests run: 3, Failures: 0, Errors: 0, Skipped: 0, Time elapsed: 0.001 s - in org.eclipse.mylyn.wikitext.mediawiki.internal.validation.CommentValidationRuleTest
[INFO] Running org.eclipse.mylyn.wikitext.mediawiki.WikiTemplateResolverTest
[INFO] Tests run: 6, Failures: 0, Errors: 0, Skipped: 0, Time elapsed: 0.002 s - in org.eclipse.mylyn.wikitext.mediawiki.WikiTemplateResolverTest
[INFO] 
[INFO] Results:
[INFO] 
[INFO] Tests run: 185, Failures: 0, Errors: 0, Skipped: 0
[INFO] 
[INFO] 
[INFO] --- maven-bundle-plugin:3.2.0:bundle (default-bundle) @ org.eclipse.mylyn.wikitext.mediawiki ---
[INFO] 
[INFO] --- maven-source-plugin:3.0.1:jar-no-fork (attach-sources) @ org.eclipse.mylyn.wikitext.mediawiki ---
[INFO] Building jar: /jobs/genie.mylyn/mylyn-integration-connectors/workspace/org.eclipse.mylyn.docs/wikitext/core/org.eclipse.mylyn.wikitext.mediawiki/target/org.eclipse.mylyn.wikitext.mediawiki-3.0.25-SNAPSHOT-sources.jar
[INFO] 
[INFO] ------< org.eclipse.mylyn.docs:org.eclipse.mylyn.wikitext.tests >-------
[INFO] Building Mylyn WikiText Integration Tests 3.0.25-SNAPSHOT         [8/28]
[INFO] -------------------------------[ bundle ]-------------------------------
[INFO] 
[INFO] --- maven-clean-plugin:2.5:clean (default-clean) @ org.eclipse.mylyn.wikitext.tests ---
[INFO] 
[INFO] --- maven-resources-plugin:3.0.1:resources (default-resources) @ org.eclipse.mylyn.wikitext.tests ---
[INFO] Using 'UTF-8' encoding to copy filtered resources.
[INFO] skip non existing resourceDirectory /jobs/genie.mylyn/mylyn-integration-connectors/workspace/org.eclipse.mylyn.docs/wikitext/core/org.eclipse.mylyn.wikitext.tests/src/main/java
[INFO] skip non existing resourceDirectory /jobs/genie.mylyn/mylyn-integration-connectors/workspace/org.eclipse.mylyn.docs/wikitext/core/org.eclipse.mylyn.wikitext.tests/src/main/resources
[INFO] Copying 0 resource
[INFO] 
[INFO] --- maven-compiler-plugin:3.6.0:compile (default-compile) @ org.eclipse.mylyn.wikitext.tests ---
[INFO] No sources to compile
[INFO] 
[INFO] --- maven-resources-plugin:3.0.1:testResources (default-testResources) @ org.eclipse.mylyn.wikitext.tests ---
[INFO] Using 'UTF-8' encoding to copy filtered resources.
[INFO] Copying 6 resources
[INFO] skip non existing resourceDirectory /jobs/genie.mylyn/mylyn-integration-connectors/workspace/org.eclipse.mylyn.docs/wikitext/core/org.eclipse.mylyn.wikitext.tests/src/test/resources
[INFO] 
[INFO] --- maven-compiler-plugin:3.6.0:testCompile (default-testCompile) @ org.eclipse.mylyn.wikitext.tests ---
[INFO] Changes detected - recompiling the module!
[INFO] Compiling 10 source files to /jobs/genie.mylyn/mylyn-integration-connectors/workspace/org.eclipse.mylyn.docs/wikitext/core/org.eclipse.mylyn.wikitext.tests/target/test-classes
[INFO] 
[INFO] --- maven-surefire-plugin:3.0.0-M4:test (default-test) @ org.eclipse.mylyn.wikitext.tests ---
[INFO] 
[INFO] -------------------------------------------------------
[INFO]  T E S T S
[INFO] -------------------------------------------------------
[INFO] Running org.eclipse.mylyn.wikitext.parser.builder.HtmlDocumentBuilder2Test
[INFO] Tests run: 27, Failures: 0, Errors: 0, Skipped: 0, Time elapsed: 0.228 s - in org.eclipse.mylyn.wikitext.parser.builder.HtmlDocumentBuilder2Test
[INFO] Running org.eclipse.mylyn.wikitext.parser.builder.HtmlDocumentBuilderIntegrationTest
[INFO] Tests run: 5, Failures: 0, Errors: 0, Skipped: 0, Time elapsed: 0.005 s - in org.eclipse.mylyn.wikitext.parser.builder.HtmlDocumentBuilderIntegrationTest
[INFO] Running org.eclipse.mylyn.wikitext.parser.builder.XslfoDocumentBuilderIntegrationTest
Feb 12, 2021 9:01:03 AM org.eclipse.mylyn.wikitext.parser.builder.XslfoDocumentBuilder charactersUnescaped
WARNING: escaping XML literal
Feb 12, 2021 9:01:03 AM org.eclipse.mylyn.wikitext.parser.builder.XslfoDocumentBuilder charactersUnescaped
WARNING: escaping XML literal
Feb 12, 2021 9:01:03 AM org.eclipse.mylyn.wikitext.parser.builder.XslfoDocumentBuilder charactersUnescaped
WARNING: escaping XML literal
Feb 12, 2021 9:01:03 AM org.eclipse.mylyn.wikitext.parser.builder.XslfoDocumentBuilder charactersUnescaped
WARNING: escaping XML literal
[INFO] Tests run: 9, Failures: 0, Errors: 0, Skipped: 0, Time elapsed: 0.067 s - in org.eclipse.mylyn.wikitext.parser.builder.XslfoDocumentBuilderIntegrationTest
[INFO] Running org.eclipse.mylyn.wikitext.parser.builder.SplittingHtmlDocumentBuilderTest
[INFO] Tests run: 2, Failures: 0, Errors: 0, Skipped: 0, Time elapsed: 0.06 s - in org.eclipse.mylyn.wikitext.parser.builder.SplittingHtmlDocumentBuilderTest
[INFO] Running org.eclipse.mylyn.wikitext.parser.builder.DocBookDocumentBuilderIntegrationTest
[INFO] Tests run: 6, Failures: 0, Errors: 0, Skipped: 0, Time elapsed: 0.022 s - in org.eclipse.mylyn.wikitext.parser.builder.DocBookDocumentBuilderIntegrationTest
[INFO] Running org.eclipse.mylyn.internal.wikitext.parser.html.XHtmlParserTest
[INFO] Tests run: 32, Failures: 0, Errors: 0, Skipped: 0, Time elapsed: 0.071 s - in org.eclipse.mylyn.internal.wikitext.parser.html.XHtmlParserTest
[INFO] Running org.eclipse.mylyn.internal.wikitext.parser.html.HtmlParserTest
[INFO] Tests run: 39, Failures: 0, Errors: 0, Skipped: 0, Time elapsed: 0.082 s - in org.eclipse.mylyn.internal.wikitext.parser.html.HtmlParserTest
[INFO] Running org.eclipse.mylyn.internal.wikitext.parser.builder.DitaTopicDocumentBuilderTest
[INFO] Tests run: 4, Failures: 0, Errors: 0, Skipped: 0, Time elapsed: 0.006 s - in org.eclipse.mylyn.internal.wikitext.parser.builder.DitaTopicDocumentBuilderTest
[INFO] 
[INFO] Results:
[INFO] 
[INFO] Tests run: 124, Failures: 0, Errors: 0, Skipped: 0
[INFO] 
[INFO] 
[INFO] --- maven-bundle-plugin:3.2.0:bundle (default-bundle) @ org.eclipse.mylyn.wikitext.tests ---
[WARNING] Bundle org.eclipse.mylyn.docs:org.eclipse.mylyn.wikitext.tests:bundle:3.0.25-SNAPSHOT : Unused Export-Package instructions: [org.eclipse.mylyn.wikitext.tests.internal*, org.eclipse.mylyn.wikitext.tests*] 
[WARNING] Bundle org.eclipse.mylyn.docs:org.eclipse.mylyn.wikitext.tests:bundle:3.0.25-SNAPSHOT : Unused Import-Package instructions: [com.google.common*] 
[WARNING] Bundle org.eclipse.mylyn.docs:org.eclipse.mylyn.wikitext.tests:bundle:3.0.25-SNAPSHOT : The JAR is empty: The instructions for the JAR named org.eclipse.mylyn.wikitext.tests did not cause any content to be included, this is likely wrong
[INFO] 
[INFO] --- maven-source-plugin:3.0.1:jar-no-fork (attach-sources) @ org.eclipse.mylyn.wikitext.tests ---
[INFO] No sources in project. Archive not created.
[INFO] 
[INFO] -------< org.eclipse.mylyn.docs:org.eclipse.mylyn.wikitext.ant >--------
[INFO] Building Mylyn WikiText Ant Tasks 3.0.25-SNAPSHOT                 [9/28]
[INFO] -------------------------------[ bundle ]-------------------------------
[INFO] 
[INFO] --- maven-clean-plugin:2.5:clean (default-clean) @ org.eclipse.mylyn.wikitext.ant ---
[INFO] 
[INFO] --- maven-resources-plugin:3.0.1:resources (default-resources) @ org.eclipse.mylyn.wikitext.ant ---
[INFO] Using 'UTF-8' encoding to copy filtered resources.
[INFO] Copying 2 resources
[INFO] skip non existing resourceDirectory /jobs/genie.mylyn/mylyn-integration-connectors/workspace/org.eclipse.mylyn.docs/wikitext/core/org.eclipse.mylyn.wikitext.ant/src/main/resources
[INFO] Copying 1 resource
[INFO] 
[INFO] --- maven-compiler-plugin:3.6.0:compile (default-compile) @ org.eclipse.mylyn.wikitext.ant ---
[INFO] Changes detected - recompiling the module!
[INFO] Compiling 10 source files to /jobs/genie.mylyn/mylyn-integration-connectors/workspace/org.eclipse.mylyn.docs/wikitext/core/org.eclipse.mylyn.wikitext.ant/target/classes
[INFO] 
[INFO] --- maven-resources-plugin:3.0.1:testResources (default-testResources) @ org.eclipse.mylyn.wikitext.ant ---
[INFO] Using 'UTF-8' encoding to copy filtered resources.
[INFO] Copying 0 resource
[INFO] skip non existing resourceDirectory /jobs/genie.mylyn/mylyn-integration-connectors/workspace/org.eclipse.mylyn.docs/wikitext/core/org.eclipse.mylyn.wikitext.ant/src/test/resources
[INFO] 
[INFO] --- maven-compiler-plugin:3.6.0:testCompile (default-testCompile) @ org.eclipse.mylyn.wikitext.ant ---
[INFO] Changes detected - recompiling the module!
[INFO] Compiling 7 source files to /jobs/genie.mylyn/mylyn-integration-connectors/workspace/org.eclipse.mylyn.docs/wikitext/core/org.eclipse.mylyn.wikitext.ant/target/test-classes
[INFO] 
[INFO] --- maven-surefire-plugin:3.0.0-M4:test (default-test) @ org.eclipse.mylyn.wikitext.ant ---
[INFO] 
[INFO] -------------------------------------------------------
[INFO]  T E S T S
[INFO] -------------------------------------------------------
[INFO] Running org.eclipse.mylyn.wikitext.ant.internal.MarkupToHtmlTaskTest
[INFO] Tests run: 9, Failures: 0, Errors: 0, Skipped: 0, Time elapsed: 0.194 s - in org.eclipse.mylyn.wikitext.ant.internal.MarkupToHtmlTaskTest
[INFO] Running org.eclipse.mylyn.wikitext.ant.internal.MarkupToEclipseHelpTaskTest
Help: /tmp/genie.mylyn/MarkupToEclipseHelpTaskTest4435395710068120437.tmp /tmp/genie.mylyn/MarkupToEclipseHelpTaskTest4435395710068120437.tmp/markup.html
Help: /tmp/genie.mylyn/MarkupToEclipseHelpTaskTest4279933846581118858.tmp /tmp/genie.mylyn/MarkupToEclipseHelpTaskTest4279933846581118858.tmp/markup.html
Help: /tmp/genie.mylyn/MarkupToEclipseHelpTaskTest3651028135368308892.tmp /tmp/genie.mylyn/MarkupToEclipseHelpTaskTest3651028135368308892.tmp/markup.html
Help: /tmp/genie.mylyn/MarkupToEclipseHelpTaskTest797345442647930096.tmp /tmp/genie.mylyn/MarkupToEclipseHelpTaskTest797345442647930096.tmp/markup.html
Help: /tmp/genie.mylyn/MarkupToEclipseHelpTaskTest573645088212024423.tmp /tmp/genie.mylyn/MarkupToEclipseHelpTaskTest573645088212024423.tmp/markup.html
Help: /tmp/genie.mylyn/MarkupToEclipseHelpTaskTest4127320288014480817.tmp /tmp/genie.mylyn/MarkupToEclipseHelpTaskTest4127320288014480817.tmp/markup.html
Help: /tmp/genie.mylyn/MarkupToEclipseHelpTaskTest3383066133018973973.tmp /tmp/genie.mylyn/MarkupToEclipseHelpTaskTest3383066133018973973.tmp/markup.html
Help: /tmp/genie.mylyn/MarkupToEclipseHelpTaskTest4988626460439273818.tmp /tmp/genie.mylyn/MarkupToEclipseHelpTaskTest4988626460439273818.tmp/markup.html
Help: /tmp/genie.mylyn/MarkupToEclipseHelpTaskTest6129969086433098591.tmp /tmp/genie.mylyn/MarkupToEclipseHelpTaskTest6129969086433098591.tmp/markup.html
[INFO] Tests run: 10, Failures: 0, Errors: 0, Skipped: 0, Time elapsed: 0.05 s - in org.eclipse.mylyn.wikitext.ant.internal.MarkupToEclipseHelpTaskTest
[INFO] Running org.eclipse.mylyn.wikitext.ant.internal.MarkupToDitaTaskTest
[INFO] Tests run: 10, Failures: 0, Errors: 0, Skipped: 0, Time elapsed: 0.043 s - in org.eclipse.mylyn.wikitext.ant.internal.MarkupToDitaTaskTest
[INFO] Running org.eclipse.mylyn.wikitext.ant.internal.MarkupToDocbookTaskTest
[INFO] Tests run: 3, Failures: 0, Errors: 0, Skipped: 0, Time elapsed: 0.014 s - in org.eclipse.mylyn.wikitext.ant.internal.MarkupToDocbookTaskTest
[INFO] Running org.eclipse.mylyn.wikitext.ant.internal.MarkupToXslfoTaskTest
[INFO] Tests run: 2, Failures: 0, Errors: 0, Skipped: 0, Time elapsed: 0.011 s - in org.eclipse.mylyn.wikitext.ant.internal.MarkupToXslfoTaskTest
[INFO] Running org.eclipse.mylyn.wikitext.ant.internal.HtmlToMarkupTaskTest
HTML source validation is not available
[INFO] Tests run: 2, Failures: 0, Errors: 0, Skipped: 0, Time elapsed: 0.064 s - in org.eclipse.mylyn.wikitext.ant.internal.HtmlToMarkupTaskTest
[INFO] 
[INFO] Results:
[INFO] 
[INFO] Tests run: 36, Failures: 0, Errors: 0, Skipped: 0
[INFO] 
[INFO] 
[INFO] --- maven-bundle-plugin:3.2.0:bundle (default-bundle) @ org.eclipse.mylyn.wikitext.ant ---
[WARNING] Bundle org.eclipse.mylyn.docs:org.eclipse.mylyn.wikitext.ant:bundle:3.0.25-SNAPSHOT : Unused Import-Package instructions: [com.google.common*] 
[INFO] 
[INFO] --- maven-source-plugin:3.0.1:jar-no-fork (attach-sources) @ org.eclipse.mylyn.wikitext.ant ---
[INFO] Building jar: /jobs/genie.mylyn/mylyn-integration-connectors/workspace/org.eclipse.mylyn.docs/wikitext/core/org.eclipse.mylyn.wikitext.ant/target/org.eclipse.mylyn.wikitext.ant-3.0.25-SNAPSHOT-sources.jar
[INFO] 
[INFO] ------< org.eclipse.mylyn.docs:org.eclipse.mylyn.wikitext.maven >-------
[INFO] Building Mylyn WikiText Maven 3.0.25-SNAPSHOT                    [10/28]
[INFO] ----------------------------[ maven-plugin ]----------------------------
[INFO] 
[INFO] --- maven-clean-plugin:2.5:clean (default-clean) @ org.eclipse.mylyn.wikitext.maven ---
[INFO] 
[INFO] --- maven-resources-plugin:3.0.1:resources (default-resources) @ org.eclipse.mylyn.wikitext.maven ---
[INFO] Using 'UTF-8' encoding to copy filtered resources.
[INFO] Copying 0 resource
[INFO] skip non existing resourceDirectory /jobs/genie.mylyn/mylyn-integration-connectors/workspace/org.eclipse.mylyn.docs/wikitext/core/org.eclipse.mylyn.wikitext.maven/src/main/resources
[INFO] Copying 1 resource
[INFO] 
[INFO] --- maven-compiler-plugin:3.6.0:compile (default-compile) @ org.eclipse.mylyn.wikitext.maven ---
[INFO] Changes detected - recompiling the module!
[INFO] Compiling 4 source files to /jobs/genie.mylyn/mylyn-integration-connectors/workspace/org.eclipse.mylyn.docs/wikitext/core/org.eclipse.mylyn.wikitext.maven/target/classes
[INFO] 
[INFO] --- maven-plugin-plugin:3.4:descriptor (default-descriptor) @ org.eclipse.mylyn.wikitext.maven ---
[WARNING] 

Goal prefix is specified as: 'wikitext'. Maven currently expects it to be 'org.eclipse.mylyn.wikitext.'.

[INFO] Using 'UTF-8' encoding to read mojo metadata.
[WARNING] org.eclipse.mylyn.wikitext.maven.internal.MarkupToEclipseHelpMojo#outputFolder:
[WARNING]   The syntax
[WARNING]     @parameter expression="${property}"
[WARNING]   is deprecated, please use
[WARNING]     @parameter property="property"
[WARNING]   instead.
[WARNING] org.eclipse.mylyn.wikitext.maven.internal.MarkupToEclipseHelpMojo#sourceEncoding:
[WARNING]   The syntax
[WARNING]     @parameter expression="${property}"
[WARNING]   is deprecated, please use
[WARNING]     @parameter property="property"
[WARNING]   instead.
[WARNING] org.eclipse.mylyn.wikitext.maven.internal.MarkupToEclipseHelpMojo#sourceFolder:
[WARNING]   The syntax
[WARNING]     @parameter expression="${property}"
[WARNING]   is deprecated, please use
[WARNING]     @parameter property="property"
[WARNING]   instead.
[INFO] Mojo extractor with id: java-javadoc found 1 mojo descriptors.
[INFO] Mojo extractor with id: java-annotations found 0 mojo descriptors.
[INFO] 
[INFO] --- maven-resources-plugin:3.0.1:testResources (default-testResources) @ org.eclipse.mylyn.wikitext.maven ---
[INFO] Using 'UTF-8' encoding to copy filtered resources.
[INFO] Copying 0 resource
[INFO] Copying 2 resources
[INFO] 
[INFO] --- maven-compiler-plugin:3.6.0:testCompile (default-testCompile) @ org.eclipse.mylyn.wikitext.maven ---
[INFO] Changes detected - recompiling the module!
[INFO] Compiling 3 source files to /jobs/genie.mylyn/mylyn-integration-connectors/workspace/org.eclipse.mylyn.docs/wikitext/core/org.eclipse.mylyn.wikitext.maven/target/test-classes
[INFO] 
[INFO] --- maven-surefire-plugin:2.12.4:test (default-test) @ org.eclipse.mylyn.wikitext.maven ---
[INFO] Surefire report directory: /jobs/genie.mylyn/mylyn-integration-connectors/workspace/org.eclipse.mylyn.docs/wikitext/core/org.eclipse.mylyn.wikitext.maven/target/surefire-reports

-------------------------------------------------------
 T E S T S
-------------------------------------------------------
Picked up JAVA_TOOL_OPTIONS: -Xmx2G -Djava.io.tmpdir=/tmp/genie.mylyn -DforkCount=1
Running org.eclipse.mylyn.wikitext.maven.internal.MarkupToEclipseHelpMojoTest
[info] Generating Eclipse help content from sources: /jobs/genie.mylyn/mylyn-integration-connectors/workspace/org.eclipse.mylyn.docs/wikitext/core/org.eclipse.mylyn.wikitext.maven/target/test-classes -> /tmp/genie.mylyn/junit9192295861632269281
[info] Processing markup file: /jobs/genie.mylyn/mylyn-integration-connectors/workspace/org.eclipse.mylyn.docs/wikitext/core/org.eclipse.mylyn.wikitext.maven/target/test-classes/test.textile
[info] Processed 5 files
Tests run: 20, Failures: 0, Errors: 0, Skipped: 0, Time elapsed: 0.964 sec
Running org.eclipse.mylyn.wikitext.maven.internal.FileToMarkupLanguageTest
Tests run: 7, Failures: 0, Errors: 0, Skipped: 0, Time elapsed: 0.012 sec
Running org.eclipse.mylyn.wikitext.maven.internal.SourceFileTraversalTest
Tests run: 3, Failures: 0, Errors: 0, Skipped: 0, Time elapsed: 0.015 sec

Results :

Tests run: 30, Failures: 0, Errors: 0, Skipped: 0

[INFO] 
[INFO] --- maven-jar-plugin:2.4:jar (default-jar) @ org.eclipse.mylyn.wikitext.maven ---
[INFO] Building jar: /jobs/genie.mylyn/mylyn-integration-connectors/workspace/org.eclipse.mylyn.docs/wikitext/core/org.eclipse.mylyn.wikitext.maven/target/org.eclipse.mylyn.wikitext.maven-3.0.25-SNAPSHOT.jar
[INFO] 
[INFO] --- maven-plugin-plugin:3.4:addPluginArtifactMetadata (default-addPluginArtifactMetadata) @ org.eclipse.mylyn.wikitext.maven ---
[INFO] 
[INFO] --- maven-source-plugin:3.0.1:jar-no-fork (attach-sources) @ org.eclipse.mylyn.wikitext.maven ---
[INFO] Building jar: /jobs/genie.mylyn/mylyn-integration-connectors/workspace/org.eclipse.mylyn.docs/wikitext/core/org.eclipse.mylyn.wikitext.maven/target/org.eclipse.mylyn.wikitext.maven-3.0.25-SNAPSHOT-sources.jar
[INFO] 
[INFO] -----< org.eclipse.mylyn.docs:org.eclipse.mylyn.wikitext.asciidoc >-----
[INFO] Building Mylyn WikiText AsciiDoc 3.0.25-SNAPSHOT                 [11/28]
[INFO] -------------------------------[ bundle ]-------------------------------
[INFO] 
[INFO] --- maven-clean-plugin:2.5:clean (default-clean) @ org.eclipse.mylyn.wikitext.asciidoc ---
[INFO] 
[INFO] --- maven-resources-plugin:3.0.1:resources (default-resources) @ org.eclipse.mylyn.wikitext.asciidoc ---
[INFO] Using 'UTF-8' encoding to copy filtered resources.
[INFO] Copying 0 resource
[INFO] Copying 1 resource
[INFO] Copying 2 resources
[INFO] 
[INFO] --- maven-compiler-plugin:3.6.0:compile (default-compile) @ org.eclipse.mylyn.wikitext.asciidoc ---
[INFO] Changes detected - recompiling the module!
[INFO] Compiling 43 source files to /jobs/genie.mylyn/mylyn-integration-connectors/workspace/org.eclipse.mylyn.docs/wikitext/core/org.eclipse.mylyn.wikitext.asciidoc/target/classes
[INFO] 
[INFO] --- maven-resources-plugin:3.0.1:testResources (default-testResources) @ org.eclipse.mylyn.wikitext.asciidoc ---
[INFO] Using 'UTF-8' encoding to copy filtered resources.
[INFO] Copying 0 resource
[INFO] skip non existing resourceDirectory /jobs/genie.mylyn/mylyn-integration-connectors/workspace/org.eclipse.mylyn.docs/wikitext/core/org.eclipse.mylyn.wikitext.asciidoc/src/test/resources
[INFO] 
[INFO] --- maven-compiler-plugin:3.6.0:testCompile (default-testCompile) @ org.eclipse.mylyn.wikitext.asciidoc ---
[INFO] Changes detected - recompiling the module!
[INFO] Compiling 20 source files to /jobs/genie.mylyn/mylyn-integration-connectors/workspace/org.eclipse.mylyn.docs/wikitext/core/org.eclipse.mylyn.wikitext.asciidoc/target/test-classes
[INFO] 
[INFO] --- maven-surefire-plugin:3.0.0-M4:test (default-test) @ org.eclipse.mylyn.wikitext.asciidoc ---
[INFO] 
[INFO] -------------------------------------------------------
[INFO]  T E S T S
[INFO] -------------------------------------------------------
[INFO] Running org.eclipse.mylyn.internal.wikitext.asciidoc.tests.AsciiDocLanguageAttributeTest
[INFO] Tests run: 15, Failures: 0, Errors: 0, Skipped: 0, Time elapsed: 0.105 s - in org.eclipse.mylyn.internal.wikitext.asciidoc.tests.AsciiDocLanguageAttributeTest
[INFO] Running org.eclipse.mylyn.internal.wikitext.asciidoc.tests.AsciiDocLanguagePreformattedBlockTest
[INFO] Tests run: 3, Failures: 0, Errors: 0, Skipped: 0, Time elapsed: 0.004 s - in org.eclipse.mylyn.internal.wikitext.asciidoc.tests.AsciiDocLanguagePreformattedBlockTest
[INFO] Running org.eclipse.mylyn.internal.wikitext.asciidoc.tests.AsciiDocLanguageSupportTest
[INFO] Tests run: 9, Failures: 0, Errors: 0, Skipped: 0, Time elapsed: 0.015 s - in org.eclipse.mylyn.internal.wikitext.asciidoc.tests.AsciiDocLanguageSupportTest
[INFO] Running org.eclipse.mylyn.internal.wikitext.asciidoc.tests.AsciiDocDocumentBuilderTest
Feb 12, 2021 9:01:19 AM org.eclipse.mylyn.wikitext.asciidoc.internal.AsciiDocDocumentBuilder computeSpan
WARNING: Unexpected block type: UNDERLINED
Feb 12, 2021 9:01:19 AM org.eclipse.mylyn.wikitext.asciidoc.internal.AsciiDocDocumentBuilder computeBlock
WARNING: Unexpected block type: FOOTNOTE
[INFO] Tests run: 70, Failures: 0, Errors: 0, Skipped: 0, Time elapsed: 0.054 s - in org.eclipse.mylyn.internal.wikitext.asciidoc.tests.AsciiDocDocumentBuilderTest
[INFO] Running org.eclipse.mylyn.internal.wikitext.asciidoc.tests.AsciiDocLanguageLinksTest
[INFO] Tests run: 15, Failures: 0, Errors: 0, Skipped: 0, Time elapsed: 0.017 s - in org.eclipse.mylyn.internal.wikitext.asciidoc.tests.AsciiDocLanguageLinksTest
[INFO] Running org.eclipse.mylyn.internal.wikitext.asciidoc.tests.AsciiDocLanguageMiscellaneousTest
[INFO] Tests run: 23, Failures: 0, Errors: 0, Skipped: 0, Time elapsed: 0.02 s - in org.eclipse.mylyn.internal.wikitext.asciidoc.tests.AsciiDocLanguageMiscellaneousTest
[INFO] Running org.eclipse.mylyn.internal.wikitext.asciidoc.tests.AsciiDocLanguageCommentBlockElementsTest
[INFO] Tests run: 6, Failures: 0, Errors: 0, Skipped: 0, Time elapsed: 0.006 s - in org.eclipse.mylyn.internal.wikitext.asciidoc.tests.AsciiDocLanguageCommentBlockElementsTest
[INFO] Running org.eclipse.mylyn.internal.wikitext.asciidoc.tests.AsciiDocLanguageTest
[INFO] Tests run: 1, Failures: 0, Errors: 0, Skipped: 0, Time elapsed: 0.002 s - in org.eclipse.mylyn.internal.wikitext.asciidoc.tests.AsciiDocLanguageTest
[INFO] Running org.eclipse.mylyn.internal.wikitext.asciidoc.tests.AsciiDocLanguageAnchorTest
[INFO] Tests run: 9, Failures: 0, Errors: 0, Skipped: 0, Time elapsed: 0.007 s - in org.eclipse.mylyn.internal.wikitext.asciidoc.tests.AsciiDocLanguageAnchorTest
[INFO] Running org.eclipse.mylyn.internal.wikitext.asciidoc.tests.AsciiDocLanguageXrefTest
[INFO] Tests run: 17, Failures: 0, Errors: 0, Skipped: 0, Time elapsed: 0.009 s - in org.eclipse.mylyn.internal.wikitext.asciidoc.tests.AsciiDocLanguageXrefTest
[INFO] Running org.eclipse.mylyn.internal.wikitext.asciidoc.tests.AsciiDocLanguageTableTest
[INFO] Tests run: 30, Failures: 0, Errors: 0, Skipped: 0, Time elapsed: 0.027 s - in org.eclipse.mylyn.internal.wikitext.asciidoc.tests.AsciiDocLanguageTableTest
[INFO] Running org.eclipse.mylyn.internal.wikitext.asciidoc.tests.AsciiDocLanguageBlockElementsTest
[INFO] Tests run: 78, Failures: 0, Errors: 0, Skipped: 0, Time elapsed: 0.045 s - in org.eclipse.mylyn.internal.wikitext.asciidoc.tests.AsciiDocLanguageBlockElementsTest
[INFO] Running org.eclipse.mylyn.internal.wikitext.asciidoc.tests.AsciiDocLanguageImageTest
[INFO] Tests run: 10, Failures: 0, Errors: 0, Skipped: 0, Time elapsed: 0.01 s - in org.eclipse.mylyn.internal.wikitext.asciidoc.tests.AsciiDocLanguageImageTest
[INFO] Running org.eclipse.mylyn.internal.wikitext.asciidoc.tests.AsciiDocLanguageListTest
[INFO] Tests run: 42, Failures: 0, Errors: 0, Skipped: 0, Time elapsed: 0.02 s - in org.eclipse.mylyn.internal.wikitext.asciidoc.tests.AsciiDocLanguageListTest
[INFO] Running org.eclipse.mylyn.internal.wikitext.asciidoc.tests.AsciiDocLanguageHorizontalRuleTest
[INFO] Tests run: 7, Failures: 0, Errors: 0, Skipped: 0, Time elapsed: 0.001 s - in org.eclipse.mylyn.internal.wikitext.asciidoc.tests.AsciiDocLanguageHorizontalRuleTest
[INFO] Running org.eclipse.mylyn.internal.wikitext.asciidoc.tests.AsciiDocLanguageCodeBlockElementsTest
[INFO] Tests run: 8, Failures: 0, Errors: 0, Skipped: 0, Time elapsed: 0.002 s - in org.eclipse.mylyn.internal.wikitext.asciidoc.tests.AsciiDocLanguageCodeBlockElementsTest
[INFO] Running org.eclipse.mylyn.internal.wikitext.asciidoc.tests.AsciiDocLanguageSpanElementsTest
[INFO] Tests run: 71, Failures: 0, Errors: 0, Skipped: 0, Time elapsed: 0.028 s - in org.eclipse.mylyn.internal.wikitext.asciidoc.tests.AsciiDocLanguageSpanElementsTest
[INFO] Running org.eclipse.mylyn.internal.wikitext.asciidoc.tests.AsciiDocLanguageWithConfigurationIntegrationTest
[INFO] Tests run: 3, Failures: 0, Errors: 0, Skipped: 0, Time elapsed: 0.01 s - in org.eclipse.mylyn.internal.wikitext.asciidoc.tests.AsciiDocLanguageWithConfigurationIntegrationTest
[INFO] Running org.eclipse.mylyn.wikitext.asciidoc.internal.AsciiDocIdGenerationStrategyTest
[INFO] Tests run: 1, Failures: 0, Errors: 0, Skipped: 0, Time elapsed: 0.001 s - in org.eclipse.mylyn.wikitext.asciidoc.internal.AsciiDocIdGenerationStrategyTest
[INFO] 
[INFO] Results:
[INFO] 
[INFO] Tests run: 418, Failures: 0, Errors: 0, Skipped: 0
[INFO] 
[INFO] 
[INFO] --- maven-bundle-plugin:3.2.0:bundle (default-bundle) @ org.eclipse.mylyn.wikitext.asciidoc ---
[INFO] 
[INFO] --- maven-source-plugin:3.0.1:jar-no-fork (attach-sources) @ org.eclipse.mylyn.wikitext.asciidoc ---
[INFO] Building jar: /jobs/genie.mylyn/mylyn-integration-connectors/workspace/org.eclipse.mylyn.docs/wikitext/core/org.eclipse.mylyn.wikitext.asciidoc/target/org.eclipse.mylyn.wikitext.asciidoc-3.0.25-SNAPSHOT-sources.jar
[INFO] 
[INFO] ----< org.eclipse.mylyn.docs:org.eclipse.mylyn.wikitext.commonmark >----
[INFO] Building Mylyn WikiText CommonMark 3.0.25-SNAPSHOT               [12/28]
[INFO] -------------------------------[ bundle ]-------------------------------
[INFO] 
[INFO] --- maven-clean-plugin:2.5:clean (default-clean) @ org.eclipse.mylyn.wikitext.commonmark ---
[INFO] 
[INFO] --- maven-resources-plugin:3.0.1:resources (default-resources) @ org.eclipse.mylyn.wikitext.commonmark ---
[INFO] Using 'UTF-8' encoding to copy filtered resources.
[INFO] Copying 0 resource
[INFO] Copying 1 resource
[INFO] Copying 1 resource
[INFO] 
[INFO] --- maven-compiler-plugin:3.6.0:compile (default-compile) @ org.eclipse.mylyn.wikitext.commonmark ---
[INFO] Changes detected - recompiling the module!
[INFO] Compiling 70 source files to /jobs/genie.mylyn/mylyn-integration-connectors/workspace/org.eclipse.mylyn.docs/wikitext/core/org.eclipse.mylyn.wikitext.commonmark/target/classes
[INFO] 
[INFO] --- maven-resources-plugin:3.0.1:testResources (default-testResources) @ org.eclipse.mylyn.wikitext.commonmark ---
[INFO] Using 'UTF-8' encoding to copy filtered resources.
[INFO] Copying 0 resource
[INFO] skip non existing resourceDirectory /jobs/genie.mylyn/mylyn-integration-connectors/workspace/org.eclipse.mylyn.docs/wikitext/core/org.eclipse.mylyn.wikitext.commonmark/src/test/resources
[INFO] 
[INFO] --- maven-compiler-plugin:3.6.0:testCompile (default-testCompile) @ org.eclipse.mylyn.wikitext.commonmark ---
[INFO] Changes detected - recompiling the module!
[INFO] Compiling 45 source files to /jobs/genie.mylyn/mylyn-integration-connectors/workspace/org.eclipse.mylyn.docs/wikitext/core/org.eclipse.mylyn.wikitext.commonmark/target/test-classes
[INFO] 
[INFO] --- maven-surefire-plugin:3.0.0-M4:test (default-test) @ org.eclipse.mylyn.wikitext.commonmark ---
[INFO] 
[INFO] -------------------------------------------------------
[INFO]  T E S T S
[INFO] -------------------------------------------------------
[INFO] Running org.eclipse.mylyn.wikitext.commonmark.internal.spec.CommonMarkSpecTest
[WARNING] Tests run: 595, Failures: 0, Errors: 0, Skipped: 13, Time elapsed: 2.48 s - in org.eclipse.mylyn.wikitext.commonmark.internal.spec.CommonMarkSpecTest
[INFO] Running org.eclipse.mylyn.wikitext.commonmark.internal.inlines.CursorTest
[INFO] Tests run: 12, Failures: 0, Errors: 0, Skipped: 0, Time elapsed: 0.002 s - in org.eclipse.mylyn.wikitext.commonmark.internal.inlines.CursorTest
[INFO] Running org.eclipse.mylyn.wikitext.commonmark.internal.inlines.PotentialBracketEndDelimiterTest
[INFO] Tests run: 14, Failures: 0, Errors: 0, Skipped: 0, Time elapsed: 0.004 s - in org.eclipse.mylyn.wikitext.commonmark.internal.inlines.PotentialBracketEndDelimiterTest
[INFO] Running org.eclipse.mylyn.wikitext.commonmark.internal.inlines.BackslashEscapeSpanTest
[INFO] Tests run: 1, Failures: 0, Errors: 0, Skipped: 0, Time elapsed: 0.002 s - in org.eclipse.mylyn.wikitext.commonmark.internal.inlines.BackslashEscapeSpanTest
[INFO] Running org.eclipse.mylyn.wikitext.commonmark.internal.inlines.HtmlEntitySpanTest
[INFO] Tests run: 1, Failures: 0, Errors: 0, Skipped: 0, Time elapsed: 0.002 s - in org.eclipse.mylyn.wikitext.commonmark.internal.inlines.HtmlEntitySpanTest
[INFO] Running org.eclipse.mylyn.wikitext.commonmark.internal.inlines.PotentialBracketSpanTest
[INFO] Tests run: 3, Failures: 0, Errors: 0, Skipped: 0, Time elapsed: 0.001 s - in org.eclipse.mylyn.wikitext.commonmark.internal.inlines.PotentialBracketSpanTest
[INFO] Running org.eclipse.mylyn.wikitext.commonmark.internal.inlines.InlineTest
[INFO] Tests run: 2, Failures: 0, Errors: 0, Skipped: 0, Time elapsed: 0.002 s - in org.eclipse.mylyn.wikitext.commonmark.internal.inlines.InlineTest
[INFO] Running org.eclipse.mylyn.wikitext.commonmark.internal.inlines.LineBreakSpanTest
[INFO] Tests run: 1, Failures: 0, Errors: 0, Skipped: 0, Time elapsed: 0.002 s - in org.eclipse.mylyn.wikitext.commonmark.internal.inlines.LineBreakSpanTest
[INFO] Running org.eclipse.mylyn.wikitext.commonmark.internal.inlines.CodeSpanTest
[INFO] Tests run: 2, Failures: 0, Errors: 0, Skipped: 0, Time elapsed: 0.001 s - in org.eclipse.mylyn.wikitext.commonmark.internal.inlines.CodeSpanTest
[INFO] Running org.eclipse.mylyn.wikitext.commonmark.internal.inlines.AutoLinkSpanTest
[INFO] Tests run: 1, Failures: 0, Errors: 0, Skipped: 0, Time elapsed: 0.002 s - in org.eclipse.mylyn.wikitext.commonmark.internal.inlines.AutoLinkSpanTest
[INFO] Running org.eclipse.mylyn.wikitext.commonmark.internal.inlines.AutoLinkWithoutDemarcationSpanTest
[INFO] Tests run: 1, Failures: 0, Errors: 0, Skipped: 0, Time elapsed: 0.001 s - in org.eclipse.mylyn.wikitext.commonmark.internal.inlines.AutoLinkWithoutDemarcationSpanTest
[INFO] Running org.eclipse.mylyn.wikitext.commonmark.internal.inlines.PotentialEmphasisSpanTest
[INFO] Tests run: 6, Failures: 0, Errors: 0, Skipped: 0, Time elapsed: 0.002 s - in org.eclipse.mylyn.wikitext.commonmark.internal.inlines.PotentialEmphasisSpanTest
[INFO] Running org.eclipse.mylyn.wikitext.commonmark.internal.inlines.HtmlTagSpanTest
[INFO] Tests run: 1, Failures: 0, Errors: 0, Skipped: 0, Time elapsed: 0.002 s - in org.eclipse.mylyn.wikitext.commonmark.internal.inlines.HtmlTagSpanTest
[INFO] Running org.eclipse.mylyn.wikitext.commonmark.internal.inlines.StringCharactersSpanTest
[INFO] Tests run: 1, Failures: 0, Errors: 0, Skipped: 0, Time elapsed: 0.001 s - in org.eclipse.mylyn.wikitext.commonmark.internal.inlines.StringCharactersSpanTest
[INFO] Running org.eclipse.mylyn.wikitext.commonmark.internal.inlines.InlineParserTest
[INFO] Tests run: 4, Failures: 0, Errors: 0, Skipped: 0, Time elapsed: 0.003 s - in org.eclipse.mylyn.wikitext.commonmark.internal.inlines.InlineParserTest
[INFO] Running org.eclipse.mylyn.wikitext.commonmark.internal.blocks.HorizontalRuleBlockTest
[INFO] Tests run: 2, Failures: 0, Errors: 0, Skipped: 0, Time elapsed: 0.003 s - in org.eclipse.mylyn.wikitext.commonmark.internal.blocks.HorizontalRuleBlockTest
[INFO] Running org.eclipse.mylyn.wikitext.commonmark.internal.blocks.ListBlockTest
[INFO] Tests run: 11, Failures: 0, Errors: 0, Skipped: 0, Time elapsed: 0.006 s - in org.eclipse.mylyn.wikitext.commonmark.internal.blocks.ListBlockTest
[INFO] Running org.eclipse.mylyn.wikitext.commonmark.internal.blocks.AtxHeaderBlockTest
[INFO] Tests run: 3, Failures: 0, Errors: 0, Skipped: 0, Time elapsed: 0.004 s - in org.eclipse.mylyn.wikitext.commonmark.internal.blocks.AtxHeaderBlockTest
[INFO] Running org.eclipse.mylyn.wikitext.commonmark.internal.blocks.SetextHeaderBlockTest
[INFO] Tests run: 2, Failures: 0, Errors: 0, Skipped: 0, Time elapsed: 0.003 s - in org.eclipse.mylyn.wikitext.commonmark.internal.blocks.SetextHeaderBlockTest
[INFO] Running org.eclipse.mylyn.wikitext.commonmark.internal.blocks.HtmlType1BlockTest
[INFO] Tests run: 1, Failures: 0, Errors: 0, Skipped: 0, Time elapsed: 0.001 s - in org.eclipse.mylyn.wikitext.commonmark.internal.blocks.HtmlType1BlockTest
[INFO] Running org.eclipse.mylyn.wikitext.commonmark.internal.blocks.BlockQuoteBlockTest
[INFO] Tests run: 6, Failures: 0, Errors: 0, Skipped: 0, Time elapsed: 0.006 s - in org.eclipse.mylyn.wikitext.commonmark.internal.blocks.BlockQuoteBlockTest
[INFO] Running org.eclipse.mylyn.wikitext.commonmark.internal.blocks.EmptyBlockTest
[INFO] Tests run: 2, Failures: 0, Errors: 0, Skipped: 0, Time elapsed: 0.001 s - in org.eclipse.mylyn.wikitext.commonmark.internal.blocks.EmptyBlockTest
[INFO] Running org.eclipse.mylyn.wikitext.commonmark.internal.blocks.HtmlCommentBlockTest
[INFO] Tests run: 2, Failures: 0, Errors: 0, Skipped: 0, Time elapsed: 0.002 s - in org.eclipse.mylyn.wikitext.commonmark.internal.blocks.HtmlCommentBlockTest
[INFO] Running org.eclipse.mylyn.wikitext.commonmark.internal.blocks.ParagraphBlockTest
[INFO] Tests run: 3, Failures: 0, Errors: 0, Skipped: 0, Time elapsed: 0.002 s - in org.eclipse.mylyn.wikitext.commonmark.internal.blocks.ParagraphBlockTest
[INFO] Running org.eclipse.mylyn.wikitext.commonmark.internal.blocks.FencedCodeBlockTest
[INFO] Tests run: 5, Failures: 0, Errors: 0, Skipped: 0, Time elapsed: 0.003 s - in org.eclipse.mylyn.wikitext.commonmark.internal.blocks.FencedCodeBlockTest
[INFO] Running org.eclipse.mylyn.wikitext.commonmark.internal.blocks.IndentedCodeBlockTest
[INFO] Tests run: 2, Failures: 0, Errors: 0, Skipped: 0, Time elapsed: 0.006 s - in org.eclipse.mylyn.wikitext.commonmark.internal.blocks.IndentedCodeBlockTest
[INFO] Running org.eclipse.mylyn.wikitext.commonmark.internal.blocks.HtmlBlockTest
[INFO] Tests run: 2, Failures: 0, Errors: 0, Skipped: 0, Time elapsed: 0.002 s - in org.eclipse.mylyn.wikitext.commonmark.internal.blocks.HtmlBlockTest
[INFO] Running org.eclipse.mylyn.wikitext.commonmark.internal.CommonMarkIdGenerationStrategyTest
[INFO] Tests run: 6, Failures: 0, Errors: 0, Skipped: 0, Time elapsed: 0.001 s - in org.eclipse.mylyn.wikitext.commonmark.internal.CommonMarkIdGenerationStrategyTest
[INFO] Running org.eclipse.mylyn.wikitext.commonmark.internal.TextSegmentTest
[INFO] Tests run: 6, Failures: 0, Errors: 0, Skipped: 0, Time elapsed: 0.001 s - in org.eclipse.mylyn.wikitext.commonmark.internal.TextSegmentTest
[INFO] Running org.eclipse.mylyn.wikitext.commonmark.internal.LineSequenceTest
[INFO] Tests run: 13, Failures: 0, Errors: 0, Skipped: 0, Time elapsed: 0.001 s - in org.eclipse.mylyn.wikitext.commonmark.internal.LineSequenceTest
[INFO] Running org.eclipse.mylyn.wikitext.commonmark.internal.SourceBlocksTest
[INFO] Tests run: 4, Failures: 0, Errors: 0, Skipped: 0, Time elapsed: 0.002 s - in org.eclipse.mylyn.wikitext.commonmark.internal.SourceBlocksTest
[INFO] Running org.eclipse.mylyn.wikitext.commonmark.internal.TransformLineSequenceTest
[INFO] Tests run: 5, Failures: 0, Errors: 0, Skipped: 0, Time elapsed: 0.001 s - in org.eclipse.mylyn.wikitext.commonmark.internal.TransformLineSequenceTest
[INFO] Running org.eclipse.mylyn.wikitext.commonmark.internal.LineTest
[INFO] Tests run: 10, Failures: 0, Errors: 0, Skipped: 0, Time elapsed: 0.002 s - in org.eclipse.mylyn.wikitext.commonmark.internal.LineTest
[INFO] Running org.eclipse.mylyn.wikitext.commonmark.internal.PredicateLineSequenceTest
[INFO] Tests run: 4, Failures: 0, Errors: 0, Skipped: 0, Time elapsed: 0.001 s - in org.eclipse.mylyn.wikitext.commonmark.internal.PredicateLineSequenceTest
[INFO] Running org.eclipse.mylyn.wikitext.commonmark.internal.ProcessingContextTest
[INFO] Tests run: 6, Failures: 0, Errors: 0, Skipped: 0, Time elapsed: 0.001 s - in org.eclipse.mylyn.wikitext.commonmark.internal.ProcessingContextTest
[INFO] Running org.eclipse.mylyn.wikitext.commonmark.internal.LinesIterableTest
[INFO] Tests run: 6, Failures: 0, Errors: 0, Skipped: 0, Time elapsed: 0.08 s - in org.eclipse.mylyn.wikitext.commonmark.internal.LinesIterableTest
[INFO] Running org.eclipse.mylyn.wikitext.commonmark.internal.LinePredicatesTest
[INFO] Tests run: 2, Failures: 0, Errors: 0, Skipped: 0, Time elapsed: 0.002 s - in org.eclipse.mylyn.wikitext.commonmark.internal.LinePredicatesTest
[INFO] Running org.eclipse.mylyn.wikitext.commonmark.internal.SimpleLocatorTest
[INFO] Tests run: 2, Failures: 0, Errors: 0, Skipped: 0, Time elapsed: 0.001 s - in org.eclipse.mylyn.wikitext.commonmark.internal.SimpleLocatorTest
[INFO] Running org.eclipse.mylyn.wikitext.commonmark.internal.ToStringHelperTest
[INFO] Tests run: 1, Failures: 0, Errors: 0, Skipped: 0, Time elapsed: 0.002 s - in org.eclipse.mylyn.wikitext.commonmark.internal.ToStringHelperTest
[INFO] Running org.eclipse.mylyn.wikitext.commonmark.CommonMarkLanguageDocumentOffsetsTest
[INFO] Tests run: 4, Failures: 0, Errors: 0, Skipped: 0, Time elapsed: 0.002 s - in org.eclipse.mylyn.wikitext.commonmark.CommonMarkLanguageDocumentOffsetsTest
[INFO] Running org.eclipse.mylyn.wikitext.commonmark.CommonMarkLanguageTest
[INFO] Tests run: 10, Failures: 0, Errors: 0, Skipped: 0, Time elapsed: 0.009 s - in org.eclipse.mylyn.wikitext.commonmark.CommonMarkLanguageTest
[INFO] 
[INFO] Results:
[INFO] 
[WARNING] Tests run: 765, Failures: 0, Errors: 0, Skipped: 13
[INFO] 
[INFO] 
[INFO] --- maven-bundle-plugin:3.2.0:bundle (default-bundle) @ org.eclipse.mylyn.wikitext.commonmark ---
[INFO] 
[INFO] --- maven-source-plugin:3.0.1:jar-no-fork (attach-sources) @ org.eclipse.mylyn.wikitext.commonmark ---
[INFO] Building jar: /jobs/genie.mylyn/mylyn-integration-connectors/workspace/org.eclipse.mylyn.docs/wikitext/core/org.eclipse.mylyn.wikitext.commonmark/target/org.eclipse.mylyn.wikitext.commonmark-3.0.25-SNAPSHOT-sources.jar
[INFO] 
[INFO] ------< org.eclipse.mylyn.docs:org.eclipse.mylyn.wikitext.creole >------
[INFO] Building Mylyn WikiText Creole 3.0.25-SNAPSHOT                   [13/28]
[INFO] -------------------------------[ bundle ]-------------------------------
[INFO] 
[INFO] --- maven-clean-plugin:2.5:clean (default-clean) @ org.eclipse.mylyn.wikitext.creole ---
[INFO] 
[INFO] --- maven-resources-plugin:3.0.1:resources (default-resources) @ org.eclipse.mylyn.wikitext.creole ---
[INFO] Using 'UTF-8' encoding to copy filtered resources.
[INFO] Copying 0 resource
[INFO] Copying 1 resource
[INFO] Copying 2 resources
[INFO] 
[INFO] --- maven-compiler-plugin:3.6.0:compile (default-compile) @ org.eclipse.mylyn.wikitext.creole ---
[INFO] Changes detected - recompiling the module!
[INFO] Compiling 12 source files to /jobs/genie.mylyn/mylyn-integration-connectors/workspace/org.eclipse.mylyn.docs/wikitext/core/org.eclipse.mylyn.wikitext.creole/target/classes
[INFO] 
[INFO] --- maven-resources-plugin:3.0.1:testResources (default-testResources) @ org.eclipse.mylyn.wikitext.creole ---
[INFO] Using 'UTF-8' encoding to copy filtered resources.
[INFO] Copying 0 resource
[INFO] skip non existing resourceDirectory /jobs/genie.mylyn/mylyn-integration-connectors/workspace/org.eclipse.mylyn.docs/wikitext/core/org.eclipse.mylyn.wikitext.creole/src/test/resources
[INFO] 
[INFO] --- maven-compiler-plugin:3.6.0:testCompile (default-testCompile) @ org.eclipse.mylyn.wikitext.creole ---
[INFO] Changes detected - recompiling the module!
[INFO] Compiling 1 source file to /jobs/genie.mylyn/mylyn-integration-connectors/workspace/org.eclipse.mylyn.docs/wikitext/core/org.eclipse.mylyn.wikitext.creole/target/test-classes
[INFO] 
[INFO] --- maven-surefire-plugin:3.0.0-M4:test (default-test) @ org.eclipse.mylyn.wikitext.creole ---
[INFO] 
[INFO] -------------------------------------------------------
[INFO]  T E S T S
[INFO] -------------------------------------------------------
[INFO] Running org.eclipse.mylyn.internal.wikitext.creole.tests.CreoleLanguageTest
[INFO] Tests run: 25, Failures: 0, Errors: 0, Skipped: 0, Time elapsed: 0.106 s - in org.eclipse.mylyn.internal.wikitext.creole.tests.CreoleLanguageTest
[INFO] 
[INFO] Results:
[INFO] 
[INFO] Tests run: 25, Failures: 0, Errors: 0, Skipped: 0
[INFO] 
[INFO] 
[INFO] --- maven-bundle-plugin:3.2.0:bundle (default-bundle) @ org.eclipse.mylyn.wikitext.creole ---
[WARNING] Bundle org.eclipse.mylyn.docs:org.eclipse.mylyn.wikitext.creole:bundle:3.0.25-SNAPSHOT : Unused Import-Package instructions: [com.google.common*] 
[INFO] 
[INFO] --- maven-source-plugin:3.0.1:jar-no-fork (attach-sources) @ org.eclipse.mylyn.wikitext.creole ---
[INFO] Building jar: /jobs/genie.mylyn/mylyn-integration-connectors/workspace/org.eclipse.mylyn.docs/wikitext/core/org.eclipse.mylyn.wikitext.creole/target/org.eclipse.mylyn.wikitext.creole-3.0.25-SNAPSHOT-sources.jar
[INFO] 
[INFO] -----< org.eclipse.mylyn.docs:org.eclipse.mylyn.wikitext.markdown >-----
[INFO] Building Mylyn WikiText Markdown 3.0.25-SNAPSHOT                 [14/28]
[INFO] -------------------------------[ bundle ]-------------------------------
[INFO] 
[INFO] --- maven-clean-plugin:2.5:clean (default-clean) @ org.eclipse.mylyn.wikitext.markdown ---
[INFO] 
[INFO] --- maven-resources-plugin:3.0.1:resources (default-resources) @ org.eclipse.mylyn.wikitext.markdown ---
[INFO] Using 'UTF-8' encoding to copy filtered resources.
[INFO] Copying 1 resource
[INFO] Copying 1 resource
[INFO] Copying 2 resources
[INFO] 
[INFO] --- maven-compiler-plugin:3.6.0:compile (default-compile) @ org.eclipse.mylyn.wikitext.markdown ---
[INFO] Changes detected - recompiling the module!
[INFO] Compiling 31 source files to /jobs/genie.mylyn/mylyn-integration-connectors/workspace/org.eclipse.mylyn.docs/wikitext/core/org.eclipse.mylyn.wikitext.markdown/target/classes
[INFO] 
[INFO] --- maven-resources-plugin:3.0.1:testResources (default-testResources) @ org.eclipse.mylyn.wikitext.markdown ---
[INFO] Using 'UTF-8' encoding to copy filtered resources.
[INFO] Copying 0 resource
[INFO] skip non existing resourceDirectory /jobs/genie.mylyn/mylyn-integration-connectors/workspace/org.eclipse.mylyn.docs/wikitext/core/org.eclipse.mylyn.wikitext.markdown/src/test/resources
[INFO] 
[INFO] --- maven-compiler-plugin:3.6.0:testCompile (default-testCompile) @ org.eclipse.mylyn.wikitext.markdown ---
[INFO] Changes detected - recompiling the module!
[INFO] Compiling 13 source files to /jobs/genie.mylyn/mylyn-integration-connectors/workspace/org.eclipse.mylyn.docs/wikitext/core/org.eclipse.mylyn.wikitext.markdown/target/test-classes
[INFO] 
[INFO] --- maven-surefire-plugin:3.0.0-M4:test (default-test) @ org.eclipse.mylyn.wikitext.markdown ---
[INFO] 
[INFO] -------------------------------------------------------
[INFO]  T E S T S
[INFO] -------------------------------------------------------
[INFO] Running org.eclipse.mylyn.internal.wikitext.markdown.tests.MarkdownLanguageBlockElementsTest
[INFO] Tests run: 64, Failures: 0, Errors: 0, Skipped: 0, Time elapsed: 0.122 s - in org.eclipse.mylyn.internal.wikitext.markdown.tests.MarkdownLanguageBlockElementsTest
[INFO] Running org.eclipse.mylyn.internal.wikitext.markdown.tests.MarkdownLanguageTest
[INFO] Tests run: 5, Failures: 0, Errors: 0, Skipped: 0, Time elapsed: 0.022 s - in org.eclipse.mylyn.internal.wikitext.markdown.tests.MarkdownLanguageTest
[INFO] Running org.eclipse.mylyn.internal.wikitext.markdown.tests.MarkdownLanguageMiscellaneousTest
[INFO] Tests run: 29, Failures: 0, Errors: 0, Skipped: 0, Time elapsed: 0.015 s - in org.eclipse.mylyn.internal.wikitext.markdown.tests.MarkdownLanguageMiscellaneousTest
[INFO] Running org.eclipse.mylyn.internal.wikitext.markdown.tests.MarkdownLanguageSpanElementsTest
[INFO] Tests run: 44, Failures: 0, Errors: 0, Skipped: 0, Time elapsed: 0.021 s - in org.eclipse.mylyn.internal.wikitext.markdown.tests.MarkdownLanguageSpanElementsTest
[INFO] Running org.eclipse.mylyn.internal.wikitext.markdown.tests.MarkdownHeadingTest
[INFO] Tests run: 20, Failures: 0, Errors: 0, Skipped: 0, Time elapsed: 0.033 s - in org.eclipse.mylyn.internal.wikitext.markdown.tests.MarkdownHeadingTest
[INFO] Running org.eclipse.mylyn.internal.wikitext.markdown.tests.MarkdownLanguageParagraphBreakingBlocksDisabledTest
[INFO] Tests run: 5, Failures: 0, Errors: 0, Skipped: 0, Time elapsed: 0.003 s - in org.eclipse.mylyn.internal.wikitext.markdown.tests.MarkdownLanguageParagraphBreakingBlocksDisabledTest
[INFO] Running org.eclipse.mylyn.internal.wikitext.markdown.tests.MarkdownReferenceValidationRuleTest
[INFO] Tests run: 2, Failures: 0, Errors: 0, Skipped: 0, Time elapsed: 0.01 s - in org.eclipse.mylyn.internal.wikitext.markdown.tests.MarkdownReferenceValidationRuleTest
[INFO] Running org.eclipse.mylyn.internal.wikitext.markdown.tests.LinkDefinitionParserTest
[INFO] Tests run: 12, Failures: 0, Errors: 0, Skipped: 0, Time elapsed: 0.002 s - in org.eclipse.mylyn.internal.wikitext.markdown.tests.LinkDefinitionParserTest
[INFO] Running org.eclipse.mylyn.internal.wikitext.markdown.tests.MarkdownDocumentBuilderTest
Feb 12, 2021 9:01:27 AM org.eclipse.mylyn.wikitext.markdown.internal.MarkdownDocumentBuilder computeSpan
WARNING: Unexpected block type: UNDERLINED
Feb 12, 2021 9:01:27 AM org.eclipse.mylyn.wikitext.markdown.internal.MarkdownDocumentBuilder computeBlock
WARNING: Unexpected block type: FOOTNOTE
[INFO] Tests run: 63, Failures: 0, Errors: 0, Skipped: 0, Time elapsed: 0.034 s - in org.eclipse.mylyn.internal.wikitext.markdown.tests.MarkdownDocumentBuilderTest
[INFO] Running org.eclipse.mylyn.internal.wikitext.markdown.tests.MarkdownRoundTripTest
[INFO] Tests run: 1, Failures: 0, Errors: 0, Skipped: 0, Time elapsed: 0.001 s - in org.eclipse.mylyn.internal.wikitext.markdown.tests.MarkdownRoundTripTest
[INFO] Running org.eclipse.mylyn.internal.wikitext.markdown.tests.LinkDefinitionValidationRuleTest
[INFO] Tests run: 8, Failures: 0, Errors: 0, Skipped: 0, Time elapsed: 0.005 s - in org.eclipse.mylyn.internal.wikitext.markdown.tests.LinkDefinitionValidationRuleTest
[INFO] Running org.eclipse.mylyn.wikitext.markdown.internal.GfmIdGenerationStrategyTest
[INFO] Tests run: 8, Failures: 0, Errors: 0, Skipped: 0, Time elapsed: 0.002 s - in org.eclipse.mylyn.wikitext.markdown.internal.GfmIdGenerationStrategyTest
[INFO] 
[INFO] Results:
[INFO] 
[INFO] Tests run: 261, Failures: 0, Errors: 0, Skipped: 0
[INFO] 
[INFO] 
[INFO] --- maven-bundle-plugin:3.2.0:bundle (default-bundle) @ org.eclipse.mylyn.wikitext.markdown ---
[INFO] 
[INFO] --- maven-source-plugin:3.0.1:jar-no-fork (attach-sources) @ org.eclipse.mylyn.wikitext.markdown ---
[INFO] Building jar: /jobs/genie.mylyn/mylyn-integration-connectors/workspace/org.eclipse.mylyn.docs/wikitext/core/org.eclipse.mylyn.wikitext.markdown/target/org.eclipse.mylyn.wikitext.markdown-3.0.25-SNAPSHOT-sources.jar
[INFO] 
[INFO] --< org.eclipse.mylyn.docs:org.eclipse.mylyn.wikitext.mediawiki.ant >---
[INFO] Building Mylyn WikiText MediaWiki Ant 3.0.25-SNAPSHOT            [15/28]
[INFO] -------------------------------[ bundle ]-------------------------------
[INFO] 
[INFO] --- maven-clean-plugin:2.5:clean (default-clean) @ org.eclipse.mylyn.wikitext.mediawiki.ant ---
[INFO] 
[INFO] --- maven-resources-plugin:3.0.1:resources (default-resources) @ org.eclipse.mylyn.wikitext.mediawiki.ant ---
[INFO] Using 'UTF-8' encoding to copy filtered resources.
[INFO] Copying 2 resources
[INFO] skip non existing resourceDirectory /jobs/genie.mylyn/mylyn-integration-connectors/workspace/org.eclipse.mylyn.docs/wikitext/core/org.eclipse.mylyn.wikitext.mediawiki.ant/src/main/resources
[INFO] Copying 1 resource
[INFO] 
[INFO] --- maven-compiler-plugin:3.6.0:compile (default-compile) @ org.eclipse.mylyn.wikitext.mediawiki.ant ---
[INFO] Changes detected - recompiling the module!
[INFO] Compiling 7 source files to /jobs/genie.mylyn/mylyn-integration-connectors/workspace/org.eclipse.mylyn.docs/wikitext/core/org.eclipse.mylyn.wikitext.mediawiki.ant/target/classes
[INFO] 
[INFO] --- maven-resources-plugin:3.0.1:testResources (default-testResources) @ org.eclipse.mylyn.wikitext.mediawiki.ant ---
[INFO] Using 'UTF-8' encoding to copy filtered resources.
[INFO] Copying 0 resource
[INFO] Copying 3 resources
[INFO] 
[INFO] --- maven-compiler-plugin:3.6.0:testCompile (default-testCompile) @ org.eclipse.mylyn.wikitext.mediawiki.ant ---
[INFO] Changes detected - recompiling the module!
[INFO] Compiling 7 source files to /jobs/genie.mylyn/mylyn-integration-connectors/workspace/org.eclipse.mylyn.docs/wikitext/core/org.eclipse.mylyn.wikitext.mediawiki.ant/target/test-classes
[INFO] 
[INFO] --- maven-surefire-plugin:3.0.0-M4:test (default-test) @ org.eclipse.mylyn.wikitext.mediawiki.ant ---
[INFO] 
[INFO] -------------------------------------------------------
[INFO]  T E S T S
[INFO] -------------------------------------------------------
[INFO] Running org.eclipse.mylyn.wikitext.mediawiki.ant.internal.tasks.WikiToDocTaskIntegrationTest
[INFO] Tests run: 1, Failures: 0, Errors: 0, Skipped: 0, Time elapsed: 0.23 s - in org.eclipse.mylyn.wikitext.mediawiki.ant.internal.tasks.WikiToDocTaskIntegrationTest
[INFO] Running org.eclipse.mylyn.wikitext.mediawiki.ant.internal.tasks.WikiToDocTaskTest
[INFO] Tests run: 4, Failures: 0, Errors: 0, Skipped: 0, Time elapsed: 0.029 s - in org.eclipse.mylyn.wikitext.mediawiki.ant.internal.tasks.WikiToDocTaskTest
[INFO] Running org.eclipse.mylyn.wikitext.mediawiki.ant.internal.tasks.MediaWikiImageFetcherTest
[INFO] Tests run: 1, Failures: 0, Errors: 0, Skipped: 0, Time elapsed: 0.011 s - in org.eclipse.mylyn.wikitext.mediawiki.ant.internal.tasks.MediaWikiImageFetcherTest
[INFO] 
[INFO] Results:
[INFO] 
[INFO] Tests run: 6, Failures: 0, Errors: 0, Skipped: 0
[INFO] 
[INFO] 
[INFO] --- maven-bundle-plugin:3.2.0:bundle (default-bundle) @ org.eclipse.mylyn.wikitext.mediawiki.ant ---
[WARNING] Bundle org.eclipse.mylyn.docs:org.eclipse.mylyn.wikitext.mediawiki.ant:bundle:3.0.25-SNAPSHOT : Unused Import-Package instructions: [com.google.common*] 
[INFO] 
[INFO] --- maven-source-plugin:3.0.1:jar-no-fork (attach-sources) @ org.eclipse.mylyn.wikitext.mediawiki.ant ---
[INFO] Building jar: /jobs/genie.mylyn/mylyn-integration-connectors/workspace/org.eclipse.mylyn.docs/wikitext/core/org.eclipse.mylyn.wikitext.mediawiki.ant/target/org.eclipse.mylyn.wikitext.mediawiki.ant-3.0.25-SNAPSHOT-sources.jar
[INFO] 
[INFO] -----< org.eclipse.mylyn.docs:org.eclipse.mylyn.wikitext.tracwiki >-----
[INFO] Building Mylyn WikiText TracWiki 3.0.25-SNAPSHOT                 [16/28]
[INFO] -------------------------------[ bundle ]-------------------------------
[INFO] 
[INFO] --- maven-clean-plugin:2.5:clean (default-clean) @ org.eclipse.mylyn.wikitext.tracwiki ---
[INFO] 
[INFO] --- maven-resources-plugin:3.0.1:resources (default-resources) @ org.eclipse.mylyn.wikitext.tracwiki ---
[INFO] Using 'UTF-8' encoding to copy filtered resources.
[INFO] Copying 0 resource
[INFO] Copying 1 resource
[INFO] Copying 2 resources
[INFO] 
[INFO] --- maven-compiler-plugin:3.6.0:compile (default-compile) @ org.eclipse.mylyn.wikitext.tracwiki ---
[INFO] Changes detected - recompiling the module!
[INFO] Compiling 26 source files to /jobs/genie.mylyn/mylyn-integration-connectors/workspace/org.eclipse.mylyn.docs/wikitext/core/org.eclipse.mylyn.wikitext.tracwiki/target/classes
[INFO] 
[INFO] --- maven-resources-plugin:3.0.1:testResources (default-testResources) @ org.eclipse.mylyn.wikitext.tracwiki ---
[INFO] Using 'UTF-8' encoding to copy filtered resources.
[INFO] Copying 0 resource
[INFO] skip non existing resourceDirectory /jobs/genie.mylyn/mylyn-integration-connectors/workspace/org.eclipse.mylyn.docs/wikitext/core/org.eclipse.mylyn.wikitext.tracwiki/src/test/resources
[INFO] 
[INFO] --- maven-compiler-plugin:3.6.0:testCompile (default-testCompile) @ org.eclipse.mylyn.wikitext.tracwiki ---
[INFO] Changes detected - recompiling the module!
[INFO] Compiling 2 source files to /jobs/genie.mylyn/mylyn-integration-connectors/workspace/org.eclipse.mylyn.docs/wikitext/core/org.eclipse.mylyn.wikitext.tracwiki/target/test-classes
[INFO] 
[INFO] --- maven-surefire-plugin:3.0.0-M4:test (default-test) @ org.eclipse.mylyn.wikitext.tracwiki ---
[INFO] 
[INFO] -------------------------------------------------------
[INFO]  T E S T S
[INFO] -------------------------------------------------------
[INFO] Running org.eclipse.mylyn.wikitext.tracwiki.TracWikiLanguageTest
[INFO] Tests run: 87, Failures: 0, Errors: 0, Skipped: 0, Time elapsed: 0.18 s - in org.eclipse.mylyn.wikitext.tracwiki.TracWikiLanguageTest
[INFO] Running org.eclipse.mylyn.wikitext.tracwiki.WikiWordReplacementTokenTest
[INFO] Tests run: 1, Failures: 0, Errors: 0, Skipped: 0, Time elapsed: 0.003 s - in org.eclipse.mylyn.wikitext.tracwiki.WikiWordReplacementTokenTest
[INFO] 
[INFO] Results:
[INFO] 
[INFO] Tests run: 88, Failures: 0, Errors: 0, Skipped: 0
[INFO] 
[INFO] 
[INFO] --- maven-bundle-plugin:3.2.0:bundle (default-bundle) @ org.eclipse.mylyn.wikitext.tracwiki ---
[WARNING] Bundle org.eclipse.mylyn.docs:org.eclipse.mylyn.wikitext.tracwiki:bundle:3.0.25-SNAPSHOT : Unused Import-Package instructions: [com.google.common*] 
[INFO] 
[INFO] --- maven-source-plugin:3.0.1:jar-no-fork (attach-sources) @ org.eclipse.mylyn.wikitext.tracwiki ---
[INFO] Building jar: /jobs/genie.mylyn/mylyn-integration-connectors/workspace/org.eclipse.mylyn.docs/wikitext/core/org.eclipse.mylyn.wikitext.tracwiki/target/org.eclipse.mylyn.wikitext.tracwiki-3.0.25-SNAPSHOT-sources.jar
[INFO] 
[INFO] ------< org.eclipse.mylyn.docs:org.eclipse.mylyn.wikitext.twiki >-------
[INFO] Building Mylyn WikiText Twiki 3.0.25-SNAPSHOT                    [17/28]
[INFO] -------------------------------[ bundle ]-------------------------------
[INFO] 
[INFO] --- maven-clean-plugin:2.5:clean (default-clean) @ org.eclipse.mylyn.wikitext.twiki ---
[INFO] 
[INFO] --- maven-resources-plugin:3.0.1:resources (default-resources) @ org.eclipse.mylyn.wikitext.twiki ---
[INFO] Using 'UTF-8' encoding to copy filtered resources.
[INFO] Copying 1 resource
[INFO] Copying 1 resource
[INFO] Copying 2 resources
[INFO] 
[INFO] --- maven-compiler-plugin:3.6.0:compile (default-compile) @ org.eclipse.mylyn.wikitext.twiki ---
[INFO] Changes detected - recompiling the module!
[INFO] Compiling 19 source files to /jobs/genie.mylyn/mylyn-integration-connectors/workspace/org.eclipse.mylyn.docs/wikitext/core/org.eclipse.mylyn.wikitext.twiki/target/classes
[INFO] 
[INFO] --- maven-resources-plugin:3.0.1:testResources (default-testResources) @ org.eclipse.mylyn.wikitext.twiki ---
[INFO] Using 'UTF-8' encoding to copy filtered resources.
[INFO] Copying 0 resource
[INFO] skip non existing resourceDirectory /jobs/genie.mylyn/mylyn-integration-connectors/workspace/org.eclipse.mylyn.docs/wikitext/core/org.eclipse.mylyn.wikitext.twiki/src/test/resources
[INFO] 
[INFO] --- maven-compiler-plugin:3.6.0:testCompile (default-testCompile) @ org.eclipse.mylyn.wikitext.twiki ---
[INFO] Changes detected - recompiling the module!
[INFO] Compiling 2 source files to /jobs/genie.mylyn/mylyn-integration-connectors/workspace/org.eclipse.mylyn.docs/wikitext/core/org.eclipse.mylyn.wikitext.twiki/target/test-classes
[INFO] 
[INFO] --- maven-surefire-plugin:3.0.0-M4:test (default-test) @ org.eclipse.mylyn.wikitext.twiki ---
[INFO] 
[INFO] -------------------------------------------------------
[INFO]  T E S T S
[INFO] -------------------------------------------------------
[INFO] Running org.eclipse.mylyn.internal.wikitext.twiki.tests.TWikiLanguageTest
[INFO] Tests run: 37, Failures: 0, Errors: 0, Skipped: 0, Time elapsed: 0.114 s - in org.eclipse.mylyn.internal.wikitext.twiki.tests.TWikiLanguageTest
[INFO] Running org.eclipse.mylyn.wikitext.twiki.internal.validation.ListWhitespaceValidationRuleTest
[INFO] Tests run: 9, Failures: 0, Errors: 0, Skipped: 0, Time elapsed: 0.007 s - in org.eclipse.mylyn.wikitext.twiki.internal.validation.ListWhitespaceValidationRuleTest
[INFO] 
[INFO] Results:
[INFO] 
[INFO] Tests run: 46, Failures: 0, Errors: 0, Skipped: 0
[INFO] 
[INFO] 
[INFO] --- maven-bundle-plugin:3.2.0:bundle (default-bundle) @ org.eclipse.mylyn.wikitext.twiki ---
[WARNING] Bundle org.eclipse.mylyn.docs:org.eclipse.mylyn.wikitext.twiki:bundle:3.0.25-SNAPSHOT : Unused Import-Package instructions: [com.google.common*] 
[INFO] 
[INFO] --- maven-source-plugin:3.0.1:jar-no-fork (attach-sources) @ org.eclipse.mylyn.wikitext.twiki ---
[INFO] Building jar: /jobs/genie.mylyn/mylyn-integration-connectors/workspace/org.eclipse.mylyn.docs/wikitext/core/org.eclipse.mylyn.wikitext.twiki/target/org.eclipse.mylyn.wikitext.twiki-3.0.25-SNAPSHOT-sources.jar
[INFO] 
[INFO] ----------< org.eclipse.mylyn.docs:wikitext.core.repository >-----------
[INFO] Building Mylyn WikiText Core p2 Repository 3.0.25-SNAPSHOT       [18/28]
[INFO] --------------------------------[ pom ]---------------------------------
[INFO] 
[INFO] --- maven-clean-plugin:2.5:clean (default-clean) @ wikitext.core.repository ---
[INFO] 
[INFO] --- maven-antrun-plugin:1.6:run (create-unsigned-p2-site) @ wikitext.core.repository ---
[INFO] Executing tasks

main:
     [echo] creating repository with version 3.0.25-SNAPSHOT
     [copy] Copying 1 file to /jobs/genie.mylyn/mylyn-integration-connectors/workspace/org.eclipse.mylyn.docs/wikitext/core/repository
[INFO] Executed tasks
[INFO] 
[INFO] --- maven-invoker-plugin:2.0.0:install (two-part-repository-build) @ wikitext.core.repository ---
[INFO] Installing /jobs/genie.mylyn/mylyn-integration-connectors/workspace/org.eclipse.mylyn.docs/wikitext/core/pom.xml to /jobs/genie.mylyn/mylyn-integration-connectors/workspace/org.eclipse.mylyn.docs/wikitext/core/repository/.local-repo/org/eclipse/mylyn/docs/wikitext.core/3.0.25-SNAPSHOT/wikitext.core-3.0.25-SNAPSHOT.pom
[INFO] Installing /jobs/genie.mylyn/mylyn-integration-connectors/workspace/org.eclipse.mylyn.docs/wikitext/core/org.eclipse.mylyn.wikitext/pom.xml to /jobs/genie.mylyn/mylyn-integration-connectors/workspace/org.eclipse.mylyn.docs/wikitext/core/repository/.local-repo/org/eclipse/mylyn/docs/org.eclipse.mylyn.wikitext/3.0.25-SNAPSHOT/org.eclipse.mylyn.wikitext-3.0.25-SNAPSHOT.pom
[INFO] Installing /jobs/genie.mylyn/mylyn-integration-connectors/workspace/org.eclipse.mylyn.docs/wikitext/core/org.eclipse.mylyn.wikitext/target/org.eclipse.mylyn.wikitext-3.0.25-SNAPSHOT.jar to /jobs/genie.mylyn/mylyn-integration-connectors/workspace/org.eclipse.mylyn.docs/wikitext/core/repository/.local-repo/org/eclipse/mylyn/docs/org.eclipse.mylyn.wikitext/3.0.25-SNAPSHOT/org.eclipse.mylyn.wikitext-3.0.25-SNAPSHOT.jar
[INFO] Installing /jobs/genie.mylyn/mylyn-integration-connectors/workspace/org.eclipse.mylyn.docs/wikitext/core/org.eclipse.mylyn.wikitext/target/org.eclipse.mylyn.wikitext-3.0.25-SNAPSHOT-sources.jar to /jobs/genie.mylyn/mylyn-integration-connectors/workspace/org.eclipse.mylyn.docs/wikitext/core/repository/.local-repo/org/eclipse/mylyn/docs/org.eclipse.mylyn.wikitext/3.0.25-SNAPSHOT/org.eclipse.mylyn.wikitext-3.0.25-SNAPSHOT-sources.jar
[INFO] Installing /jobs/genie.mylyn/mylyn-integration-connectors/workspace/org.eclipse.mylyn.docs/wikitext/core/org.eclipse.mylyn.wikitext.toolkit/pom.xml to /jobs/genie.mylyn/mylyn-integration-connectors/workspace/org.eclipse.mylyn.docs/wikitext/core/repository/.local-repo/org/eclipse/mylyn/docs/org.eclipse.mylyn.wikitext.toolkit/3.0.25-SNAPSHOT/org.eclipse.mylyn.wikitext.toolkit-3.0.25-SNAPSHOT.pom
[INFO] Installing /jobs/genie.mylyn/mylyn-integration-connectors/workspace/org.eclipse.mylyn.docs/wikitext/core/org.eclipse.mylyn.wikitext.toolkit/target/org.eclipse.mylyn.wikitext.toolkit-3.0.25-SNAPSHOT.jar to /jobs/genie.mylyn/mylyn-integration-connectors/workspace/org.eclipse.mylyn.docs/wikitext/core/repository/.local-repo/org/eclipse/mylyn/docs/org.eclipse.mylyn.wikitext.toolkit/3.0.25-SNAPSHOT/org.eclipse.mylyn.wikitext.toolkit-3.0.25-SNAPSHOT.jar
[INFO] Installing /jobs/genie.mylyn/mylyn-integration-connectors/workspace/org.eclipse.mylyn.docs/wikitext/core/org.eclipse.mylyn.wikitext.toolkit/target/org.eclipse.mylyn.wikitext.toolkit-3.0.25-SNAPSHOT-sources.jar to /jobs/genie.mylyn/mylyn-integration-connectors/workspace/org.eclipse.mylyn.docs/wikitext/core/repository/.local-repo/org/eclipse/mylyn/docs/org.eclipse.mylyn.wikitext.toolkit/3.0.25-SNAPSHOT/org.eclipse.mylyn.wikitext.toolkit-3.0.25-SNAPSHOT-sources.jar
[INFO] Installing /jobs/genie.mylyn/mylyn-integration-connectors/workspace/org.eclipse.mylyn.docs/wikitext/core/org.eclipse.mylyn.wikitext.textile/pom.xml to /jobs/genie.mylyn/mylyn-integration-connectors/workspace/org.eclipse.mylyn.docs/wikitext/core/repository/.local-repo/org/eclipse/mylyn/docs/org.eclipse.mylyn.wikitext.textile/3.0.25-SNAPSHOT/org.eclipse.mylyn.wikitext.textile-3.0.25-SNAPSHOT.pom
[INFO] Installing /jobs/genie.mylyn/mylyn-integration-connectors/workspace/org.eclipse.mylyn.docs/wikitext/core/org.eclipse.mylyn.wikitext.textile/target/org.eclipse.mylyn.wikitext.textile-3.0.25-SNAPSHOT.jar to /jobs/genie.mylyn/mylyn-integration-connectors/workspace/org.eclipse.mylyn.docs/wikitext/core/repository/.local-repo/org/eclipse/mylyn/docs/org.eclipse.mylyn.wikitext.textile/3.0.25-SNAPSHOT/org.eclipse.mylyn.wikitext.textile-3.0.25-SNAPSHOT.jar
[INFO] Installing /jobs/genie.mylyn/mylyn-integration-connectors/workspace/org.eclipse.mylyn.docs/wikitext/core/org.eclipse.mylyn.wikitext.textile/target/org.eclipse.mylyn.wikitext.textile-3.0.25-SNAPSHOT-sources.jar to /jobs/genie.mylyn/mylyn-integration-connectors/workspace/org.eclipse.mylyn.docs/wikitext/core/repository/.local-repo/org/eclipse/mylyn/docs/org.eclipse.mylyn.wikitext.textile/3.0.25-SNAPSHOT/org.eclipse.mylyn.wikitext.textile-3.0.25-SNAPSHOT-sources.jar
[INFO] Installing /jobs/genie.mylyn/mylyn-integration-connectors/workspace/org.eclipse.mylyn.docs/wikitext/core/org.eclipse.mylyn.wikitext.html/pom.xml to /jobs/genie.mylyn/mylyn-integration-connectors/workspace/org.eclipse.mylyn.docs/wikitext/core/repository/.local-repo/org/eclipse/mylyn/docs/org.eclipse.mylyn.wikitext.html/3.0.25-SNAPSHOT/org.eclipse.mylyn.wikitext.html-3.0.25-SNAPSHOT.pom
[INFO] Installing /jobs/genie.mylyn/mylyn-integration-connectors/workspace/org.eclipse.mylyn.docs/wikitext/core/org.eclipse.mylyn.wikitext.html/target/org.eclipse.mylyn.wikitext.html-3.0.25-SNAPSHOT.jar to /jobs/genie.mylyn/mylyn-integration-connectors/workspace/org.eclipse.mylyn.docs/wikitext/core/repository/.local-repo/org/eclipse/mylyn/docs/org.eclipse.mylyn.wikitext.html/3.0.25-SNAPSHOT/org.eclipse.mylyn.wikitext.html-3.0.25-SNAPSHOT.jar
[INFO] Installing /jobs/genie.mylyn/mylyn-integration-connectors/workspace/org.eclipse.mylyn.docs/wikitext/core/org.eclipse.mylyn.wikitext.html/target/org.eclipse.mylyn.wikitext.html-3.0.25-SNAPSHOT-sources.jar to /jobs/genie.mylyn/mylyn-integration-connectors/workspace/org.eclipse.mylyn.docs/wikitext/core/repository/.local-repo/org/eclipse/mylyn/docs/org.eclipse.mylyn.wikitext.html/3.0.25-SNAPSHOT/org.eclipse.mylyn.wikitext.html-3.0.25-SNAPSHOT-sources.jar
[INFO] Installing /jobs/genie.mylyn/mylyn-integration-connectors/workspace/org.eclipse.mylyn.docs/wikitext/core/org.eclipse.mylyn.wikitext.confluence/pom.xml to /jobs/genie.mylyn/mylyn-integration-connectors/workspace/org.eclipse.mylyn.docs/wikitext/core/repository/.local-repo/org/eclipse/mylyn/docs/org.eclipse.mylyn.wikitext.confluence/3.0.25-SNAPSHOT/org.eclipse.mylyn.wikitext.confluence-3.0.25-SNAPSHOT.pom
[INFO] Installing /jobs/genie.mylyn/mylyn-integration-connectors/workspace/org.eclipse.mylyn.docs/wikitext/core/org.eclipse.mylyn.wikitext.confluence/target/org.eclipse.mylyn.wikitext.confluence-3.0.25-SNAPSHOT.jar to /jobs/genie.mylyn/mylyn-integration-connectors/workspace/org.eclipse.mylyn.docs/wikitext/core/repository/.local-repo/org/eclipse/mylyn/docs/org.eclipse.mylyn.wikitext.confluence/3.0.25-SNAPSHOT/org.eclipse.mylyn.wikitext.confluence-3.0.25-SNAPSHOT.jar
[INFO] Installing /jobs/genie.mylyn/mylyn-integration-connectors/workspace/org.eclipse.mylyn.docs/wikitext/core/org.eclipse.mylyn.wikitext.confluence/target/org.eclipse.mylyn.wikitext.confluence-3.0.25-SNAPSHOT-sources.jar to /jobs/genie.mylyn/mylyn-integration-connectors/workspace/org.eclipse.mylyn.docs/wikitext/core/repository/.local-repo/org/eclipse/mylyn/docs/org.eclipse.mylyn.wikitext.confluence/3.0.25-SNAPSHOT/org.eclipse.mylyn.wikitext.confluence-3.0.25-SNAPSHOT-sources.jar
[INFO] Installing /jobs/genie.mylyn/mylyn-integration-connectors/workspace/org.eclipse.mylyn.docs/wikitext/core/org.eclipse.mylyn.wikitext.mediawiki/pom.xml to /jobs/genie.mylyn/mylyn-integration-connectors/workspace/org.eclipse.mylyn.docs/wikitext/core/repository/.local-repo/org/eclipse/mylyn/docs/org.eclipse.mylyn.wikitext.mediawiki/3.0.25-SNAPSHOT/org.eclipse.mylyn.wikitext.mediawiki-3.0.25-SNAPSHOT.pom
[INFO] Installing /jobs/genie.mylyn/mylyn-integration-connectors/workspace/org.eclipse.mylyn.docs/wikitext/core/org.eclipse.mylyn.wikitext.mediawiki/target/org.eclipse.mylyn.wikitext.mediawiki-3.0.25-SNAPSHOT.jar to /jobs/genie.mylyn/mylyn-integration-connectors/workspace/org.eclipse.mylyn.docs/wikitext/core/repository/.local-repo/org/eclipse/mylyn/docs/org.eclipse.mylyn.wikitext.mediawiki/3.0.25-SNAPSHOT/org.eclipse.mylyn.wikitext.mediawiki-3.0.25-SNAPSHOT.jar
[INFO] Installing /jobs/genie.mylyn/mylyn-integration-connectors/workspace/org.eclipse.mylyn.docs/wikitext/core/org.eclipse.mylyn.wikitext.mediawiki/target/org.eclipse.mylyn.wikitext.mediawiki-3.0.25-SNAPSHOT-sources.jar to /jobs/genie.mylyn/mylyn-integration-connectors/workspace/org.eclipse.mylyn.docs/wikitext/core/repository/.local-repo/org/eclipse/mylyn/docs/org.eclipse.mylyn.wikitext.mediawiki/3.0.25-SNAPSHOT/org.eclipse.mylyn.wikitext.mediawiki-3.0.25-SNAPSHOT-sources.jar
[INFO] Installing /jobs/genie.mylyn/mylyn-integration-connectors/workspace/org.eclipse.mylyn.docs/wikitext/core/org.eclipse.mylyn.wikitext.tests/pom.xml to /jobs/genie.mylyn/mylyn-integration-connectors/workspace/org.eclipse.mylyn.docs/wikitext/core/repository/.local-repo/org/eclipse/mylyn/docs/org.eclipse.mylyn.wikitext.tests/3.0.25-SNAPSHOT/org.eclipse.mylyn.wikitext.tests-3.0.25-SNAPSHOT.pom
[INFO] Installing /jobs/genie.mylyn/mylyn-integration-connectors/workspace/org.eclipse.mylyn.docs/wikitext/core/org.eclipse.mylyn.wikitext.tests/target/org.eclipse.mylyn.wikitext.tests-3.0.25-SNAPSHOT.jar to /jobs/genie.mylyn/mylyn-integration-connectors/workspace/org.eclipse.mylyn.docs/wikitext/core/repository/.local-repo/org/eclipse/mylyn/docs/org.eclipse.mylyn.wikitext.tests/3.0.25-SNAPSHOT/org.eclipse.mylyn.wikitext.tests-3.0.25-SNAPSHOT.jar
[INFO] Installing /jobs/genie.mylyn/mylyn-integration-connectors/workspace/org.eclipse.mylyn.docs/wikitext/core/org.eclipse.mylyn.wikitext.ant/pom.xml to /jobs/genie.mylyn/mylyn-integration-connectors/workspace/org.eclipse.mylyn.docs/wikitext/core/repository/.local-repo/org/eclipse/mylyn/docs/org.eclipse.mylyn.wikitext.ant/3.0.25-SNAPSHOT/org.eclipse.mylyn.wikitext.ant-3.0.25-SNAPSHOT.pom
[INFO] Installing /jobs/genie.mylyn/mylyn-integration-connectors/workspace/org.eclipse.mylyn.docs/wikitext/core/org.eclipse.mylyn.wikitext.ant/target/org.eclipse.mylyn.wikitext.ant-3.0.25-SNAPSHOT.jar to /jobs/genie.mylyn/mylyn-integration-connectors/workspace/org.eclipse.mylyn.docs/wikitext/core/repository/.local-repo/org/eclipse/mylyn/docs/org.eclipse.mylyn.wikitext.ant/3.0.25-SNAPSHOT/org.eclipse.mylyn.wikitext.ant-3.0.25-SNAPSHOT.jar
[INFO] Installing /jobs/genie.mylyn/mylyn-integration-connectors/workspace/org.eclipse.mylyn.docs/wikitext/core/org.eclipse.mylyn.wikitext.ant/target/org.eclipse.mylyn.wikitext.ant-3.0.25-SNAPSHOT-sources.jar to /jobs/genie.mylyn/mylyn-integration-connectors/workspace/org.eclipse.mylyn.docs/wikitext/core/repository/.local-repo/org/eclipse/mylyn/docs/org.eclipse.mylyn.wikitext.ant/3.0.25-SNAPSHOT/org.eclipse.mylyn.wikitext.ant-3.0.25-SNAPSHOT-sources.jar
[INFO] Installing /jobs/genie.mylyn/mylyn-integration-connectors/workspace/org.eclipse.mylyn.docs/wikitext/core/org.eclipse.mylyn.wikitext.maven/pom.xml to /jobs/genie.mylyn/mylyn-integration-connectors/workspace/org.eclipse.mylyn.docs/wikitext/core/repository/.local-repo/org/eclipse/mylyn/docs/org.eclipse.mylyn.wikitext.maven/3.0.25-SNAPSHOT/org.eclipse.mylyn.wikitext.maven-3.0.25-SNAPSHOT.pom
[INFO] Installing /jobs/genie.mylyn/mylyn-integration-connectors/workspace/org.eclipse.mylyn.docs/wikitext/core/org.eclipse.mylyn.wikitext.maven/target/org.eclipse.mylyn.wikitext.maven-3.0.25-SNAPSHOT.jar to /jobs/genie.mylyn/mylyn-integration-connectors/workspace/org.eclipse.mylyn.docs/wikitext/core/repository/.local-repo/org/eclipse/mylyn/docs/org.eclipse.mylyn.wikitext.maven/3.0.25-SNAPSHOT/org.eclipse.mylyn.wikitext.maven-3.0.25-SNAPSHOT.jar
[INFO] Installing /jobs/genie.mylyn/mylyn-integration-connectors/workspace/org.eclipse.mylyn.docs/wikitext/core/org.eclipse.mylyn.wikitext.maven/target/org.eclipse.mylyn.wikitext.maven-3.0.25-SNAPSHOT-sources.jar to /jobs/genie.mylyn/mylyn-integration-connectors/workspace/org.eclipse.mylyn.docs/wikitext/core/repository/.local-repo/org/eclipse/mylyn/docs/org.eclipse.mylyn.wikitext.maven/3.0.25-SNAPSHOT/org.eclipse.mylyn.wikitext.maven-3.0.25-SNAPSHOT-sources.jar
[INFO] Installing /jobs/genie.mylyn/mylyn-integration-connectors/workspace/org.eclipse.mylyn.docs/wikitext/core/org.eclipse.mylyn.wikitext.asciidoc/pom.xml to /jobs/genie.mylyn/mylyn-integration-connectors/workspace/org.eclipse.mylyn.docs/wikitext/core/repository/.local-repo/org/eclipse/mylyn/docs/org.eclipse.mylyn.wikitext.asciidoc/3.0.25-SNAPSHOT/org.eclipse.mylyn.wikitext.asciidoc-3.0.25-SNAPSHOT.pom
[INFO] Installing /jobs/genie.mylyn/mylyn-integration-connectors/workspace/org.eclipse.mylyn.docs/wikitext/core/org.eclipse.mylyn.wikitext.asciidoc/target/org.eclipse.mylyn.wikitext.asciidoc-3.0.25-SNAPSHOT.jar to /jobs/genie.mylyn/mylyn-integration-connectors/workspace/org.eclipse.mylyn.docs/wikitext/core/repository/.local-repo/org/eclipse/mylyn/docs/org.eclipse.mylyn.wikitext.asciidoc/3.0.25-SNAPSHOT/org.eclipse.mylyn.wikitext.asciidoc-3.0.25-SNAPSHOT.jar
[INFO] Installing /jobs/genie.mylyn/mylyn-integration-connectors/workspace/org.eclipse.mylyn.docs/wikitext/core/org.eclipse.mylyn.wikitext.asciidoc/target/org.eclipse.mylyn.wikitext.asciidoc-3.0.25-SNAPSHOT-sources.jar to /jobs/genie.mylyn/mylyn-integration-connectors/workspace/org.eclipse.mylyn.docs/wikitext/core/repository/.local-repo/org/eclipse/mylyn/docs/org.eclipse.mylyn.wikitext.asciidoc/3.0.25-SNAPSHOT/org.eclipse.mylyn.wikitext.asciidoc-3.0.25-SNAPSHOT-sources.jar
[INFO] Installing /jobs/genie.mylyn/mylyn-integration-connectors/workspace/org.eclipse.mylyn.docs/wikitext/core/org.eclipse.mylyn.wikitext.commonmark/pom.xml to /jobs/genie.mylyn/mylyn-integration-connectors/workspace/org.eclipse.mylyn.docs/wikitext/core/repository/.local-repo/org/eclipse/mylyn/docs/org.eclipse.mylyn.wikitext.commonmark/3.0.25-SNAPSHOT/org.eclipse.mylyn.wikitext.commonmark-3.0.25-SNAPSHOT.pom
[INFO] Installing /jobs/genie.mylyn/mylyn-integration-connectors/workspace/org.eclipse.mylyn.docs/wikitext/core/org.eclipse.mylyn.wikitext.commonmark/target/org.eclipse.mylyn.wikitext.commonmark-3.0.25-SNAPSHOT.jar to /jobs/genie.mylyn/mylyn-integration-connectors/workspace/org.eclipse.mylyn.docs/wikitext/core/repository/.local-repo/org/eclipse/mylyn/docs/org.eclipse.mylyn.wikitext.commonmark/3.0.25-SNAPSHOT/org.eclipse.mylyn.wikitext.commonmark-3.0.25-SNAPSHOT.jar
[INFO] Installing /jobs/genie.mylyn/mylyn-integration-connectors/workspace/org.eclipse.mylyn.docs/wikitext/core/org.eclipse.mylyn.wikitext.commonmark/target/org.eclipse.mylyn.wikitext.commonmark-3.0.25-SNAPSHOT-sources.jar to /jobs/genie.mylyn/mylyn-integration-connectors/workspace/org.eclipse.mylyn.docs/wikitext/core/repository/.local-repo/org/eclipse/mylyn/docs/org.eclipse.mylyn.wikitext.commonmark/3.0.25-SNAPSHOT/org.eclipse.mylyn.wikitext.commonmark-3.0.25-SNAPSHOT-sources.jar
[INFO] Installing /jobs/genie.mylyn/mylyn-integration-connectors/workspace/org.eclipse.mylyn.docs/wikitext/core/org.eclipse.mylyn.wikitext.creole/pom.xml to /jobs/genie.mylyn/mylyn-integration-connectors/workspace/org.eclipse.mylyn.docs/wikitext/core/repository/.local-repo/org/eclipse/mylyn/docs/org.eclipse.mylyn.wikitext.creole/3.0.25-SNAPSHOT/org.eclipse.mylyn.wikitext.creole-3.0.25-SNAPSHOT.pom
[INFO] Installing /jobs/genie.mylyn/mylyn-integration-connectors/workspace/org.eclipse.mylyn.docs/wikitext/core/org.eclipse.mylyn.wikitext.creole/target/org.eclipse.mylyn.wikitext.creole-3.0.25-SNAPSHOT.jar to /jobs/genie.mylyn/mylyn-integration-connectors/workspace/org.eclipse.mylyn.docs/wikitext/core/repository/.local-repo/org/eclipse/mylyn/docs/org.eclipse.mylyn.wikitext.creole/3.0.25-SNAPSHOT/org.eclipse.mylyn.wikitext.creole-3.0.25-SNAPSHOT.jar
[INFO] Installing /jobs/genie.mylyn/mylyn-integration-connectors/workspace/org.eclipse.mylyn.docs/wikitext/core/org.eclipse.mylyn.wikitext.creole/target/org.eclipse.mylyn.wikitext.creole-3.0.25-SNAPSHOT-sources.jar to /jobs/genie.mylyn/mylyn-integration-connectors/workspace/org.eclipse.mylyn.docs/wikitext/core/repository/.local-repo/org/eclipse/mylyn/docs/org.eclipse.mylyn.wikitext.creole/3.0.25-SNAPSHOT/org.eclipse.mylyn.wikitext.creole-3.0.25-SNAPSHOT-sources.jar
[INFO] Installing /jobs/genie.mylyn/mylyn-integration-connectors/workspace/org.eclipse.mylyn.docs/wikitext/core/org.eclipse.mylyn.wikitext.markdown/pom.xml to /jobs/genie.mylyn/mylyn-integration-connectors/workspace/org.eclipse.mylyn.docs/wikitext/core/repository/.local-repo/org/eclipse/mylyn/docs/org.eclipse.mylyn.wikitext.markdown/3.0.25-SNAPSHOT/org.eclipse.mylyn.wikitext.markdown-3.0.25-SNAPSHOT.pom
[INFO] Installing /jobs/genie.mylyn/mylyn-integration-connectors/workspace/org.eclipse.mylyn.docs/wikitext/core/org.eclipse.mylyn.wikitext.markdown/target/org.eclipse.mylyn.wikitext.markdown-3.0.25-SNAPSHOT.jar to /jobs/genie.mylyn/mylyn-integration-connectors/workspace/org.eclipse.mylyn.docs/wikitext/core/repository/.local-repo/org/eclipse/mylyn/docs/org.eclipse.mylyn.wikitext.markdown/3.0.25-SNAPSHOT/org.eclipse.mylyn.wikitext.markdown-3.0.25-SNAPSHOT.jar
[INFO] Installing /jobs/genie.mylyn/mylyn-integration-connectors/workspace/org.eclipse.mylyn.docs/wikitext/core/org.eclipse.mylyn.wikitext.markdown/target/org.eclipse.mylyn.wikitext.markdown-3.0.25-SNAPSHOT-sources.jar to /jobs/genie.mylyn/mylyn-integration-connectors/workspace/org.eclipse.mylyn.docs/wikitext/core/repository/.local-repo/org/eclipse/mylyn/docs/org.eclipse.mylyn.wikitext.markdown/3.0.25-SNAPSHOT/org.eclipse.mylyn.wikitext.markdown-3.0.25-SNAPSHOT-sources.jar
[INFO] Installing /jobs/genie.mylyn/mylyn-integration-connectors/workspace/org.eclipse.mylyn.docs/wikitext/core/org.eclipse.mylyn.wikitext.mediawiki.ant/pom.xml to /jobs/genie.mylyn/mylyn-integration-connectors/workspace/org.eclipse.mylyn.docs/wikitext/core/repository/.local-repo/org/eclipse/mylyn/docs/org.eclipse.mylyn.wikitext.mediawiki.ant/3.0.25-SNAPSHOT/org.eclipse.mylyn.wikitext.mediawiki.ant-3.0.25-SNAPSHOT.pom
[INFO] Installing /jobs/genie.mylyn/mylyn-integration-connectors/workspace/org.eclipse.mylyn.docs/wikitext/core/org.eclipse.mylyn.wikitext.mediawiki.ant/target/org.eclipse.mylyn.wikitext.mediawiki.ant-3.0.25-SNAPSHOT.jar to /jobs/genie.mylyn/mylyn-integration-connectors/workspace/org.eclipse.mylyn.docs/wikitext/core/repository/.local-repo/org/eclipse/mylyn/docs/org.eclipse.mylyn.wikitext.mediawiki.ant/3.0.25-SNAPSHOT/org.eclipse.mylyn.wikitext.mediawiki.ant-3.0.25-SNAPSHOT.jar
[INFO] Installing /jobs/genie.mylyn/mylyn-integration-connectors/workspace/org.eclipse.mylyn.docs/wikitext/core/org.eclipse.mylyn.wikitext.mediawiki.ant/target/org.eclipse.mylyn.wikitext.mediawiki.ant-3.0.25-SNAPSHOT-sources.jar to /jobs/genie.mylyn/mylyn-integration-connectors/workspace/org.eclipse.mylyn.docs/wikitext/core/repository/.local-repo/org/eclipse/mylyn/docs/org.eclipse.mylyn.wikitext.mediawiki.ant/3.0.25-SNAPSHOT/org.eclipse.mylyn.wikitext.mediawiki.ant-3.0.25-SNAPSHOT-sources.jar
[INFO] Installing /jobs/genie.mylyn/mylyn-integration-connectors/workspace/org.eclipse.mylyn.docs/wikitext/core/org.eclipse.mylyn.wikitext.tracwiki/pom.xml to /jobs/genie.mylyn/mylyn-integration-connectors/workspace/org.eclipse.mylyn.docs/wikitext/core/repository/.local-repo/org/eclipse/mylyn/docs/org.eclipse.mylyn.wikitext.tracwiki/3.0.25-SNAPSHOT/org.eclipse.mylyn.wikitext.tracwiki-3.0.25-SNAPSHOT.pom
[INFO] Installing /jobs/genie.mylyn/mylyn-integration-connectors/workspace/org.eclipse.mylyn.docs/wikitext/core/org.eclipse.mylyn.wikitext.tracwiki/target/org.eclipse.mylyn.wikitext.tracwiki-3.0.25-SNAPSHOT.jar to /jobs/genie.mylyn/mylyn-integration-connectors/workspace/org.eclipse.mylyn.docs/wikitext/core/repository/.local-repo/org/eclipse/mylyn/docs/org.eclipse.mylyn.wikitext.tracwiki/3.0.25-SNAPSHOT/org.eclipse.mylyn.wikitext.tracwiki-3.0.25-SNAPSHOT.jar
[INFO] Installing /jobs/genie.mylyn/mylyn-integration-connectors/workspace/org.eclipse.mylyn.docs/wikitext/core/org.eclipse.mylyn.wikitext.tracwiki/target/org.eclipse.mylyn.wikitext.tracwiki-3.0.25-SNAPSHOT-sources.jar to /jobs/genie.mylyn/mylyn-integration-connectors/workspace/org.eclipse.mylyn.docs/wikitext/core/repository/.local-repo/org/eclipse/mylyn/docs/org.eclipse.mylyn.wikitext.tracwiki/3.0.25-SNAPSHOT/org.eclipse.mylyn.wikitext.tracwiki-3.0.25-SNAPSHOT-sources.jar
[INFO] Installing /jobs/genie.mylyn/mylyn-integration-connectors/workspace/org.eclipse.mylyn.docs/wikitext/core/org.eclipse.mylyn.wikitext.twiki/pom.xml to /jobs/genie.mylyn/mylyn-integration-connectors/workspace/org.eclipse.mylyn.docs/wikitext/core/repository/.local-repo/org/eclipse/mylyn/docs/org.eclipse.mylyn.wikitext.twiki/3.0.25-SNAPSHOT/org.eclipse.mylyn.wikitext.twiki-3.0.25-SNAPSHOT.pom
[INFO] Installing /jobs/genie.mylyn/mylyn-integration-connectors/workspace/org.eclipse.mylyn.docs/wikitext/core/org.eclipse.mylyn.wikitext.twiki/target/org.eclipse.mylyn.wikitext.twiki-3.0.25-SNAPSHOT.jar to /jobs/genie.mylyn/mylyn-integration-connectors/workspace/org.eclipse.mylyn.docs/wikitext/core/repository/.local-repo/org/eclipse/mylyn/docs/org.eclipse.mylyn.wikitext.twiki/3.0.25-SNAPSHOT/org.eclipse.mylyn.wikitext.twiki-3.0.25-SNAPSHOT.jar
[INFO] Installing /jobs/genie.mylyn/mylyn-integration-connectors/workspace/org.eclipse.mylyn.docs/wikitext/core/org.eclipse.mylyn.wikitext.twiki/target/org.eclipse.mylyn.wikitext.twiki-3.0.25-SNAPSHOT-sources.jar to /jobs/genie.mylyn/mylyn-integration-connectors/workspace/org.eclipse.mylyn.docs/wikitext/core/repository/.local-repo/org/eclipse/mylyn/docs/org.eclipse.mylyn.wikitext.twiki/3.0.25-SNAPSHOT/org.eclipse.mylyn.wikitext.twiki-3.0.25-SNAPSHOT-sources.jar
[INFO] Installing /jobs/genie.mylyn/mylyn-integration-connectors/workspace/org.eclipse.mylyn.docs/wikitext/core/repository/pom.xml to /jobs/genie.mylyn/mylyn-integration-connectors/workspace/org.eclipse.mylyn.docs/wikitext/core/repository/.local-repo/org/eclipse/mylyn/docs/wikitext.core.repository/3.0.25-SNAPSHOT/wikitext.core.repository-3.0.25-SNAPSHOT.pom
[INFO] 
[INFO] --- maven-invoker-plugin:2.0.0:run (two-part-repository-build) @ wikitext.core.repository ---
[WARNING] Filtering of parent/child POMs is not supported without cloning the projects
[INFO] Building: repository-pom.xml
[INFO] Picked up JAVA_TOOL_OPTIONS: -Xmx2G -Djava.io.tmpdir=/tmp/genie.mylyn -DforkCount=1
[INFO] [INFO] Scanning for projects...
[INFO] [INFO] Downloading from reficio: http://repo.reficio.org/maven/org/apache/felix/maven-bundle-plugin/3.2.0/maven-bundle-plugin-3.2.0.pom
[INFO] [WARNING] Checksum validation failed, expected <!DOCTYPE but is 5fcb99bce285a5a310aec1c6c2a8ef41162fa102 from reficio for http://repo.reficio.org/maven/org/apache/felix/maven-bundle-plugin/3.2.0/maven-bundle-plugin-3.2.0.pom
[INFO] [WARNING] Could not validate integrity of download from http://repo.reficio.org/maven/org/apache/felix/maven-bundle-plugin/3.2.0/maven-bundle-plugin-3.2.0.pom: Checksum validation failed, expected <!DOCTYPE but is 5fcb99bce285a5a310aec1c6c2a8ef41162fa102
[INFO] [WARNING] Checksum validation failed, expected <!DOCTYPE but is 5fcb99bce285a5a310aec1c6c2a8ef41162fa102 from reficio for http://repo.reficio.org/maven/org/apache/felix/maven-bundle-plugin/3.2.0/maven-bundle-plugin-3.2.0.pom
[INFO] [INFO] Downloaded from reficio: http://repo.reficio.org/maven/org/apache/felix/maven-bundle-plugin/3.2.0/maven-bundle-plugin-3.2.0.pom (6.1 kB at 9.0 kB/s)
[INFO] [WARNING] The POM for org.apache.felix:maven-bundle-plugin:jar:3.2.0 is invalid, transitive dependencies (if any) will not be available, enable debug logging for more details
[INFO] [INFO] Downloading from reficio: http://repo.reficio.org/maven/org/apache/felix/maven-bundle-plugin/3.2.0/maven-bundle-plugin-3.2.0.jar
[INFO] [INFO] Downloading from reficio: http://repo.reficio.org/maven/org/codehaus/plexus/plexus-utils/1.1/plexus-utils-1.1.jar
[INFO] [WARNING] Checksum validation failed, expected <!DOCTYPE but is 5fcb99bce285a5a310aec1c6c2a8ef41162fa102 from reficio for http://repo.reficio.org/maven/org/apache/felix/maven-bundle-plugin/3.2.0/maven-bundle-plugin-3.2.0.jar
[INFO] [WARNING] Checksum validation failed, expected <!DOCTYPE but is 5fcb99bce285a5a310aec1c6c2a8ef41162fa102 from reficio for http://repo.reficio.org/maven/org/codehaus/plexus/plexus-utils/1.1/plexus-utils-1.1.jar
[INFO] [WARNING] Could not validate integrity of download from http://repo.reficio.org/maven/org/apache/felix/maven-bundle-plugin/3.2.0/maven-bundle-plugin-3.2.0.jar: Checksum validation failed, expected <!DOCTYPE but is 5fcb99bce285a5a310aec1c6c2a8ef41162fa102
[INFO] [WARNING] Checksum validation failed, expected <!DOCTYPE but is 5fcb99bce285a5a310aec1c6c2a8ef41162fa102 from reficio for http://repo.reficio.org/maven/org/apache/felix/maven-bundle-plugin/3.2.0/maven-bundle-plugin-3.2.0.jar
[INFO] [INFO] Downloaded from reficio: http://repo.reficio.org/maven/org/apache/felix/maven-bundle-plugin/3.2.0/maven-bundle-plugin-3.2.0.jar (6.1 kB at 16 kB/s)
[INFO] [WARNING] Could not validate integrity of download from http://repo.reficio.org/maven/org/codehaus/plexus/plexus-utils/1.1/plexus-utils-1.1.jar: Checksum validation failed, expected <!DOCTYPE but is 5fcb99bce285a5a310aec1c6c2a8ef41162fa102
[INFO] [WARNING] Checksum validation failed, expected <!DOCTYPE but is 5fcb99bce285a5a310aec1c6c2a8ef41162fa102 from reficio for http://repo.reficio.org/maven/org/codehaus/plexus/plexus-utils/1.1/plexus-utils-1.1.jar
[INFO] [INFO] Downloaded from reficio: http://repo.reficio.org/maven/org/codehaus/plexus/plexus-utils/1.1/plexus-utils-1.1.jar (6.1 kB at 15 kB/s)
[INFO] [ERROR] Invalid extension descriptor for org.apache.felix:maven-bundle-plugin:3.2.0: error in opening zip file
[INFO] [INFO] Downloading from eclipse.maven.central.mirror: https://repo.eclipse.org/content/repositories/maven_central/org/apache/felix/maven-bundle-plugin/3.2.0/maven-bundle-plugin-3.2.0.pom
[INFO] [INFO] Downloaded from eclipse.maven.central.mirror: https://repo.eclipse.org/content/repositories/maven_central/org/apache/felix/maven-bundle-plugin/3.2.0/maven-bundle-plugin-3.2.0.pom (0 B at 0 B/s)
[INFO] [WARNING] The POM for org.apache.felix:maven-bundle-plugin:jar:3.2.0 is invalid, transitive dependencies (if any) will not be available, enable debug logging for more details
[INFO] [INFO] Downloading from eclipse.maven.central.mirror: https://repo.eclipse.org/content/repositories/maven_central/org/apache/felix/maven-bundle-plugin/3.2.0/maven-bundle-plugin-3.2.0.jar
[INFO] [INFO] Downloading from eclipse.maven.central.mirror: https://repo.eclipse.org/content/repositories/maven_central/org/codehaus/plexus/plexus-utils/1.1/plexus-utils-1.1.jar
[INFO] [INFO] Downloaded from eclipse.maven.central.mirror: https://repo.eclipse.org/content/repositories/maven_central/org/codehaus/plexus/plexus-utils/1.1/plexus-utils-1.1.jar (0 B at 0 B/s)
[INFO] [INFO] Downloaded from eclipse.maven.central.mirror: https://repo.eclipse.org/content/repositories/maven_central/org/apache/felix/maven-bundle-plugin/3.2.0/maven-bundle-plugin-3.2.0.jar (0 B at 0 B/s)
[INFO] [INFO] 
[INFO] [INFO] ----------< org.eclipse.mylyn.docs:wikitext.core.repository >-----------
[INFO] [INFO] Building Mylyn WikiText Core p2 Repository 3.0.25-SNAPSHOT
[INFO] [INFO] --------------------------------[ pom ]---------------------------------
[INFO] [INFO] Downloading from reficio: http://repo.reficio.org/maven/org/apache/maven/plugins/maven-clean-plugin/2.5/maven-clean-plugin-2.5.pom
[INFO] [WARNING] Checksum validation failed, expected <!DOCTYPE but is 5fcb99bce285a5a310aec1c6c2a8ef41162fa102 from reficio for http://repo.reficio.org/maven/org/apache/maven/plugins/maven-clean-plugin/2.5/maven-clean-plugin-2.5.pom
[INFO] [WARNING] Could not validate integrity of download from http://repo.reficio.org/maven/org/apache/maven/plugins/maven-clean-plugin/2.5/maven-clean-plugin-2.5.pom: Checksum validation failed, expected <!DOCTYPE but is 5fcb99bce285a5a310aec1c6c2a8ef41162fa102
[INFO] [WARNING] Checksum validation failed, expected <!DOCTYPE but is 5fcb99bce285a5a310aec1c6c2a8ef41162fa102 from reficio for http://repo.reficio.org/maven/org/apache/maven/plugins/maven-clean-plugin/2.5/maven-clean-plugin-2.5.pom
[INFO] [INFO] Downloaded from reficio: http://repo.reficio.org/maven/org/apache/maven/plugins/maven-clean-plugin/2.5/maven-clean-plugin-2.5.pom (6.1 kB at 16 kB/s)
[INFO] [WARNING] The POM for org.apache.maven.plugins:maven-clean-plugin:jar:2.5 is invalid, transitive dependencies (if any) will not be available, enable debug logging for more details
[INFO] [INFO] ------------------------------------------------------------------------
[INFO] [INFO] BUILD FAILURE
[INFO] [INFO] ------------------------------------------------------------------------
[INFO] [INFO] Total time:  2.851 s
[INFO] [INFO] Finished at: 2021-02-12T09:01:44-05:00
[INFO] [INFO] ------------------------------------------------------------------------
[INFO] [ERROR] Plugin org.apache.maven.plugins:maven-clean-plugin:2.5 or one of its dependencies could not be resolved: Failed to read artifact descriptor for org.apache.maven.plugins:maven-clean-plugin:jar:2.5: 1 problem was encountered while building the effective model
[INFO] [ERROR] [FATAL] Non-parseable POM /jobs/genie.mylyn/mylyn-integration-connectors/workspace/org.eclipse.mylyn.docs/wikitext/core/repository/.local-repo/org/apache/maven/plugins/maven-clean-plugin/2.5/maven-clean-plugin-2.5.pom: end tag name </head> must be the same as start tag <meta> from line 7 (position: TEXT seen ...f3950918c7562df7e68eeeebd8649bdea2bc3844eb07fc8269.css" />\n</head>... @11:8)  @ line 11, column 8
[INFO] [ERROR] -> [Help 1]
[INFO] [ERROR] 
[INFO] [ERROR] To see the full stack trace of the errors, re-run Maven with the -e switch.
[INFO] [ERROR] Re-run Maven using the -X switch to enable full debug logging.
[INFO] [ERROR] 
[INFO] [ERROR] For more information about the errors and possible solutions, please read the following articles:
[INFO] [ERROR] [Help 1] http://cwiki.apache.org/confluence/display/MAVEN/PluginResolutionException
[INFO] ..FAILED (4.0 s)
[INFO]   The build exited with code 1. See /jobs/genie.mylyn/mylyn-integration-connectors/workspace/org.eclipse.mylyn.docs/wikitext/core/repository/build.log for details.
[INFO] -------------------------------------------------
[INFO] Build Summary:
[INFO]   Passed: 0, Failed: 1, Errors: 0, Skipped: 0
[INFO] -------------------------------------------------
[ERROR] The following builds failed:
[ERROR] *  repository-pom.xml
[INFO] -------------------------------------------------
[INFO] ------------------------------------------------------------------------
[INFO] Reactor Summary:
[INFO] 
[INFO] Mylyn Docs: WikiText: Core 3.0.25-SNAPSHOT ......... SUCCESS [  1.020 s]
[INFO] Mylyn WikiText 3.0.25-SNAPSHOT ..................... SUCCESS [ 25.133 s]
[INFO] Mylyn WikiText Toolkit 3.0.25-SNAPSHOT ............. SUCCESS [  0.363 s]
[INFO] Mylyn WikiText Textile 3.0.25-SNAPSHOT ............. SUCCESS [  2.044 s]
[INFO] Mylyn WikiText HTML 3.0.25-SNAPSHOT ................ SUCCESS [  2.040 s]
[INFO] Mylyn WikiText Confluence 3.0.25-SNAPSHOT .......... SUCCESS [  2.341 s]
[INFO] Mylyn WikiText MediaWiki 3.0.25-SNAPSHOT ........... SUCCESS [  1.694 s]
[INFO] Mylyn WikiText Integration Tests 3.0.25-SNAPSHOT ... SUCCESS [  5.383 s]
[INFO] Mylyn WikiText Ant Tasks 3.0.25-SNAPSHOT ........... SUCCESS [  4.021 s]
[INFO] Mylyn WikiText Maven 3.0.25-SNAPSHOT ............... SUCCESS [  6.270 s]
[INFO] Mylyn WikiText AsciiDoc 3.0.25-SNAPSHOT ............ SUCCESS [  2.070 s]
[INFO] Mylyn WikiText CommonMark 3.0.25-SNAPSHOT .......... SUCCESS [  4.762 s]
[INFO] Mylyn WikiText Creole 3.0.25-SNAPSHOT .............. SUCCESS [  1.089 s]
[INFO] Mylyn WikiText Markdown 3.0.25-SNAPSHOT ............ SUCCESS [  1.775 s]
[INFO] Mylyn WikiText MediaWiki Ant 3.0.25-SNAPSHOT ....... SUCCESS [  1.641 s]
[INFO] Mylyn WikiText TracWiki 3.0.25-SNAPSHOT ............ SUCCESS [  1.183 s]
[INFO] Mylyn WikiText Twiki 3.0.25-SNAPSHOT ............... SUCCESS [  1.259 s]
[INFO] Mylyn WikiText Core p2 Repository 3.0.25-SNAPSHOT .. FAILURE [ 12.770 s]
[INFO] Mylyn Docs: WikiText 3.0.25-SNAPSHOT ............... SKIPPED
[INFO] Mylyn Docs: WikiText UI Build 3.0.25-SNAPSHOT ...... SKIPPED
[INFO] Mylyn Docs: EPUB Core 4.0.7-SNAPSHOT ............... SKIPPED
[INFO] Eclipse EPUB Tools Core 4.0.7-SNAPSHOT ............. SKIPPED
[INFO] Eclipse EPUB Tools Ant Task 4.0.7-SNAPSHOT ......... SKIPPED
[INFO] Mylyn EPUB Core p2 Repository 4.0.7-SNAPSHOT ....... SKIPPED
[INFO] Mylyn Docs: EPUB 4.0.7-SNAPSHOT .................... SKIPPED
[INFO] Mylyn Docs: EPUB UI Build 4.0.7-SNAPSHOT ........... SKIPPED
[INFO] Mylyn Docs 3.0.25-SNAPSHOT ......................... SKIPPED
[INFO] Mylyn Docs: Docs Build 3.0.25-SNAPSHOT ............. SKIPPED
[INFO] ------------------------------------------------------------------------
[INFO] BUILD FAILURE
[INFO] ------------------------------------------------------------------------
[INFO] Total time:  01:21 min
[INFO] Finished at: 2021-02-12T09:01:44-05:00
[INFO] ------------------------------------------------------------------------
[ERROR] Failed to execute goal org.apache.maven.plugins:maven-invoker-plugin:2.0.0:run (two-part-repository-build) on project wikitext.core.repository: 1 build failed. See console output above for details. -> [Help 1]
[ERROR] 
[ERROR] To see the full stack trace of the errors, re-run Maven with the -e switch.
[ERROR] Re-run Maven using the -X switch to enable full debug logging.
[ERROR] 
[ERROR] For more information about the errors and possible solutions, please read the following articles:
[ERROR] [Help 1] http://cwiki.apache.org/confluence/display/MAVEN/MojoFailureException
[ERROR] 
[ERROR] After correcting the problems, you can resume the build with the command
[ERROR]   mvn <args> -rf :wikitext.core.repository
Build step 'Invoke top-level Maven targets' marked build as failure
Terminating xvnc.
Recording test results
[Checks API] No suitable checks publisher found.
Recording fingerprints
Archiving artifacts
Started calculate disk usage of build
Finished Calculation of disk usage of build in 0 seconds
Started calculate disk usage of workspace
Finished Calculation of disk usage of workspace in 0 seconds
Finished: FAILURE