Console Output

Skipping 15,249 KB.. Full Log
[WARNING] /jobs/genie.mylyn/mylyn-3.23.x-release/workspace/org.eclipse.mylyn.tasks/org.eclipse.mylyn.tasks.ui.tests/src/org/eclipse/mylyn/internal/tasks/ui/migrator/ConnectorMigratorTest.java:[412] 
	RepositoryQuery query = new RepositoryQuery("mock", "mock");
	                        ^^^^^^^^^^^^^^^^^^^^^^^^^^^^^^^^^^^
Discouraged access: The constructor 'RepositoryQuery(String, String)' is not API (restriction on classpath entry '/jobs/genie.mylyn/mylyn-3.23.x-release/workspace/org.eclipse.mylyn.tasks/org.eclipse.mylyn.tasks.core/target/classes')
[WARNING] /jobs/genie.mylyn/mylyn-3.23.x-release/workspace/org.eclipse.mylyn.tasks/org.eclipse.mylyn.tasks.ui.tests/src/org/eclipse/mylyn/internal/tasks/ui/migrator/ConnectorMigratorTest.java:[412] 
	RepositoryQuery query = new RepositoryQuery("mock", "mock");
	                            ^^^^^^^^^^^^^^^
Discouraged access: The type 'RepositoryQuery' is not API (restriction on classpath entry '/jobs/genie.mylyn/mylyn-3.23.x-release/workspace/org.eclipse.mylyn.tasks/org.eclipse.mylyn.tasks.core/target/classes')
[WARNING] /jobs/genie.mylyn/mylyn-3.23.x-release/workspace/org.eclipse.mylyn.tasks/org.eclipse.mylyn.tasks.ui.tests/src/org/eclipse/mylyn/internal/tasks/ui/migrator/ConnectorMigratorTest.java:[413] 
	query.setRepositoryUrl("http://mock");
	^^^^^^^^^^^^^^^^^^^^^^^^^^^^^^^^^^^^^
Discouraged access: The method 'RepositoryQuery.setRepositoryUrl(String)' is not API (restriction on classpath entry '/jobs/genie.mylyn/mylyn-3.23.x-release/workspace/org.eclipse.mylyn.tasks/org.eclipse.mylyn.tasks.core/target/classes')
[WARNING] /jobs/genie.mylyn/mylyn-3.23.x-release/workspace/org.eclipse.mylyn.tasks/org.eclipse.mylyn.tasks.ui.tests/src/org/eclipse/mylyn/internal/tasks/ui/migrator/ConnectorMigratorTest.java:[414] 
	tasksState.getTaskList().addQuery(query);
	^^^^^^^^^^^^^^^^^^^^^^^^^^^^^^^^^^^^^^^^
Discouraged access: The method 'TaskList.addQuery(RepositoryQuery)' is not API (restriction on classpath entry '/jobs/genie.mylyn/mylyn-3.23.x-release/workspace/org.eclipse.mylyn.tasks/org.eclipse.mylyn.tasks.core/target/classes')
[WARNING] /jobs/genie.mylyn/mylyn-3.23.x-release/workspace/org.eclipse.mylyn.tasks/org.eclipse.mylyn.tasks.ui.tests/src/org/eclipse/mylyn/internal/tasks/ui/migrator/ConnectorMigratorTest.java:[419] 
	verify(tasksState.getTaskActivityManager()).deactivateActiveTask();
	^^^^^^^^^^^^^^^^^^^^^^^^^^^^^^^^^^^^^^^^^^^^^^^^^^^^^^^^^^^^^^^^^^
Discouraged access: The method 'TaskActivityManager.deactivateActiveTask()' is not API (restriction on classpath entry '/jobs/genie.mylyn/mylyn-3.23.x-release/workspace/org.eclipse.mylyn.tasks/org.eclipse.mylyn.tasks.core/target/classes')
[WARNING] /jobs/genie.mylyn/mylyn-3.23.x-release/workspace/org.eclipse.mylyn.tasks/org.eclipse.mylyn.tasks.ui.tests/src/org/eclipse/mylyn/internal/tasks/ui/migrator/ConnectorMigratorTest.java:[420] 
	TaskRepository newRepository = manager.getRepository("mock.new", "http://mock");
	                               ^^^^^^^^^^^^^^^^^^^^^^^^^^^^^^^^^^^^^^^^^^^^^^^^
Discouraged access: The method 'TaskRepositoryManager.getRepository(String, String)' is not API (restriction on classpath entry '/jobs/genie.mylyn/mylyn-3.23.x-release/workspace/org.eclipse.mylyn.tasks/org.eclipse.mylyn.tasks.core/target/classes')
[WARNING] /jobs/genie.mylyn/mylyn-3.23.x-release/workspace/org.eclipse.mylyn.tasks/org.eclipse.mylyn.tasks.ui.tests/src/org/eclipse/mylyn/internal/tasks/ui/migrator/ConnectorMigratorTest.java:[422] 
	manager.getRepositoryConnector("mock.new"), monitor);
	^^^^^^^^^^^^^^^^^^^^^^^^^^^^^^^^^^^^^^^^^^
Discouraged access: The method 'TaskRepositoryManager.getRepositoryConnector(String)' is not API (restriction on classpath entry '/jobs/genie.mylyn/mylyn-3.23.x-release/workspace/org.eclipse.mylyn.tasks/org.eclipse.mylyn.tasks.core/target/classes')
[WARNING] /jobs/genie.mylyn/mylyn-3.23.x-release/workspace/org.eclipse.mylyn.tasks/org.eclipse.mylyn.tasks.ui.tests/src/org/eclipse/mylyn/internal/tasks/ui/migrator/ConnectorMigratorTest.java:[428] 
	verify(migrator).migratePrivateData((AbstractTask) task1, (AbstractTask) task1Migrated, monitor);
	                                     ^^^^^^^^^^^^
Discouraged access: The type 'AbstractTask' is not API (restriction on classpath entry '/jobs/genie.mylyn/mylyn-3.23.x-release/workspace/org.eclipse.mylyn.tasks/org.eclipse.mylyn.tasks.core/target/classes')
[WARNING] /jobs/genie.mylyn/mylyn-3.23.x-release/workspace/org.eclipse.mylyn.tasks/org.eclipse.mylyn.tasks.ui.tests/src/org/eclipse/mylyn/internal/tasks/ui/migrator/ConnectorMigratorTest.java:[428] 
	verify(migrator).migratePrivateData((AbstractTask) task1, (AbstractTask) task1Migrated, monitor);
	                                                           ^^^^^^^^^^^^
Discouraged access: The type 'AbstractTask' is not API (restriction on classpath entry '/jobs/genie.mylyn/mylyn-3.23.x-release/workspace/org.eclipse.mylyn.tasks/org.eclipse.mylyn.tasks.core/target/classes')
[WARNING] /jobs/genie.mylyn/mylyn-3.23.x-release/workspace/org.eclipse.mylyn.tasks/org.eclipse.mylyn.tasks.ui.tests/src/org/eclipse/mylyn/internal/tasks/ui/migrator/ConnectorMigratorTest.java:[429] 
	ITask task2Migrated = new TaskTask("mock.new", "http://mock", "2.migrated");
	                      ^^^^^^^^^^^^^^^^^^^^^^^^^^^^^^^^^^^^^^^^^^^^^^^^^^^^^
Discouraged access: The constructor 'TaskTask(String, String, String)' is not API (restriction on classpath entry '/jobs/genie.mylyn/mylyn-3.23.x-release/workspace/org.eclipse.mylyn.tasks/org.eclipse.mylyn.tasks.core/target/classes')
[WARNING] /jobs/genie.mylyn/mylyn-3.23.x-release/workspace/org.eclipse.mylyn.tasks/org.eclipse.mylyn.tasks.ui.tests/src/org/eclipse/mylyn/internal/tasks/ui/migrator/ConnectorMigratorTest.java:[429] 
	ITask task2Migrated = new TaskTask("mock.new", "http://mock", "2.migrated");
	                          ^^^^^^^^
Discouraged access: The type 'TaskTask' is not API (restriction on classpath entry '/jobs/genie.mylyn/mylyn-3.23.x-release/workspace/org.eclipse.mylyn.tasks/org.eclipse.mylyn.tasks.core/target/classes')
[WARNING] /jobs/genie.mylyn/mylyn-3.23.x-release/workspace/org.eclipse.mylyn.tasks/org.eclipse.mylyn.tasks.ui.tests/src/org/eclipse/mylyn/internal/tasks/ui/migrator/ConnectorMigratorTest.java:[431] 
	verify(migrator).migratePrivateData((AbstractTask) task2, (AbstractTask) task2Migrated, monitor);
	                                     ^^^^^^^^^^^^
Discouraged access: The type 'AbstractTask' is not API (restriction on classpath entry '/jobs/genie.mylyn/mylyn-3.23.x-release/workspace/org.eclipse.mylyn.tasks/org.eclipse.mylyn.tasks.core/target/classes')
[WARNING] /jobs/genie.mylyn/mylyn-3.23.x-release/workspace/org.eclipse.mylyn.tasks/org.eclipse.mylyn.tasks.ui.tests/src/org/eclipse/mylyn/internal/tasks/ui/migrator/ConnectorMigratorTest.java:[431] 
	verify(migrator).migratePrivateData((AbstractTask) task2, (AbstractTask) task2Migrated, monitor);
	                                                           ^^^^^^^^^^^^
Discouraged access: The type 'AbstractTask' is not API (restriction on classpath entry '/jobs/genie.mylyn/mylyn-3.23.x-release/workspace/org.eclipse.mylyn.tasks/org.eclipse.mylyn.tasks.core/target/classes')
[WARNING] /jobs/genie.mylyn/mylyn-3.23.x-release/workspace/org.eclipse.mylyn.tasks/org.eclipse.mylyn.tasks.ui.tests/src/org/eclipse/mylyn/internal/tasks/ui/migrator/ConnectorMigratorTest.java:[434] 
	assertEquals(SynchronizationState.INCOMING_NEW, tasksState.getTaskList()
				.getTask(repository.getRepositoryUrl(), "1.migrated")
	                                                ^^^^^^^^^^^^^^^^^^^^^^^^^^^^^^^^^^^^^^^^^^^^^^^^^^^^^^^^^^^^^^^^^^^^^^^^^^^^^^^^^^
Discouraged access: The method 'TaskList.getTask(String, String)' is not API (restriction on classpath entry '/jobs/genie.mylyn/mylyn-3.23.x-release/workspace/org.eclipse.mylyn.tasks/org.eclipse.mylyn.tasks.core/target/classes')
[WARNING] /jobs/genie.mylyn/mylyn-3.23.x-release/workspace/org.eclipse.mylyn.tasks/org.eclipse.mylyn.tasks.ui.tests/src/org/eclipse/mylyn/internal/tasks/ui/migrator/ConnectorMigratorTest.java:[437] 
	assertEquals(SynchronizationState.INCOMING, tasksState.getTaskList()
				.getTask(repository.getRepositoryUrl(), "2.migrated")
	                                            ^^^^^^^^^^^^^^^^^^^^^^^^^^^^^^^^^^^^^^^^^^^^^^^^^^^^^^^^^^^^^^^^^^^^^^^^^^^^^^^^^^
Discouraged access: The method 'TaskList.getTask(String, String)' is not API (restriction on classpath entry '/jobs/genie.mylyn/mylyn-3.23.x-release/workspace/org.eclipse.mylyn.tasks/org.eclipse.mylyn.tasks.core/target/classes')
[WARNING] /jobs/genie.mylyn/mylyn-3.23.x-release/workspace/org.eclipse.mylyn.tasks/org.eclipse.mylyn.tasks.ui.tests/src/org/eclipse/mylyn/internal/tasks/ui/migrator/ConnectorMigratorTest.java:[442] 
	ImmutableSet.copyOf(tasksState.getTaskList().getAllTasks()));
	                    ^^^^^^^^^^^^^^^^^^^^^^^^^^^^^^^^^^^^^^
Discouraged access: The method 'TaskList.getAllTasks()' is not API (restriction on classpath entry '/jobs/genie.mylyn/mylyn-3.23.x-release/workspace/org.eclipse.mylyn.tasks/org.eclipse.mylyn.tasks.core/target/classes')
[WARNING] /jobs/genie.mylyn/mylyn-3.23.x-release/workspace/org.eclipse.mylyn.tasks/org.eclipse.mylyn.tasks.ui.tests/src/org/eclipse/mylyn/internal/tasks/ui/migrator/ConnectorMigratorTest.java:[443] 
	verify(tasksState.getRepositoryManager()).removeRepository(repository);
	^^^^^^^^^^^^^^^^^^^^^^^^^^^^^^^^^^^^^^^^^^^^^^^^^^^^^^^^^^^^^^^^^^^^^^
Discouraged access: The method 'TaskRepositoryManager.removeRepository(TaskRepository)' is not API (restriction on classpath entry '/jobs/genie.mylyn/mylyn-3.23.x-release/workspace/org.eclipse.mylyn.tasks/org.eclipse.mylyn.tasks.core/target/classes')
[WARNING] /jobs/genie.mylyn/mylyn-3.23.x-release/workspace/org.eclipse.mylyn.tasks/org.eclipse.mylyn.tasks.ui.tests/src/org/eclipse/mylyn/internal/tasks/ui/migrator/ConnectorMigratorTest.java:[444] 
	assertTrue(tasksState.getTaskList().getQueries().isEmpty());
	           ^^^^^^^^^^^^^^^^^^^^^^^^^^^^^^^^^^^^^
Discouraged access: The method 'TaskList.getQueries()' is not API (restriction on classpath entry '/jobs/genie.mylyn/mylyn-3.23.x-release/workspace/org.eclipse.mylyn.tasks/org.eclipse.mylyn.tasks.core/target/classes')
[WARNING] /jobs/genie.mylyn/mylyn-3.23.x-release/workspace/org.eclipse.mylyn.tasks/org.eclipse.mylyn.tasks.ui.tests/src/org/eclipse/mylyn/internal/tasks/ui/migrator/ConnectorMigratorTest.java:[445] 
	assertEquals(ImmutableSet.of(newRepository), tasksState.getRepositoryManager().getRepositories("mock.new"));
	                                             ^^^^^^^^^^^^^^^^^^^^^^^^^^^^^^^^^^^^^^^^^^^^^^^^^^^^^^^^^^^^^
Discouraged access: The method 'TaskRepositoryManager.getRepositories(String)' is not API (restriction on classpath entry '/jobs/genie.mylyn/mylyn-3.23.x-release/workspace/org.eclipse.mylyn.tasks/org.eclipse.mylyn.tasks.core/target/classes')
[WARNING] /jobs/genie.mylyn/mylyn-3.23.x-release/workspace/org.eclipse.mylyn.tasks/org.eclipse.mylyn.tasks.ui.tests/src/org/eclipse/mylyn/internal/tasks/ui/migrator/ConnectorMigratorTest.java:[460] 
	ITask task1 = new TaskTask("mock", "http://mock", "1");
	              ^^^^^^^^^^^^^^^^^^^^^^^^^^^^^^^^^^^^^^^^
Discouraged access: The constructor 'TaskTask(String, String, String)' is not API (restriction on classpath entry '/jobs/genie.mylyn/mylyn-3.23.x-release/workspace/org.eclipse.mylyn.tasks/org.eclipse.mylyn.tasks.core/target/classes')
[WARNING] /jobs/genie.mylyn/mylyn-3.23.x-release/workspace/org.eclipse.mylyn.tasks/org.eclipse.mylyn.tasks.ui.tests/src/org/eclipse/mylyn/internal/tasks/ui/migrator/ConnectorMigratorTest.java:[460] 
	ITask task1 = new TaskTask("mock", "http://mock", "1");
	                  ^^^^^^^^
Discouraged access: The type 'TaskTask' is not API (restriction on classpath entry '/jobs/genie.mylyn/mylyn-3.23.x-release/workspace/org.eclipse.mylyn.tasks/org.eclipse.mylyn.tasks.core/target/classes')
[WARNING] /jobs/genie.mylyn/mylyn-3.23.x-release/workspace/org.eclipse.mylyn.tasks/org.eclipse.mylyn.tasks.ui.tests/src/org/eclipse/mylyn/internal/tasks/ui/migrator/ConnectorMigratorTest.java:[462] 
	((AbstractTask) task1).setSynchronizationState(SynchronizationState.INCOMING_NEW);
	^^^^^^^^^^^^^^^^^^^^^^^^^^^^^^^^^^^^^^^^^^^^^^^^^^^^^^^^^^^^^^^^^^^^^^^^^^^^^^^^^
Discouraged access: The method 'AbstractTask.setSynchronizationState(ITask.SynchronizationState)' is not API (restriction on classpath entry '/jobs/genie.mylyn/mylyn-3.23.x-release/workspace/org.eclipse.mylyn.tasks/org.eclipse.mylyn.tasks.core/target/classes')
[WARNING] /jobs/genie.mylyn/mylyn-3.23.x-release/workspace/org.eclipse.mylyn.tasks/org.eclipse.mylyn.tasks.ui.tests/src/org/eclipse/mylyn/internal/tasks/ui/migrator/ConnectorMigratorTest.java:[462] 
	((AbstractTask) task1).setSynchronizationState(SynchronizationState.INCOMING_NEW);
	  ^^^^^^^^^^^^
Discouraged access: The type 'AbstractTask' is not API (restriction on classpath entry '/jobs/genie.mylyn/mylyn-3.23.x-release/workspace/org.eclipse.mylyn.tasks/org.eclipse.mylyn.tasks.core/target/classes')
[WARNING] /jobs/genie.mylyn/mylyn-3.23.x-release/workspace/org.eclipse.mylyn.tasks/org.eclipse.mylyn.tasks.ui.tests/src/org/eclipse/mylyn/internal/tasks/ui/migrator/ConnectorMigratorTest.java:[463] 
	ITask task2 = new TaskTask("mock", "http://mock", "2");
	              ^^^^^^^^^^^^^^^^^^^^^^^^^^^^^^^^^^^^^^^^
Discouraged access: The constructor 'TaskTask(String, String, String)' is not API (restriction on classpath entry '/jobs/genie.mylyn/mylyn-3.23.x-release/workspace/org.eclipse.mylyn.tasks/org.eclipse.mylyn.tasks.core/target/classes')
[WARNING] /jobs/genie.mylyn/mylyn-3.23.x-release/workspace/org.eclipse.mylyn.tasks/org.eclipse.mylyn.tasks.ui.tests/src/org/eclipse/mylyn/internal/tasks/ui/migrator/ConnectorMigratorTest.java:[463] 
	ITask task2 = new TaskTask("mock", "http://mock", "2");
	                  ^^^^^^^^
Discouraged access: The type 'TaskTask' is not API (restriction on classpath entry '/jobs/genie.mylyn/mylyn-3.23.x-release/workspace/org.eclipse.mylyn.tasks/org.eclipse.mylyn.tasks.core/target/classes')
[WARNING] /jobs/genie.mylyn/mylyn-3.23.x-release/workspace/org.eclipse.mylyn.tasks/org.eclipse.mylyn.tasks.ui.tests/src/org/eclipse/mylyn/internal/tasks/ui/migrator/ConnectorMigratorTest.java:[465] 
	((AbstractTask) task2).setSynchronizationState(SynchronizationState.INCOMING);
	^^^^^^^^^^^^^^^^^^^^^^^^^^^^^^^^^^^^^^^^^^^^^^^^^^^^^^^^^^^^^^^^^^^^^^^^^^^^^
Discouraged access: The method 'AbstractTask.setSynchronizationState(ITask.SynchronizationState)' is not API (restriction on classpath entry '/jobs/genie.mylyn/mylyn-3.23.x-release/workspace/org.eclipse.mylyn.tasks/org.eclipse.mylyn.tasks.core/target/classes')
[WARNING] /jobs/genie.mylyn/mylyn-3.23.x-release/workspace/org.eclipse.mylyn.tasks/org.eclipse.mylyn.tasks.ui.tests/src/org/eclipse/mylyn/internal/tasks/ui/migrator/ConnectorMigratorTest.java:[465] 
	((AbstractTask) task2).setSynchronizationState(SynchronizationState.INCOMING);
	  ^^^^^^^^^^^^
Discouraged access: The type 'AbstractTask' is not API (restriction on classpath entry '/jobs/genie.mylyn/mylyn-3.23.x-release/workspace/org.eclipse.mylyn.tasks/org.eclipse.mylyn.tasks.core/target/classes')
[WARNING] /jobs/genie.mylyn/mylyn-3.23.x-release/workspace/org.eclipse.mylyn.tasks/org.eclipse.mylyn.tasks.ui.tests/src/org/eclipse/mylyn/internal/tasks/ui/migrator/ConnectorMigratorTest.java:[466] 
	ITask task1Migrated = new TaskTask("mock.new", "http://mock", "1");
	                      ^^^^^^^^^^^^^^^^^^^^^^^^^^^^^^^^^^^^^^^^^^^^
Discouraged access: The constructor 'TaskTask(String, String, String)' is not API (restriction on classpath entry '/jobs/genie.mylyn/mylyn-3.23.x-release/workspace/org.eclipse.mylyn.tasks/org.eclipse.mylyn.tasks.core/target/classes')
[WARNING] /jobs/genie.mylyn/mylyn-3.23.x-release/workspace/org.eclipse.mylyn.tasks/org.eclipse.mylyn.tasks.ui.tests/src/org/eclipse/mylyn/internal/tasks/ui/migrator/ConnectorMigratorTest.java:[466] 
	ITask task1Migrated = new TaskTask("mock.new", "http://mock", "1");
	                          ^^^^^^^^
Discouraged access: The type 'TaskTask' is not API (restriction on classpath entry '/jobs/genie.mylyn/mylyn-3.23.x-release/workspace/org.eclipse.mylyn.tasks/org.eclipse.mylyn.tasks.core/target/classes')
[WARNING] /jobs/genie.mylyn/mylyn-3.23.x-release/workspace/org.eclipse.mylyn.tasks/org.eclipse.mylyn.tasks.ui.tests/src/org/eclipse/mylyn/internal/tasks/ui/migrator/ConnectorMigratorTest.java:[468] 
	TaskTask taskOtherRepo = new TaskTask("mock", "http://other-mock", "1");
	^^^^^^^^
Discouraged access: The type 'TaskTask' is not API (restriction on classpath entry '/jobs/genie.mylyn/mylyn-3.23.x-release/workspace/org.eclipse.mylyn.tasks/org.eclipse.mylyn.tasks.core/target/classes')
[WARNING] /jobs/genie.mylyn/mylyn-3.23.x-release/workspace/org.eclipse.mylyn.tasks/org.eclipse.mylyn.tasks.ui.tests/src/org/eclipse/mylyn/internal/tasks/ui/migrator/ConnectorMigratorTest.java:[468] 
	TaskTask taskOtherRepo = new TaskTask("mock", "http://other-mock", "1");
	                         ^^^^^^^^^^^^^^^^^^^^^^^^^^^^^^^^^^^^^^^^^^^^^^
Discouraged access: The constructor 'TaskTask(String, String, String)' is not API (restriction on classpath entry '/jobs/genie.mylyn/mylyn-3.23.x-release/workspace/org.eclipse.mylyn.tasks/org.eclipse.mylyn.tasks.core/target/classes')
[WARNING] /jobs/genie.mylyn/mylyn-3.23.x-release/workspace/org.eclipse.mylyn.tasks/org.eclipse.mylyn.tasks.ui.tests/src/org/eclipse/mylyn/internal/tasks/ui/migrator/ConnectorMigratorTest.java:[468] 
	TaskTask taskOtherRepo = new TaskTask("mock", "http://other-mock", "1");
	                             ^^^^^^^^
Discouraged access: The type 'TaskTask' is not API (restriction on classpath entry '/jobs/genie.mylyn/mylyn-3.23.x-release/workspace/org.eclipse.mylyn.tasks/org.eclipse.mylyn.tasks.core/target/classes')
[WARNING] /jobs/genie.mylyn/mylyn-3.23.x-release/workspace/org.eclipse.mylyn.tasks/org.eclipse.mylyn.tasks.ui.tests/src/org/eclipse/mylyn/internal/tasks/ui/migrator/ConnectorMigratorTest.java:[469] 
	tasksState.getTaskList().addTask(task1);
	^^^^^^^^^^^^^^^^^^^^^^^^^^^^^^^^^^^^^^^
Discouraged access: The method 'TaskList.addTask(ITask)' is not API (restriction on classpath entry '/jobs/genie.mylyn/mylyn-3.23.x-release/workspace/org.eclipse.mylyn.tasks/org.eclipse.mylyn.tasks.core/target/classes')
[WARNING] /jobs/genie.mylyn/mylyn-3.23.x-release/workspace/org.eclipse.mylyn.tasks/org.eclipse.mylyn.tasks.ui.tests/src/org/eclipse/mylyn/internal/tasks/ui/migrator/ConnectorMigratorTest.java:[470] 
	tasksState.getTaskList().addTask(task1Migrated);
	^^^^^^^^^^^^^^^^^^^^^^^^^^^^^^^^^^^^^^^^^^^^^^^
Discouraged access: The method 'TaskList.addTask(ITask)' is not API (restriction on classpath entry '/jobs/genie.mylyn/mylyn-3.23.x-release/workspace/org.eclipse.mylyn.tasks/org.eclipse.mylyn.tasks.core/target/classes')
[WARNING] /jobs/genie.mylyn/mylyn-3.23.x-release/workspace/org.eclipse.mylyn.tasks/org.eclipse.mylyn.tasks.ui.tests/src/org/eclipse/mylyn/internal/tasks/ui/migrator/ConnectorMigratorTest.java:[471] 
	tasksState.getTaskList().addTask(taskOtherRepo);
	^^^^^^^^^^^^^^^^^^^^^^^^^^^^^^^^^^^^^^^^^^^^^^^
Discouraged access: The method 'TaskList.addTask(ITask)' is not API (restriction on classpath entry '/jobs/genie.mylyn/mylyn-3.23.x-release/workspace/org.eclipse.mylyn.tasks/org.eclipse.mylyn.tasks.core/target/classes')
[WARNING] /jobs/genie.mylyn/mylyn-3.23.x-release/workspace/org.eclipse.mylyn.tasks/org.eclipse.mylyn.tasks.ui.tests/src/org/eclipse/mylyn/internal/tasks/ui/migrator/ConnectorMigratorTest.java:[472] 
	tasksState.getTaskList().addTask(task2);
	^^^^^^^^^^^^^^^^^^^^^^^^^^^^^^^^^^^^^^^
Discouraged access: The method 'TaskList.addTask(ITask)' is not API (restriction on classpath entry '/jobs/genie.mylyn/mylyn-3.23.x-release/workspace/org.eclipse.mylyn.tasks/org.eclipse.mylyn.tasks.core/target/classes')
[WARNING] /jobs/genie.mylyn/mylyn-3.23.x-release/workspace/org.eclipse.mylyn.tasks/org.eclipse.mylyn.tasks.ui.tests/src/org/eclipse/mylyn/internal/tasks/ui/migrator/ConnectorMigratorTest.java:[473] 
	RepositoryQuery query = new RepositoryQuery("mock", "mock");
	^^^^^^^^^^^^^^^
Discouraged access: The type 'RepositoryQuery' is not API (restriction on classpath entry '/jobs/genie.mylyn/mylyn-3.23.x-release/workspace/org.eclipse.mylyn.tasks/org.eclipse.mylyn.tasks.core/target/classes')
[WARNING] /jobs/genie.mylyn/mylyn-3.23.x-release/workspace/org.eclipse.mylyn.tasks/org.eclipse.mylyn.tasks.ui.tests/src/org/eclipse/mylyn/internal/tasks/ui/migrator/ConnectorMigratorTest.java:[473] 
	RepositoryQuery query = new RepositoryQuery("mock", "mock");
	                        ^^^^^^^^^^^^^^^^^^^^^^^^^^^^^^^^^^^
Discouraged access: The constructor 'RepositoryQuery(String, String)' is not API (restriction on classpath entry '/jobs/genie.mylyn/mylyn-3.23.x-release/workspace/org.eclipse.mylyn.tasks/org.eclipse.mylyn.tasks.core/target/classes')
[WARNING] /jobs/genie.mylyn/mylyn-3.23.x-release/workspace/org.eclipse.mylyn.tasks/org.eclipse.mylyn.tasks.ui.tests/src/org/eclipse/mylyn/internal/tasks/ui/migrator/ConnectorMigratorTest.java:[473] 
	RepositoryQuery query = new RepositoryQuery("mock", "mock");
	                            ^^^^^^^^^^^^^^^
Discouraged access: The type 'RepositoryQuery' is not API (restriction on classpath entry '/jobs/genie.mylyn/mylyn-3.23.x-release/workspace/org.eclipse.mylyn.tasks/org.eclipse.mylyn.tasks.core/target/classes')
[WARNING] /jobs/genie.mylyn/mylyn-3.23.x-release/workspace/org.eclipse.mylyn.tasks/org.eclipse.mylyn.tasks.ui.tests/src/org/eclipse/mylyn/internal/tasks/ui/migrator/ConnectorMigratorTest.java:[474] 
	query.setRepositoryUrl("http://mock");
	^^^^^^^^^^^^^^^^^^^^^^^^^^^^^^^^^^^^^
Discouraged access: The method 'RepositoryQuery.setRepositoryUrl(String)' is not API (restriction on classpath entry '/jobs/genie.mylyn/mylyn-3.23.x-release/workspace/org.eclipse.mylyn.tasks/org.eclipse.mylyn.tasks.core/target/classes')
[WARNING] /jobs/genie.mylyn/mylyn-3.23.x-release/workspace/org.eclipse.mylyn.tasks/org.eclipse.mylyn.tasks.ui.tests/src/org/eclipse/mylyn/internal/tasks/ui/migrator/ConnectorMigratorTest.java:[475] 
	tasksState.getTaskList().addQuery(query);
	^^^^^^^^^^^^^^^^^^^^^^^^^^^^^^^^^^^^^^^^
Discouraged access: The method 'TaskList.addQuery(RepositoryQuery)' is not API (restriction on classpath entry '/jobs/genie.mylyn/mylyn-3.23.x-release/workspace/org.eclipse.mylyn.tasks/org.eclipse.mylyn.tasks.core/target/classes')
[WARNING] /jobs/genie.mylyn/mylyn-3.23.x-release/workspace/org.eclipse.mylyn.tasks/org.eclipse.mylyn.tasks.ui.tests/src/org/eclipse/mylyn/internal/tasks/ui/migrator/ConnectorMigratorTest.java:[480] 
	verify(tasksState.getTaskActivityManager()).deactivateActiveTask();
	^^^^^^^^^^^^^^^^^^^^^^^^^^^^^^^^^^^^^^^^^^^^^^^^^^^^^^^^^^^^^^^^^^
Discouraged access: The method 'TaskActivityManager.deactivateActiveTask()' is not API (restriction on classpath entry '/jobs/genie.mylyn/mylyn-3.23.x-release/workspace/org.eclipse.mylyn.tasks/org.eclipse.mylyn.tasks.core/target/classes')
[WARNING] /jobs/genie.mylyn/mylyn-3.23.x-release/workspace/org.eclipse.mylyn.tasks/org.eclipse.mylyn.tasks.ui.tests/src/org/eclipse/mylyn/internal/tasks/ui/migrator/ConnectorMigratorTest.java:[481] 
	TaskRepository newRepository = manager.getRepository("mock.new", "http://mock");
	                               ^^^^^^^^^^^^^^^^^^^^^^^^^^^^^^^^^^^^^^^^^^^^^^^^
Discouraged access: The method 'TaskRepositoryManager.getRepository(String, String)' is not API (restriction on classpath entry '/jobs/genie.mylyn/mylyn-3.23.x-release/workspace/org.eclipse.mylyn.tasks/org.eclipse.mylyn.tasks.core/target/classes')
[WARNING] /jobs/genie.mylyn/mylyn-3.23.x-release/workspace/org.eclipse.mylyn.tasks/org.eclipse.mylyn.tasks.ui.tests/src/org/eclipse/mylyn/internal/tasks/ui/wizards/NewRepositoryWizardTest.java:[41] 
	assertNull(wizard.getBrand());
	                  ^^^^^^^^^^
The method getBrand() from the type NewRepositoryWizard is deprecated
[WARNING] /jobs/genie.mylyn/mylyn-3.23.x-release/workspace/org.eclipse.mylyn.tasks/org.eclipse.mylyn.tasks.ui.tests/src/org/eclipse/mylyn/internal/tasks/ui/wizards/NewRepositoryWizardTest.java:[43] 
	assertEquals("org.mylyn", wizard.getBrand());
	                                 ^^^^^^^^^^
The method getBrand() from the type NewRepositoryWizard is deprecated
[WARNING] /jobs/genie.mylyn/mylyn-3.23.x-release/workspace/org.eclipse.mylyn.tasks/org.eclipse.mylyn.tasks.ui.tests/src/org/eclipse/mylyn/tasks/ui/wizards/AbstractRepositorySettingsPageTest.java:[369] 
	Throwables.propagate(e);
	           ^^^^^^^^^^^^
The method propagate(Throwable) from the type Throwables is deprecated
[WARNING] /jobs/genie.mylyn/mylyn-3.23.x-release/workspace/org.eclipse.mylyn.tasks/org.eclipse.mylyn.tasks.ui.tests/src/org/eclipse/mylyn/internal/tasks/ui/migrator/CompleteConnectorMigrationWizardTest.java:[38] 
	import org.eclipse.mylyn.internal.tasks.core.RepositoryQuery;
	       ^^^^^^^^^^^^^^^^^^^^^^^^^^^^^^^^^^^^^^^^^^^^^^^^^^^^^
Discouraged access: The type 'RepositoryQuery' is not API (restriction on classpath entry '/jobs/genie.mylyn/mylyn-3.23.x-release/workspace/org.eclipse.mylyn.tasks/org.eclipse.mylyn.tasks.core/target/classes')
[WARNING] /jobs/genie.mylyn/mylyn-3.23.x-release/workspace/org.eclipse.mylyn.tasks/org.eclipse.mylyn.tasks.ui.tests/src/org/eclipse/mylyn/internal/tasks/ui/migrator/CompleteConnectorMigrationWizardTest.java:[44] 
	import org.eclipse.mylyn.tests.util.TestFixture;
	       ^^^^^^^^^^^^^^^^^^^^^^^^^^^^^^^^^^^^^^^^
Discouraged access: The type 'TestFixture' is not API (restriction on classpath entry '/jobs/genie.mylyn/mylyn-3.23.x-release/workspace/org.eclipse.mylyn.tasks/org.eclipse.mylyn.tests.util/target/classes')
[WARNING] /jobs/genie.mylyn/mylyn-3.23.x-release/workspace/org.eclipse.mylyn.tasks/org.eclipse.mylyn.tasks.ui.tests/src/org/eclipse/mylyn/internal/tasks/ui/migrator/CompleteConnectorMigrationWizardTest.java:[88] 
	TestFixture.resetTaskList();
	^^^^^^^^^^^
Discouraged access: The type 'TestFixture' is not API (restriction on classpath entry '/jobs/genie.mylyn/mylyn-3.23.x-release/workspace/org.eclipse.mylyn.tasks/org.eclipse.mylyn.tests.util/target/classes')
[WARNING] /jobs/genie.mylyn/mylyn-3.23.x-release/workspace/org.eclipse.mylyn.tasks/org.eclipse.mylyn.tasks.ui.tests/src/org/eclipse/mylyn/internal/tasks/ui/migrator/CompleteConnectorMigrationWizardTest.java:[88] 
	TestFixture.resetTaskList();
	^^^^^^^^^^^^^^^^^^^^^^^^^^^
Discouraged access: The method 'TestFixture.resetTaskList()' is not API (restriction on classpath entry '/jobs/genie.mylyn/mylyn-3.23.x-release/workspace/org.eclipse.mylyn.tasks/org.eclipse.mylyn.tests.util/target/classes')
[WARNING] /jobs/genie.mylyn/mylyn-3.23.x-release/workspace/org.eclipse.mylyn.tasks/org.eclipse.mylyn.tasks.ui.tests/src/org/eclipse/mylyn/internal/tasks/ui/migrator/CompleteConnectorMigrationWizardTest.java:[213] 
	Map<TaskRepository, ? extends Set<RepositoryQuery>> queries = ImmutableMap.of(repository,
	                                  ^^^^^^^^^^^^^^^
Discouraged access: The type 'RepositoryQuery' is not API (restriction on classpath entry '/jobs/genie.mylyn/mylyn-3.23.x-release/workspace/org.eclipse.mylyn.tasks/org.eclipse.mylyn.tasks.core/target/classes')
[WARNING] /jobs/genie.mylyn/mylyn-3.23.x-release/workspace/org.eclipse.mylyn.tasks/org.eclipse.mylyn.tasks.ui.tests/src/org/eclipse/mylyn/internal/tasks/ui/migrator/CompleteConnectorMigrationWizardTest.java:[214] 
	ImmutableSet.of(new RepositoryQuery("mock", "mock")));
	                ^^^^^^^^^^^^^^^^^^^^^^^^^^^^^^^^^^^
Discouraged access: The constructor 'RepositoryQuery(String, String)' is not API (restriction on classpath entry '/jobs/genie.mylyn/mylyn-3.23.x-release/workspace/org.eclipse.mylyn.tasks/org.eclipse.mylyn.tasks.core/target/classes')
[WARNING] /jobs/genie.mylyn/mylyn-3.23.x-release/workspace/org.eclipse.mylyn.tasks/org.eclipse.mylyn.tasks.ui.tests/src/org/eclipse/mylyn/internal/tasks/ui/migrator/CompleteConnectorMigrationWizardTest.java:[214] 
	ImmutableSet.of(new RepositoryQuery("mock", "mock")));
	                    ^^^^^^^^^^^^^^^
Discouraged access: The type 'RepositoryQuery' is not API (restriction on classpath entry '/jobs/genie.mylyn/mylyn-3.23.x-release/workspace/org.eclipse.mylyn.tasks/org.eclipse.mylyn.tasks.core/target/classes')
[WARNING] /jobs/genie.mylyn/mylyn-3.23.x-release/workspace/org.eclipse.mylyn.tasks/org.eclipse.mylyn.tasks.ui.tests/src/org/eclipse/mylyn/internal/tasks/ui/migrator/CompleteConnectorMigrationWizardTest.java:[233] 
	RepositoryQuery query1 = createQuery(repository1);
	^^^^^^^^^^^^^^^
Discouraged access: The type 'RepositoryQuery' is not API (restriction on classpath entry '/jobs/genie.mylyn/mylyn-3.23.x-release/workspace/org.eclipse.mylyn.tasks/org.eclipse.mylyn.tasks.core/target/classes')
[WARNING] /jobs/genie.mylyn/mylyn-3.23.x-release/workspace/org.eclipse.mylyn.tasks/org.eclipse.mylyn.tasks.ui.tests/src/org/eclipse/mylyn/internal/tasks/ui/migrator/CompleteConnectorMigrationWizardTest.java:[234] 
	RepositoryQuery query2 = createQuery(repository1);
	^^^^^^^^^^^^^^^
Discouraged access: The type 'RepositoryQuery' is not API (restriction on classpath entry '/jobs/genie.mylyn/mylyn-3.23.x-release/workspace/org.eclipse.mylyn.tasks/org.eclipse.mylyn.tasks.core/target/classes')
[WARNING] /jobs/genie.mylyn/mylyn-3.23.x-release/workspace/org.eclipse.mylyn.tasks/org.eclipse.mylyn.tasks.ui.tests/src/org/eclipse/mylyn/internal/tasks/ui/migrator/CompleteConnectorMigrationWizardTest.java:[235] 
	RepositoryQuery query3 = createQuery(repository2);
	^^^^^^^^^^^^^^^
Discouraged access: The type 'RepositoryQuery' is not API (restriction on classpath entry '/jobs/genie.mylyn/mylyn-3.23.x-release/workspace/org.eclipse.mylyn.tasks/org.eclipse.mylyn.tasks.core/target/classes')
[WARNING] /jobs/genie.mylyn/mylyn-3.23.x-release/workspace/org.eclipse.mylyn.tasks/org.eclipse.mylyn.tasks.ui.tests/src/org/eclipse/mylyn/internal/tasks/ui/migrator/CompleteConnectorMigrationWizardTest.java:[236] 
	RepositoryQuery query4 = createQuery(repository2);
	^^^^^^^^^^^^^^^
Discouraged access: The type 'RepositoryQuery' is not API (restriction on classpath entry '/jobs/genie.mylyn/mylyn-3.23.x-release/workspace/org.eclipse.mylyn.tasks/org.eclipse.mylyn.tasks.core/target/classes')
[WARNING] /jobs/genie.mylyn/mylyn-3.23.x-release/workspace/org.eclipse.mylyn.tasks/org.eclipse.mylyn.tasks.ui.tests/src/org/eclipse/mylyn/internal/tasks/ui/migrator/CompleteConnectorMigrationWizardTest.java:[238] 
	Map<TaskRepository, Set<RepositoryQuery>> map = //
	                        ^^^^^^^^^^^^^^^
Discouraged access: The type 'RepositoryQuery' is not API (restriction on classpath entry '/jobs/genie.mylyn/mylyn-3.23.x-release/workspace/org.eclipse.mylyn.tasks/org.eclipse.mylyn.tasks.core/target/classes')
[WARNING] /jobs/genie.mylyn/mylyn-3.23.x-release/workspace/org.eclipse.mylyn.tasks/org.eclipse.mylyn.tasks.ui.tests/src/org/eclipse/mylyn/internal/tasks/ui/migrator/CompleteConnectorMigrationWizardTest.java:[249] 
	RepositoryQuery query = createQuery(repository);
	^^^^^^^^^^^^^^^
Discouraged access: The type 'RepositoryQuery' is not API (restriction on classpath entry '/jobs/genie.mylyn/mylyn-3.23.x-release/workspace/org.eclipse.mylyn.tasks/org.eclipse.mylyn.tasks.core/target/classes')
[WARNING] /jobs/genie.mylyn/mylyn-3.23.x-release/workspace/org.eclipse.mylyn.tasks/org.eclipse.mylyn.tasks.ui.tests/src/org/eclipse/mylyn/internal/tasks/ui/migrator/CompleteConnectorMigrationWizardTest.java:[251] 
	Map<TaskRepository, Set<RepositoryQuery>> map = //
	                        ^^^^^^^^^^^^^^^
Discouraged access: The type 'RepositoryQuery' is not API (restriction on classpath entry '/jobs/genie.mylyn/mylyn-3.23.x-release/workspace/org.eclipse.mylyn.tasks/org.eclipse.mylyn.tasks.core/target/classes')
[WARNING] /jobs/genie.mylyn/mylyn-3.23.x-release/workspace/org.eclipse.mylyn.tasks/org.eclipse.mylyn.tasks.ui.tests/src/org/eclipse/mylyn/internal/tasks/ui/migrator/CompleteConnectorMigrationWizardTest.java:[261] 
	RepositoryQuery query = createQuery(repository);
	^^^^^^^^^^^^^^^
Discouraged access: The type 'RepositoryQuery' is not API (restriction on classpath entry '/jobs/genie.mylyn/mylyn-3.23.x-release/workspace/org.eclipse.mylyn.tasks/org.eclipse.mylyn.tasks.core/target/classes')
[WARNING] /jobs/genie.mylyn/mylyn-3.23.x-release/workspace/org.eclipse.mylyn.tasks/org.eclipse.mylyn.tasks.ui.tests/src/org/eclipse/mylyn/internal/tasks/ui/migrator/CompleteConnectorMigrationWizardTest.java:[262] 
	RepositoryQuery migratedQuery = createQuery(migratedRepository);
	^^^^^^^^^^^^^^^
Discouraged access: The type 'RepositoryQuery' is not API (restriction on classpath entry '/jobs/genie.mylyn/mylyn-3.23.x-release/workspace/org.eclipse.mylyn.tasks/org.eclipse.mylyn.tasks.core/target/classes')
[WARNING] /jobs/genie.mylyn/mylyn-3.23.x-release/workspace/org.eclipse.mylyn.tasks/org.eclipse.mylyn.tasks.ui.tests/src/org/eclipse/mylyn/internal/tasks/ui/migrator/CompleteConnectorMigrationWizardTest.java:[264] 
	Map<TaskRepository, Set<RepositoryQuery>> map = //
	                        ^^^^^^^^^^^^^^^
Discouraged access: The type 'RepositoryQuery' is not API (restriction on classpath entry '/jobs/genie.mylyn/mylyn-3.23.x-release/workspace/org.eclipse.mylyn.tasks/org.eclipse.mylyn.tasks.core/target/classes')
[WARNING] /jobs/genie.mylyn/mylyn-3.23.x-release/workspace/org.eclipse.mylyn.tasks/org.eclipse.mylyn.tasks.ui.tests/src/org/eclipse/mylyn/internal/tasks/ui/migrator/CompleteConnectorMigrationWizardTest.java:[280] 
	protected RepositoryQuery createQuery(TaskRepository repository) {
	          ^^^^^^^^^^^^^^^
Discouraged access: The type 'RepositoryQuery' is not API (restriction on classpath entry '/jobs/genie.mylyn/mylyn-3.23.x-release/workspace/org.eclipse.mylyn.tasks/org.eclipse.mylyn.tasks.core/target/classes')
[WARNING] /jobs/genie.mylyn/mylyn-3.23.x-release/workspace/org.eclipse.mylyn.tasks/org.eclipse.mylyn.tasks.ui.tests/src/org/eclipse/mylyn/internal/tasks/ui/migrator/CompleteConnectorMigrationWizardTest.java:[281] 
	RepositoryQuery query = new RepositoryQuery(repository.getConnectorKind(),
	^^^^^^^^^^^^^^^
Discouraged access: The type 'RepositoryQuery' is not API (restriction on classpath entry '/jobs/genie.mylyn/mylyn-3.23.x-release/workspace/org.eclipse.mylyn.tasks/org.eclipse.mylyn.tasks.core/target/classes')
[WARNING] /jobs/genie.mylyn/mylyn-3.23.x-release/workspace/org.eclipse.mylyn.tasks/org.eclipse.mylyn.tasks.ui.tests/src/org/eclipse/mylyn/internal/tasks/ui/migrator/CompleteConnectorMigrationWizardTest.java:[281] 
	RepositoryQuery query = new RepositoryQuery(repository.getConnectorKind(),
				repository.getConnectorKind() + repository.getRepositoryUrl() + Math.random());
	                        ^^^^^^^^^^^^^^^^^^^^^^^^^^^^^^^^^^^^^^^^^^^^^^^^^^^^^^^^^^^^^^^^^^^^^^^^^^^^^^^^^^^^^^^^^^^^^^^^^^^^^^^^^^^^^^^^^^^^^^^^^^^^^^^^^^^^^
Discouraged access: The constructor 'RepositoryQuery(String, String)' is not API (restriction on classpath entry '/jobs/genie.mylyn/mylyn-3.23.x-release/workspace/org.eclipse.mylyn.tasks/org.eclipse.mylyn.tasks.core/target/classes')
[WARNING] /jobs/genie.mylyn/mylyn-3.23.x-release/workspace/org.eclipse.mylyn.tasks/org.eclipse.mylyn.tasks.ui.tests/src/org/eclipse/mylyn/internal/tasks/ui/migrator/CompleteConnectorMigrationWizardTest.java:[281] 
	RepositoryQuery query = new RepositoryQuery(repository.getConnectorKind(),
	                            ^^^^^^^^^^^^^^^
Discouraged access: The type 'RepositoryQuery' is not API (restriction on classpath entry '/jobs/genie.mylyn/mylyn-3.23.x-release/workspace/org.eclipse.mylyn.tasks/org.eclipse.mylyn.tasks.core/target/classes')
[WARNING] /jobs/genie.mylyn/mylyn-3.23.x-release/workspace/org.eclipse.mylyn.tasks/org.eclipse.mylyn.tasks.ui.tests/src/org/eclipse/mylyn/internal/tasks/ui/migrator/CompleteConnectorMigrationWizardTest.java:[283] 
	query.setRepositoryUrl(repository.getRepositoryUrl());
	^^^^^^^^^^^^^^^^^^^^^^^^^^^^^^^^^^^^^^^^^^^^^^^^^^^^^
Discouraged access: The method 'RepositoryQuery.setRepositoryUrl(String)' is not API (restriction on classpath entry '/jobs/genie.mylyn/mylyn-3.23.x-release/workspace/org.eclipse.mylyn.tasks/org.eclipse.mylyn.tasks.core/target/classes')
[WARNING] /jobs/genie.mylyn/mylyn-3.23.x-release/workspace/org.eclipse.mylyn.tasks/org.eclipse.mylyn.tasks.ui.tests/src/org/eclipse/mylyn/internal/tasks/ui/migrator/CompleteConnectorMigrationWizardTest.java:[284] 
	TasksUiPlugin.getTaskList().addQuery(query);
	^^^^^^^^^^^^^^^^^^^^^^^^^^^^^^^^^^^^^^^^^^^
Discouraged access: The method 'TaskList.addQuery(RepositoryQuery)' is not API (restriction on classpath entry '/jobs/genie.mylyn/mylyn-3.23.x-release/workspace/org.eclipse.mylyn.tasks/org.eclipse.mylyn.tasks.core/target/classes')
183 problems (183 warnings)
[INFO] 
[INFO] --- tycho-source-plugin:1.0.0:plugin-source (attach-source) @ org.eclipse.mylyn.tasks.ui.tests ---
[WARNING] bundle localization file /jobs/genie.mylyn/mylyn-3.23.x-release/workspace/org.eclipse.mylyn.tasks/org.eclipse.mylyn.tasks.ui.tests/plugin.properties not found
[INFO] Building jar: /jobs/genie.mylyn/mylyn-3.23.x-release/workspace/org.eclipse.mylyn.tasks/org.eclipse.mylyn.tasks.ui.tests/target/org.eclipse.mylyn.tasks.ui.tests-3.23.3-SNAPSHOT-sources.jar
[INFO] 
[INFO] --- maven-resources-plugin:2.4.1:testResources (default-testResources) @ org.eclipse.mylyn.tasks.ui.tests ---
[INFO] Using 'ISO-8859-1' encoding to copy filtered resources.
[INFO] skip non existing resourceDirectory /jobs/genie.mylyn/mylyn-3.23.x-release/workspace/org.eclipse.mylyn.tasks/org.eclipse.mylyn.tasks.ui.tests/src/test/resources
[INFO] 
[INFO] --- target-platform-configuration:1.0.0:target-platform (default-target-platform) @ org.eclipse.mylyn.tasks.ui.tests ---
[INFO] 
[INFO] --- tycho-packaging-plugin:1.0.0:package-plugin (default-package-plugin) @ org.eclipse.mylyn.tasks.ui.tests ---
[INFO] Building jar: /jobs/genie.mylyn/mylyn-3.23.x-release/workspace/org.eclipse.mylyn.tasks/org.eclipse.mylyn.tasks.ui.tests/target/org.eclipse.mylyn.tasks.ui.tests-3.23.3-SNAPSHOT.jar
[INFO] 
[INFO] --- tycho-p2-plugin:1.0.0:p2-metadata-default (default-p2-metadata-default) @ org.eclipse.mylyn.tasks.ui.tests ---
[INFO] 
[INFO] -----< org.eclipse.mylyn.tasks:org.eclipse.mylyn.trac.core.tests >------
[INFO] Building org.eclipse.mylyn.trac.core.tests 3.23.3-SNAPSHOT     [131/176]
[INFO] ------------------------[ eclipse-test-plugin ]-------------------------
[INFO] 
[INFO] --- maven-clean-plugin:2.5:clean (default-clean) @ org.eclipse.mylyn.trac.core.tests ---
[INFO] 
[INFO] --- tycho-packaging-plugin:1.0.0:build-qualifier (default-build-qualifier) @ org.eclipse.mylyn.trac.core.tests ---
[INFO] The project's OSGi version is 3.23.3.v20180622-1953
[INFO] 
[INFO] --- tycho-packaging-plugin:1.0.0:validate-id (default-validate-id) @ org.eclipse.mylyn.trac.core.tests ---
[INFO] 
[INFO] --- tycho-packaging-plugin:1.0.0:validate-version (default-validate-version) @ org.eclipse.mylyn.trac.core.tests ---
[INFO] 
[INFO] --- jacoco-maven-plugin:0.5.6.201201232323:prepare-agent (default) @ org.eclipse.mylyn.trac.core.tests ---
[INFO] Skipping JaCoCo execution
[INFO] 
[INFO] --- maven-resources-plugin:2.4.1:resources (default-resources) @ org.eclipse.mylyn.trac.core.tests ---
[INFO] Using 'ISO-8859-1' encoding to copy filtered resources.
[INFO] skip non existing resourceDirectory /jobs/genie.mylyn/mylyn-3.23.x-release/workspace/org.eclipse.mylyn.tasks/org.eclipse.mylyn.trac.core.tests/src/main/resources
[INFO] 
[INFO] --- tycho-compiler-plugin:1.0.0:compile (default-compile) @ org.eclipse.mylyn.trac.core.tests ---
[INFO] Compiling 1 source file to /jobs/genie.mylyn/mylyn-3.23.x-release/workspace/org.eclipse.mylyn.tasks/org.eclipse.mylyn.trac.core.tests/target/classes
[INFO] 
[INFO] --- tycho-source-plugin:1.0.0:plugin-source (attach-source) @ org.eclipse.mylyn.trac.core.tests ---
[WARNING] bundle localization file /jobs/genie.mylyn/mylyn-3.23.x-release/workspace/org.eclipse.mylyn.tasks/org.eclipse.mylyn.trac.core.tests/plugin.properties not found
[INFO] Building jar: /jobs/genie.mylyn/mylyn-3.23.x-release/workspace/org.eclipse.mylyn.tasks/org.eclipse.mylyn.trac.core.tests/target/org.eclipse.mylyn.trac.core.tests-3.23.3-SNAPSHOT-sources.jar
[INFO] 
[INFO] --- maven-resources-plugin:2.4.1:testResources (default-testResources) @ org.eclipse.mylyn.trac.core.tests ---
[INFO] Using 'ISO-8859-1' encoding to copy filtered resources.
[INFO] skip non existing resourceDirectory /jobs/genie.mylyn/mylyn-3.23.x-release/workspace/org.eclipse.mylyn.tasks/org.eclipse.mylyn.trac.core.tests/src/test/resources
[INFO] 
[INFO] --- target-platform-configuration:1.0.0:target-platform (default-target-platform) @ org.eclipse.mylyn.trac.core.tests ---
[INFO] 
[INFO] --- tycho-packaging-plugin:1.0.0:package-plugin (default-package-plugin) @ org.eclipse.mylyn.trac.core.tests ---
[INFO] Building jar: /jobs/genie.mylyn/mylyn-3.23.x-release/workspace/org.eclipse.mylyn.tasks/org.eclipse.mylyn.trac.core.tests/target/org.eclipse.mylyn.trac.core.tests-3.23.3-SNAPSHOT.jar
[INFO] 
[INFO] --- tycho-p2-plugin:1.0.0:p2-metadata-default (default-p2-metadata-default) @ org.eclipse.mylyn.trac.core.tests ---
[INFO] 
[INFO] ------< org.eclipse.mylyn.tasks:org.eclipse.mylyn.trac.ui.tests >-------
[INFO] Building org.eclipse.mylyn.trac.ui.tests 3.23.3-SNAPSHOT       [132/176]
[INFO] ------------------------[ eclipse-test-plugin ]-------------------------
[INFO] 
[INFO] --- maven-clean-plugin:2.5:clean (default-clean) @ org.eclipse.mylyn.trac.ui.tests ---
[INFO] 
[INFO] --- tycho-packaging-plugin:1.0.0:build-qualifier (default-build-qualifier) @ org.eclipse.mylyn.trac.ui.tests ---
[INFO] The project's OSGi version is 3.23.3.v20180622-1953
[INFO] 
[INFO] --- tycho-packaging-plugin:1.0.0:validate-id (default-validate-id) @ org.eclipse.mylyn.trac.ui.tests ---
[INFO] 
[INFO] --- tycho-packaging-plugin:1.0.0:validate-version (default-validate-version) @ org.eclipse.mylyn.trac.ui.tests ---
[INFO] 
[INFO] --- jacoco-maven-plugin:0.5.6.201201232323:prepare-agent (default) @ org.eclipse.mylyn.trac.ui.tests ---
[INFO] Skipping JaCoCo execution
[INFO] 
[INFO] --- maven-resources-plugin:2.4.1:resources (default-resources) @ org.eclipse.mylyn.trac.ui.tests ---
[INFO] Using 'ISO-8859-1' encoding to copy filtered resources.
[INFO] skip non existing resourceDirectory /jobs/genie.mylyn/mylyn-3.23.x-release/workspace/org.eclipse.mylyn.tasks/org.eclipse.mylyn.trac.ui.tests/src/main/resources
[INFO] 
[INFO] --- tycho-compiler-plugin:1.0.0:compile (default-compile) @ org.eclipse.mylyn.trac.ui.tests ---
[INFO] Compiling 1 source file to /jobs/genie.mylyn/mylyn-3.23.x-release/workspace/org.eclipse.mylyn.tasks/org.eclipse.mylyn.trac.ui.tests/target/classes
[INFO] 
[INFO] --- tycho-source-plugin:1.0.0:plugin-source (attach-source) @ org.eclipse.mylyn.trac.ui.tests ---
[WARNING] bundle localization file /jobs/genie.mylyn/mylyn-3.23.x-release/workspace/org.eclipse.mylyn.tasks/org.eclipse.mylyn.trac.ui.tests/plugin.properties not found
[INFO] Building jar: /jobs/genie.mylyn/mylyn-3.23.x-release/workspace/org.eclipse.mylyn.tasks/org.eclipse.mylyn.trac.ui.tests/target/org.eclipse.mylyn.trac.ui.tests-3.23.3-SNAPSHOT-sources.jar
[INFO] 
[INFO] --- maven-resources-plugin:2.4.1:testResources (default-testResources) @ org.eclipse.mylyn.trac.ui.tests ---
[INFO] Using 'ISO-8859-1' encoding to copy filtered resources.
[INFO] skip non existing resourceDirectory /jobs/genie.mylyn/mylyn-3.23.x-release/workspace/org.eclipse.mylyn.tasks/org.eclipse.mylyn.trac.ui.tests/src/test/resources
[INFO] 
[INFO] --- target-platform-configuration:1.0.0:target-platform (default-target-platform) @ org.eclipse.mylyn.trac.ui.tests ---
[INFO] 
[INFO] --- tycho-packaging-plugin:1.0.0:package-plugin (default-package-plugin) @ org.eclipse.mylyn.trac.ui.tests ---
[INFO] Building jar: /jobs/genie.mylyn/mylyn-3.23.x-release/workspace/org.eclipse.mylyn.tasks/org.eclipse.mylyn.trac.ui.tests/target/org.eclipse.mylyn.trac.ui.tests-3.23.3-SNAPSHOT.jar
[INFO] 
[INFO] --- tycho-p2-plugin:1.0.0:p2-metadata-default (default-p2-metadata-default) @ org.eclipse.mylyn.trac.ui.tests ---
[INFO] 
[INFO] -------< org.eclipse.mylyn.tasks:org.eclipse.mylyn.test_feature >-------
[INFO] Building org.eclipse.mylyn.test_feature 3.23.3-SNAPSHOT        [133/176]
[INFO] --------------------------[ eclipse-feature ]---------------------------
[INFO] 
[INFO] --- maven-clean-plugin:2.5:clean (default-clean) @ org.eclipse.mylyn.test_feature ---
[INFO] 
[INFO] --- tycho-packaging-plugin:1.0.0:build-qualifier-aggregator (default-build-qualifier-aggregator) @ org.eclipse.mylyn.test_feature ---
[INFO] The project's OSGi version is 3.23.3.v20180622-2013
[INFO] 
[INFO] --- tycho-packaging-plugin:1.0.0:validate-id (default-validate-id) @ org.eclipse.mylyn.test_feature ---
[INFO] 
[INFO] --- tycho-packaging-plugin:1.0.0:validate-version (default-validate-version) @ org.eclipse.mylyn.test_feature ---
[INFO] 
[INFO] --- jacoco-maven-plugin:0.5.6.201201232323:prepare-agent (default) @ org.eclipse.mylyn.test_feature ---
[INFO] Skipping JaCoCo execution
[INFO] 
[INFO] --- target-platform-configuration:1.0.0:target-platform (default-target-platform) @ org.eclipse.mylyn.test_feature ---
[INFO] 
[INFO] --- tycho-packaging-plugin:1.0.0:package-feature (default-package-feature) @ org.eclipse.mylyn.test_feature ---
[INFO] Building jar: /jobs/genie.mylyn/mylyn-3.23.x-release/workspace/org.eclipse.mylyn.tasks/org.eclipse.mylyn.test-feature/target/org.eclipse.mylyn.test_feature-3.23.3-SNAPSHOT.jar
[INFO] 
[INFO] --- tycho-p2-plugin:1.0.0:p2-metadata-default (default-p2-metadata-default) @ org.eclipse.mylyn.test_feature ---
[INFO] 
[INFO] --- tycho-p2-plugin:1.0.0:feature-p2-metadata (default-feature-p2-metadata) @ org.eclipse.mylyn.test_feature ---
[INFO] 
[INFO] -----< org.eclipse.mylyn.versions:org.eclipse.mylyn.versions.sdk >------
[INFO] Building org.eclipse.mylyn.versions.sdk 1.15.0-SNAPSHOT        [134/176]
[INFO] --------------------------[ eclipse-feature ]---------------------------
[INFO] 
[INFO] --- maven-clean-plugin:2.5:clean (default-clean) @ org.eclipse.mylyn.versions.sdk ---
[INFO] 
[INFO] --- tycho-packaging-plugin:1.0.0:build-qualifier-aggregator (default-build-qualifier-aggregator) @ org.eclipse.mylyn.versions.sdk ---
[INFO] The project's OSGi version is 1.15.0.v20170411-2003
[INFO] 
[INFO] --- tycho-packaging-plugin:1.0.0:validate-id (default-validate-id) @ org.eclipse.mylyn.versions.sdk ---
[INFO] 
[INFO] --- tycho-packaging-plugin:1.0.0:validate-version (default-validate-version) @ org.eclipse.mylyn.versions.sdk ---
[INFO] 
[INFO] --- jacoco-maven-plugin:0.5.6.201201232323:prepare-agent (default) @ org.eclipse.mylyn.versions.sdk ---
[INFO] Skipping JaCoCo execution
[INFO] 
[INFO] --- target-platform-configuration:1.0.0:target-platform (default-target-platform) @ org.eclipse.mylyn.versions.sdk ---
[INFO] 
[INFO] --- tycho-packaging-plugin:1.0.0:package-feature (default-package-feature) @ org.eclipse.mylyn.versions.sdk ---
[INFO] Building jar: /jobs/genie.mylyn/mylyn-3.23.x-release/workspace/org.eclipse.mylyn.versions/org.eclipse.mylyn.versions.sdk-feature/target/org.eclipse.mylyn.versions.sdk-1.15.0-SNAPSHOT.jar
[INFO] 
[INFO] --- tycho-p2-plugin:1.0.0:p2-metadata-default (default-p2-metadata-default) @ org.eclipse.mylyn.versions.sdk ---
[INFO] 
[INFO] --- tycho-p2-plugin:1.0.0:feature-p2-metadata (default-feature-p2-metadata) @ org.eclipse.mylyn.versions.sdk ---
[INFO] 
[INFO] --------------< org.eclipse.mylyn:org.eclipse.mylyn-site >--------------
[INFO] Building Mylyn for Eclipse 4.x 3.23.3-SNAPSHOT                 [135/176]
[INFO] ------------------------[ eclipse-update-site ]-------------------------
[INFO] 
[INFO] --- maven-clean-plugin:2.5:clean (default-clean) @ org.eclipse.mylyn-site ---
[INFO] 
[INFO] --- tycho-packaging-plugin:1.0.0:build-qualifier (default-build-qualifier) @ org.eclipse.mylyn-site ---
[INFO] The project's OSGi version is 3.23.3.v20180622-2027
[INFO] 
[INFO] --- maven-resources-plugin:2.4.1:copy-resources (copy-resources) @ org.eclipse.mylyn-site ---
[INFO] Using 'ISO-8859-1' encoding to copy filtered resources.
[INFO] Copying 1 resource
[INFO] 
[INFO] --- jacoco-maven-plugin:0.5.6.201201232323:prepare-agent (default) @ org.eclipse.mylyn-site ---
[INFO] Skipping JaCoCo execution
[INFO] 
[INFO] --- tycho-packaging-plugin:1.0.0:update-site (default-update-site) @ org.eclipse.mylyn-site ---
[INFO] 
[INFO] --- tycho-p2-plugin:1.0.0:update-site-p2-metadata (default-update-site-p2-metadata) @ org.eclipse.mylyn-site ---
[INFO] Command line:
	[/opt/public/common/java/oracle/jdk1.8.0_162_x64/jre/bin/java, -jar, /jobs/genie.mylyn/mylyn-3.23.x-release/workspace/.repository/org/eclipse/tycho/tycho-bundles-external/1.0.0/eclipse/plugins/org.eclipse.equinox.launcher_1.3.201.v20161025-1711.jar, -configuration, /tmp/genie.mylyn/tycho-p2-runtime8876231117540283983.tmp/configuration, -nosplash, -application, org.eclipse.equinox.p2.publisher.UpdateSitePublisher, -source, /jobs/genie.mylyn/mylyn-3.23.x-release/workspace/org.eclipse.mylyn/org.eclipse.mylyn-site/target/site, -metadataRepository, file:/jobs/genie.mylyn/mylyn-3.23.x-release/workspace/org.eclipse.mylyn/org.eclipse.mylyn-site/target/site/, -metadataRepositoryName, Mylyn for Eclipse 4.x, -artifactRepository, file:/jobs/genie.mylyn/mylyn-3.23.x-release/workspace/org.eclipse.mylyn/org.eclipse.mylyn-site/target/site/, -artifactRepositoryName, Mylyn for Eclipse 4.x Artifacts, -noDefaultIUs, -compress]
Picked up JAVA_TOOL_OPTIONS: -Xmx2G -Djava.io.tmpdir=/tmp/genie.mylyn
Generating metadata for ..
Generation completed with success [0 seconds].
[INFO] 
[INFO] --- tycho-packaging-plugin:1.0.0:update-site-packaging (default-update-site-packaging) @ org.eclipse.mylyn-site ---
[INFO] Building zip: /jobs/genie.mylyn/mylyn-3.23.x-release/workspace/org.eclipse.mylyn/org.eclipse.mylyn-site/target/site.zip
[INFO] 
[INFO] --- maven-antrun-plugin:1.6:run (pack-and-sign) @ org.eclipse.mylyn-site ---
Downloading from eclipse.maven.central.mirror: https://repo.eclipse.org/content/repositories/maven_central/org/apache/maven/maven-plugin-api/2.0.11/maven-plugin-api-2.0.11.pom
Progress (1): 1.5 kB
                    
Downloaded from eclipse.maven.central.mirror: https://repo.eclipse.org/content/repositories/maven_central/org/apache/maven/maven-plugin-api/2.0.11/maven-plugin-api-2.0.11.pom (1.5 kB at 38 kB/s)
Downloading from eclipse.maven.central.mirror: https://repo.eclipse.org/content/repositories/maven_central/org/apache/maven/maven/2.0.11/maven-2.0.11.pom
Progress (1): 4.1/22 kB
Progress (1): 7.7/22 kB
Progress (1): 12/22 kB 
Progress (1): 16/22 kB
Progress (1): 20/22 kB
Progress (1): 22 kB   
                   
Downloaded from eclipse.maven.central.mirror: https://repo.eclipse.org/content/repositories/maven_central/org/apache/maven/maven/2.0.11/maven-2.0.11.pom (22 kB at 993 kB/s)
Downloading from eclipse.maven.central.mirror: https://repo.eclipse.org/content/repositories/maven_central/org/apache/maven/maven-parent/12/maven-parent-12.pom
Progress (1): 4.1/22 kB
Progress (1): 7.7/22 kB
Progress (1): 12/22 kB 
Progress (1): 16/22 kB
Progress (1): 20/22 kB
Progress (1): 22 kB   
                   
Downloaded from eclipse.maven.central.mirror: https://repo.eclipse.org/content/repositories/maven_central/org/apache/maven/maven-parent/12/maven-parent-12.pom (22 kB at 1.1 MB/s)
Downloading from eclipse.maven.central.mirror: https://repo.eclipse.org/content/repositories/maven_central/org/apache/maven/maven-project/2.0.11/maven-project-2.0.11.pom
Progress (1): 2.8 kB
                    
Downloaded from eclipse.maven.central.mirror: https://repo.eclipse.org/content/repositories/maven_central/org/apache/maven/maven-project/2.0.11/maven-project-2.0.11.pom (2.8 kB at 154 kB/s)
Downloading from eclipse.maven.central.mirror: https://repo.eclipse.org/content/repositories/maven_central/org/apache/maven/maven-settings/2.0.11/maven-settings-2.0.11.pom
Progress (1): 2.2 kB
                    
Downloaded from eclipse.maven.central.mirror: https://repo.eclipse.org/content/repositories/maven_central/org/apache/maven/maven-settings/2.0.11/maven-settings-2.0.11.pom (2.2 kB at 168 kB/s)
Downloading from eclipse.maven.central.mirror: https://repo.eclipse.org/content/repositories/maven_central/org/apache/maven/maven-model/2.0.11/maven-model-2.0.11.pom
Progress (1): 3.2 kB
                    
Downloaded from eclipse.maven.central.mirror: https://repo.eclipse.org/content/repositories/maven_central/org/apache/maven/maven-model/2.0.11/maven-model-2.0.11.pom (3.2 kB at 154 kB/s)
Downloading from eclipse.maven.central.mirror: https://repo.eclipse.org/content/repositories/maven_central/org/apache/maven/maven-profile/2.0.11/maven-profile-2.0.11.pom
Progress (1): 2.0 kB
                    
Downloaded from eclipse.maven.central.mirror: https://repo.eclipse.org/content/repositories/maven_central/org/apache/maven/maven-profile/2.0.11/maven-profile-2.0.11.pom (2.0 kB at 97 kB/s)
Downloading from eclipse.maven.central.mirror: https://repo.eclipse.org/content/repositories/maven_central/org/apache/maven/maven-artifact-manager/2.0.11/maven-artifact-manager-2.0.11.pom
Progress (1): 2.6 kB
                    
Downloaded from eclipse.maven.central.mirror: https://repo.eclipse.org/content/repositories/maven_central/org/apache/maven/maven-artifact-manager/2.0.11/maven-artifact-manager-2.0.11.pom (2.6 kB at 138 kB/s)
Downloading from eclipse.maven.central.mirror: https://repo.eclipse.org/content/repositories/maven_central/org/apache/maven/maven-repository-metadata/2.0.11/maven-repository-metadata-2.0.11.pom
Progress (1): 2.3 kB
                    
Downloaded from eclipse.maven.central.mirror: https://repo.eclipse.org/content/repositories/maven_central/org/apache/maven/maven-repository-metadata/2.0.11/maven-repository-metadata-2.0.11.pom (2.3 kB at 125 kB/s)
Downloading from eclipse.maven.central.mirror: https://repo.eclipse.org/content/repositories/maven_central/org/apache/maven/maven-artifact/2.0.11/maven-artifact-2.0.11.pom
Progress (1): 1.6 kB
                    
Downloaded from eclipse.maven.central.mirror: https://repo.eclipse.org/content/repositories/maven_central/org/apache/maven/maven-artifact/2.0.11/maven-artifact-2.0.11.pom (1.6 kB at 83 kB/s)
Downloading from eclipse.maven.central.mirror: https://repo.eclipse.org/content/repositories/maven_central/org/apache/maven/maven-plugin-registry/2.0.11/maven-plugin-registry-2.0.11.pom
Progress (1): 1.9 kB
                    
Downloaded from eclipse.maven.central.mirror: https://repo.eclipse.org/content/repositories/maven_central/org/apache/maven/maven-plugin-registry/2.0.11/maven-plugin-registry-2.0.11.pom (1.9 kB at 107 kB/s)
Downloading from eclipse.maven.central.mirror: https://repo.eclipse.org/content/repositories/maven_central/org/codehaus/plexus/plexus-utils/2.0.5/plexus-utils-2.0.5.pom
Progress (1): 3.3 kB
                    
Downloaded from eclipse.maven.central.mirror: https://repo.eclipse.org/content/repositories/maven_central/org/codehaus/plexus/plexus-utils/2.0.5/plexus-utils-2.0.5.pom (3.3 kB at 196 kB/s)
Downloading from eclipse.maven.central.mirror: https://repo.eclipse.org/content/repositories/maven_central/org/apache/ant/ant-nodeps/1.8.1/ant-nodeps-1.8.1.pom
Progress (1): 4.1/4.8 kB
Progress (1): 4.8 kB    
                    
Downloaded from eclipse.maven.central.mirror: https://repo.eclipse.org/content/repositories/maven_central/org/apache/ant/ant-nodeps/1.8.1/ant-nodeps-1.8.1.pom (4.8 kB at 241 kB/s)
Downloading from eclipse.maven.central.mirror: https://repo.eclipse.org/content/repositories/maven_central/org/apache/ant/ant-parent/1.8.1/ant-parent-1.8.1.pom
Progress (1): 4.1/4.3 kB
Progress (1): 4.3 kB    
                    
Downloaded from eclipse.maven.central.mirror: https://repo.eclipse.org/content/repositories/maven_central/org/apache/ant/ant-parent/1.8.1/ant-parent-1.8.1.pom (4.3 kB at 238 kB/s)
Downloading from eclipse.maven.central.mirror: https://repo.eclipse.org/content/repositories/maven_central/org/apache/ant/ant/1.8.1/ant-1.8.1.pom
Progress (1): 4.1/8.8 kB
Progress (1): 7.7/8.8 kB
Progress (1): 8.8 kB    
                    
Downloaded from eclipse.maven.central.mirror: https://repo.eclipse.org/content/repositories/maven_central/org/apache/ant/ant/1.8.1/ant-1.8.1.pom (8.8 kB at 463 kB/s)
Downloading from eclipse.maven.central.mirror: https://repo.eclipse.org/content/repositories/maven_central/org/apache/ant/ant-launcher/1.8.1/ant-launcher-1.8.1.pom
Progress (1): 2.4 kB
                    
Downloaded from eclipse.maven.central.mirror: https://repo.eclipse.org/content/repositories/maven_central/org/apache/ant/ant-launcher/1.8.1/ant-launcher-1.8.1.pom (2.4 kB at 113 kB/s)
Downloading from eclipse.maven.central.mirror: https://repo.eclipse.org/content/repositories/maven_central/org/apache/maven/maven-plugin-api/2.0.11/maven-plugin-api-2.0.11.jar
Downloading from eclipse.maven.central.mirror: https://repo.eclipse.org/content/repositories/maven_central/org/apache/maven/maven-settings/2.0.11/maven-settings-2.0.11.jar
Downloading from eclipse.maven.central.mirror: https://repo.eclipse.org/content/repositories/maven_central/org/apache/maven/maven-project/2.0.11/maven-project-2.0.11.jar
Downloading from eclipse.maven.central.mirror: https://repo.eclipse.org/content/repositories/maven_central/org/apache/maven/maven-model/2.0.11/maven-model-2.0.11.jar
Downloading from eclipse.maven.central.mirror: https://repo.eclipse.org/content/repositories/maven_central/org/apache/maven/maven-profile/2.0.11/maven-profile-2.0.11.jar
Progress (1): 4.1/13 kB
Progress (1): 7.7/13 kB
Progress (1): 12/13 kB 
Progress (1): 13 kB   
                   
Downloaded from eclipse.maven.central.mirror: https://repo.eclipse.org/content/repositories/maven_central/org/apache/maven/maven-plugin-api/2.0.11/maven-plugin-api-2.0.11.jar (13 kB at 523 kB/s)
Downloading from eclipse.maven.central.mirror: https://repo.eclipse.org/content/repositories/maven_central/org/apache/maven/maven-artifact-manager/2.0.11/maven-artifact-manager-2.0.11.jar
Progress (1): 4.1/58 kB
Progress (1): 7.7/58 kB
Progress (1): 12/58 kB 
Progress (1): 16/58 kB
Progress (1): 20/58 kB
Progress (1): 24/58 kB
Progress (1): 28/58 kB
Progress (1): 32/58 kB
Progress (1): 36/58 kB
Progress (1): 40/58 kB
Progress (1): 44/58 kB
Progress (1): 48/58 kB
Progress (1): 52/58 kB
Progress (1): 56/58 kB
Progress (1): 58 kB   
Progress (2): 58 kB | 4.1/37 kB
Progress (2): 58 kB | 7.7/37 kB
Progress (2): 58 kB | 12/37 kB 
Progress (2): 58 kB | 16/37 kB
Progress (2): 58 kB | 20/37 kB
Progress (2): 58 kB | 24/37 kB
Progress (2): 58 kB | 28/37 kB
Progress (2): 58 kB | 32/37 kB
Progress (2): 58 kB | 36/37 kB
Progress (3): 58 kB | 36/37 kB | 4.1/123 kB
Progress (4): 58 kB | 36/37 kB | 4.1/123 kB | 4.1/51 kB
Progress (4): 58 kB | 36/37 kB | 7.7/123 kB | 4.1/51 kB
Progress (4): 58 kB | 37 kB | 7.7/123 kB | 4.1/51 kB   
Progress (4): 58 kB | 37 kB | 7.7/123 kB | 7.7/51 kB
Progress (4): 58 kB | 37 kB | 12/123 kB | 7.7/51 kB 
Progress (4): 58 kB | 37 kB | 12/123 kB | 12/51 kB 
Progress (4): 58 kB | 37 kB | 16/123 kB | 12/51 kB
Progress (4): 58 kB | 37 kB | 16/123 kB | 16/51 kB
Progress (5): 58 kB | 37 kB | 16/123 kB | 16/51 kB | 4.1/97 kB
Progress (5): 58 kB | 37 kB | 20/123 kB | 16/51 kB | 4.1/97 kB
Progress (5): 58 kB | 37 kB | 20/123 kB | 20/51 kB | 4.1/97 kB
Progress (5): 58 kB | 37 kB | 24/123 kB | 20/51 kB | 4.1/97 kB
Progress (5): 58 kB | 37 kB | 24/123 kB | 20/51 kB | 7.7/97 kB
Progress (5): 58 kB | 37 kB | 24/123 kB | 24/51 kB | 7.7/97 kB
Progress (5): 58 kB | 37 kB | 28/123 kB | 24/51 kB | 7.7/97 kB
Progress (5): 58 kB | 37 kB | 28/123 kB | 24/51 kB | 12/97 kB 
Progress (5): 58 kB | 37 kB | 32/123 kB | 24/51 kB | 12/97 kB
Progress (5): 58 kB | 37 kB | 32/123 kB | 28/51 kB | 12/97 kB
Progress (5): 58 kB | 37 kB | 32/123 kB | 28/51 kB | 16/97 kB
Progress (5): 58 kB | 37 kB | 32/123 kB | 32/51 kB | 16/97 kB
Progress (5): 58 kB | 37 kB | 36/123 kB | 32/51 kB | 16/97 kB
Progress (5): 58 kB | 37 kB | 36/123 kB | 32/51 kB | 20/97 kB
Progress (5): 58 kB | 37 kB | 40/123 kB | 32/51 kB | 20/97 kB
Progress (5): 58 kB | 37 kB | 40/123 kB | 36/51 kB | 20/97 kB
Progress (5): 58 kB | 37 kB | 40/123 kB | 36/51 kB | 24/97 kB
Progress (5): 58 kB | 37 kB | 40/123 kB | 40/51 kB | 24/97 kB
Progress (5): 58 kB | 37 kB | 44/123 kB | 40/51 kB | 24/97 kB
Progress (5): 58 kB | 37 kB | 44/123 kB | 40/51 kB | 28/97 kB
Progress (5): 58 kB | 37 kB | 44/123 kB | 44/51 kB | 28/97 kB
Progress (5): 58 kB | 37 kB | 48/123 kB | 44/51 kB | 28/97 kB
Progress (5): 58 kB | 37 kB | 48/123 kB | 48/51 kB | 28/97 kB
                                                             
Downloaded from eclipse.maven.central.mirror: https://repo.eclipse.org/content/repositories/maven_central/org/apache/maven/maven-profile/2.0.11/maven-profile-2.0.11.jar (37 kB at 676 kB/s)
Progress (4): 58 kB | 48/123 kB | 48/51 kB | 32/97 kB
                                                     
Downloading from eclipse.maven.central.mirror: https://repo.eclipse.org/content/repositories/maven_central/org/apache/maven/maven-repository-metadata/2.0.11/maven-repository-metadata-2.0.11.jar
Progress (4): 58 kB | 52/123 kB | 48/51 kB | 32/97 kB
Progress (4): 58 kB | 52/123 kB | 51 kB | 32/97 kB   
Progress (4): 58 kB | 56/123 kB | 51 kB | 32/97 kB
Progress (4): 58 kB | 56/123 kB | 51 kB | 36/97 kB
Progress (4): 58 kB | 56/123 kB | 51 kB | 40/97 kB
Progress (4): 58 kB | 60/123 kB | 51 kB | 40/97 kB
Progress (4): 58 kB | 64/123 kB | 51 kB | 40/97 kB
Progress (4): 58 kB | 64/123 kB | 51 kB | 44/97 kB
Progress (4): 58 kB | 64/123 kB | 51 kB | 48/97 kB
Progress (4): 58 kB | 68/123 kB | 51 kB | 48/97 kB
Progress (4): 58 kB | 72/123 kB | 51 kB | 48/97 kB
Progress (4): 58 kB | 72/123 kB | 51 kB | 52/97 kB
Progress (4): 58 kB | 72/123 kB | 51 kB | 56/97 kB
Progress (4): 58 kB | 76/123 kB | 51 kB | 56/97 kB
Progress (4): 58 kB | 80/123 kB | 51 kB | 56/97 kB
Progress (4): 58 kB | 80/123 kB | 51 kB | 60/97 kB
Progress (4): 58 kB | 80/123 kB | 51 kB | 64/97 kB
Progress (4): 58 kB | 84/123 kB | 51 kB | 64/97 kB
Progress (4): 58 kB | 88/123 kB | 51 kB | 64/97 kB
Progress (4): 58 kB | 88/123 kB | 51 kB | 68/97 kB
Progress (4): 58 kB | 88/123 kB | 51 kB | 72/97 kB
Progress (4): 58 kB | 92/123 kB | 51 kB | 72/97 kB
Progress (4): 58 kB | 96/123 kB | 51 kB | 72/97 kB
Progress (4): 58 kB | 96/123 kB | 51 kB | 76/97 kB
Progress (4): 58 kB | 96/123 kB | 51 kB | 80/97 kB
Progress (4): 58 kB | 100/123 kB | 51 kB | 80/97 kB
Progress (4): 58 kB | 104/123 kB | 51 kB | 80/97 kB
Progress (4): 58 kB | 104/123 kB | 51 kB | 84/97 kB
Progress (4): 58 kB | 104/123 kB | 51 kB | 88/97 kB
Progress (4): 58 kB | 108/123 kB | 51 kB | 88/97 kB
Progress (4): 58 kB | 112/123 kB | 51 kB | 88/97 kB
Progress (4): 58 kB | 112/123 kB | 51 kB | 92/97 kB
Progress (4): 58 kB | 112/123 kB | 51 kB | 96/97 kB
Progress (4): 58 kB | 116/123 kB | 51 kB | 96/97 kB
Progress (4): 58 kB | 116/123 kB | 51 kB | 97 kB   
Progress (4): 58 kB | 120/123 kB | 51 kB | 97 kB
Progress (4): 58 kB | 123 kB | 51 kB | 97 kB    
Progress (5): 58 kB | 123 kB | 51 kB | 97 kB | 4.1/26 kB
Progress (5): 58 kB | 123 kB | 51 kB | 97 kB | 7.7/26 kB
Progress (5): 58 kB | 123 kB | 51 kB | 97 kB | 12/26 kB 
Progress (5): 58 kB | 123 kB | 51 kB | 97 kB | 16/26 kB
Progress (5): 58 kB | 123 kB | 51 kB | 97 kB | 20/26 kB
Progress (5): 58 kB | 123 kB | 51 kB | 97 kB | 24/26 kB
Progress (5): 58 kB | 123 kB | 51 kB | 97 kB | 26 kB   
                                                    
Downloaded from eclipse.maven.central.mirror: https://repo.eclipse.org/content/repositories/maven_central/org/apache/maven/maven-settings/2.0.11/maven-settings-2.0.11.jar (51 kB at 745 kB/s)
Downloading from eclipse.maven.central.mirror: https://repo.eclipse.org/content/repositories/maven_central/org/apache/maven/maven-plugin-registry/2.0.11/maven-plugin-registry-2.0.11.jar
Downloaded from eclipse.maven.central.mirror: https://repo.eclipse.org/content/repositories/maven_central/org/apache/maven/maven-model/2.0.11/maven-model-2.0.11.jar (97 kB at 1.4 MB/s)
Downloading from eclipse.maven.central.mirror: https://repo.eclipse.org/content/repositories/maven_central/org/codehaus/plexus/plexus-interpolation/1.1/plexus-interpolation-1.1.jar
Downloaded from eclipse.maven.central.mirror: https://repo.eclipse.org/content/repositories/maven_central/org/apache/maven/maven-project/2.0.11/maven-project-2.0.11.jar (123 kB at 1.8 MB/s)
Downloading from eclipse.maven.central.mirror: https://repo.eclipse.org/content/repositories/maven_central/org/apache/maven/maven-artifact/2.0.11/maven-artifact-2.0.11.jar
Downloaded from eclipse.maven.central.mirror: https://repo.eclipse.org/content/repositories/maven_central/org/apache/maven/maven-artifact-manager/2.0.11/maven-artifact-manager-2.0.11.jar (58 kB at 770 kB/s)
Downloading from eclipse.maven.central.mirror: https://repo.eclipse.org/content/repositories/maven_central/org/codehaus/plexus/plexus-utils/2.0.5/plexus-utils-2.0.5.jar
Progress (2): 26 kB | 4.1/31 kB
Progress (2): 26 kB | 7.7/31 kB
Progress (2): 26 kB | 12/31 kB 
Progress (2): 26 kB | 16/31 kB
Progress (2): 26 kB | 20/31 kB
Progress (2): 26 kB | 24/31 kB
Progress (2): 26 kB | 28/31 kB
Progress (2): 26 kB | 31 kB   
Progress (3): 26 kB | 31 kB | 4.1/90 kB
Progress (3): 26 kB | 31 kB | 7.7/90 kB
Progress (3): 26 kB | 31 kB | 12/90 kB 
Progress (3): 26 kB | 31 kB | 16/90 kB
Progress (3): 26 kB | 31 kB | 20/90 kB
Progress (3): 26 kB | 31 kB | 24/90 kB
Progress (3): 26 kB | 31 kB | 28/90 kB
Progress (3): 26 kB | 31 kB | 32/90 kB
Progress (3): 26 kB | 31 kB | 33/90 kB
Progress (3): 26 kB | 31 kB | 37/90 kB
                                      
Downloaded from eclipse.maven.central.mirror: https://repo.eclipse.org/content/repositories/maven_central/org/apache/maven/maven-plugin-registry/2.0.11/maven-plugin-registry-2.0.11.jar (31 kB at 360 kB/s)
Progress (2): 26 kB | 41/90 kB
                              
Downloading from eclipse.maven.central.mirror: https://repo.eclipse.org/content/repositories/maven_central/org/apache/ant/ant-nodeps/1.8.1/ant-nodeps-1.8.1.jar
Progress (3): 26 kB | 41/90 kB | 4.1/223 kB
Progress (3): 26 kB | 45/90 kB | 4.1/223 kB
Progress (3): 26 kB | 45/90 kB | 7.7/223 kB
Progress (3): 26 kB | 49/90 kB | 7.7/223 kB
Progress (4): 26 kB | 49/90 kB | 7.7/223 kB | 4.1/35 kB
Progress (4): 26 kB | 49/90 kB | 7.7/223 kB | 7.7/35 kB
Progress (4): 26 kB | 49/90 kB | 12/223 kB | 7.7/35 kB 
Progress (4): 26 kB | 53/90 kB | 12/223 kB | 7.7/35 kB
Progress (4): 26 kB | 53/90 kB | 12/223 kB | 12/35 kB 
Progress (4): 26 kB | 53/90 kB | 16/223 kB | 12/35 kB
Progress (4): 26 kB | 53/90 kB | 16/223 kB | 16/35 kB
Progress (4): 26 kB | 57/90 kB | 16/223 kB | 16/35 kB
Progress (4): 26 kB | 57/90 kB | 16/223 kB | 20/35 kB
Progress (4): 26 kB | 57/90 kB | 20/223 kB | 20/35 kB
Progress (4): 26 kB | 57/90 kB | 20/223 kB | 24/35 kB
Progress (4): 26 kB | 57/90 kB | 24/223 kB | 24/35 kB
Progress (4): 26 kB | 61/90 kB | 24/223 kB | 24/35 kB
Progress (4): 26 kB | 61/90 kB | 24/223 kB | 28/35 kB
Progress (4): 26 kB | 65/90 kB | 24/223 kB | 28/35 kB
Progress (4): 26 kB | 65/90 kB | 28/223 kB | 28/35 kB
Progress (4): 26 kB | 65/90 kB | 28/223 kB | 32/35 kB
Progress (4): 26 kB | 65/90 kB | 32/223 kB | 32/35 kB
Progress (4): 26 kB | 66/90 kB | 32/223 kB | 32/35 kB
Progress (4): 26 kB | 66/90 kB | 33/223 kB | 32/35 kB
Progress (4): 26 kB | 66/90 kB | 33/223 kB | 33/35 kB
Progress (4): 26 kB | 66/90 kB | 33/223 kB | 35 kB   
Progress (4): 26 kB | 70/90 kB | 33/223 kB | 35 kB
Progress (4): 26 kB | 70/90 kB | 37/223 kB | 35 kB
Progress (4): 26 kB | 74/90 kB | 37/223 kB | 35 kB
Progress (4): 26 kB | 74/90 kB | 41/223 kB | 35 kB
Progress (4): 26 kB | 78/90 kB | 41/223 kB | 35 kB
Progress (4): 26 kB | 78/90 kB | 45/223 kB | 35 kB
Progress (4): 26 kB | 82/90 kB | 45/223 kB | 35 kB
Progress (4): 26 kB | 82/90 kB | 49/223 kB | 35 kB
Progress (4): 26 kB | 86/90 kB | 49/223 kB | 35 kB
Progress (4): 26 kB | 86/90 kB | 53/223 kB | 35 kB
Progress (4): 26 kB | 90 kB | 53/223 kB | 35 kB   
Progress (4): 26 kB | 90 kB | 57/223 kB | 35 kB
Progress (4): 26 kB | 90 kB | 61/223 kB | 35 kB
Progress (4): 26 kB | 90 kB | 65/223 kB | 35 kB
Progress (4): 26 kB | 90 kB | 69/223 kB | 35 kB
Progress (5): 26 kB | 90 kB | 69/223 kB | 35 kB | 4.1/409 kB
Progress (5): 26 kB | 90 kB | 73/223 kB | 35 kB | 4.1/409 kB
Progress (5): 26 kB | 90 kB | 73/223 kB | 35 kB | 7.7/409 kB
Progress (5): 26 kB | 90 kB | 77/223 kB | 35 kB | 7.7/409 kB
Progress (5): 26 kB | 90 kB | 77/223 kB | 35 kB | 12/409 kB 
Progress (5): 26 kB | 90 kB | 81/223 kB | 35 kB | 12/409 kB
Progress (5): 26 kB | 90 kB | 81/223 kB | 35 kB | 16/409 kB
Progress (5): 26 kB | 90 kB | 85/223 kB | 35 kB | 16/409 kB
Progress (5): 26 kB | 90 kB | 85/223 kB | 35 kB | 20/409 kB
Progress (5): 26 kB | 90 kB | 89/223 kB | 35 kB | 20/409 kB
Progress (5): 26 kB | 90 kB | 89/223 kB | 35 kB | 24/409 kB
Progress (5): 26 kB | 90 kB | 93/223 kB | 35 kB | 24/409 kB
Progress (5): 26 kB | 90 kB | 93/223 kB | 35 kB | 28/409 kB
Progress (5): 26 kB | 90 kB | 97/223 kB | 35 kB | 28/409 kB
Progress (5): 26 kB | 90 kB | 97/223 kB | 35 kB | 32/409 kB
                                                           
Downloaded from eclipse.maven.central.mirror: https://repo.eclipse.org/content/repositories/maven_central/org/codehaus/plexus/plexus-interpolation/1.1/plexus-interpolation-1.1.jar (35 kB at 366 kB/s)
Progress (4): 26 kB | 90 kB | 101/223 kB | 32/409 kB
Progress (4): 26 kB | 90 kB | 101/223 kB | 33/409 kB
                                                    
Downloaded from eclipse.maven.central.mirror: https://repo.eclipse.org/content/repositories/maven_central/org/apache/maven/maven-artifact/2.0.11/maven-artifact-2.0.11.jar (90 kB at 923 kB/s)
Progress (3): 26 kB | 101/223 kB | 37/409 kB
Progress (3): 26 kB | 105/223 kB | 37/409 kB
                                            
Downloading from eclipse.maven.central.mirror: https://repo.eclipse.org/content/repositories/maven_central/org/apache/ant/ant/1.8.1/ant-1.8.1.jar
Progress (3): 26 kB | 109/223 kB | 37/409 kB
Progress (3): 26 kB | 109/223 kB | 41/409 kB
                                            
Downloading from eclipse.maven.central.mirror: https://repo.eclipse.org/content/repositories/maven_central/org/apache/ant/ant-launcher/1.8.1/ant-launcher-1.8.1.jar
Progress (3): 26 kB | 109/223 kB | 45/409 kB
Progress (3): 26 kB | 113/223 kB | 45/409 kB
Progress (3): 26 kB | 113/223 kB | 49/409 kB
Progress (3): 26 kB | 117/223 kB | 49/409 kB
Progress (3): 26 kB | 117/223 kB | 53/409 kB
Progress (3): 26 kB | 121/223 kB | 53/409 kB
Progress (3): 26 kB | 121/223 kB | 57/409 kB
Progress (3): 26 kB | 125/223 kB | 57/409 kB
Progress (3): 26 kB | 125/223 kB | 61/409 kB
Progress (3): 26 kB | 129/223 kB | 61/409 kB
Progress (3): 26 kB | 129/223 kB | 65/409 kB
Progress (3): 26 kB | 129/223 kB | 66/409 kB
Progress (3): 26 kB | 133/223 kB | 66/409 kB
Progress (3): 26 kB | 137/223 kB | 66/409 kB
Progress (3): 26 kB | 137/223 kB | 70/409 kB
Progress (3): 26 kB | 137/223 kB | 74/409 kB
Progress (3): 26 kB | 141/223 kB | 74/409 kB
Progress (3): 26 kB | 145/223 kB | 74/409 kB
Progress (3): 26 kB | 145/223 kB | 78/409 kB
Progress (3): 26 kB | 145/223 kB | 82/409 kB
Progress (3): 26 kB | 149/223 kB | 82/409 kB
Progress (3): 26 kB | 153/223 kB | 82/409 kB
Progress (3): 26 kB | 153/223 kB | 86/409 kB
Progress (3): 26 kB | 153/223 kB | 90/409 kB
Progress (3): 26 kB | 157/223 kB | 90/409 kB
Progress (3): 26 kB | 161/223 kB | 90/409 kB
Progress (3): 26 kB | 161/223 kB | 94/409 kB
Progress (3): 26 kB | 161/223 kB | 98/409 kB
Progress (3): 26 kB | 165/223 kB | 98/409 kB
Progress (3): 26 kB | 169/223 kB | 98/409 kB
Progress (3): 26 kB | 169/223 kB | 102/409 kB
Progress (3): 26 kB | 169/223 kB | 106/409 kB
Progress (3): 26 kB | 173/223 kB | 106/409 kB
Progress (3): 26 kB | 177/223 kB | 106/409 kB
Progress (3): 26 kB | 177/223 kB | 110/409 kB
Progress (3): 26 kB | 177/223 kB | 114/409 kB
Progress (3): 26 kB | 181/223 kB | 114/409 kB
Progress (3): 26 kB | 185/223 kB | 114/409 kB
Progress (4): 26 kB | 185/223 kB | 114/409 kB | 4.1/12 kB
Progress (4): 26 kB | 185/223 kB | 118/409 kB | 4.1/12 kB
Progress (4): 26 kB | 185/223 kB | 118/409 kB | 7.7/12 kB
Progress (5): 26 kB | 185/223 kB | 118/409 kB | 7.7/12 kB | 0/1.5 MB
Progress (5): 26 kB | 185/223 kB | 118/409 kB | 12/12 kB | 0/1.5 MB 
Progress (5): 26 kB | 185/223 kB | 122/409 kB | 12/12 kB | 0/1.5 MB
Progress (5): 26 kB | 189/223 kB | 122/409 kB | 12/12 kB | 0/1.5 MB
Progress (5): 26 kB | 189/223 kB | 122/409 kB | 12 kB | 0/1.5 MB   
Progress (5): 26 kB | 189/223 kB | 122/409 kB | 12 kB | 0/1.5 MB
Progress (5): 26 kB | 189/223 kB | 126/409 kB | 12 kB | 0/1.5 MB
Progress (5): 26 kB | 193/223 kB | 126/409 kB | 12 kB | 0/1.5 MB
Progress (5): 26 kB | 193/223 kB | 130/409 kB | 12 kB | 0/1.5 MB
Progress (5): 26 kB | 193/223 kB | 130/409 kB | 12 kB | 0/1.5 MB
Progress (5): 26 kB | 197/223 kB | 130/409 kB | 12 kB | 0/1.5 MB
Progress (5): 26 kB | 197/223 kB | 130/409 kB | 12 kB | 0/1.5 MB
Progress (5): 26 kB | 197/223 kB | 134/409 kB | 12 kB | 0/1.5 MB
Progress (5): 26 kB | 201/223 kB | 134/409 kB | 12 kB | 0/1.5 MB
Progress (5): 26 kB | 201/223 kB | 134/409 kB | 12 kB | 0/1.5 MB
Progress (5): 26 kB | 201/223 kB | 138/409 kB | 12 kB | 0/1.5 MB
Progress (5): 26 kB | 205/223 kB | 138/409 kB | 12 kB | 0/1.5 MB
Progress (5): 26 kB | 205/223 kB | 138/409 kB | 12 kB | 0/1.5 MB
Progress (5): 26 kB | 209/223 kB | 138/409 kB | 12 kB | 0/1.5 MB
Progress (5): 26 kB | 209/223 kB | 142/409 kB | 12 kB | 0/1.5 MB
Progress (5): 26 kB | 209/223 kB | 142/409 kB | 12 kB | 0/1.5 MB
Progress (5): 26 kB | 213/223 kB | 142/409 kB | 12 kB | 0/1.5 MB
Progress (5): 26 kB | 213/223 kB | 146/409 kB | 12 kB | 0/1.5 MB
Progress (5): 26 kB | 217/223 kB | 146/409 kB | 12 kB | 0/1.5 MB
Progress (5): 26 kB | 217/223 kB | 146/409 kB | 12 kB | 0/1.5 MB
Progress (5): 26 kB | 217/223 kB | 146/409 kB | 12 kB | 0/1.5 MB
Progress (5): 26 kB | 221/223 kB | 146/409 kB | 12 kB | 0/1.5 MB
Progress (5): 26 kB | 221/223 kB | 150/409 kB | 12 kB | 0/1.5 MB
Progress (5): 26 kB | 221/223 kB | 150/409 kB | 12 kB | 0/1.5 MB
Progress (5): 26 kB | 223 kB | 150/409 kB | 12 kB | 0/1.5 MB    
Progress (5): 26 kB | 223 kB | 150/409 kB | 12 kB | 0/1.5 MB
Progress (5): 26 kB | 223 kB | 154/409 kB | 12 kB | 0/1.5 MB
Progress (5): 26 kB | 223 kB | 154/409 kB | 12 kB | 0/1.5 MB
Progress (5): 26 kB | 223 kB | 154/409 kB | 12 kB | 0/1.5 MB
Progress (5): 26 kB | 223 kB | 158/409 kB | 12 kB | 0/1.5 MB
                                                            
Downloaded from eclipse.maven.central.mirror: https://repo.eclipse.org/content/repositories/maven_central/org/apache/ant/ant-launcher/1.8.1/ant-launcher-1.8.1.jar (12 kB at 110 kB/s)
Progress (4): 26 kB | 223 kB | 158/409 kB | 0.1/1.5 MB
Progress (4): 26 kB | 223 kB | 162/409 kB | 0.1/1.5 MB
Progress (4): 26 kB | 223 kB | 162/409 kB | 0.1/1.5 MB
Progress (4): 26 kB | 223 kB | 166/409 kB | 0.1/1.5 MB
Progress (4): 26 kB | 223 kB | 166/409 kB | 0.1/1.5 MB
Progress (4): 26 kB | 223 kB | 170/409 kB | 0.1/1.5 MB
Progress (4): 26 kB | 223 kB | 170/409 kB | 0.1/1.5 MB
Progress (4): 26 kB | 223 kB | 170/409 kB | 0.1/1.5 MB
Progress (4): 26 kB | 223 kB | 174/409 kB | 0.1/1.5 MB
Progress (4): 26 kB | 223 kB | 178/409 kB | 0.1/1.5 MB
Progress (4): 26 kB | 223 kB | 178/409 kB | 0.1/1.5 MB
Progress (4): 26 kB | 223 kB | 178/409 kB | 0.1/1.5 MB
Progress (4): 26 kB | 223 kB | 182/409 kB | 0.1/1.5 MB
Progress (4): 26 kB | 223 kB | 186/409 kB | 0.1/1.5 MB
Progress (4): 26 kB | 223 kB | 186/409 kB | 0.1/1.5 MB
Progress (4): 26 kB | 223 kB | 186/409 kB | 0.1/1.5 MB
Progress (4): 26 kB | 223 kB | 190/409 kB | 0.1/1.5 MB
Progress (4): 26 kB | 223 kB | 194/409 kB | 0.1/1.5 MB
Progress (4): 26 kB | 223 kB | 194/409 kB | 0.1/1.5 MB
Progress (4): 26 kB | 223 kB | 194/409 kB | 0.1/1.5 MB
Progress (4): 26 kB | 223 kB | 198/409 kB | 0.1/1.5 MB
Progress (4): 26 kB | 223 kB | 202/409 kB | 0.1/1.5 MB
Progress (4): 26 kB | 223 kB | 202/409 kB | 0.1/1.5 MB
Progress (4): 26 kB | 223 kB | 202/409 kB | 0.1/1.5 MB
Progress (4): 26 kB | 223 kB | 206/409 kB | 0.1/1.5 MB
Progress (4): 26 kB | 223 kB | 206/409 kB | 0.1/1.5 MB
Progress (4): 26 kB | 223 kB | 210/409 kB | 0.1/1.5 MB
                                                      
Downloaded from eclipse.maven.central.mirror: https://repo.eclipse.org/content/repositories/maven_central/org/codehaus/plexus/plexus-utils/2.0.5/plexus-utils-2.0.5.jar (223 kB at 1.9 MB/s)
Progress (3): 26 kB | 214/409 kB | 0.1/1.5 MB
Progress (3): 26 kB | 214/409 kB | 0.1/1.5 MB
Progress (3): 26 kB | 218/409 kB | 0.1/1.5 MB
Progress (3): 26 kB | 218/409 kB | 0.1/1.5 MB
Progress (3): 26 kB | 222/409 kB | 0.1/1.5 MB
Progress (3): 26 kB | 222/409 kB | 0.1/1.5 MB
Progress (3): 26 kB | 226/409 kB | 0.1/1.5 MB
Progress (3): 26 kB | 226/409 kB | 0.1/1.5 MB
Progress (3): 26 kB | 230/409 kB | 0.1/1.5 MB
Progress (3): 26 kB | 230/409 kB | 0.1/1.5 MB
Progress (3): 26 kB | 234/409 kB | 0.1/1.5 MB
Progress (3): 26 kB | 234/409 kB | 0.1/1.5 MB
Progress (3): 26 kB | 238/409 kB | 0.1/1.5 MB
Progress (3): 26 kB | 238/409 kB | 0.1/1.5 MB
Progress (3): 26 kB | 242/409 kB | 0.1/1.5 MB
Progress (3): 26 kB | 242/409 kB | 0.1/1.5 MB
Progress (3): 26 kB | 246/409 kB | 0.1/1.5 MB
Progress (3): 26 kB | 246/409 kB | 0.1/1.5 MB
Progress (3): 26 kB | 250/409 kB | 0.1/1.5 MB
Progress (3): 26 kB | 250/409 kB | 0.1/1.5 MB
Progress (3): 26 kB | 254/409 kB | 0.1/1.5 MB
Progress (3): 26 kB | 254/409 kB | 0.1/1.5 MB
Progress (3): 26 kB | 258/409 kB | 0.1/1.5 MB
Progress (3): 26 kB | 258/409 kB | 0.1/1.5 MB
Progress (3): 26 kB | 262/409 kB | 0.1/1.5 MB
Progress (3): 26 kB | 262/409 kB | 0.2/1.5 MB
Progress (3): 26 kB | 266/409 kB | 0.2/1.5 MB
Progress (3): 26 kB | 266/409 kB | 0.2/1.5 MB
Progress (3): 26 kB | 270/409 kB | 0.2/1.5 MB
Progress (3): 26 kB | 270/409 kB | 0.2/1.5 MB
Progress (3): 26 kB | 274/409 kB | 0.2/1.5 MB
Progress (3): 26 kB | 274/409 kB | 0.2/1.5 MB
Progress (3): 26 kB | 278/409 kB | 0.2/1.5 MB
Progress (3): 26 kB | 278/409 kB | 0.2/1.5 MB
Progress (3): 26 kB | 282/409 kB | 0.2/1.5 MB
Progress (3): 26 kB | 282/409 kB | 0.2/1.5 MB
Progress (3): 26 kB | 286/409 kB | 0.2/1.5 MB
Progress (3): 26 kB | 286/409 kB | 0.2/1.5 MB
Progress (3): 26 kB | 290/409 kB | 0.2/1.5 MB
Progress (3): 26 kB | 290/409 kB | 0.2/1.5 MB
Progress (3): 26 kB | 294/409 kB | 0.2/1.5 MB
Progress (3): 26 kB | 294/409 kB | 0.2/1.5 MB
Progress (3): 26 kB | 298/409 kB | 0.2/1.5 MB
Progress (3): 26 kB | 298/409 kB | 0.2/1.5 MB
Progress (3): 26 kB | 302/409 kB | 0.2/1.5 MB
Progress (3): 26 kB | 302/409 kB | 0.2/1.5 MB
Progress (3): 26 kB | 306/409 kB | 0.2/1.5 MB
Progress (3): 26 kB | 306/409 kB | 0.2/1.5 MB
Progress (3): 26 kB | 310/409 kB | 0.2/1.5 MB
Progress (3): 26 kB | 310/409 kB | 0.2/1.5 MB
Progress (3): 26 kB | 314/409 kB | 0.2/1.5 MB
Progress (3): 26 kB | 314/409 kB | 0.2/1.5 MB
Progress (3): 26 kB | 318/409 kB | 0.2/1.5 MB
Progress (3): 26 kB | 318/409 kB | 0.2/1.5 MB
Progress (3): 26 kB | 322/409 kB | 0.2/1.5 MB
Progress (3): 26 kB | 322/409 kB | 0.2/1.5 MB
Progress (3): 26 kB | 326/409 kB | 0.2/1.5 MB
Progress (3): 26 kB | 326/409 kB | 0.2/1.5 MB
Progress (3): 26 kB | 330/409 kB | 0.2/1.5 MB
Progress (3): 26 kB | 330/409 kB | 0.2/1.5 MB
Progress (3): 26 kB | 334/409 kB | 0.2/1.5 MB
Progress (3): 26 kB | 334/409 kB | 0.2/1.5 MB
Progress (3): 26 kB | 338/409 kB | 0.2/1.5 MB
Progress (3): 26 kB | 338/409 kB | 0.2/1.5 MB
Progress (3): 26 kB | 342/409 kB | 0.2/1.5 MB
Progress (3): 26 kB | 342/409 kB | 0.2/1.5 MB
Progress (3): 26 kB | 346/409 kB | 0.2/1.5 MB
Progress (3): 26 kB | 346/409 kB | 0.2/1.5 MB
Progress (3): 26 kB | 350/409 kB | 0.2/1.5 MB
Progress (3): 26 kB | 350/409 kB | 0.2/1.5 MB
Progress (3): 26 kB | 354/409 kB | 0.2/1.5 MB
Progress (3): 26 kB | 354/409 kB | 0.2/1.5 MB
Progress (3): 26 kB | 358/409 kB | 0.2/1.5 MB
Progress (3): 26 kB | 358/409 kB | 0.2/1.5 MB
Progress (3): 26 kB | 362/409 kB | 0.2/1.5 MB
Progress (3): 26 kB | 362/409 kB | 0.3/1.5 MB
Progress (3): 26 kB | 366/409 kB | 0.3/1.5 MB
Progress (3): 26 kB | 366/409 kB | 0.3/1.5 MB
Progress (3): 26 kB | 370/409 kB | 0.3/1.5 MB
Progress (3): 26 kB | 370/409 kB | 0.3/1.5 MB
Progress (3): 26 kB | 374/409 kB | 0.3/1.5 MB
Progress (3): 26 kB | 374/409 kB | 0.3/1.5 MB
Progress (3): 26 kB | 378/409 kB | 0.3/1.5 MB
Progress (3): 26 kB | 378/409 kB | 0.3/1.5 MB
Progress (3): 26 kB | 382/409 kB | 0.3/1.5 MB
Progress (3): 26 kB | 386/409 kB | 0.3/1.5 MB
Progress (3): 26 kB | 386/409 kB | 0.3/1.5 MB
Progress (3): 26 kB | 386/409 kB | 0.3/1.5 MB
Progress (3): 26 kB | 390/409 kB | 0.3/1.5 MB
Progress (3): 26 kB | 394/409 kB | 0.3/1.5 MB
Progress (3): 26 kB | 394/409 kB | 0.3/1.5 MB
Progress (3): 26 kB | 394/409 kB | 0.3/1.5 MB
Progress (3): 26 kB | 398/409 kB | 0.3/1.5 MB
Progress (3): 26 kB | 402/409 kB | 0.3/1.5 MB
Progress (3): 26 kB | 402/409 kB | 0.3/1.5 MB
Progress (3): 26 kB | 402/409 kB | 0.3/1.5 MB
Progress (3): 26 kB | 406/409 kB | 0.3/1.5 MB
Progress (3): 26 kB | 409 kB | 0.3/1.5 MB    
Progress (3): 26 kB | 409 kB | 0.3/1.5 MB
Progress (3): 26 kB | 409 kB | 0.3/1.5 MB
Progress (3): 26 kB | 409 kB | 0.3/1.5 MB
Progress (3): 26 kB | 409 kB | 0.3/1.5 MB
Progress (3): 26 kB | 409 kB | 0.3/1.5 MB
Progress (3): 26 kB | 409 kB | 0.3/1.5 MB
Progress (3): 26 kB | 409 kB | 0.3/1.5 MB
Progress (3): 26 kB | 409 kB | 0.3/1.5 MB
Progress (3): 26 kB | 409 kB | 0.3/1.5 MB
Progress (3): 26 kB | 409 kB | 0.3/1.5 MB
Progress (3): 26 kB | 409 kB | 0.3/1.5 MB
Progress (3): 26 kB | 409 kB | 0.3/1.5 MB
Progress (3): 26 kB | 409 kB | 0.3/1.5 MB
Progress (3): 26 kB | 409 kB | 0.3/1.5 MB
Progress (3): 26 kB | 409 kB | 0.4/1.5 MB
Progress (3): 26 kB | 409 kB | 0.4/1.5 MB
Progress (3): 26 kB | 409 kB | 0.4/1.5 MB
Progress (3): 26 kB | 409 kB | 0.4/1.5 MB
                                         
Downloaded from eclipse.maven.central.mirror: https://repo.eclipse.org/content/repositories/maven_central/org/apache/ant/ant-nodeps/1.8.1/ant-nodeps-1.8.1.jar (409 kB at 3.1 MB/s)
Progress (2): 26 kB | 0.4/1.5 MB
Progress (2): 26 kB | 0.4/1.5 MB
Progress (2): 26 kB | 0.4/1.5 MB
Progress (2): 26 kB | 0.4/1.5 MB
Progress (2): 26 kB | 0.4/1.5 MB
Progress (2): 26 kB | 0.4/1.5 MB
Progress (2): 26 kB | 0.4/1.5 MB
Progress (2): 26 kB | 0.4/1.5 MB
Progress (2): 26 kB | 0.4/1.5 MB
Progress (2): 26 kB | 0.4/1.5 MB
Progress (2): 26 kB | 0.4/1.5 MB
Progress (2): 26 kB | 0.4/1.5 MB
Progress (2): 26 kB | 0.4/1.5 MB
Progress (2): 26 kB | 0.4/1.5 MB
Progress (2): 26 kB | 0.4/1.5 MB
Progress (2): 26 kB | 0.4/1.5 MB
Progress (2): 26 kB | 0.4/1.5 MB
Progress (2): 26 kB | 0.4/1.5 MB
Progress (2): 26 kB | 0.4/1.5 MB
Progress (2): 26 kB | 0.4/1.5 MB
Progress (2): 26 kB | 0.4/1.5 MB
Progress (2): 26 kB | 0.5/1.5 MB
Progress (2): 26 kB | 0.5/1.5 MB
Progress (2): 26 kB | 0.5/1.5 MB
Progress (2): 26 kB | 0.5/1.5 MB
Progress (2): 26 kB | 0.5/1.5 MB
Progress (2): 26 kB | 0.5/1.5 MB
Progress (2): 26 kB | 0.5/1.5 MB
Progress (2): 26 kB | 0.5/1.5 MB
Progress (2): 26 kB | 0.5/1.5 MB
Progress (2): 26 kB | 0.5/1.5 MB
Progress (2): 26 kB | 0.5/1.5 MB
Progress (2): 26 kB | 0.5/1.5 MB
Progress (2): 26 kB | 0.5/1.5 MB
Progress (2): 26 kB | 0.5/1.5 MB
Progress (2): 26 kB | 0.5/1.5 MB
Progress (2): 26 kB | 0.5/1.5 MB
Progress (2): 26 kB | 0.5/1.5 MB
Progress (2): 26 kB | 0.5/1.5 MB
Progress (2): 26 kB | 0.5/1.5 MB
Progress (2): 26 kB | 0.5/1.5 MB
Progress (2): 26 kB | 0.5/1.5 MB
Progress (2): 26 kB | 0.5/1.5 MB
Progress (2): 26 kB | 0.5/1.5 MB
Progress (2): 26 kB | 0.5/1.5 MB
Progress (2): 26 kB | 0.5/1.5 MB
Progress (2): 26 kB | 0.6/1.5 MB
Progress (2): 26 kB | 0.6/1.5 MB
Progress (2): 26 kB | 0.6/1.5 MB
Progress (2): 26 kB | 0.6/1.5 MB
Progress (2): 26 kB | 0.6/1.5 MB
Progress (2): 26 kB | 0.6/1.5 MB
Progress (2): 26 kB | 0.6/1.5 MB
Progress (2): 26 kB | 0.6/1.5 MB
Progress (2): 26 kB | 0.6/1.5 MB
Progress (2): 26 kB | 0.6/1.5 MB
Progress (2): 26 kB | 0.6/1.5 MB
Progress (2): 26 kB | 0.6/1.5 MB
Progress (2): 26 kB | 0.6/1.5 MB
Progress (2): 26 kB | 0.6/1.5 MB
Progress (2): 26 kB | 0.6/1.5 MB
Progress (2): 26 kB | 0.6/1.5 MB
Progress (2): 26 kB | 0.6/1.5 MB
Progress (2): 26 kB | 0.6/1.5 MB
Progress (2): 26 kB | 0.6/1.5 MB
Progress (2): 26 kB | 0.6/1.5 MB
Progress (2): 26 kB | 0.6/1.5 MB
Progress (2): 26 kB | 0.6/1.5 MB
Progress (2): 26 kB | 0.6/1.5 MB
Progress (2): 26 kB | 0.6/1.5 MB
Progress (2): 26 kB | 0.6/1.5 MB
Progress (2): 26 kB | 0.7/1.5 MB
Progress (2): 26 kB | 0.7/1.5 MB
Progress (2): 26 kB | 0.7/1.5 MB
Progress (2): 26 kB | 0.7/1.5 MB
Progress (2): 26 kB | 0.7/1.5 MB
Progress (2): 26 kB | 0.7/1.5 MB
Progress (2): 26 kB | 0.7/1.5 MB
Progress (2): 26 kB | 0.7/1.5 MB
Progress (2): 26 kB | 0.7/1.5 MB
Progress (2): 26 kB | 0.7/1.5 MB
Progress (2): 26 kB | 0.7/1.5 MB
Progress (2): 26 kB | 0.7/1.5 MB
Progress (2): 26 kB | 0.7/1.5 MB
Progress (2): 26 kB | 0.7/1.5 MB
Progress (2): 26 kB | 0.7/1.5 MB
Progress (2): 26 kB | 0.7/1.5 MB
Progress (2): 26 kB | 0.7/1.5 MB
Progress (2): 26 kB | 0.7/1.5 MB
Progress (2): 26 kB | 0.7/1.5 MB
Progress (2): 26 kB | 0.7/1.5 MB
Progress (2): 26 kB | 0.7/1.5 MB
Progress (2): 26 kB | 0.7/1.5 MB
Progress (2): 26 kB | 0.7/1.5 MB
Progress (2): 26 kB | 0.7/1.5 MB
Progress (2): 26 kB | 0.7/1.5 MB
Progress (2): 26 kB | 0.8/1.5 MB
Progress (2): 26 kB | 0.8/1.5 MB
Progress (2): 26 kB | 0.8/1.5 MB
Progress (2): 26 kB | 0.8/1.5 MB
Progress (2): 26 kB | 0.8/1.5 MB
Progress (2): 26 kB | 0.8/1.5 MB
Progress (2): 26 kB | 0.8/1.5 MB
Progress (2): 26 kB | 0.8/1.5 MB
Progress (2): 26 kB | 0.8/1.5 MB
Progress (2): 26 kB | 0.8/1.5 MB
Progress (2): 26 kB | 0.8/1.5 MB
Progress (2): 26 kB | 0.8/1.5 MB
Progress (2): 26 kB | 0.8/1.5 MB
Progress (2): 26 kB | 0.8/1.5 MB
Progress (2): 26 kB | 0.8/1.5 MB
Progress (2): 26 kB | 0.8/1.5 MB
Progress (2): 26 kB | 0.8/1.5 MB
Progress (2): 26 kB | 0.8/1.5 MB
Progress (2): 26 kB | 0.8/1.5 MB
Progress (2): 26 kB | 0.8/1.5 MB
Progress (2): 26 kB | 0.8/1.5 MB
Progress (2): 26 kB | 0.8/1.5 MB
Progress (2): 26 kB | 0.8/1.5 MB
Progress (2): 26 kB | 0.8/1.5 MB
Progress (2): 26 kB | 0.8/1.5 MB
Progress (2): 26 kB | 0.9/1.5 MB
Progress (2): 26 kB | 0.9/1.5 MB
Progress (2): 26 kB | 0.9/1.5 MB
Progress (2): 26 kB | 0.9/1.5 MB
Progress (2): 26 kB | 0.9/1.5 MB
Progress (2): 26 kB | 0.9/1.5 MB
Progress (2): 26 kB | 0.9/1.5 MB
Progress (2): 26 kB | 0.9/1.5 MB
Progress (2): 26 kB | 0.9/1.5 MB
Progress (2): 26 kB | 0.9/1.5 MB
Progress (2): 26 kB | 0.9/1.5 MB
Progress (2): 26 kB | 0.9/1.5 MB
Progress (2): 26 kB | 0.9/1.5 MB
Progress (2): 26 kB | 0.9/1.5 MB
Progress (2): 26 kB | 0.9/1.5 MB
Progress (2): 26 kB | 0.9/1.5 MB
Progress (2): 26 kB | 0.9/1.5 MB
Progress (2): 26 kB | 0.9/1.5 MB
Progress (2): 26 kB | 0.9/1.5 MB
Progress (2): 26 kB | 0.9/1.5 MB
Progress (2): 26 kB | 0.9/1.5 MB
Progress (2): 26 kB | 0.9/1.5 MB
Progress (2): 26 kB | 0.9/1.5 MB
Progress (2): 26 kB | 0.9/1.5 MB
Progress (2): 26 kB | 0.9/1.5 MB
Progress (2): 26 kB | 1.0/1.5 MB
Progress (2): 26 kB | 1.0/1.5 MB
Progress (2): 26 kB | 1.0/1.5 MB
Progress (2): 26 kB | 1.0/1.5 MB
Progress (2): 26 kB | 1.0/1.5 MB
Progress (2): 26 kB | 1.0/1.5 MB
Progress (2): 26 kB | 1.0/1.5 MB
Progress (2): 26 kB | 1.0/1.5 MB
Progress (2): 26 kB | 1.0/1.5 MB
Progress (2): 26 kB | 1.0/1.5 MB
Progress (2): 26 kB | 1.0/1.5 MB
Progress (2): 26 kB | 1.0/1.5 MB
Progress (2): 26 kB | 1.0/1.5 MB
Progress (2): 26 kB | 1.0/1.5 MB
Progress (2): 26 kB | 1.0/1.5 MB
Progress (2): 26 kB | 1.0/1.5 MB
Progress (2): 26 kB | 1.0/1.5 MB
Progress (2): 26 kB | 1.0/1.5 MB
Progress (2): 26 kB | 1.0/1.5 MB
Progress (2): 26 kB | 1.0/1.5 MB
Progress (2): 26 kB | 1.0/1.5 MB
Progress (2): 26 kB | 1.0/1.5 MB
Progress (2): 26 kB | 1.0/1.5 MB
Progress (2): 26 kB | 1.0/1.5 MB
Progress (2): 26 kB | 1.0/1.5 MB
Progress (2): 26 kB | 1.1/1.5 MB
Progress (2): 26 kB | 1.1/1.5 MB
Progress (2): 26 kB | 1.1/1.5 MB
Progress (2): 26 kB | 1.1/1.5 MB
Progress (2): 26 kB | 1.1/1.5 MB
Progress (2): 26 kB | 1.1/1.5 MB
Progress (2): 26 kB | 1.1/1.5 MB
Progress (2): 26 kB | 1.1/1.5 MB
Progress (2): 26 kB | 1.1/1.5 MB
Progress (2): 26 kB | 1.1/1.5 MB
Progress (2): 26 kB | 1.1/1.5 MB
Progress (2): 26 kB | 1.1/1.5 MB
Progress (2): 26 kB | 1.1/1.5 MB
Progress (2): 26 kB | 1.1/1.5 MB
Progress (2): 26 kB | 1.1/1.5 MB
Progress (2): 26 kB | 1.1/1.5 MB
Progress (2): 26 kB | 1.1/1.5 MB
Progress (2): 26 kB | 1.1/1.5 MB
Progress (2): 26 kB | 1.1/1.5 MB
Progress (2): 26 kB | 1.1/1.5 MB
Progress (2): 26 kB | 1.1/1.5 MB
Progress (2): 26 kB | 1.1/1.5 MB
Progress (2): 26 kB | 1.1/1.5 MB
Progress (2): 26 kB | 1.1/1.5 MB
Progress (2): 26 kB | 1.1/1.5 MB
Progress (2): 26 kB | 1.2/1.5 MB
Progress (2): 26 kB | 1.2/1.5 MB
Progress (2): 26 kB | 1.2/1.5 MB
Progress (2): 26 kB | 1.2/1.5 MB
Progress (2): 26 kB | 1.2/1.5 MB
Progress (2): 26 kB | 1.2/1.5 MB
Progress (2): 26 kB | 1.2/1.5 MB
Progress (2): 26 kB | 1.2/1.5 MB
Progress (2): 26 kB | 1.2/1.5 MB
Progress (2): 26 kB | 1.2/1.5 MB
Progress (2): 26 kB | 1.2/1.5 MB
Progress (2): 26 kB | 1.2/1.5 MB
Progress (2): 26 kB | 1.2/1.5 MB
Progress (2): 26 kB | 1.2/1.5 MB
Progress (2): 26 kB | 1.2/1.5 MB
Progress (2): 26 kB | 1.2/1.5 MB
Progress (2): 26 kB | 1.2/1.5 MB
Progress (2): 26 kB | 1.2/1.5 MB
Progress (2): 26 kB | 1.2/1.5 MB
Progress (2): 26 kB | 1.2/1.5 MB
Progress (2): 26 kB | 1.2/1.5 MB
Progress (2): 26 kB | 1.2/1.5 MB
Progress (2): 26 kB | 1.2/1.5 MB
Progress (2): 26 kB | 1.2/1.5 MB
Progress (2): 26 kB | 1.2/1.5 MB
Progress (2): 26 kB | 1.3/1.5 MB
Progress (2): 26 kB | 1.3/1.5 MB
Progress (2): 26 kB | 1.3/1.5 MB
Progress (2): 26 kB | 1.3/1.5 MB
Progress (2): 26 kB | 1.3/1.5 MB
Progress (2): 26 kB | 1.3/1.5 MB
Progress (2): 26 kB | 1.3/1.5 MB
Progress (2): 26 kB | 1.3/1.5 MB
Progress (2): 26 kB | 1.3/1.5 MB
Progress (2): 26 kB | 1.3/1.5 MB
Progress (2): 26 kB | 1.3/1.5 MB
Progress (2): 26 kB | 1.3/1.5 MB
Progress (2): 26 kB | 1.3/1.5 MB
Progress (2): 26 kB | 1.3/1.5 MB
Progress (2): 26 kB | 1.3/1.5 MB
Progress (2): 26 kB | 1.3/1.5 MB
Progress (2): 26 kB | 1.3/1.5 MB
Progress (2): 26 kB | 1.3/1.5 MB
Progress (2): 26 kB | 1.3/1.5 MB
Progress (2): 26 kB | 1.3/1.5 MB
Progress (2): 26 kB | 1.3/1.5 MB
Progress (2): 26 kB | 1.3/1.5 MB
Progress (2): 26 kB | 1.3/1.5 MB
Progress (2): 26 kB | 1.3/1.5 MB
Progress (2): 26 kB | 1.3/1.5 MB
Progress (2): 26 kB | 1.4/1.5 MB
Progress (2): 26 kB | 1.4/1.5 MB
Progress (2): 26 kB | 1.4/1.5 MB
Progress (2): 26 kB | 1.4/1.5 MB
Progress (2): 26 kB | 1.4/1.5 MB
Progress (2): 26 kB | 1.4/1.5 MB
Progress (2): 26 kB | 1.4/1.5 MB
Progress (2): 26 kB | 1.4/1.5 MB
Progress (2): 26 kB | 1.4/1.5 MB
Progress (2): 26 kB | 1.4/1.5 MB
Progress (2): 26 kB | 1.4/1.5 MB
Progress (2): 26 kB | 1.4/1.5 MB
Progress (2): 26 kB | 1.4/1.5 MB
Progress (2): 26 kB | 1.4/1.5 MB
Progress (2): 26 kB | 1.4/1.5 MB
Progress (2): 26 kB | 1.4/1.5 MB
Progress (2): 26 kB | 1.4/1.5 MB
Progress (2): 26 kB | 1.4/1.5 MB
Progress (2): 26 kB | 1.4/1.5 MB
Progress (2): 26 kB | 1.4/1.5 MB
Progress (2): 26 kB | 1.4/1.5 MB
Progress (2): 26 kB | 1.4/1.5 MB
Progress (2): 26 kB | 1.4/1.5 MB
Progress (2): 26 kB | 1.4/1.5 MB
Progress (2): 26 kB | 1.4/1.5 MB
Progress (2): 26 kB | 1.5/1.5 MB
Progress (2): 26 kB | 1.5/1.5 MB
Progress (2): 26 kB | 1.5/1.5 MB
Progress (2): 26 kB | 1.5/1.5 MB
Progress (2): 26 kB | 1.5/1.5 MB
Progress (2): 26 kB | 1.5/1.5 MB
Progress (2): 26 kB | 1.5/1.5 MB
Progress (2): 26 kB | 1.5/1.5 MB
Progress (2): 26 kB | 1.5/1.5 MB
Progress (2): 26 kB | 1.5/1.5 MB
Progress (2): 26 kB | 1.5/1.5 MB
Progress (2): 26 kB | 1.5/1.5 MB
Progress (2): 26 kB | 1.5/1.5 MB
Progress (2): 26 kB | 1.5/1.5 MB
Progress (2): 26 kB | 1.5/1.5 MB
Progress (2): 26 kB | 1.5/1.5 MB
Progress (2): 26 kB | 1.5 MB    
                            
Downloaded from eclipse.maven.central.mirror: https://repo.eclipse.org/content/repositories/maven_central/org/apache/ant/ant/1.8.1/ant-1.8.1.jar (1.5 MB at 7.8 MB/s)
Downloaded from eclipse.maven.central.mirror: https://repo.eclipse.org/content/repositories/maven_central/org/apache/maven/maven-repository-metadata/2.0.11/maven-repository-metadata-2.0.11.jar (26 kB at 126 kB/s)
[INFO] Executing tasks

main:

pack-and-sign:
     [echo] Running on Linux 3.12.60-52.54-default (amd64) / Apache Ant version 1.8.1 compiled on April 30 2010 / Oracle Corporation Java HotSpot(TM) 64-Bit Server VM 1.8.0_162

sign:
     [exec] + SRC=/jobs/genie.mylyn/mylyn-3.23.x-release/workspace/org.eclipse.mylyn/org.eclipse.mylyn-site/target/site
     [exec] + DST=/home/data/httpd/download-staging.priv/tools/mylyn/signing/mylyn/3.23.3-SNAPSHOT
     [exec] + OUT=/home/data/httpd/download-staging.priv/tools/mylyn/signing/mylyn/3.23.3-SNAPSHOT/output
     [exec] + LOG=/home/data/httpd/download-staging.priv/arch/signer.log
     [exec] + rm -rf /home/data/httpd/download-staging.priv/tools/mylyn/signing/mylyn/3.23.3-SNAPSHOT
     [exec] + mkdir -p /home/data/httpd/download-staging.priv/tools/mylyn/signing/mylyn/3.23.3-SNAPSHOT
     [exec] + mkdir -p /home/data/httpd/download-staging.priv/tools/mylyn/signing/mylyn/3.23.3-SNAPSHOT/output
     [exec] + echo Creating archive for signing
     [exec] + cd /jobs/genie.mylyn/mylyn-3.23.x-release/workspace/org.eclipse.mylyn/org.eclipse.mylyn-site/target/site
     [exec] + /usr/bin/find -name '*mylyn*'
     [exec] + zip /home/data/httpd/download-staging.priv/tools/mylyn/signing/mylyn/3.23.3-SNAPSHOT/site.zip -@
     [exec] Creating archive for signing
     [exec]   adding: features/org.eclipse.mylyn_feature_3.23.3.v20180622-2013.jar (deflated 3%)
     [exec]   adding: features/org.eclipse.mylyn.context_feature_3.23.3.v20180622-1953.jar (deflated 3%)
     [exec]   adding: features/org.eclipse.cdt.mylyn_5.19.3.v20180622-1953.jar (deflated 3%)
     [exec]   adding: features/org.eclipse.mylyn.bugzilla_feature_3.23.3.v20180622-1953.jar (deflated 3%)
     [exec]   adding: features/org.eclipse.mylyn.cvs_1.15.0.v20170411-2003.jar (deflated 3%)
     [exec]   adding: features/org.eclipse.mylyn.gerrit.feature_2.14.3.v20180622-1953.jar (deflated 3%)
     [exec]   adding: features/org.eclipse.mylyn.gerrit.dashboard.feature_2.14.3.v20180622-1953.jar (deflated 3%)
     [exec]   adding: features/org.eclipse.mylyn.git_1.15.0.v20170411-2003.jar (deflated 3%)
     [exec]   adding: features/org.eclipse.mylyn.hudson_1.15.0.v20170411-2141.jar (deflated 3%)
     [exec]   adding: features/org.eclipse.mylyn.ide_feature_3.23.3.v20180622-1953.jar (deflated 3%)
     [exec]   adding: features/org.eclipse.mylyn.java_feature_3.23.3.v20180622-1953.jar (deflated 3%)
     [exec]   adding: features/org.eclipse.mylyn.pde_feature_3.23.3.v20180622-1953.jar (deflated 3%)
     [exec]   adding: features/org.eclipse.mylyn.team_feature_3.23.3.v20180622-1953.jar (deflated 3%)
     [exec]   adding: features/org.eclipse.mylyn.team.cvs_3.23.3.v20180622-1953.jar (deflated 3%)
     [exec]   adding: features/org.eclipse.mylyn.subclipse_1.15.0.v20170411-2003.jar (deflated 3%)
     [exec]   adding: features/org.eclipse.mylyn.trac_feature_3.23.3.v20180622-1953.jar (deflated 3%)
     [exec]   adding: features/org.eclipse.mylyn.builds_1.15.0.v20180622-1953.jar (deflated 3%)
     [exec]   adding: features/org.eclipse.mylyn.builds.sdk_1.15.0.v20180622-1953.jar (deflated 3%)
     [exec]   adding: features/org.eclipse.mylyn.commons_3.23.3.v20180622-1953.jar (deflated 3%)
     [exec]   adding: features/org.eclipse.mylyn.commons.identity_1.15.0.v20180622-1953.jar (deflated 3%)
     [exec]   adding: features/org.eclipse.mylyn.commons.notifications_1.15.0.v20180622-1953.jar (deflated 3%)
     [exec]   adding: features/org.eclipse.mylyn.commons.repositories_1.15.0.v20180622-1953.jar (deflated 3%)
     [exec]   adding: features/org.eclipse.mylyn.commons.repositories.http_1.15.0.v20180622-1953.jar (deflated 3%)
     [exec]   adding: features/org.eclipse.mylyn.commons.sdk_3.23.3.v20180622-1953.jar (deflated 3%)
     [exec]   adding: features/org.eclipse.mylyn.discovery_3.23.3.v20180622-1953.jar (deflated 3%)
     [exec]   adding: features/org.eclipse.mylyn.monitor_3.23.3.v20180622-1953.jar (deflated 3%)
     [exec]   adding: features/org.eclipse.mylyn.context.sdk_3.23.3.v20180622-1953.jar (deflated 3%)
     [exec]   adding: features/org.eclipse.mylyn.reviews.feature_2.14.3.v20180622-1953.jar (deflated 3%)
     [exec]   adding: features/org.eclipse.mylyn.reviews.sdk.feature_2.14.3.v20180622-1953.jar (deflated 3%)
     [exec]   adding: features/org.eclipse.mylyn.sdk_feature_3.23.3.v20180622-2013.jar (deflated 3%)
     [exec]   adding: features/org.eclipse.mylyn.tasks.ide_3.23.3.v20180622-1953.jar (deflated 3%)
     [exec]   adding: features/org.eclipse.mylyn.test_feature_3.23.3.v20180622-2013.jar (deflated 3%)
     [exec]   adding: features/org.eclipse.mylyn.versions_1.15.0.v20170411-2003.jar (deflated 3%)
     [exec]   adding: features/org.eclipse.mylyn.versions.sdk_1.15.0.v20170411-2003.jar (deflated 3%)
     [exec]   adding: plugins/org.eclipse.mylyn.tasks.core_3.23.3.v20180622-2013.jar (deflated 12%)
     [exec]   adding: plugins/org.eclipse.mylyn.tasks.index.core_3.23.3.v20180622-1953.jar (deflated 10%)
     [exec]   adding: plugins/org.eclipse.mylyn.tasks.index.ui_3.23.3.v20180622-1953.jar (deflated 20%)
     [exec]   adding: plugins/org.eclipse.mylyn.tasks.search_3.23.3.v20180622-1953.jar (deflated 13%)
     [exec]   adding: plugins/org.eclipse.mylyn.tasks.ui_3.23.3.v20180622-1953.jar (deflated 12%)
     [exec]   adding: plugins/org.eclipse.mylyn.context.core_3.23.3.v20180622-1953.jar (deflated 11%)
     [exec]   adding: plugins/org.eclipse.mylyn.context.ui_3.23.3.v20180622-1953.jar (deflated 12%)
     [exec]   adding: plugins/org.eclipse.mylyn.resources.ui_3.23.3.v20180622-1953.jar (deflated 12%)
     [exec]   adding: plugins/org.eclipse.mylyn.context.tasks.ui_3.23.3.v20180622-1953.jar (deflated 14%)
     [exec]   adding: plugins/org.eclipse.cdt.mylyn.ui_3.23.3.v20180622-1953.jar (deflated 11%)
     [exec]   adding: plugins/org.eclipse.mylyn.bugzilla.core_3.23.3.v20180622-1953.jar (deflated 8%)
     [exec]   adding: plugins/org.eclipse.mylyn.bugzilla.ui_3.23.3.v20180622-1953.jar (deflated 13%)
     [exec]   adding: plugins/org.eclipse.mylyn.cvs.core_1.15.0.v20170411-2003.jar (deflated 23%)
     [exec]   adding: plugins/org.eclipse.mylyn.gerrit.core_2.14.3.v20180622-1953.jar (deflated 13%)
     [exec]   adding: plugins/org.eclipse.mylyn.gerrit.ui_2.14.3.v20180622-1953.jar (deflated 14%)
     [exec]   adding: plugins/org.eclipse.mylyn.gerrit.dashboard.core_2.14.3.v20180622-1953.jar (deflated 14%)
     [exec]   adding: plugins/org.eclipse.mylyn.gerrit.dashboard.ui_2.14.3.v20180622-1953.jar (deflated 17%)
     [exec]   adding: plugins/org.eclipse.mylyn.git.core_1.15.0.v20170411-2003.jar (deflated 12%)
     [exec]   adding: plugins/org.eclipse.mylyn.git.ui_1.15.0.v20170411-2003.jar (deflated 13%)
     [exec]   adding: plugins/org.eclipse.mylyn.hudson.core_1.15.0.v20170411-2141.jar (deflated 14%)
     [exec]   adding: plugins/org.eclipse.mylyn.hudson.ui_1.15.0.v20170411-2141.jar (deflated 19%)
     [exec]   adding: plugins/org.eclipse.mylyn.bugzilla.ide_3.23.3.v20180622-1953.jar (deflated 7%)
     [exec]   adding: plugins/org.eclipse.mylyn.ide.ui_3.23.3.v20180622-1953.jar (deflated 20%)
     [exec]   adding: plugins/org.eclipse.mylyn.java.ui_3.23.3.v20180622-1953.jar (deflated 11%)
     [exec]   adding: plugins/org.eclipse.mylyn.java.tasks_3.23.3.v20180622-1953.jar (deflated 16%)
     [exec]   adding: plugins/org.eclipse.mylyn.ide.ant_3.23.3.v20180622-1953.jar (deflated 15%)
     [exec]   adding: plugins/org.eclipse.mylyn.debug.ui_3.23.3.v20180622-1953.jar (deflated 15%)
     [exec]   adding: plugins/org.eclipse.mylyn.pde.ui_3.23.3.v20180622-1953.jar (deflated 13%)
     [exec]   adding: plugins/org.eclipse.mylyn.team.ui_3.23.3.v20180622-1953.jar (deflated 17%)
     [exec]   adding: plugins/org.eclipse.mylyn.team.cvs_3.23.3.v20180622-1953.jar (deflated 16%)
     [exec]   adding: plugins/org.eclipse.mylyn.subclipse.core_1.15.0.v20170411-2003.jar (deflated 10%)
     [exec]   adding: plugins/org.eclipse.mylyn.subclipse.ui_1.15.0.v20170411-2003.jar (deflated 14%)
     [exec]   adding: plugins/org.eclipse.mylyn.trac.core_3.23.3.v20180622-1953.jar (deflated 11%)
     [exec]   adding: plugins/org.eclipse.mylyn.trac.ui_3.23.3.v20180622-1953.jar (deflated 12%)
     [exec]   adding: plugins/org.eclipse.mylyn.builds.core_1.15.0.v20170411-2141.jar (deflated 11%)
     [exec]   adding: plugins/org.eclipse.mylyn.builds.ui_1.15.0.v20170411-2141.jar (deflated 14%)
     [exec]   adding: plugins/org.eclipse.mylyn.builds.core.source_1.15.0.v20170411-2141.jar (deflated 11%)
     [exec]   adding: plugins/org.eclipse.mylyn.builds.ui.source_1.15.0.v20170411-2141.jar (deflated 15%)
     [exec]   adding: plugins/org.eclipse.mylyn.hudson.core.source_1.15.0.v20170411-2141.jar (deflated 15%)
     [exec]   adding: plugins/org.eclipse.mylyn.hudson.ui.source_1.15.0.v20170411-2141.jar (deflated 22%)
     [exec]   adding: plugins/org.eclipse.mylyn.commons.core_3.23.3.v20180622-1953.jar (deflated 11%)
     [exec]   adding: plugins/org.eclipse.mylyn.commons.screenshots_3.23.3.v20180622-1953.jar (deflated 18%)
     [exec]   adding: plugins/org.eclipse.mylyn.commons.ui_3.23.3.v20180622-1953.jar (deflated 22%)
     [exec]   adding: plugins/org.eclipse.mylyn.commons.workbench_3.23.3.v20180622-1953.jar (deflated 14%)
     [exec]   adding: plugins/org.eclipse.mylyn.commons.identity.core_1.15.0.v20180622-1953.jar (deflated 20%)
     [exec]   adding: plugins/org.eclipse.mylyn.commons.notifications.core_1.15.0.v20180622-1953.jar (deflated 24%)
     [exec]   adding: plugins/org.eclipse.mylyn.commons.notifications.feed_1.15.0.v20180622-1953.jar (deflated 18%)
     [exec]   adding: plugins/org.eclipse.mylyn.commons.notifications.ui_1.15.0.v20180622-1953.jar (deflated 17%)
     [exec]   adding: plugins/org.eclipse.mylyn.commons.repositories.core_1.15.0.v20180622-1953.jar (deflated 17%)
     [exec]   adding: plugins/org.eclipse.mylyn.commons.repositories.ui_1.15.0.v20180622-1953.jar (deflated 15%)
     [exec]   adding: plugins/org.eclipse.mylyn.commons.repositories.http.core_1.15.0.v20180622-1953.jar (deflated 14%)
     [exec]   adding: plugins/org.eclipse.mylyn.commons.net_3.23.3.v20180622-1953.jar (deflated 11%)
     [exec]   adding: plugins/org.eclipse.mylyn.commons.xmlrpc_3.23.3.v20180622-1953.jar (deflated 17%)
     [exec]   adding: plugins/org.eclipse.mylyn.commons.sdk.util_3.23.3.v20180622-1953.jar (deflated 10%)
     [exec]   adding: plugins/org.eclipse.mylyn.commons.core.source_3.23.3.v20180622-1953.jar (deflated 12%)
     [exec]   adding: plugins/org.eclipse.mylyn.commons.identity.core.source_1.15.0.v20180622-1953.jar (deflated 24%)
     [exec]   adding: plugins/org.eclipse.mylyn.commons.net.source_3.23.3.v20180622-1953.jar (deflated 12%)
     [exec]   adding: plugins/org.eclipse.mylyn.commons.notifications.core.source_1.15.0.v20180622-1953.jar (deflated 27%)
     [exec]   adding: plugins/org.eclipse.mylyn.commons.notifications.feed.source_1.15.0.v20180622-1953.jar (deflated 23%)
     [exec]   adding: plugins/org.eclipse.mylyn.commons.notifications.ui.source_1.15.0.v20180622-1953.jar (deflated 19%)
     [exec]   adding: plugins/org.eclipse.mylyn.commons.repositories.core.source_1.15.0.v20180622-1953.jar (deflated 21%)
     [exec]   adding: plugins/org.eclipse.mylyn.commons.repositories.ui.source_1.15.0.v20180622-1953.jar (deflated 15%)
     [exec]   adding: plugins/org.eclipse.mylyn.commons.repositories.http.core.source_1.15.0.v20180622-1953.jar (deflated 20%)
     [exec]   adding: plugins/org.eclipse.mylyn.commons.screenshots.source_3.23.3.v20180622-1953.jar (deflated 9%)
     [exec]   adding: plugins/org.eclipse.mylyn.commons.sdk.util.source_3.23.3.v20180622-1953.jar (deflated 12%)
     [exec]   adding: plugins/org.eclipse.mylyn.commons.ui.source_3.23.3.v20180622-1953.jar (deflated 11%)
     [exec]   adding: plugins/org.eclipse.mylyn.commons.workbench.source_3.23.3.v20180622-1953.jar (deflated 12%)
     [exec]   adding: plugins/org.eclipse.mylyn.commons.xmlrpc.source_3.23.3.v20180622-1953.jar (deflated 19%)
     [exec]   adding: plugins/org.eclipse.mylyn.discovery.core.source_3.23.3.v20180622-1953.jar (deflated 15%)
     [exec]   adding: plugins/org.eclipse.mylyn.discovery.ui.source_3.23.3.v20180622-1953.jar (deflated 12%)
     [exec]   adding: plugins/org.eclipse.mylyn.monitor.core.source_3.23.3.v20180622-1953.jar (deflated 20%)
     [exec]   adding: plugins/org.eclipse.mylyn.monitor.ui.source_3.23.3.v20180622-1953.jar (deflated 18%)
     [exec]   adding: plugins/org.eclipse.mylyn.discovery.core_3.23.3.v20180622-1953.jar (deflated 12%)
     [exec]   adding: plugins/org.eclipse.mylyn.discovery.ui_3.23.3.v20180622-1953.jar (deflated 13%)
     [exec]   adding: plugins/org.eclipse.mylyn.monitor.core_3.23.3.v20180622-1953.jar (deflated 15%)
     [exec]   adding: plugins/org.eclipse.mylyn.monitor.ui_3.23.3.v20180622-1953.jar (deflated 17%)
     [exec]   adding: plugins/org.eclipse.mylyn.context.sdk.java_3.23.3.v20180622-1953.jar (deflated 5%)
     [exec]   adding: plugins/org.eclipse.mylyn.context.sdk.util_3.23.3.v20180622-1953.jar (deflated 20%)
     [exec]   adding: plugins/org.eclipse.mylyn.bugzilla.ide.source_3.23.3.v20180622-1953.jar (deflated 26%)
     [exec]   adding: plugins/org.eclipse.cdt.mylyn.ui.source_3.23.3.v20180622-1953.jar (deflated 14%)
     [exec]   adding: plugins/org.eclipse.mylyn.context.core.source_3.23.3.v20180622-1953.jar (deflated 12%)
     [exec]   adding: plugins/org.eclipse.mylyn.context.sdk.java.source_3.23.3.v20180622-1953.jar (deflated 16%)
     [exec]   adding: plugins/org.eclipse.mylyn.context.sdk.util.source_3.23.3.v20180622-1953.jar (deflated 26%)
     [exec]   adding: plugins/org.eclipse.mylyn.context.tasks.ui.source_3.23.3.v20180622-1953.jar (deflated 13%)
     [exec]   adding: plugins/org.eclipse.mylyn.context.ui.source_3.23.3.v20180622-1953.jar (deflated 13%)
     [exec]   adding: plugins/org.eclipse.mylyn.ide.ant.source_3.23.3.v20180622-1953.jar (deflated 16%)
     [exec]   adding: plugins/org.eclipse.mylyn.ide.ui.source_3.23.3.v20180622-1953.jar (deflated 21%)
     [exec]   adding: plugins/org.eclipse.mylyn.java.tasks.source_3.23.3.v20180622-1953.jar (deflated 19%)
     [exec]   adding: plugins/org.eclipse.mylyn.java.ui.source_3.23.3.v20180622-1953.jar (deflated 14%)
     [exec]   adding: plugins/org.eclipse.mylyn.pde.ui.source_3.23.3.v20180622-1953.jar (deflated 14%)
     [exec]   adding: plugins/org.eclipse.mylyn.resources.ui.source_3.23.3.v20180622-1953.jar (deflated 14%)
     [exec]   adding: plugins/org.eclipse.mylyn.team.cvs.source_3.23.3.v20180622-1953.jar (deflated 22%)
     [exec]   adding: plugins/org.eclipse.mylyn.team.ui.source_3.23.3.v20180622-1953.jar (deflated 16%)
     [exec]   adding: plugins/org.eclipse.mylyn.reviews.core_2.14.3.v20180622-1953.jar (deflated 11%)
     [exec]   adding: plugins/org.eclipse.mylyn.reviews.edit_2.14.3.v20180622-1953.jar (deflated 20%)
     [exec]   adding: plugins/org.eclipse.mylyn.reviews.ui_2.14.3.v20180622-1953.jar (deflated 13%)
     [exec]   adding: plugins/org.eclipse.mylyn.gerrit.core.source_2.14.3.v20180622-1953.jar (deflated 15%)
     [exec]   adding: plugins/org.eclipse.mylyn.gerrit.ui.source_2.14.3.v20180622-1953.jar (deflated 15%)
     [exec]   adding: plugins/org.eclipse.mylyn.reviews.core.source_2.14.3.v20180622-1953.jar (deflated 11%)
     [exec]   adding: plugins/org.eclipse.mylyn.reviews.edit.source_2.14.3.v20180622-1953.jar (deflated 12%)
     [exec]   adding: plugins/org.eclipse.mylyn.reviews.ui.source_2.14.3.v20180622-1953.jar (deflated 12%)
     [exec]   adding: plugins/org.eclipse.mylyn.tests.util_3.23.3.v20180622-1953.jar (deflated 12%)
     [exec]   adding: plugins/org.eclipse.mylyn.tests.util.source_3.23.3.v20180622-1953.jar (deflated 17%)
     [exec]   adding: plugins/org.eclipse.mylyn.bugzilla.core.source_3.23.3.v20180622-1953.jar (deflated 8%)
     [exec]   adding: plugins/org.eclipse.mylyn.bugzilla.ui.source_3.23.3.v20180622-1953.jar (deflated 10%)
     [exec]   adding: plugins/org.eclipse.mylyn.help.ui.source_3.23.3.v20180622-1953.jar (deflated 26%)
     [exec]   adding: plugins/org.eclipse.mylyn.tasks.bugs.source_3.23.3.v20180622-1953.jar (deflated 15%)
     [exec]   adding: plugins/org.eclipse.mylyn.tasks.core.source_3.23.3.v20180622-2013.jar (deflated 13%)
     [exec]   adding: plugins/org.eclipse.mylyn.tasks.index.core.source_3.23.3.v20180622-1953.jar (deflated 12%)
     [exec]   adding: plugins/org.eclipse.mylyn.tasks.index.ui.source_3.23.3.v20180622-1953.jar (deflated 22%)
     [exec]   adding: plugins/org.eclipse.mylyn.tasks.search.source_3.23.3.v20180622-1953.jar (deflated 14%)
     [exec]   adding: plugins/org.eclipse.mylyn.tasks.ui.source_3.23.3.v20180622-1953.jar (deflated 10%)
     [exec]   adding: plugins/org.eclipse.mylyn.trac.core.source_3.23.3.v20180622-1953.jar (deflated 13%)
     [exec]   adding: plugins/org.eclipse.mylyn.trac.ui.source_3.23.3.v20180622-1953.jar (deflated 14%)
     [exec]   adding: plugins/org.eclipse.mylyn.tasks.bugs_3.23.3.v20180622-1953.jar (deflated 14%)
     [exec]   adding: plugins/org.eclipse.mylyn.help.ui_3.23.3.v20180622-1953.jar (deflated 2%)
     [exec]   adding: plugins/org.eclipse.mylyn.bugzilla.tests_3.23.3.v20180622-1953.jar (deflated 12%)
     [exec]   adding: plugins/org.eclipse.mylyn.tasks.tests_3.23.3.v20180622-1953.jar (deflated 5%)
     [exec]   adding: plugins/org.eclipse.mylyn.trac.tests_3.23.3.v20180622-1953.jar (deflated 8%)
     [exec]   adding: plugins/org.eclipse.mylyn.bugzilla.tests.source_3.23.3.v20180622-1953.jar (deflated 9%)
     [exec]   adding: plugins/org.eclipse.mylyn.tasks.tests.source_3.23.3.v20180622-1953.jar (deflated 12%)
     [exec]   adding: plugins/org.eclipse.mylyn.trac.tests.source_3.23.3.v20180622-1953.jar (deflated 11%)
     [exec]   adding: plugins/org.eclipse.mylyn.tasks.core.tests_3.23.3.v20180622-2013.jar (deflated 13%)
     [exec]   adding: plugins/org.eclipse.mylyn.tasks.index.tests_3.23.3.v20180622-1953.jar (deflated 12%)
     [exec]   adding: plugins/org.eclipse.mylyn.tasks.ui.tests_3.23.3.v20180622-1953.jar (deflated 11%)
     [exec]   adding: plugins/org.eclipse.mylyn.trac.core.tests_3.23.3.v20180622-1953.jar (deflated 25%)
     [exec]   adding: plugins/org.eclipse.mylyn.trac.ui.tests_3.23.3.v20180622-1953.jar (deflated 26%)
     [exec]   adding: plugins/org.eclipse.mylyn.versions.core_1.15.0.v20170411-2003.jar (deflated 14%)
     [exec]   adding: plugins/org.eclipse.mylyn.versions.ui_1.15.0.v20170411-2003.jar (deflated 16%)
     [exec]   adding: plugins/org.eclipse.mylyn.versions.core.source_1.15.0.v20170411-2003.jar (deflated 17%)
     [exec]   adding: plugins/org.eclipse.mylyn.versions.ui.source_1.15.0.v20170411-2003.jar (deflated 21%)
     [exec]   adding: plugins/org.eclipse.mylyn.git.core.source_1.15.0.v20170411-2003.jar (deflated 16%)
     [exec]   adding: plugins/org.eclipse.mylyn.git.ui.source_1.15.0.v20170411-2003.jar (deflated 16%)
     [exec]   adding: plugins/org.eclipse.mylyn.cvs.core.source_1.15.0.v20170411-2003.jar (deflated 29%)
     [exec] + /usr/bin/sign /home/data/httpd/download-staging.priv/tools/mylyn/signing/mylyn/3.23.3-SNAPSHOT/site.zip nomail /home/data/httpd/download-staging.priv/tools/mylyn/signing/mylyn/3.23.3-SNAPSHOT/output
     [exec] /jobs/genie.mylyn/mylyn-3.23.x-release/workspace/org.eclipse.mylyn/org.eclipse.mylyn-site/pack-and-sign/sign-and-wait.sh: line 42: /usr/bin/sign: No such file or directory
[INFO] ------------------------------------------------------------------------
[INFO] Reactor Summary:
[INFO] 
[INFO] org.eclipse.mylyn-parent ........................... SUCCESS [  7.603 s]
[INFO] Mylyn Releng ....................................... SUCCESS [  0.004 s]
[INFO] org.eclipse.mylyn.discovery 3.7.0 .................. SUCCESS [  7.914 s]
[INFO] Mylyn Commons ...................................... SUCCESS [  0.003 s]
[INFO] org.eclipse.mylyn.commons.core ..................... SUCCESS [  1.951 s]
[INFO] org.eclipse.mylyn.monitor.core ..................... SUCCESS [  0.251 s]
[INFO] Mylyn Context ...................................... SUCCESS [  0.002 s]
[INFO] org.eclipse.mylyn.context.core ..................... SUCCESS [  0.433 s]
[INFO] org.eclipse.mylyn.commons.screenshots .............. SUCCESS [  0.290 s]
[INFO] org.eclipse.mylyn.commons.ui ....................... SUCCESS [  0.611 s]
[INFO] org.eclipse.mylyn.commons.workbench ................ SUCCESS [  0.501 s]
[INFO] org.eclipse.mylyn.monitor.ui ....................... SUCCESS [  0.232 s]
[INFO] org.eclipse.mylyn.context.ui ....................... SUCCESS [  0.586 s]
[INFO] org.eclipse.cdt.mylyn.ui ........................... SUCCESS [  0.491 s]
[INFO] org.eclipse.mylyn.commons.net ...................... SUCCESS [  0.260 s]
[INFO] org.eclipse.mylyn.commons.repositories.core 1.15.0-SNAPSHOT SUCCESS [  0.160 s]
[INFO] Mylyn Tasks ........................................ SUCCESS [  0.002 s]
[INFO] org.eclipse.mylyn.tasks.core ....................... SUCCESS [  0.919 s]
[INFO] org.eclipse.mylyn.commons.xmlrpc ................... SUCCESS [  0.148 s]
[INFO] org.eclipse.mylyn.bugzilla.core .................... SUCCESS [  0.644 s]
[INFO] org.eclipse.mylyn.commons.repositories.http.core 1.15.0-SNAPSHOT SUCCESS [  0.253 s]
[INFO] org.eclipse.mylyn.tasks.connector-bugzilla-rest .... SUCCESS [  0.002 s]
[INFO] org.eclipse.mylyn.bugzilla.rest.core 1.0.0-SNAPSHOT  SUCCESS [  0.635 s]
[INFO] org.eclipse.mylyn.commons.sdk.util ................. SUCCESS [  0.275 s]
[INFO] org.eclipse.mylyn.bugzilla.rest.core.tests 1.0.0-SNAPSHOT SUCCESS [  0.454 s]
[INFO] org.eclipse.mylyn.commons.identity.core 1.15.0-SNAPSHOT SUCCESS [  0.175 s]
[INFO] org.eclipse.mylyn.commons.notifications.core 1.15.0-SNAPSHOT SUCCESS [  0.154 s]
[INFO] org.eclipse.mylyn.commons.notifications.feed 1.15.0-SNAPSHOT SUCCESS [  0.160 s]
[INFO] org.eclipse.mylyn.commons.notifications.ui 1.15.0-SNAPSHOT SUCCESS [  0.238 s]
[INFO] org.eclipse.mylyn.commons.repositories.ui 1.15.0-SNAPSHOT SUCCESS [  0.347 s]
[INFO] org.eclipse.mylyn.discovery.core ................... SUCCESS [  0.180 s]
[INFO] org.eclipse.mylyn.discovery.ui ..................... SUCCESS [  0.301 s]
[INFO] org.eclipse.mylyn.tasks.ui ......................... SUCCESS [  2.661 s]
[INFO] org.eclipse.mylyn.bugzilla.ui ...................... SUCCESS [  0.668 s]
[INFO] org.eclipse.mylyn.tests.util ....................... SUCCESS [  0.366 s]
[INFO] org.eclipse.mylyn.bugzilla.tests ................... SUCCESS [  1.750 s]
[INFO] Mylyn Builds 1.15.0-SNAPSHOT ....................... SUCCESS [  0.003 s]
[INFO] org.eclipse.mylyn.builds.core 1.15.0-SNAPSHOT ...... SUCCESS [  0.414 s]
[INFO] Mylyn Versions 1.15.0-SNAPSHOT ..................... SUCCESS [  0.002 s]
[INFO] org.eclipse.mylyn.versions.core 1.15.0-SNAPSHOT .... SUCCESS [  0.132 s]
[INFO] org.eclipse.mylyn.resources.ui ..................... SUCCESS [  0.312 s]
[INFO] org.eclipse.mylyn.team.ui .......................... SUCCESS [  0.548 s]
[INFO] org.eclipse.mylyn.versions.ui 1.15.0-SNAPSHOT ...... SUCCESS [  0.132 s]
[INFO] org.eclipse.mylyn.builds.ui 1.15.0-SNAPSHOT ........ SUCCESS [  0.772 s]
[INFO] org.eclipse.mylyn.builds.tests 1.15.0-SNAPSHOT ..... SUCCESS [  0.405 s]
[INFO] org.eclipse.mylyn.context.tasks.ui ................. SUCCESS [  0.747 s]
[INFO] org.eclipse.mylyn.ide.ui ........................... SUCCESS [  0.293 s]
[INFO] org.eclipse.mylyn.context.sdk.util ................. SUCCESS [  0.231 s]
[INFO] org.eclipse.mylyn.cdt.tests ........................ SUCCESS [  0.319 s]
[INFO] org.eclipse.mylyn.commons.notifications.tests 1.15.0-SNAPSHOT SUCCESS [  0.302 s]
[INFO] org.eclipse.mylyn.commons.tests .................... SUCCESS [  0.479 s]
[INFO] org.eclipse.mylyn.java.ui .......................... SUCCESS [  0.559 s]
[INFO] org.eclipse.mylyn.context.sdk.java ................. SUCCESS [  0.388 s]
[INFO] org.eclipse.mylyn.tasks.bugs ....................... SUCCESS [  0.596 s]
[INFO] org.eclipse.mylyn.tasks.search ..................... SUCCESS [  0.526 s]
[INFO] org.eclipse.mylyn.tasks.tests ...................... SUCCESS [  3.674 s]
[INFO] org.eclipse.mylyn.context.tasks.tests .............. SUCCESS [  0.623 s]
[INFO] org.eclipse.mylyn.context.tests .................... SUCCESS [  0.582 s]
[INFO] org.eclipse.mylyn.discovery.tests .................. SUCCESS [  0.389 s]
[INFO] Mylyn Reviews 2.14.3-SNAPSHOT ...................... SUCCESS [  0.002 s]
[INFO] org.eclipse.mylyn.reviews.core 2.14.3-SNAPSHOT ..... SUCCESS [  0.372 s]
[INFO] org.eclipse.mylyn.reviews.edit 2.14.3-SNAPSHOT ..... SUCCESS [  0.238 s]
[INFO] org.eclipse.mylyn.gerrit.core 2.14.3-SNAPSHOT ...... SUCCESS [  0.660 s]
[INFO] org.eclipse.mylyn.reviews.ui 2.14.3-SNAPSHOT ....... SUCCESS [  0.559 s]
[INFO] org.eclipse.mylyn.gerrit.ui 2.14.3-SNAPSHOT ........ SUCCESS [  0.658 s]
[INFO] org.eclipse.mylyn.gerrit.tests 2.14.3-SNAPSHOT ..... SUCCESS [  5.027 s]
[INFO] org.eclipse.mylyn.hudson.core 1.15.0-SNAPSHOT ...... SUCCESS [  1.107 s]
[INFO] org.eclipse.mylyn.hudson.ui 1.15.0-SNAPSHOT ........ SUCCESS [  0.352 s]
[INFO] org.eclipse.mylyn.hudson.tests 1.15.0-SNAPSHOT ..... SUCCESS [  0.584 s]
[INFO] org.eclipse.mylyn.ide.ant .......................... SUCCESS [  0.367 s]
[INFO] org.eclipse.mylyn.ide.tests ........................ SUCCESS [  0.323 s]
[INFO] org.eclipse.mylyn.java.tasks ....................... SUCCESS [  0.265 s]
[INFO] org.eclipse.mylyn.pde.ui ........................... SUCCESS [  0.349 s]
[INFO] org.eclipse.mylyn.java.tests ....................... SUCCESS [  1.256 s]
[INFO] org.eclipse.mylyn.monitor.tests .................... SUCCESS [  0.227 s]
[INFO] org.eclipse.mylyn.resources.tests .................. SUCCESS [  0.534 s]
[INFO] org.eclipse.mylyn.reviews.tests 2.14.3-SNAPSHOT .... SUCCESS [  0.397 s]
[INFO] org.eclipse.mylyn.tasks.index.core ................. SUCCESS [  0.384 s]
[INFO] org.eclipse.mylyn.tasks.index.ui ................... SUCCESS [  0.369 s]
[INFO] org.eclipse.mylyn.tasks.index.tests ................ SUCCESS [  0.447 s]
[INFO] org.eclipse.mylyn.team.cvs ......................... SUCCESS [  0.289 s]
[INFO] org.eclipse.mylyn.team.tests ....................... SUCCESS [  0.398 s]
[INFO] org.eclipse.mylyn.trac.core ........................ SUCCESS [  0.418 s]
[INFO] org.eclipse.mylyn.trac.ui .......................... SUCCESS [  0.445 s]
[INFO] org.eclipse.mylyn.trac.tests ....................... SUCCESS [  1.047 s]
[INFO] org.eclipse.mylyn.tests ............................ SUCCESS [  0.698 s]
[INFO] org.eclipse.mylyn.commons .......................... SUCCESS [  0.129 s]
[INFO] org.eclipse.mylyn.commons.identity 1.15.0-SNAPSHOT . SUCCESS [  0.059 s]
[INFO] org.eclipse.mylyn.commons.notifications 1.15.0-SNAPSHOT SUCCESS [  0.119 s]
[INFO] org.eclipse.mylyn.commons.repositories 1.15.0-SNAPSHOT SUCCESS [  0.111 s]
[INFO] org.eclipse.mylyn.discovery ........................ SUCCESS [  0.094 s]
[INFO] org.eclipse.mylyn.monitor .......................... SUCCESS [  0.082 s]
[INFO] org.eclipse.mylyn_feature .......................... SUCCESS [  0.224 s]
[INFO] org.eclipse.mylyn.context_feature .................. SUCCESS [  0.151 s]
[INFO] org.eclipse.cdt.mylyn 5.19.3-SNAPSHOT .............. SUCCESS [  0.136 s]
[INFO] org.eclipse.mylyn.bugzilla_feature ................. SUCCESS [  0.251 s]
[INFO] org.eclipse.mylyn.cvs.core 1.15.0-SNAPSHOT ......... SUCCESS [  0.102 s]
[INFO] org.eclipse.mylyn.versions 1.15.0-SNAPSHOT ......... SUCCESS [  0.028 s]
[INFO] org.eclipse.mylyn.cvs 1.15.0-SNAPSHOT .............. SUCCESS [  0.029 s]
[INFO] org.eclipse.mylyn.reviews.feature 2.14.3-SNAPSHOT .. SUCCESS [  0.052 s]
[INFO] org.eclipse.mylyn.gerrit.feature 2.14.3-SNAPSHOT ... SUCCESS [  0.062 s]
[INFO] org.eclipse.mylyn.gerrit.dashboard.core 2.14.3-SNAPSHOT SUCCESS [  0.155 s]
[INFO] org.eclipse.mylyn.gerrit.dashboard.ui 2.14.3-SNAPSHOT SUCCESS [  0.373 s]
[INFO] org.eclipse.mylyn.gerrit.dashboard.feature 2.14.3-SNAPSHOT SUCCESS [  0.098 s]
[INFO] org.eclipse.mylyn.git.core 1.15.0-SNAPSHOT ......... SUCCESS [  0.155 s]
[INFO] org.eclipse.mylyn.git.ui 1.15.0-SNAPSHOT ........... SUCCESS [  0.220 s]
[INFO] org.eclipse.mylyn.git 1.15.0-SNAPSHOT .............. SUCCESS [  0.053 s]
[INFO] org.eclipse.mylyn.team_feature ..................... SUCCESS [  0.186 s]
[INFO] org.eclipse.mylyn.builds 1.15.0-SNAPSHOT ........... SUCCESS [  0.088 s]
[INFO] org.eclipse.mylyn.commons.repositories.http 1.15.0-SNAPSHOT SUCCESS [  0.097 s]
[INFO] org.eclipse.mylyn.hudson 1.15.0-SNAPSHOT ........... SUCCESS [  0.086 s]
[INFO] org.eclipse.mylyn.bugzilla.ide ..................... SUCCESS [  0.073 s]
[INFO] org.eclipse.mylyn.help.ui .......................... SUCCESS [  0.251 s]
[INFO] org.eclipse.mylyn.tasks.ide ........................ SUCCESS [  0.190 s]
[INFO] org.eclipse.mylyn.ide_feature ...................... SUCCESS [  0.133 s]
[INFO] org.eclipse.mylyn.debug.ui ......................... SUCCESS [  0.260 s]
[INFO] org.eclipse.mylyn.java_feature ..................... SUCCESS [  0.147 s]
[INFO] org.eclipse.mylyn.pde_feature ...................... SUCCESS [  0.171 s]
[INFO] org.eclipse.mylyn.team.cvs ......................... SUCCESS [  0.125 s]
[INFO] org.eclipse.mylyn.subclipse.core 1.15.0-SNAPSHOT ... SUCCESS [  0.143 s]
[INFO] org.eclipse.mylyn.subclipse.ui 1.15.0-SNAPSHOT ..... SUCCESS [  0.189 s]
[INFO] org.eclipse.mylyn.subclipse 1.15.0-SNAPSHOT ........ SUCCESS [  0.035 s]
[INFO] org.eclipse.mylyn.trac_feature ..................... SUCCESS [  0.253 s]
[INFO] org.eclipse.mylyn.builds.sdk 1.15.0-SNAPSHOT ....... SUCCESS [  0.210 s]
[INFO] org.eclipse.mylyn.commons.sdk ...................... SUCCESS [  0.270 s]
[INFO] org.eclipse.mylyn.context.sdk ...................... SUCCESS [  0.306 s]
[INFO] org.eclipse.mylyn.reviews.sdk.feature 2.14.3-SNAPSHOT SUCCESS [  0.097 s]
[INFO] org.eclipse.mylyn.sdk_feature ...................... SUCCESS [  0.274 s]
[INFO] org.eclipse.mylyn.tasks.core.tests ................. SUCCESS [  0.341 s]
[INFO] org.eclipse.mylyn.tasks.ui.tests ................... SUCCESS [  0.723 s]
[INFO] org.eclipse.mylyn.trac.core.tests .................. SUCCESS [  0.239 s]
[INFO] org.eclipse.mylyn.trac.ui.tests .................... SUCCESS [  0.293 s]
[INFO] org.eclipse.mylyn.test_feature ..................... SUCCESS [  0.322 s]
[INFO] org.eclipse.mylyn.versions.sdk 1.15.0-SNAPSHOT ..... SUCCESS [  0.083 s]
[INFO] Mylyn for Eclipse 4.x .............................. FAILURE [ 14.638 s]
[INFO] org.eclipse.mylyn-target ........................... SKIPPED
[INFO] org.eclipse.mylyn.commons.tck ...................... SKIPPED
[INFO] Mylyn Commons ...................................... SKIPPED
[INFO] org.eclipse.mylyn.commons-target ................... SKIPPED
[INFO] org.eclipse.mylyn.commons.ui.tests ................. SKIPPED
[INFO] org.eclipse.mylyn.commons.activity.ui .............. SKIPPED
[INFO] org.eclipse.mylyn.commons.activity ................. SKIPPED
[INFO] org.eclipse.mylyn.commons.activity.tests ........... SKIPPED
[INFO] org.eclipse.mylyn.commons.repositories.http.tests 1.15.0-SNAPSHOT SKIPPED
[INFO] org.eclipse.mylyn.commons.repositories.tests 1.15.0-SNAPSHOT SKIPPED
[INFO] org.eclipse.mylyn.commons.development .............. SKIPPED
[INFO] org.eclipse.mylyn.commons.identity.ui 1.15.0-SNAPSHOT SKIPPED
[INFO] Mylyn Versions 1.15.0-SNAPSHOT ..................... SKIPPED
[INFO] org.eclipse.mylyn.versions.tests 1.15.0-SNAPSHOT ... SKIPPED
[INFO] org.eclipse.mylyn.versions.development 1.15.0-SNAPSHOT SKIPPED
[INFO] org.eclipse.mylyn.help.sdk ......................... SKIPPED
[INFO] org.eclipse.mylyn.tasks.index ...................... SKIPPED
[INFO] Mylyn Tasks ........................................ SKIPPED
[INFO] org.eclipse.mylyn.tasks-target ..................... SKIPPED
[INFO] org.eclipse.mylyn.tasks.activity.core .............. SKIPPED
[INFO] org.eclipse.mylyn.tasks.activity.ui ................ SKIPPED
[INFO] org.eclipse.mylyn.tasks.activity.tests ............. SKIPPED
[INFO] org.eclipse.mylyn.bugzilla.rest.ui 1.0.0-SNAPSHOT .. SKIPPED
[INFO] org.eclipse.mylyn.bugzilla.rest 1.0.0-SNAPSHOT ..... SKIPPED
[INFO] org.eclipse.mylyn.bugzilla.rest.tests 1.0.0-SNAPSHOT SKIPPED
[INFO] org.eclipse.mylyn.bugzilla.rest.ui.tests 1.0.0-SNAPSHOT SKIPPED
[INFO] Mylyn Context ...................................... SKIPPED
[INFO] org.eclipse.mylyn.context-target ................... SKIPPED
[INFO] org.eclipse.mylyn.debug.tests ...................... SKIPPED
[INFO] org.eclipse.mylyn.context.development .............. SKIPPED
[INFO] org.eclipse.mylyn.context.tasks.ui.tests ........... SKIPPED
[INFO] Mylyn Builds 1.15.0-SNAPSHOT ....................... SKIPPED
[INFO] org.eclipse.mylyn.builds.development 1.15.0-SNAPSHOT SKIPPED
[INFO] org.eclipse.mylyn.gerrit.core.tests 2.14.3-SNAPSHOT  SKIPPED
[INFO] org.eclipse.mylyn.gerrit.target 2.14.3-SNAPSHOT .... SKIPPED
[INFO] org.eclipse.mylyn.gerrit.ui.tests 2.14.3-SNAPSHOT .. SKIPPED
[INFO] org.eclipse.mylyn.reviews.core.tests 2.14.3-SNAPSHOT SKIPPED
[INFO] org.eclipse.mylyn.reviews.development.feature 2.14.3-SNAPSHOT SKIPPED
[INFO] org.eclipse.mylyn.reviews.ui.tests 2.14.3-SNAPSHOT . SKIPPED
[INFO] org.eclipse.mylyn.reviews.site 2.14.3-SNAPSHOT ..... SKIPPED
[INFO] org.eclipse.mylyn.all 3.23.3-SNAPSHOT .............. SKIPPED
[INFO] ------------------------------------------------------------------------
[INFO] BUILD FAILURE
[INFO] ------------------------------------------------------------------------
[INFO] Total time: 04:52 min
[INFO] Finished at: 2018-06-22T16:32:44-04:00
[INFO] ------------------------------------------------------------------------
[ERROR] Failed to execute goal org.apache.maven.plugins:maven-antrun-plugin:1.6:run (pack-and-sign) on project org.eclipse.mylyn-site: An Ant BuildException has occured: The following error occurred while executing this line:
[ERROR] /jobs/genie.mylyn/mylyn-3.23.x-release/workspace/org.eclipse.mylyn/org.eclipse.mylyn-site/pack-and-sign/build.xml:23: The following error occurred while executing this line:
[ERROR] /jobs/genie.mylyn/mylyn-3.23.x-release/workspace/org.eclipse.mylyn/org.eclipse.mylyn-site/pack-and-sign/build.xml:84: exec returned: 1
[ERROR] -> [Help 1]
[ERROR] 
[ERROR] To see the full stack trace of the errors, re-run Maven with the -e switch.
[ERROR] Re-run Maven using the -X switch to enable full debug logging.
[ERROR] 
[ERROR] For more information about the errors and possible solutions, please read the following articles:
[ERROR] [Help 1] http://cwiki.apache.org/confluence/display/MAVEN/MojoExecutionException
[ERROR] 
[ERROR] After correcting the problems, you can resume the build with the command
[ERROR]   mvn <goals> -rf :org.eclipse.mylyn-site
Build step 'Invoke top-level Maven targets' marked build as failure
Recording fingerprints
Archiving artifacts
Started calculate disk usage of build
Finished Calculation of disk usage of build in 0 seconds
Started calculate disk usage of workspace
Finished Calculation of disk usage of workspace in 0 seconds
Finished: FAILURE