Console Output

Started by an SCM change
Checkout:workspace / /home/hudson/genie.mylyn/.hudson/jobs/mylyn-3.21.x-release/workspace - hudson.remoting.LocalChannel@10627f11
Using strategy: Default
Last Built Revision: Revision e3bae51d4ca0aeaee8f3b9e8d94e7fd38ebb19f5 (origin/master)
Checkout:workspace / /home/hudson/genie.mylyn/.hudson/jobs/mylyn-3.21.x-release/workspace - hudson.remoting.LocalChannel@10627f11
Wiping out workspace first.
Cloning the remote Git repository
Cloning repository origin
Fetching upstream changes from git://git.eclipse.org/gitroot/mylyn/org.eclipse.mylyn.all
Commencing build of Revision 84f8cd95e4716065067067525a2a674270d2339a (origin/master)
Checking out Revision 84f8cd95e4716065067067525a2a674270d2339a (origin/master)
The origin is non-bare.
[workspace] $ /bin/sh -xe /tmp/hudson7716226470240416248.sh
+ git submodule foreach git rev-parse HEAD
Entering 'org.eclipse.mylyn'
e307dc4f265f61041c3373fd54893d254f66a2dc
Entering 'org.eclipse.mylyn.builds'
a8d8664e26f5aecf338fa0ea29ee21b9ce1f43dd
Entering 'org.eclipse.mylyn.commons'
7099936cdd3cc313dbc157ac997a4330af4e638f
Entering 'org.eclipse.mylyn.context'
3b977bc733704590a78b91ddd4c487e08c885891
Entering 'org.eclipse.mylyn.docs'
efc87bef8471695e18d933e438c7194a46a0a409
Entering 'org.eclipse.mylyn.reviews'
d60702e301a7b144965ed031fa46ad10679d4775
Entering 'org.eclipse.mylyn.tasks'
0e804a4b29a5d60e2e1c8f4839f4eff765ce8d83
Entering 'org.eclipse.mylyn.versions'
e018cb2389191396d5fec2e0d30e3b6a424395c3
+ git rev-list HEAD
[INFO] Using Maven 3 installation: Maven 3.0.5
[INFO] Checking Maven 3 installation environment
[workspace] $ /shared/common/apache-maven-3.0.5/bin/mvn --help
[INFO] Checking Maven 3 installation version
[INFO] Detected Maven 3 installation version: 3.0.5
[workspace] $ /shared/common/apache-maven-3.0.5/bin/mvn -Pneon -Prelease clean package -V -B -DPUBLISH=true -Dmaven.test.skip=true -Dexplicit-target=true -Dmaven.ext.class.path=/home/hudson/genie.mylyn/.hudson/maven/slavebundle/resources:/home/hudson/genie.mylyn/.hudson/maven/slavebundle/lib/maven3-eventspy-3.0.jar:/home/hudson/genie.mylyn/.hudson/war/webapp/WEB-INF/lib/hudson-remoting-3.0.0.jar -Dhudson.eventspy.port=32869 -Dmaven.repo.local=/home/hudson/genie.mylyn/.hudson/jobs/mylyn-3.21.x-release/workspace/.maven/repo -f pom.xml
[DEBUG] Waiting for connection on port: 32869
Apache Maven 3.0.5 (r01de14724cdef164cd33c7c8c2fe155faf9602da; 2013-02-19 08:51:28-0500)
Maven home: /shared/common/apache-maven-3.0.5
Java version: 1.8.0_51, vendor: Oracle Corporation
Java home: /opt/public/common/jdk1.8.0_51.x64/jre
Default locale: en_US, platform encoding: UTF-8
OS name: "linux", version: "3.12.51-52.39-default", arch: "amd64", family: "unix"
[DEBUG] Connected to remote
[INFO] Scanning for projects...
Downloading: http://repo.maven.apache.org/maven2/org/eclipse/tycho/tycho-maven-plugin/0.21.0/tycho-maven-plugin-0.21.0.pom
Downloaded: http://repo.maven.apache.org/maven2/org/eclipse/tycho/tycho-maven-plugin/0.21.0/tycho-maven-plugin-0.21.0.pom (3 KB at 11.5 KB/sec)
Downloading: http://repo.maven.apache.org/maven2/org/eclipse/tycho/tycho/0.21.0/tycho-0.21.0.pom
Downloaded: http://repo.maven.apache.org/maven2/org/eclipse/tycho/tycho/0.21.0/tycho-0.21.0.pom (18 KB at 175.5 KB/sec)
Downloading: http://repo.maven.apache.org/maven2/org/eclipse/tycho/tycho-core/0.21.0/tycho-core-0.21.0.pom
Downloaded: http://repo.maven.apache.org/maven2/org/eclipse/tycho/tycho-core/0.21.0/tycho-core-0.21.0.pom (5 KB at 53.4 KB/sec)
Downloading: http://repo.maven.apache.org/maven2/org/apache/maven/maven-core/3.0/maven-core-3.0.pom
Downloaded: http://repo.maven.apache.org/maven2/org/apache/maven/maven-core/3.0/maven-core-3.0.pom (7 KB at 74.4 KB/sec)
Downloading: http://repo.maven.apache.org/maven2/org/apache/maven/maven/3.0/maven-3.0.pom
Downloaded: http://repo.maven.apache.org/maven2/org/apache/maven/maven/3.0/maven-3.0.pom (22 KB at 218.1 KB/sec)
Downloading: http://repo.maven.apache.org/maven2/org/apache/maven/maven-parent/15/maven-parent-15.pom
Downloaded: http://repo.maven.apache.org/maven2/org/apache/maven/maven-parent/15/maven-parent-15.pom (24 KB at 236.8 KB/sec)
Downloading: http://repo.maven.apache.org/maven2/org/apache/apache/6/apache-6.pom
Downloaded: http://repo.maven.apache.org/maven2/org/apache/apache/6/apache-6.pom (13 KB at 147.0 KB/sec)
Downloading: http://repo.maven.apache.org/maven2/org/apache/maven/maven-model/3.0/maven-model-3.0.pom
Downloaded: http://repo.maven.apache.org/maven2/org/apache/maven/maven-model/3.0/maven-model-3.0.pom (4 KB at 46.4 KB/sec)
Downloading: http://repo.maven.apache.org/maven2/org/codehaus/plexus/plexus-utils/3.0.7/plexus-utils-3.0.7.pom
Downloaded: http://repo.maven.apache.org/maven2/org/codehaus/plexus/plexus-utils/3.0.7/plexus-utils-3.0.7.pom (3 KB at 29.9 KB/sec)
Downloading: http://repo.maven.apache.org/maven2/org/codehaus/plexus/plexus/3.1/plexus-3.1.pom
Downloaded: http://repo.maven.apache.org/maven2/org/codehaus/plexus/plexus/3.1/plexus-3.1.pom (19 KB at 185.5 KB/sec)
Downloading: http://repo.maven.apache.org/maven2/org/sonatype/spice/spice-parent/17/spice-parent-17.pom
Downloaded: http://repo.maven.apache.org/maven2/org/sonatype/spice/spice-parent/17/spice-parent-17.pom (7 KB at 75.9 KB/sec)
Downloading: http://repo.maven.apache.org/maven2/org/sonatype/forge/forge-parent/10/forge-parent-10.pom
Downloaded: http://repo.maven.apache.org/maven2/org/sonatype/forge/forge-parent/10/forge-parent-10.pom (14 KB at 159.5 KB/sec)
Downloading: http://repo.maven.apache.org/maven2/org/apache/maven/maven-settings/3.0/maven-settings-3.0.pom
Downloaded: http://repo.maven.apache.org/maven2/org/apache/maven/maven-settings/3.0/maven-settings-3.0.pom (2 KB at 21.4 KB/sec)
Downloading: http://repo.maven.apache.org/maven2/org/apache/maven/maven-settings-builder/3.0/maven-settings-builder-3.0.pom
Downloaded: http://repo.maven.apache.org/maven2/org/apache/maven/maven-settings-builder/3.0/maven-settings-builder-3.0.pom (3 KB at 15.9 KB/sec)
Downloading: http://repo.maven.apache.org/maven2/org/codehaus/plexus/plexus-interpolation/1.14/plexus-interpolation-1.14.pom
Downloaded: http://repo.maven.apache.org/maven2/org/codehaus/plexus/plexus-interpolation/1.14/plexus-interpolation-1.14.pom (910 B at 10.0 KB/sec)
Downloading: http://repo.maven.apache.org/maven2/org/codehaus/plexus/plexus-components/1.1.18/plexus-components-1.1.18.pom
Downloaded: http://repo.maven.apache.org/maven2/org/codehaus/plexus/plexus-components/1.1.18/plexus-components-1.1.18.pom (6 KB at 62.3 KB/sec)
Downloading: http://repo.maven.apache.org/maven2/org/codehaus/plexus/plexus/2.0.7/plexus-2.0.7.pom
Downloaded: http://repo.maven.apache.org/maven2/org/codehaus/plexus/plexus/2.0.7/plexus-2.0.7.pom (17 KB at 170.6 KB/sec)
Downloading: http://repo.maven.apache.org/maven2/org/codehaus/plexus/plexus-component-annotations/1.5.5/plexus-component-annotations-1.5.5.pom
Downloaded: http://repo.maven.apache.org/maven2/org/codehaus/plexus/plexus-component-annotations/1.5.5/plexus-component-annotations-1.5.5.pom (815 B at 8.7 KB/sec)
Downloading: http://repo.maven.apache.org/maven2/org/codehaus/plexus/plexus-containers/1.5.5/plexus-containers-1.5.5.pom
Downloaded: http://repo.maven.apache.org/maven2/org/codehaus/plexus/plexus-containers/1.5.5/plexus-containers-1.5.5.pom (5 KB at 49.9 KB/sec)
Downloading: http://repo.maven.apache.org/maven2/org/sonatype/plexus/plexus-sec-dispatcher/1.3/plexus-sec-dispatcher-1.3.pom
Downloaded: http://repo.maven.apache.org/maven2/org/sonatype/plexus/plexus-sec-dispatcher/1.3/plexus-sec-dispatcher-1.3.pom (3 KB at 33.6 KB/sec)
Downloading: http://repo.maven.apache.org/maven2/org/sonatype/spice/spice-parent/12/spice-parent-12.pom
Downloaded: http://repo.maven.apache.org/maven2/org/sonatype/spice/spice-parent/12/spice-parent-12.pom (7 KB at 81.0 KB/sec)
Downloading: http://repo.maven.apache.org/maven2/org/sonatype/forge/forge-parent/4/forge-parent-4.pom
Downloaded: http://repo.maven.apache.org/maven2/org/sonatype/forge/forge-parent/4/forge-parent-4.pom (9 KB at 97.6 KB/sec)
Downloading: http://repo.maven.apache.org/maven2/org/sonatype/plexus/plexus-cipher/1.7/plexus-cipher-1.7.pom
Downloaded: http://repo.maven.apache.org/maven2/org/sonatype/plexus/plexus-cipher/1.7/plexus-cipher-1.7.pom (5 KB at 45.3 KB/sec)
Downloading: http://repo.maven.apache.org/maven2/org/sonatype/spice/spice-parent/15/spice-parent-15.pom
Downloaded: http://repo.maven.apache.org/maven2/org/sonatype/spice/spice-parent/15/spice-parent-15.pom (9 KB at 100.8 KB/sec)
Downloading: http://repo.maven.apache.org/maven2/org/sonatype/forge/forge-parent/5/forge-parent-5.pom
Downloaded: http://repo.maven.apache.org/maven2/org/sonatype/forge/forge-parent/5/forge-parent-5.pom (9 KB at 99.6 KB/sec)
Downloading: http://repo.maven.apache.org/maven2/org/apache/maven/maven-repository-metadata/3.0/maven-repository-metadata-3.0.pom
Downloaded: http://repo.maven.apache.org/maven2/org/apache/maven/maven-repository-metadata/3.0/maven-repository-metadata-3.0.pom (2 KB at 23.0 KB/sec)
Downloading: http://repo.maven.apache.org/maven2/org/apache/maven/maven-artifact/3.0/maven-artifact-3.0.pom
Downloaded: http://repo.maven.apache.org/maven2/org/apache/maven/maven-artifact/3.0/maven-artifact-3.0.pom (2 KB at 21.6 KB/sec)
Downloading: http://repo.maven.apache.org/maven2/org/apache/maven/maven-plugin-api/3.0/maven-plugin-api-3.0.pom
Downloaded: http://repo.maven.apache.org/maven2/org/apache/maven/maven-plugin-api/3.0/maven-plugin-api-3.0.pom (3 KB at 20.5 KB/sec)
Downloading: http://repo.maven.apache.org/maven2/org/sonatype/sisu/sisu-inject-plexus/1.4.2/sisu-inject-plexus-1.4.2.pom
Downloaded: http://repo.maven.apache.org/maven2/org/sonatype/sisu/sisu-inject-plexus/1.4.2/sisu-inject-plexus-1.4.2.pom (6 KB at 62.4 KB/sec)
Downloading: http://repo.maven.apache.org/maven2/org/sonatype/sisu/inject/guice-plexus/1.4.2/guice-plexus-1.4.2.pom
Downloaded: http://repo.maven.apache.org/maven2/org/sonatype/sisu/inject/guice-plexus/1.4.2/guice-plexus-1.4.2.pom (4 KB at 37.7 KB/sec)
Downloading: http://repo.maven.apache.org/maven2/org/sonatype/sisu/inject/guice-bean/1.4.2/guice-bean-1.4.2.pom
Downloaded: http://repo.maven.apache.org/maven2/org/sonatype/sisu/inject/guice-bean/1.4.2/guice-bean-1.4.2.pom (3 KB at 31.4 KB/sec)
Downloading: http://repo.maven.apache.org/maven2/org/sonatype/sisu/sisu-inject/1.4.2/sisu-inject-1.4.2.pom
Downloaded: http://repo.maven.apache.org/maven2/org/sonatype/sisu/sisu-inject/1.4.2/sisu-inject-1.4.2.pom (2 KB at 11.2 KB/sec)
Downloading: http://repo.maven.apache.org/maven2/org/sonatype/sisu/sisu-parent/1.4.2/sisu-parent-1.4.2.pom
Downloaded: http://repo.maven.apache.org/maven2/org/sonatype/sisu/sisu-parent/1.4.2/sisu-parent-1.4.2.pom (8 KB at 90.4 KB/sec)
Downloading: http://repo.maven.apache.org/maven2/org/sonatype/forge/forge-parent/6/forge-parent-6.pom
Downloaded: http://repo.maven.apache.org/maven2/org/sonatype/forge/forge-parent/6/forge-parent-6.pom (11 KB at 98.1 KB/sec)
Downloading: http://repo.maven.apache.org/maven2/org/codehaus/plexus/plexus-classworlds/2.2.3/plexus-classworlds-2.2.3.pom
Downloaded: http://repo.maven.apache.org/maven2/org/codehaus/plexus/plexus-classworlds/2.2.3/plexus-classworlds-2.2.3.pom (4 KB at 35.2 KB/sec)
Downloading: http://repo.maven.apache.org/maven2/org/codehaus/plexus/plexus/2.0.6/plexus-2.0.6.pom
Downloaded: http://repo.maven.apache.org/maven2/org/codehaus/plexus/plexus/2.0.6/plexus-2.0.6.pom (17 KB at 170.5 KB/sec)
Downloading: http://repo.maven.apache.org/maven2/org/sonatype/sisu/sisu-inject-bean/1.4.2/sisu-inject-bean-1.4.2.pom
Downloaded: http://repo.maven.apache.org/maven2/org/sonatype/sisu/sisu-inject-bean/1.4.2/sisu-inject-bean-1.4.2.pom (6 KB at 31.5 KB/sec)
Downloading: http://repo.maven.apache.org/maven2/org/sonatype/sisu/sisu-guice/2.1.7/sisu-guice-2.1.7.pom
Downloaded: http://repo.maven.apache.org/maven2/org/sonatype/sisu/sisu-guice/2.1.7/sisu-guice-2.1.7.pom (11 KB at 98.2 KB/sec)
Downloading: http://repo.maven.apache.org/maven2/org/apache/maven/maven-model-builder/3.0/maven-model-builder-3.0.pom
Downloaded: http://repo.maven.apache.org/maven2/org/apache/maven/maven-model-builder/3.0/maven-model-builder-3.0.pom (3 KB at 25.5 KB/sec)
Downloading: http://repo.maven.apache.org/maven2/org/apache/maven/maven-aether-provider/3.0/maven-aether-provider-3.0.pom
Downloaded: http://repo.maven.apache.org/maven2/org/apache/maven/maven-aether-provider/3.0/maven-aether-provider-3.0.pom (3 KB at 29.8 KB/sec)
Downloading: http://repo.maven.apache.org/maven2/org/sonatype/aether/aether-api/1.7/aether-api-1.7.pom
Downloaded: http://repo.maven.apache.org/maven2/org/sonatype/aether/aether-api/1.7/aether-api-1.7.pom (2 KB at 19.7 KB/sec)
Downloading: http://repo.maven.apache.org/maven2/org/sonatype/aether/aether-parent/1.7/aether-parent-1.7.pom
Downloaded: http://repo.maven.apache.org/maven2/org/sonatype/aether/aether-parent/1.7/aether-parent-1.7.pom (8 KB at 92.0 KB/sec)
Downloading: http://repo.maven.apache.org/maven2/org/sonatype/aether/aether-util/1.7/aether-util-1.7.pom
Downloaded: http://repo.maven.apache.org/maven2/org/sonatype/aether/aether-util/1.7/aether-util-1.7.pom (3 KB at 9.4 KB/sec)
Downloading: http://repo.maven.apache.org/maven2/org/sonatype/aether/aether-impl/1.7/aether-impl-1.7.pom
Downloaded: http://repo.maven.apache.org/maven2/org/sonatype/aether/aether-impl/1.7/aether-impl-1.7.pom (4 KB at 33.4 KB/sec)
Downloading: http://repo.maven.apache.org/maven2/org/sonatype/aether/aether-spi/1.7/aether-spi-1.7.pom
Downloaded: http://repo.maven.apache.org/maven2/org/sonatype/aether/aether-spi/1.7/aether-spi-1.7.pom (2 KB at 19.8 KB/sec)
Downloading: http://repo.maven.apache.org/maven2/org/codehaus/plexus/plexus-archiver/2.2/plexus-archiver-2.2.pom
Downloaded: http://repo.maven.apache.org/maven2/org/codehaus/plexus/plexus-archiver/2.2/plexus-archiver-2.2.pom (4 KB at 38.3 KB/sec)
Downloading: http://repo.maven.apache.org/maven2/org/codehaus/plexus/plexus-components/1.1.20/plexus-components-1.1.20.pom
Downloaded: http://repo.maven.apache.org/maven2/org/codehaus/plexus/plexus-components/1.1.20/plexus-components-1.1.20.pom (3 KB at 35.1 KB/sec)
Downloading: http://repo.maven.apache.org/maven2/org/codehaus/plexus/plexus-io/2.0.5/plexus-io-2.0.5.pom
Downloaded: http://repo.maven.apache.org/maven2/org/codehaus/plexus/plexus-io/2.0.5/plexus-io-2.0.5.pom (3 KB at 25.7 KB/sec)
Downloading: http://repo.maven.apache.org/maven2/org/codehaus/plexus/plexus-components/1.2/plexus-components-1.2.pom
Downloaded: http://repo.maven.apache.org/maven2/org/codehaus/plexus/plexus-components/1.2/plexus-components-1.2.pom (3 KB at 27.1 KB/sec)
Downloading: http://repo.maven.apache.org/maven2/org/codehaus/plexus/plexus/3.2/plexus-3.2.pom
Downloaded: http://repo.maven.apache.org/maven2/org/codehaus/plexus/plexus/3.2/plexus-3.2.pom (19 KB at 184.9 KB/sec)
Downloading: http://repo.maven.apache.org/maven2/org/eclipse/tycho/org.eclipse.osgi.compatibility.state/1.0.0.v20140403-1907/org.eclipse.osgi.compatibility.state-1.0.0.v20140403-1907.pom
Downloaded: http://repo.maven.apache.org/maven2/org/eclipse/tycho/org.eclipse.osgi.compatibility.state/1.0.0.v20140403-1907/org.eclipse.osgi.compatibility.state-1.0.0.v20140403-1907.pom (2 KB at 12.6 KB/sec)
Downloading: http://repo.maven.apache.org/maven2/org/eclipse/tycho/sisu-equinox-embedder/0.21.0/sisu-equinox-embedder-0.21.0.pom
Downloaded: http://repo.maven.apache.org/maven2/org/eclipse/tycho/sisu-equinox-embedder/0.21.0/sisu-equinox-embedder-0.21.0.pom (2 KB at 16.7 KB/sec)
Downloading: http://repo.maven.apache.org/maven2/org/eclipse/tycho/sisu-equinox/0.21.0/sisu-equinox-0.21.0.pom
Downloaded: http://repo.maven.apache.org/maven2/org/eclipse/tycho/sisu-equinox/0.21.0/sisu-equinox-0.21.0.pom (2 KB at 12.3 KB/sec)
Downloading: http://repo.maven.apache.org/maven2/org/eclipse/tycho/org.eclipse.osgi/3.10.0.v20140606-1445/org.eclipse.osgi-3.10.0.v20140606-1445.pom
Downloaded: http://repo.maven.apache.org/maven2/org/eclipse/tycho/org.eclipse.osgi/3.10.0.v20140606-1445/org.eclipse.osgi-3.10.0.v20140606-1445.pom (2 KB at 9.5 KB/sec)
Downloading: http://repo.maven.apache.org/maven2/org/eclipse/tycho/sisu-equinox-api/0.21.0/sisu-equinox-api-0.21.0.pom
Downloaded: http://repo.maven.apache.org/maven2/org/eclipse/tycho/sisu-equinox-api/0.21.0/sisu-equinox-api-0.21.0.pom (2 KB at 20.9 KB/sec)
Downloading: http://repo.maven.apache.org/maven2/org/eclipse/tycho/tycho-metadata-model/0.21.0/tycho-metadata-model-0.21.0.pom
Downloaded: http://repo.maven.apache.org/maven2/org/eclipse/tycho/tycho-metadata-model/0.21.0/tycho-metadata-model-0.21.0.pom (2 KB at 11.5 KB/sec)
Downloading: http://repo.maven.apache.org/maven2/de/pdark/decentxml/1.3/decentxml-1.3.pom
Downloaded: http://repo.maven.apache.org/maven2/de/pdark/decentxml/1.3/decentxml-1.3.pom (7 KB at 56.2 KB/sec)
Downloading: http://repo.maven.apache.org/maven2/org/eclipse/tycho/tycho-embedder-api/0.21.0/tycho-embedder-api-0.21.0.pom
Downloaded: http://repo.maven.apache.org/maven2/org/eclipse/tycho/tycho-embedder-api/0.21.0/tycho-embedder-api-0.21.0.pom (3 KB at 18.4 KB/sec)
Downloading: http://repo.maven.apache.org/maven2/org/eclipse/tycho/org.eclipse.tycho.embedder.shared/0.21.0/org.eclipse.tycho.embedder.shared-0.21.0.pom
Downloaded: http://repo.maven.apache.org/maven2/org/eclipse/tycho/org.eclipse.tycho.embedder.shared/0.21.0/org.eclipse.tycho.embedder.shared-0.21.0.pom (2 KB at 12.1 KB/sec)
Downloading: http://repo.maven.apache.org/maven2/org/eclipse/tycho/tycho-bundles/0.21.0/tycho-bundles-0.21.0.pom
Downloaded: http://repo.maven.apache.org/maven2/org/eclipse/tycho/tycho-bundles/0.21.0/tycho-bundles-0.21.0.pom (3 KB at 0.2 KB/sec)
Downloading: http://repo.maven.apache.org/maven2/org/eclipse/tycho/org.eclipse.tycho.core.shared/0.21.0/org.eclipse.tycho.core.shared-0.21.0.pom
Downloaded: http://repo.maven.apache.org/maven2/org/eclipse/tycho/org.eclipse.tycho.core.shared/0.21.0/org.eclipse.tycho.core.shared-0.21.0.pom (2 KB at 11.2 KB/sec)
Downloading: http://repo.maven.apache.org/maven2/org/eclipse/tycho/tycho-p2-facade/0.21.0/tycho-p2-facade-0.21.0.pom
Downloaded: http://repo.maven.apache.org/maven2/org/eclipse/tycho/tycho-p2-facade/0.21.0/tycho-p2-facade-0.21.0.pom (3 KB at 23.8 KB/sec)
Downloading: http://repo.maven.apache.org/maven2/org/eclipse/tycho/tycho-p2/0.21.0/tycho-p2-0.21.0.pom
Downloaded: http://repo.maven.apache.org/maven2/org/eclipse/tycho/tycho-p2/0.21.0/tycho-p2-0.21.0.pom (2 KB at 13.4 KB/sec)
Downloading: http://repo.maven.apache.org/maven2/org/eclipse/tycho/org.eclipse.tycho.p2.resolver.shared/0.21.0/org.eclipse.tycho.p2.resolver.shared-0.21.0.pom
Downloaded: http://repo.maven.apache.org/maven2/org/eclipse/tycho/org.eclipse.tycho.p2.resolver.shared/0.21.0/org.eclipse.tycho.p2.resolver.shared-0.21.0.pom (2 KB at 12.2 KB/sec)
Downloading: http://repo.maven.apache.org/maven2/org/eclipse/tycho/org.eclipse.tycho.p2.tools.shared/0.21.0/org.eclipse.tycho.p2.tools.shared-0.21.0.pom
Downloaded: http://repo.maven.apache.org/maven2/org/eclipse/tycho/org.eclipse.tycho.p2.tools.shared/0.21.0/org.eclipse.tycho.p2.tools.shared-0.21.0.pom (2 KB at 0.2 KB/sec)
Downloading: http://repo.maven.apache.org/maven2/org/eclipse/tycho/tycho-maven-plugin/0.21.0/tycho-maven-plugin-0.21.0.jar
Downloading: http://repo.maven.apache.org/maven2/org/eclipse/tycho/tycho-core/0.21.0/tycho-core-0.21.0.jar
Downloading: http://repo.maven.apache.org/maven2/org/sonatype/aether/aether-util/1.7/aether-util-1.7.jar
Downloading: http://repo.maven.apache.org/maven2/org/sonatype/sisu/sisu-guice/2.1.7/sisu-guice-2.1.7-noaop.jar
Downloading: http://repo.maven.apache.org/maven2/org/sonatype/sisu/sisu-inject-bean/1.4.2/sisu-inject-bean-1.4.2.jar
Downloaded: http://repo.maven.apache.org/maven2/org/eclipse/tycho/tycho-maven-plugin/0.21.0/tycho-maven-plugin-0.21.0.jar (6 KB at 37.3 KB/sec)
Downloading: http://repo.maven.apache.org/maven2/org/codehaus/plexus/plexus-interpolation/1.14/plexus-interpolation-1.14.jar
Downloaded: http://repo.maven.apache.org/maven2/org/sonatype/sisu/sisu-inject-bean/1.4.2/sisu-inject-bean-1.4.2.jar (150 KB at 945.6 KB/sec)
Downloading: http://repo.maven.apache.org/maven2/org/sonatype/plexus/plexus-sec-dispatcher/1.3/plexus-sec-dispatcher-1.3.jar
Downloaded: http://repo.maven.apache.org/maven2/org/sonatype/sisu/sisu-guice/2.1.7/sisu-guice-2.1.7-noaop.jar (461 KB at 859.5 KB/sec)
Downloading: http://repo.maven.apache.org/maven2/org/sonatype/plexus/plexus-cipher/1.7/plexus-cipher-1.7.jar
Downloaded: http://repo.maven.apache.org/maven2/org/codehaus/plexus/plexus-interpolation/1.14/plexus-interpolation-1.14.jar (60 KB at 35.6 KB/sec)
Downloading: http://repo.maven.apache.org/maven2/org/codehaus/plexus/plexus-utils/3.0.7/plexus-utils-3.0.7.jar
Downloaded: http://repo.maven.apache.org/maven2/org/sonatype/plexus/plexus-sec-dispatcher/1.3/plexus-sec-dispatcher-1.3.jar (28 KB at 16.6 KB/sec)
Downloading: http://repo.maven.apache.org/maven2/org/codehaus/plexus/plexus-archiver/2.2/plexus-archiver-2.2.jar
Downloaded: http://repo.maven.apache.org/maven2/org/sonatype/plexus/plexus-cipher/1.7/plexus-cipher-1.7.jar (14 KB at 10.0 KB/sec)
Downloading: http://repo.maven.apache.org/maven2/org/codehaus/plexus/plexus-io/2.0.5/plexus-io-2.0.5.jar
Downloaded: http://repo.maven.apache.org/maven2/org/codehaus/plexus/plexus-archiver/2.2/plexus-archiver-2.2.jar (181 KB at 1101.5 KB/sec)
Downloading: http://repo.maven.apache.org/maven2/org/eclipse/tycho/org.eclipse.osgi.compatibility.state/1.0.0.v20140403-1907/org.eclipse.osgi.compatibility.state-1.0.0.v20140403-1907.jar
Downloaded: http://repo.maven.apache.org/maven2/org/eclipse/tycho/org.eclipse.osgi.compatibility.state/1.0.0.v20140403-1907/org.eclipse.osgi.compatibility.state-1.0.0.v20140403-1907.jar (237 KB at 443.6 KB/sec)
Downloading: http://repo.maven.apache.org/maven2/org/eclipse/tycho/sisu-equinox-embedder/0.21.0/sisu-equinox-embedder-0.21.0.jar
Downloaded: http://repo.maven.apache.org/maven2/org/sonatype/aether/aether-util/1.7/aether-util-1.7.jar (106 KB at 25.9 KB/sec)
Downloading: http://repo.maven.apache.org/maven2/org/eclipse/tycho/org.eclipse.osgi/3.10.0.v20140606-1445/org.eclipse.osgi-3.10.0.v20140606-1445.jar
Downloaded: http://repo.maven.apache.org/maven2/org/eclipse/tycho/tycho-core/0.21.0/tycho-core-0.21.0.jar (173 KB at 41.9 KB/sec)
Downloading: http://repo.maven.apache.org/maven2/org/eclipse/tycho/sisu-equinox-api/0.21.0/sisu-equinox-api-0.21.0.jar
Downloaded: http://repo.maven.apache.org/maven2/org/codehaus/plexus/plexus-io/2.0.5/plexus-io-2.0.5.jar (57 KB at 24.3 KB/sec)
Downloading: http://repo.maven.apache.org/maven2/org/eclipse/tycho/tycho-metadata-model/0.21.0/tycho-metadata-model-0.21.0.jar
Downloaded: http://repo.maven.apache.org/maven2/org/eclipse/tycho/sisu-equinox-embedder/0.21.0/sisu-equinox-embedder-0.21.0.jar (13 KB at 7.8 KB/sec)
Downloading: http://repo.maven.apache.org/maven2/de/pdark/decentxml/1.3/decentxml-1.3.jar
Downloaded: http://repo.maven.apache.org/maven2/org/codehaus/plexus/plexus-utils/3.0.7/plexus-utils-3.0.7.jar (226 KB at 96.0 KB/sec)
Downloading: http://repo.maven.apache.org/maven2/org/eclipse/tycho/tycho-embedder-api/0.21.0/tycho-embedder-api-0.21.0.jar
Downloaded: http://repo.maven.apache.org/maven2/org/eclipse/tycho/sisu-equinox-api/0.21.0/sisu-equinox-api-0.21.0.jar (4 KB at 29.2 KB/sec)
Downloading: http://repo.maven.apache.org/maven2/org/eclipse/tycho/org.eclipse.tycho.embedder.shared/0.21.0/org.eclipse.tycho.embedder.shared-0.21.0.jar
Downloaded: http://repo.maven.apache.org/maven2/org/eclipse/tycho/tycho-metadata-model/0.21.0/tycho-metadata-model-0.21.0.jar (31 KB at 309.5 KB/sec)
Downloading: http://repo.maven.apache.org/maven2/org/eclipse/tycho/org.eclipse.tycho.core.shared/0.21.0/org.eclipse.tycho.core.shared-0.21.0.jar
Downloaded: http://repo.maven.apache.org/maven2/org/eclipse/tycho/tycho-embedder-api/0.21.0/tycho-embedder-api-0.21.0.jar (7 KB at 64.0 KB/sec)
Downloading: http://repo.maven.apache.org/maven2/org/eclipse/tycho/tycho-p2-facade/0.21.0/tycho-p2-facade-0.21.0.jar
Downloaded: http://repo.maven.apache.org/maven2/de/pdark/decentxml/1.3/decentxml-1.3.jar (109 KB at 772.7 KB/sec)
Downloading: http://repo.maven.apache.org/maven2/org/codehaus/plexus/plexus-component-annotations/1.5.5/plexus-component-annotations-1.5.5.jar
Downloaded: http://repo.maven.apache.org/maven2/org/eclipse/tycho/org.eclipse.tycho.embedder.shared/0.21.0/org.eclipse.tycho.embedder.shared-0.21.0.jar (9 KB at 105.3 KB/sec)
Downloading: http://repo.maven.apache.org/maven2/org/eclipse/tycho/org.eclipse.tycho.p2.resolver.shared/0.21.0/org.eclipse.tycho.p2.resolver.shared-0.21.0.jar
Downloaded: http://repo.maven.apache.org/maven2/org/eclipse/tycho/org.eclipse.tycho.core.shared/0.21.0/org.eclipse.tycho.core.shared-0.21.0.jar (32 KB at 329.0 KB/sec)
Downloading: http://repo.maven.apache.org/maven2/org/eclipse/tycho/org.eclipse.tycho.p2.tools.shared/0.21.0/org.eclipse.tycho.p2.tools.shared-0.21.0.jar
Downloaded: http://repo.maven.apache.org/maven2/org/eclipse/tycho/org.eclipse.osgi/3.10.0.v20140606-1445/org.eclipse.osgi-3.10.0.v20140606-1445.jar (1235 KB at 3526.9 KB/sec)
Downloaded: http://repo.maven.apache.org/maven2/org/eclipse/tycho/org.eclipse.tycho.p2.tools.shared/0.21.0/org.eclipse.tycho.p2.tools.shared-0.21.0.jar (20 KB at 197.3 KB/sec)
Downloaded: http://repo.maven.apache.org/maven2/org/codehaus/plexus/plexus-component-annotations/1.5.5/plexus-component-annotations-1.5.5.jar (5 KB at 2.1 KB/sec)
Downloaded: http://repo.maven.apache.org/maven2/org/eclipse/tycho/tycho-p2-facade/0.21.0/tycho-p2-facade-0.21.0.jar (32 KB at 15.6 KB/sec)
Downloaded: http://repo.maven.apache.org/maven2/org/eclipse/tycho/org.eclipse.tycho.p2.resolver.shared/0.21.0/org.eclipse.tycho.p2.resolver.shared-0.21.0.jar (27 KB at 13.5 KB/sec)
Downloading: http://repo.maven.apache.org/maven2/org/eclipse/tycho/tycho-bundles-external/0.21.0/tycho-bundles-external-0.21.0.zip
Downloaded: http://repo.maven.apache.org/maven2/org/eclipse/tycho/tycho-bundles-external/0.21.0/tycho-bundles-external-0.21.0.zip (6593 KB at 4549.5 KB/sec)
Downloading: http://repo.maven.apache.org/maven2/org/eclipse/tycho/org.eclipse.tycho.p2.resolver.impl/0.21.0/org.eclipse.tycho.p2.resolver.impl-0.21.0.jar
Downloaded: http://repo.maven.apache.org/maven2/org/eclipse/tycho/org.eclipse.tycho.p2.resolver.impl/0.21.0/org.eclipse.tycho.p2.resolver.impl-0.21.0.jar (186 KB at 695.7 KB/sec)
Downloading: http://repo.maven.apache.org/maven2/org/eclipse/tycho/org.eclipse.tycho.p2.maven.repository/0.21.0/org.eclipse.tycho.p2.maven.repository-0.21.0.jar
Downloaded: http://repo.maven.apache.org/maven2/org/eclipse/tycho/org.eclipse.tycho.p2.maven.repository/0.21.0/org.eclipse.tycho.p2.maven.repository-0.21.0.jar (133 KB at 209.4 KB/sec)
Downloading: http://repo.maven.apache.org/maven2/org/eclipse/tycho/org.eclipse.tycho.p2.tools.impl/0.21.0/org.eclipse.tycho.p2.tools.impl-0.21.0.jar
Downloaded: http://repo.maven.apache.org/maven2/org/eclipse/tycho/org.eclipse.tycho.p2.tools.impl/0.21.0/org.eclipse.tycho.p2.tools.impl-0.21.0.jar (36 KB at 117.0 KB/sec)
Downloading: http://repo.maven.apache.org/maven2/org/jacoco/jacoco-maven-plugin/0.5.6.201201232323/jacoco-maven-plugin-0.5.6.201201232323.pom
Downloaded: http://repo.maven.apache.org/maven2/org/jacoco/jacoco-maven-plugin/0.5.6.201201232323/jacoco-maven-plugin-0.5.6.201201232323.pom (4 KB at 28.1 KB/sec)
Downloading: http://repo.maven.apache.org/maven2/org/jacoco/org.jacoco.build/0.5.6.201201232323/org.jacoco.build-0.5.6.201201232323.pom
Downloaded: http://repo.maven.apache.org/maven2/org/jacoco/org.jacoco.build/0.5.6.201201232323/org.jacoco.build-0.5.6.201201232323.pom (27 KB at 32.7 KB/sec)
Downloading: http://repo.maven.apache.org/maven2/org/jacoco/jacoco-maven-plugin/0.5.6.201201232323/jacoco-maven-plugin-0.5.6.201201232323.jar
Downloaded: http://repo.maven.apache.org/maven2/org/jacoco/jacoco-maven-plugin/0.5.6.201201232323/jacoco-maven-plugin-0.5.6.201201232323.jar (24 KB at 215.7 KB/sec)
Downloading: http://repo.maven.apache.org/maven2/org/eclipse/tycho/target-platform-configuration/0.21.0/target-platform-configuration-0.21.0.pom
Downloaded: http://repo.maven.apache.org/maven2/org/eclipse/tycho/target-platform-configuration/0.21.0/target-platform-configuration-0.21.0.pom (2 KB at 18.1 KB/sec)
Downloading: http://repo.maven.apache.org/maven2/org/eclipse/tycho/target-platform-configuration/0.21.0/target-platform-configuration-0.21.0.jar
Downloaded: http://repo.maven.apache.org/maven2/org/eclipse/tycho/target-platform-configuration/0.21.0/target-platform-configuration-0.21.0.jar (8 KB at 77.7 KB/sec)
Downloading: http://repo.maven.apache.org/maven2/org/apache/maven/plugins/maven-clean-plugin/2.4.1/maven-clean-plugin-2.4.1.pom
Downloaded: http://repo.maven.apache.org/maven2/org/apache/maven/plugins/maven-clean-plugin/2.4.1/maven-clean-plugin-2.4.1.pom (5 KB at 2.9 KB/sec)
Downloading: http://repo.maven.apache.org/maven2/org/apache/maven/plugins/maven-plugins/18/maven-plugins-18.pom
Downloaded: http://repo.maven.apache.org/maven2/org/apache/maven/plugins/maven-plugins/18/maven-plugins-18.pom (13 KB at 106.7 KB/sec)
Downloading: http://repo.maven.apache.org/maven2/org/apache/maven/maven-parent/16/maven-parent-16.pom
Downloaded: http://repo.maven.apache.org/maven2/org/apache/maven/maven-parent/16/maven-parent-16.pom (23 KB at 173.5 KB/sec)
Downloading: http://repo.maven.apache.org/maven2/org/apache/apache/7/apache-7.pom
Downloaded: http://repo.maven.apache.org/maven2/org/apache/apache/7/apache-7.pom (15 KB at 146.8 KB/sec)
Downloading: http://repo.maven.apache.org/maven2/org/apache/maven/plugins/maven-clean-plugin/2.4.1/maven-clean-plugin-2.4.1.jar
Downloaded: http://repo.maven.apache.org/maven2/org/apache/maven/plugins/maven-clean-plugin/2.4.1/maven-clean-plugin-2.4.1.jar (23 KB at 219.0 KB/sec)
Downloading: http://repo.maven.apache.org/maven2/org/apache/maven/plugins/maven-resources-plugin/2.4.1/maven-resources-plugin-2.4.1.pom
Downloaded: http://repo.maven.apache.org/maven2/org/apache/maven/plugins/maven-resources-plugin/2.4.1/maven-resources-plugin-2.4.1.pom (6 KB at 58.7 KB/sec)
Downloading: http://repo.maven.apache.org/maven2/org/apache/maven/plugins/maven-plugins/14/maven-plugins-14.pom
Downloaded: http://repo.maven.apache.org/maven2/org/apache/maven/plugins/maven-plugins/14/maven-plugins-14.pom (13 KB at 86.2 KB/sec)
Downloading: http://repo.maven.apache.org/maven2/org/apache/maven/maven-parent/13/maven-parent-13.pom
Downloaded: http://repo.maven.apache.org/maven2/org/apache/maven/maven-parent/13/maven-parent-13.pom (23 KB at 210.5 KB/sec)
Downloading: http://repo.maven.apache.org/maven2/org/apache/maven/plugins/maven-resources-plugin/2.4.1/maven-resources-plugin-2.4.1.jar
Downloaded: http://repo.maven.apache.org/maven2/org/apache/maven/plugins/maven-resources-plugin/2.4.1/maven-resources-plugin-2.4.1.jar (24 KB at 231.7 KB/sec)
Downloading: http://repo.maven.apache.org/maven2/org/eclipse/tycho/tycho-packaging-plugin/0.21.0/tycho-packaging-plugin-0.21.0.pom
Downloaded: http://repo.maven.apache.org/maven2/org/eclipse/tycho/tycho-packaging-plugin/0.21.0/tycho-packaging-plugin-0.21.0.pom (3 KB at 27.4 KB/sec)
Downloading: http://repo.maven.apache.org/maven2/org/eclipse/tycho/tycho-packaging-plugin/0.21.0/tycho-packaging-plugin-0.21.0.jar
Downloaded: http://repo.maven.apache.org/maven2/org/eclipse/tycho/tycho-packaging-plugin/0.21.0/tycho-packaging-plugin-0.21.0.jar (114 KB at 817.8 KB/sec)
Downloading: http://repo.maven.apache.org/maven2/org/eclipse/tycho/tycho-p2-plugin/0.21.0/tycho-p2-plugin-0.21.0.pom
Downloaded: http://repo.maven.apache.org/maven2/org/eclipse/tycho/tycho-p2-plugin/0.21.0/tycho-p2-plugin-0.21.0.pom (3 KB at 11.3 KB/sec)
Downloading: http://repo.maven.apache.org/maven2/org/eclipse/tycho/tycho-p2-plugin/0.21.0/tycho-p2-plugin-0.21.0.jar
Downloaded: http://repo.maven.apache.org/maven2/org/eclipse/tycho/tycho-p2-plugin/0.21.0/tycho-p2-plugin-0.21.0.jar (27 KB at 255.3 KB/sec)
Downloading: http://repo.maven.apache.org/maven2/org/eclipse/tycho/sisu-equinox-launching/0.21.0/sisu-equinox-launching-0.21.0.pom
Downloaded: http://repo.maven.apache.org/maven2/org/eclipse/tycho/sisu-equinox-launching/0.21.0/sisu-equinox-launching-0.21.0.pom (3 KB at 9.7 KB/sec)
Downloading: http://repo.maven.apache.org/maven2/org/apache/commons/commons-exec/1.2/commons-exec-1.2.pom
Downloaded: http://repo.maven.apache.org/maven2/org/apache/commons/commons-exec/1.2/commons-exec-1.2.pom (11 KB at 41.5 KB/sec)
Downloading: http://repo.maven.apache.org/maven2/org/apache/commons/commons-parent/32/commons-parent-32.pom
Downloaded: http://repo.maven.apache.org/maven2/org/apache/commons/commons-parent/32/commons-parent-32.pom (52 KB at 255.2 KB/sec)
Downloading: http://repo.maven.apache.org/maven2/org/apache/apache/13/apache-13.pom
Downloaded: http://repo.maven.apache.org/maven2/org/apache/apache/13/apache-13.pom (14 KB at 151.6 KB/sec)
Downloading: http://repo.maven.apache.org/maven2/org/eclipse/tycho/tycho-artifactcomparator/0.21.0/tycho-artifactcomparator-0.21.0.pom
Downloaded: http://repo.maven.apache.org/maven2/org/eclipse/tycho/tycho-artifactcomparator/0.21.0/tycho-artifactcomparator-0.21.0.pom (2 KB at 19.3 KB/sec)
Downloading: http://repo.maven.apache.org/maven2/org/ow2/asm/asm-debug-all/4.0/asm-debug-all-4.0.pom
Downloaded: http://repo.maven.apache.org/maven2/org/ow2/asm/asm-debug-all/4.0/asm-debug-all-4.0.pom (2 KB at 16.3 KB/sec)
Downloading: http://repo.maven.apache.org/maven2/org/ow2/asm/asm-parent/4.0/asm-parent-4.0.pom
Downloaded: http://repo.maven.apache.org/maven2/org/ow2/asm/asm-parent/4.0/asm-parent-4.0.pom (6 KB at 61.7 KB/sec)
Downloading: http://repo.maven.apache.org/maven2/org/ow2/ow2/1.3/ow2-1.3.pom
Downloaded: http://repo.maven.apache.org/maven2/org/ow2/ow2/1.3/ow2-1.3.pom (10 KB at 105.5 KB/sec)
Downloading: http://repo.maven.apache.org/maven2/org/eclipse/tycho/sisu-equinox-launching/0.21.0/sisu-equinox-launching-0.21.0.jar
Downloading: http://repo.maven.apache.org/maven2/org/eclipse/tycho/tycho-artifactcomparator/0.21.0/tycho-artifactcomparator-0.21.0.jar
Downloading: http://repo.maven.apache.org/maven2/org/apache/commons/commons-exec/1.2/commons-exec-1.2.jar
Downloading: http://repo.maven.apache.org/maven2/org/ow2/asm/asm-debug-all/4.0/asm-debug-all-4.0.jar
Downloaded: http://repo.maven.apache.org/maven2/org/eclipse/tycho/sisu-equinox-launching/0.21.0/sisu-equinox-launching-0.21.0.jar (26 KB at 242.9 KB/sec)
Downloaded: http://repo.maven.apache.org/maven2/org/ow2/asm/asm-debug-all/4.0/asm-debug-all-4.0.jar (314 KB at 1658.4 KB/sec)
Downloaded: http://repo.maven.apache.org/maven2/org/apache/commons/commons-exec/1.2/commons-exec-1.2.jar (53 KB at 109.1 KB/sec)
Downloaded: http://repo.maven.apache.org/maven2/org/eclipse/tycho/tycho-artifactcomparator/0.21.0/tycho-artifactcomparator-0.21.0.jar (19 KB at 38.3 KB/sec)
Downloading: http://repo.maven.apache.org/maven2/org/eclipse/tycho/tycho-compiler-plugin/0.21.0/tycho-compiler-plugin-0.21.0.pom
Downloaded: http://repo.maven.apache.org/maven2/org/eclipse/tycho/tycho-compiler-plugin/0.21.0/tycho-compiler-plugin-0.21.0.pom (3 KB at 17.0 KB/sec)
Downloading: http://repo.maven.apache.org/maven2/org/eclipse/tycho/tycho-compiler-plugin/0.21.0/tycho-compiler-plugin-0.21.0.jar
Downloaded: http://repo.maven.apache.org/maven2/org/eclipse/tycho/tycho-compiler-plugin/0.21.0/tycho-compiler-plugin-0.21.0.jar (31 KB at 113.7 KB/sec)
Downloading: http://repo.maven.apache.org/maven2/org/apache/maven/plugins/maven-install-plugin/2.3.1/maven-install-plugin-2.3.1.pom
Downloaded: http://repo.maven.apache.org/maven2/org/apache/maven/plugins/maven-install-plugin/2.3.1/maven-install-plugin-2.3.1.pom (5 KB at 18.4 KB/sec)
Downloading: http://repo.maven.apache.org/maven2/org/apache/maven/plugins/maven-install-plugin/2.3.1/maven-install-plugin-2.3.1.jar
Downloaded: http://repo.maven.apache.org/maven2/org/apache/maven/plugins/maven-install-plugin/2.3.1/maven-install-plugin-2.3.1.jar (23 KB at 154.4 KB/sec)
Downloading: http://repo.maven.apache.org/maven2/org/apache/maven/plugins/maven-deploy-plugin/2.5/maven-deploy-plugin-2.5.pom
Downloaded: http://repo.maven.apache.org/maven2/org/apache/maven/plugins/maven-deploy-plugin/2.5/maven-deploy-plugin-2.5.pom (6 KB at 3.8 KB/sec)
Downloading: http://repo.maven.apache.org/maven2/org/apache/maven/plugins/maven-plugins/16/maven-plugins-16.pom
Downloaded: http://repo.maven.apache.org/maven2/org/apache/maven/plugins/maven-plugins/16/maven-plugins-16.pom (13 KB at 131.7 KB/sec)
Downloading: http://repo.maven.apache.org/maven2/org/apache/maven/plugins/maven-deploy-plugin/2.5/maven-deploy-plugin-2.5.jar
Downloaded: http://repo.maven.apache.org/maven2/org/apache/maven/plugins/maven-deploy-plugin/2.5/maven-deploy-plugin-2.5.jar (23 KB at 218.9 KB/sec)
Downloading: http://repo.maven.apache.org/maven2/org/apache/maven/plugins/maven-site-plugin/3.0/maven-site-plugin-3.0.pom
Downloaded: http://repo.maven.apache.org/maven2/org/apache/maven/plugins/maven-site-plugin/3.0/maven-site-plugin-3.0.pom (20 KB at 147.9 KB/sec)
Downloading: http://repo.maven.apache.org/maven2/org/apache/maven/plugins/maven-plugins/21/maven-plugins-21.pom
Downloaded: http://repo.maven.apache.org/maven2/org/apache/maven/plugins/maven-plugins/21/maven-plugins-21.pom (13 KB at 57.8 KB/sec)
Downloading: http://repo.maven.apache.org/maven2/org/apache/maven/maven-parent/20/maven-parent-20.pom
Downloaded: http://repo.maven.apache.org/maven2/org/apache/maven/maven-parent/20/maven-parent-20.pom (25 KB at 106.8 KB/sec)
Downloading: http://repo.maven.apache.org/maven2/org/apache/apache/9/apache-9.pom
Downloaded: http://repo.maven.apache.org/maven2/org/apache/apache/9/apache-9.pom (15 KB at 57.2 KB/sec)
Downloading: http://repo.maven.apache.org/maven2/org/apache/maven/plugins/maven-site-plugin/3.0/maven-site-plugin-3.0.jar
Downloaded: http://repo.maven.apache.org/maven2/org/apache/maven/plugins/maven-site-plugin/3.0/maven-site-plugin-3.0.jar (112 KB at 700.8 KB/sec)
Downloading: http://repo.maven.apache.org/maven2/org/eclipse/tycho/tycho-surefire-plugin/0.21.0/tycho-surefire-plugin-0.21.0.pom
Downloaded: http://repo.maven.apache.org/maven2/org/eclipse/tycho/tycho-surefire-plugin/0.21.0/tycho-surefire-plugin-0.21.0.pom (4 KB at 7.7 KB/sec)
Downloading: http://repo.maven.apache.org/maven2/org/eclipse/tycho/tycho-surefire/0.21.0/tycho-surefire-0.21.0.pom
Downloaded: http://repo.maven.apache.org/maven2/org/eclipse/tycho/tycho-surefire/0.21.0/tycho-surefire-0.21.0.pom (3 KB at 4.3 KB/sec)
Downloading: http://repo.maven.apache.org/maven2/org/eclipse/tycho/tycho-surefire-plugin/0.21.0/tycho-surefire-plugin-0.21.0.jar
Downloaded: http://repo.maven.apache.org/maven2/org/eclipse/tycho/tycho-surefire-plugin/0.21.0/tycho-surefire-plugin-0.21.0.jar (48 KB at 194.4 KB/sec)
Downloading: http://repo.maven.apache.org/maven2/org/eclipse/tycho/org.eclipse.tycho.surefire.osgibooter/0.21.0/org.eclipse.tycho.surefire.osgibooter-0.21.0.pom
Downloaded: http://repo.maven.apache.org/maven2/org/eclipse/tycho/org.eclipse.tycho.surefire.osgibooter/0.21.0/org.eclipse.tycho.surefire.osgibooter-0.21.0.pom (2 KB at 20.7 KB/sec)
Downloading: http://repo.maven.apache.org/maven2/org/eclipse/tycho/org.eclipse.tycho.surefire.junit/0.21.0/org.eclipse.tycho.surefire.junit-0.21.0.pom
Downloaded: http://repo.maven.apache.org/maven2/org/eclipse/tycho/org.eclipse.tycho.surefire.junit/0.21.0/org.eclipse.tycho.surefire.junit-0.21.0.pom (2 KB at 1.3 KB/sec)
Downloading: http://repo.maven.apache.org/maven2/org/eclipse/tycho/org.eclipse.tycho.surefire.junit4/0.21.0/org.eclipse.tycho.surefire.junit4-0.21.0.pom
Downloaded: http://repo.maven.apache.org/maven2/org/eclipse/tycho/org.eclipse.tycho.surefire.junit4/0.21.0/org.eclipse.tycho.surefire.junit4-0.21.0.pom (2 KB at 1.4 KB/sec)
Downloading: http://repo.maven.apache.org/maven2/org/eclipse/tycho/org.eclipse.tycho.surefire.junit47/0.21.0/org.eclipse.tycho.surefire.junit47-0.21.0.pom
Downloaded: http://repo.maven.apache.org/maven2/org/eclipse/tycho/org.eclipse.tycho.surefire.junit47/0.21.0/org.eclipse.tycho.surefire.junit47-0.21.0.pom (2 KB at 1.8 KB/sec)
Downloading: http://repo.maven.apache.org/maven2/org/apache/maven/surefire/surefire-api/2.10/surefire-api-2.10.pom
Downloaded: http://repo.maven.apache.org/maven2/org/apache/maven/surefire/surefire-api/2.10/surefire-api-2.10.pom (3 KB at 9.2 KB/sec)
Downloading: http://repo.maven.apache.org/maven2/org/apache/maven/surefire/surefire/2.10/surefire-2.10.pom
Downloaded: http://repo.maven.apache.org/maven2/org/apache/maven/surefire/surefire/2.10/surefire-2.10.pom (12 KB at 100.4 KB/sec)
Downloading: http://repo.maven.apache.org/maven2/org/eclipse/tycho/org.eclipse.tycho.surefire.osgibooter/0.21.0/org.eclipse.tycho.surefire.osgibooter-0.21.0.jar
Downloading: http://repo.maven.apache.org/maven2/org/eclipse/tycho/org.eclipse.tycho.surefire.junit/0.21.0/org.eclipse.tycho.surefire.junit-0.21.0.jar
Downloading: http://repo.maven.apache.org/maven2/org/eclipse/tycho/org.eclipse.tycho.surefire.junit4/0.21.0/org.eclipse.tycho.surefire.junit4-0.21.0.jar
Downloading: http://repo.maven.apache.org/maven2/org/eclipse/tycho/org.eclipse.tycho.surefire.junit47/0.21.0/org.eclipse.tycho.surefire.junit47-0.21.0.jar
Downloading: http://repo.maven.apache.org/maven2/org/apache/maven/surefire/surefire-api/2.10/surefire-api-2.10.jar
Downloaded: http://repo.maven.apache.org/maven2/org/eclipse/tycho/org.eclipse.tycho.surefire.junit4/0.21.0/org.eclipse.tycho.surefire.junit4-0.21.0.jar (29 KB at 273.5 KB/sec)
Downloaded: http://repo.maven.apache.org/maven2/org/eclipse/tycho/org.eclipse.tycho.surefire.junit/0.21.0/org.eclipse.tycho.surefire.junit-0.21.0.jar (25 KB at 159.9 KB/sec)
Downloaded: http://repo.maven.apache.org/maven2/org/apache/maven/surefire/surefire-api/2.10/surefire-api-2.10.jar (158 KB at 921.3 KB/sec)
Downloaded: http://repo.maven.apache.org/maven2/org/eclipse/tycho/org.eclipse.tycho.surefire.junit47/0.21.0/org.eclipse.tycho.surefire.junit47-0.21.0.jar (49 KB at 264.3 KB/sec)
Downloaded: http://repo.maven.apache.org/maven2/org/eclipse/tycho/org.eclipse.tycho.surefire.osgibooter/0.21.0/org.eclipse.tycho.surefire.osgibooter-0.21.0.jar (181 KB at 531.2 KB/sec)
Downloading: http://repo.maven.apache.org/maven2/org/codehaus/mojo/xml-maven-plugin/1.0-beta-3/xml-maven-plugin-1.0-beta-3.pom
Downloaded: http://repo.maven.apache.org/maven2/org/codehaus/mojo/xml-maven-plugin/1.0-beta-3/xml-maven-plugin-1.0-beta-3.pom (6 KB at 0.9 KB/sec)
Downloading: http://repo.maven.apache.org/maven2/org/codehaus/mojo/mojo-parent/21/mojo-parent-21.pom
Downloaded: http://repo.maven.apache.org/maven2/org/codehaus/mojo/mojo-parent/21/mojo-parent-21.pom (19 KB at 47.6 KB/sec)
Downloading: http://repo.maven.apache.org/maven2/org/codehaus/mojo/xml-maven-plugin/1.0-beta-3/xml-maven-plugin-1.0-beta-3.jar
Downloaded: http://repo.maven.apache.org/maven2/org/codehaus/mojo/xml-maven-plugin/1.0-beta-3/xml-maven-plugin-1.0-beta-3.jar (31 KB at 307.6 KB/sec)
Downloading: http://repo.maven.apache.org/maven2/org/eclipse/tycho/tycho-source-plugin/0.21.0/tycho-source-plugin-0.21.0.pom
Downloaded: http://repo.maven.apache.org/maven2/org/eclipse/tycho/tycho-source-plugin/0.21.0/tycho-source-plugin-0.21.0.pom (3 KB at 0.3 KB/sec)
Downloading: http://repo.maven.apache.org/maven2/org/eclipse/tycho/tycho-source-plugin/0.21.0/tycho-source-plugin-0.21.0.jar
Downloaded: http://repo.maven.apache.org/maven2/org/eclipse/tycho/tycho-source-plugin/0.21.0/tycho-source-plugin-0.21.0.jar (22 KB at 215.8 KB/sec)
Downloading: http://repo.maven.apache.org/maven2/org/apache/maven/plugins/maven-source-plugin/2.1/maven-source-plugin-2.1.pom
Downloaded: http://repo.maven.apache.org/maven2/org/apache/maven/plugins/maven-source-plugin/2.1/maven-source-plugin-2.1.pom (5 KB at 4.3 KB/sec)
Downloading: http://repo.maven.apache.org/maven2/org/apache/maven/plugins/maven-plugins/13/maven-plugins-13.pom
Downloaded: http://repo.maven.apache.org/maven2/org/apache/maven/plugins/maven-plugins/13/maven-plugins-13.pom (12 KB at 5.3 KB/sec)
Downloading: http://repo.maven.apache.org/maven2/org/apache/maven/maven-parent/11/maven-parent-11.pom
Downloaded: http://repo.maven.apache.org/maven2/org/apache/maven/maven-parent/11/maven-parent-11.pom (32 KB at 253.2 KB/sec)
Downloading: http://repo.maven.apache.org/maven2/org/apache/apache/5/apache-5.pom
Downloaded: http://repo.maven.apache.org/maven2/org/apache/apache/5/apache-5.pom (5 KB at 37.4 KB/sec)
Downloading: http://repo.maven.apache.org/maven2/org/apache/maven/maven-archiver/2.5/maven-archiver-2.5.pom
Downloaded: http://repo.maven.apache.org/maven2/org/apache/maven/maven-archiver/2.5/maven-archiver-2.5.pom (5 KB at 3.4 KB/sec)
Downloading: http://repo.maven.apache.org/maven2/org/apache/maven/shared/maven-shared-components/17/maven-shared-components-17.pom
Downloaded: http://repo.maven.apache.org/maven2/org/apache/maven/shared/maven-shared-components/17/maven-shared-components-17.pom (9 KB at 100.0 KB/sec)
Downloading: http://repo.maven.apache.org/maven2/org/apache/maven/maven-parent/21/maven-parent-21.pom
Downloaded: http://repo.maven.apache.org/maven2/org/apache/maven/maven-parent/21/maven-parent-21.pom (26 KB at 211.0 KB/sec)
Downloading: http://repo.maven.apache.org/maven2/org/apache/apache/10/apache-10.pom
Downloaded: http://repo.maven.apache.org/maven2/org/apache/apache/10/apache-10.pom (15 KB at 14.6 KB/sec)
Downloading: http://repo.maven.apache.org/maven2/org/codehaus/plexus/plexus-interpolation/1.15/plexus-interpolation-1.15.pom
Downloaded: http://repo.maven.apache.org/maven2/org/codehaus/plexus/plexus-interpolation/1.15/plexus-interpolation-1.15.pom (1018 B at 1.2 KB/sec)
Downloading: http://repo.maven.apache.org/maven2/org/codehaus/plexus/plexus/3.0.1/plexus-3.0.1.pom
Downloaded: http://repo.maven.apache.org/maven2/org/codehaus/plexus/plexus/3.0.1/plexus-3.0.1.pom (19 KB at 68.9 KB/sec)
Downloading: http://repo.maven.apache.org/maven2/org/apache/maven/plugins/maven-source-plugin/2.1/maven-source-plugin-2.1.jar
Downloading: http://repo.maven.apache.org/maven2/org/apache/maven/maven-archiver/2.5/maven-archiver-2.5.jar
Downloaded: http://repo.maven.apache.org/maven2/org/apache/maven/plugins/maven-source-plugin/2.1/maven-source-plugin-2.1.jar (24 KB at 232.8 KB/sec)
Downloaded: http://repo.maven.apache.org/maven2/org/apache/maven/maven-archiver/2.5/maven-archiver-2.5.jar (22 KB at 153.3 KB/sec)
Downloading: http://repo.maven.apache.org/maven2/org/apache/maven/plugins/maven-antrun-plugin/1.6/maven-antrun-plugin-1.6.pom
Downloaded: http://repo.maven.apache.org/maven2/org/apache/maven/plugins/maven-antrun-plugin/1.6/maven-antrun-plugin-1.6.pom (5 KB at 49.0 KB/sec)
Downloading: http://repo.maven.apache.org/maven2/org/apache/maven/plugins/maven-antrun-plugin/1.6/maven-antrun-plugin-1.6.jar
Downloaded: http://repo.maven.apache.org/maven2/org/apache/maven/plugins/maven-antrun-plugin/1.6/maven-antrun-plugin-1.6.jar (29 KB at 175.5 KB/sec)
Downloading: http://repo.maven.apache.org/maven2/org/codehaus/mojo/findbugs-maven-plugin/2.3.2/findbugs-maven-plugin-2.3.2.pom
Downloaded: http://repo.maven.apache.org/maven2/org/codehaus/mojo/findbugs-maven-plugin/2.3.2/findbugs-maven-plugin-2.3.2.pom (16 KB at 56.3 KB/sec)
Downloading: http://repo.maven.apache.org/maven2/org/codehaus/mojo/mojo-parent/28/mojo-parent-28.pom
Downloaded: http://repo.maven.apache.org/maven2/org/codehaus/mojo/mojo-parent/28/mojo-parent-28.pom (26 KB at 9.8 KB/sec)
Downloading: http://repo.maven.apache.org/maven2/org/codehaus/codehaus-parent/3/codehaus-parent-3.pom
Downloaded: http://repo.maven.apache.org/maven2/org/codehaus/codehaus-parent/3/codehaus-parent-3.pom (5 KB at 1.0 KB/sec)
Downloading: http://repo.maven.apache.org/maven2/org/codehaus/mojo/findbugs-maven-plugin/2.3.2/findbugs-maven-plugin-2.3.2.jar
Downloaded: http://repo.maven.apache.org/maven2/org/codehaus/mojo/findbugs-maven-plugin/2.3.2/findbugs-maven-plugin-2.3.2.jar (117 KB at 29.8 KB/sec)
Downloading: http://repo.maven.apache.org/maven2/org/apache/maven/plugins/maven-pmd-plugin/2.5/maven-pmd-plugin-2.5.pom
Downloaded: http://repo.maven.apache.org/maven2/org/apache/maven/plugins/maven-pmd-plugin/2.5/maven-pmd-plugin-2.5.pom (8 KB at 7.2 KB/sec)
Downloading: http://repo.maven.apache.org/maven2/org/apache/maven/plugins/maven-plugins/17/maven-plugins-17.pom
Downloaded: http://repo.maven.apache.org/maven2/org/apache/maven/plugins/maven-plugins/17/maven-plugins-17.pom (13 KB at 6.7 KB/sec)
Downloading: http://repo.maven.apache.org/maven2/org/apache/maven/plugins/maven-pmd-plugin/2.5/maven-pmd-plugin-2.5.jar
Downloaded: http://repo.maven.apache.org/maven2/org/apache/maven/plugins/maven-pmd-plugin/2.5/maven-pmd-plugin-2.5.jar (57 KB at 246.1 KB/sec)
Downloading: http://repo.maven.apache.org/maven2/org/eclipse/tycho/tycho-p2-publisher-plugin/0.21.0/tycho-p2-publisher-plugin-0.21.0.pom
Downloaded: http://repo.maven.apache.org/maven2/org/eclipse/tycho/tycho-p2-publisher-plugin/0.21.0/tycho-p2-publisher-plugin-0.21.0.pom (2 KB at 20.7 KB/sec)
Downloading: http://repo.maven.apache.org/maven2/org/eclipse/tycho/tycho-p2-publisher-plugin/0.21.0/tycho-p2-publisher-plugin-0.21.0.jar
Downloaded: http://repo.maven.apache.org/maven2/org/eclipse/tycho/tycho-p2-publisher-plugin/0.21.0/tycho-p2-publisher-plugin-0.21.0.jar (23 KB at 229.0 KB/sec)
Downloading: http://repo.maven.apache.org/maven2/org/eclipse/tycho/tycho-p2-repository-plugin/0.21.0/tycho-p2-repository-plugin-0.21.0.pom
Downloaded: http://repo.maven.apache.org/maven2/org/eclipse/tycho/tycho-p2-repository-plugin/0.21.0/tycho-p2-repository-plugin-0.21.0.pom (2 KB at 3.7 KB/sec)
Downloading: http://repo.maven.apache.org/maven2/org/eclipse/tycho/tycho-p2-repository-plugin/0.21.0/tycho-p2-repository-plugin-0.21.0.jar
Downloaded: http://repo.maven.apache.org/maven2/org/eclipse/tycho/tycho-p2-repository-plugin/0.21.0/tycho-p2-repository-plugin-0.21.0.jar (13 KB at 112.1 KB/sec)
[INFO] Computing target platform for MavenProject: org.eclipse.mylyn:org.eclipse.mylyn.discovery:3.7.0 @ /jobs/genie.mylyn/mylyn-3.21.x-release/workspace/org.eclipse.mylyn/org.eclipse.mylyn.discovery-directory/pom.xml
[INFO] Adding repository http://download.eclipse.org/tools/orbit/downloads/drops/R20160221192158/repository
[INFO] Fetching content.jar from http://download.eclipse.org/tools/orbit/downloads/drops/R20160221192158/repository/ (0B of 174.41kB at 0B/s)
[INFO] Adding repository http://download.eclipse.org/tools/orbit/downloads/drops/R20160520211859/repository
[INFO] Fetching content.jar from http://download.eclipse.org/tools/orbit/downloads/drops/R20160520211859/repository/ (0B of 121.18kB at 0B/s)
[INFO] Fetching p2.index from http://download.eclipse.org/tools/orbit/downloads/drops/R20130517111416/repository/ (0B at 0B/s)
[INFO] Adding repository http://download.eclipse.org/tools/orbit/downloads/drops/R20130517111416/repository
[INFO] Fetching content.jar from http://download.eclipse.org/tools/orbit/downloads/drops/R20130517111416/repository/ (0B of 172.36kB at 0B/s)
[INFO] Fetching p2.index from http://download.eclipse.org/releases/neon/ (0B at 0B/s)
[INFO] Adding repository http://download.eclipse.org/releases/neon
[INFO] Fetching compositeContent.jar from http://download.eclipse.org/releases/neon/ (0B of 498B at 0B/s)
[INFO] Fetching p2.index from http://download.eclipse.org/technology/epp/packages/neon/ (0B at 0B/s)
[INFO] Fetching content.jar from http://download.eclipse.org/technology/epp/packages/neon/ (0B of 83.47kB at 0B/s)
[INFO] Fetching p2.index from http://download.eclipse.org/releases/neon/201606221000/ (0B at 0B/s)
[INFO] Fetching content.jar from http://download.eclipse.org/releases/neon/201606221000/ (0B of 2.72MB at 0B/s)
Aug 23, 2016 11:14:39 PM org.apache.http.client.protocol.ResponseProcessCookies processCookies
WARNING: Cookie rejected: "[version: 0][name: JSESSIONID][value: 7D94312E66BE4F24388ECC2597C237AE][domain: subclipse.tigris.org][path: /servlets][expiry: null]". Illegal path attribute "/servlets". Path of origin: "/archive/subclipse_1.8.10/p2.index"
[INFO] Adding repository http://subclipse.tigris.org/archive/subclipse_1.8.10
Aug 23, 2016 11:14:50 PM org.apache.http.client.protocol.ResponseProcessCookies processCookies
WARNING: Cookie rejected: "[version: 0][name: JSESSIONID][value: 0FD211C2C141F51C719D60C2FBBC3EC2][domain: subclipse.tigris.org][path: /servlets][expiry: null]". Illegal path attribute "/servlets". Path of origin: "/archive/subclipse_1.8.10/content.jar"
Aug 23, 2016 11:15:06 PM org.apache.http.client.protocol.ResponseProcessCookies processCookies
WARNING: Cookie rejected: "[version: 0][name: JSESSIONID][value: 0B10102F66FAB7E6C00421CB93B19359][domain: subclipse.tigris.org][path: /servlets][expiry: null]". Illegal path attribute "/servlets". Path of origin: "/archive/subclipse_1.8.10/content.xml"
[INFO] o.h.m.e.h.MavenExecutionResultHandler - Build failed with exception(s)
[INFO] o.h.m.e.h.MavenExecutionResultHandler - [1] org.apache.maven.InternalErrorException: Internal error: java.lang.RuntimeException: Failed to resolve target definition /jobs/genie.mylyn/mylyn-3.21.x-release/workspace/org.eclipse.mylyn/org.eclipse.mylyn-target/mylyn-e4.6.target
[DEBUG] Closing connection to remote
[ERROR] Internal error: java.lang.RuntimeException: Failed to resolve target definition /jobs/genie.mylyn/mylyn-3.21.x-release/workspace/org.eclipse.mylyn/org.eclipse.mylyn-target/mylyn-e4.6.target: Failed to load p2 metadata repository from location http://subclipse.tigris.org/archive/subclipse_1.8.10: HTTP Server 'Bad Gateway' : http://subclipse.tigris.org/archive/subclipse_1.8.10/content.xml: HttpComponents connection error response code 502. -> [Help 1]
org.apache.maven.InternalErrorException: Internal error: java.lang.RuntimeException: Failed to resolve target definition /jobs/genie.mylyn/mylyn-3.21.x-release/workspace/org.eclipse.mylyn/org.eclipse.mylyn-target/mylyn-e4.6.target
	at org.apache.maven.DefaultMaven.execute(DefaultMaven.java:168)
	at org.apache.maven.cli.MavenCli.execute(MavenCli.java:537)
	at org.apache.maven.cli.MavenCli.doMain(MavenCli.java:196)
	at org.apache.maven.cli.MavenCli.main(MavenCli.java:141)
	at sun.reflect.NativeMethodAccessorImpl.invoke0(Native Method)
	at sun.reflect.NativeMethodAccessorImpl.invoke(NativeMethodAccessorImpl.java:62)
	at sun.reflect.DelegatingMethodAccessorImpl.invoke(DelegatingMethodAccessorImpl.java:43)
	at java.lang.reflect.Method.invoke(Method.java:497)
	at org.codehaus.plexus.classworlds.launcher.Launcher.launchEnhanced(Launcher.java:290)
	at org.codehaus.plexus.classworlds.launcher.Launcher.launch(Launcher.java:230)
	at org.codehaus.plexus.classworlds.launcher.Launcher.mainWithExitCode(Launcher.java:409)
	at org.codehaus.plexus.classworlds.launcher.Launcher.main(Launcher.java:352)
Caused by: java.lang.RuntimeException: Failed to resolve target definition /jobs/genie.mylyn/mylyn-3.21.x-release/workspace/org.eclipse.mylyn/org.eclipse.mylyn-target/mylyn-e4.6.target
	at org.eclipse.tycho.p2.target.TargetDefinitionResolver.resolveContent(TargetDefinitionResolver.java:91)
	at org.eclipse.tycho.p2.target.TargetDefinitionResolverService.resolveFromArguments(TargetDefinitionResolverService.java:70)
	at org.eclipse.tycho.p2.target.TargetDefinitionResolverService.getTargetDefinitionContent(TargetDefinitionResolverService.java:60)
	at org.eclipse.tycho.p2.target.TargetPlatformFactoryImpl.resolveTargetDefinitions(TargetPlatformFactoryImpl.java:213)
	at org.eclipse.tycho.p2.target.TargetPlatformFactoryImpl.createTargetPlatform(TargetPlatformFactoryImpl.java:153)
	at org.eclipse.tycho.p2.target.TargetPlatformFactoryImpl.createTargetPlatform(TargetPlatformFactoryImpl.java:126)
	at org.eclipse.tycho.p2.target.TargetPlatformFactoryImpl.createTargetPlatform(TargetPlatformFactoryImpl.java:1)
	at org.eclipse.tycho.p2.manager.ReactorRepositoryManagerImpl.computePreliminaryTargetPlatform(ReactorRepositoryManagerImpl.java:82)
	at org.eclipse.tycho.p2.resolver.P2DependencyResolver.computePreliminaryTargetPlatform(P2DependencyResolver.java:215)
	at org.eclipse.tycho.core.resolver.DefaultTychoResolver.resolveProject(DefaultTychoResolver.java:99)
	at org.eclipse.tycho.core.maven.TychoMavenLifecycleParticipant.afterProjectsRead(TychoMavenLifecycleParticipant.java:75)
	at org.apache.maven.DefaultMaven.doExecute(DefaultMaven.java:274)
	at org.apache.maven.DefaultMaven.execute(DefaultMaven.java:156)
	... 11 more
Caused by: org.eclipse.tycho.p2.target.facade.TargetDefinitionResolutionException: Failed to load p2 metadata repository from location http://subclipse.tigris.org/archive/subclipse_1.8.10
	at org.eclipse.tycho.p2.target.TargetDefinitionResolver.loadRepository(TargetDefinitionResolver.java:210)
	at org.eclipse.tycho.p2.target.TargetDefinitionResolver.resolveContentWithExceptions(TargetDefinitionResolver.java:127)
	at org.eclipse.tycho.p2.target.TargetDefinitionResolver.resolveContent(TargetDefinitionResolver.java:86)
	... 23 more
Caused by: org.eclipse.equinox.p2.core.ProvisionException: HTTP Server 'Bad Gateway' : http://subclipse.tigris.org/archive/subclipse_1.8.10/content.xml
	at org.eclipse.equinox.internal.p2.repository.CacheManager.updateCache(CacheManager.java:371)
	at org.eclipse.equinox.internal.p2.repository.CacheManager.createCache(CacheManager.java:208)
	at org.eclipse.tycho.p2.remote.RemoteRepositoryCacheManager.createCache(RemoteRepositoryCacheManager.java:66)
	at org.eclipse.equinox.internal.p2.metadata.repository.SimpleMetadataRepositoryFactory.getLocalFile(SimpleMetadataRepositoryFactory.java:66)
	at org.eclipse.equinox.internal.p2.metadata.repository.SimpleMetadataRepositoryFactory.load(SimpleMetadataRepositoryFactory.java:88)
	at org.eclipse.equinox.internal.p2.metadata.repository.MetadataRepositoryManager.factoryLoad(MetadataRepositoryManager.java:57)
	at org.eclipse.equinox.internal.p2.repository.helpers.AbstractRepositoryManager.loadRepository(AbstractRepositoryManager.java:768)
	at org.eclipse.equinox.internal.p2.repository.helpers.AbstractRepositoryManager.loadRepository(AbstractRepositoryManager.java:668)
	at org.eclipse.equinox.internal.p2.metadata.repository.MetadataRepositoryManager.loadRepository(MetadataRepositoryManager.java:96)
	at org.eclipse.tycho.p2.remote.RemoteMetadataRepositoryManager.loadRepository(RemoteMetadataRepositoryManager.java:59)
	at org.eclipse.tycho.p2.remote.RemoteMetadataRepositoryManager.loadRepository(RemoteMetadataRepositoryManager.java:52)
	at org.eclipse.tycho.p2.target.TargetDefinitionResolver.loadRepository(TargetDefinitionResolver.java:208)
	... 25 more
Caused by: org.eclipse.ecf.filetransfer.IncomingFileTransferException: HttpComponents connection error response code 502.
	at org.eclipse.ecf.provider.filetransfer.httpclient4.HttpClientRetrieveFileTransfer.openStreams(HttpClientRetrieveFileTransfer.java:662)
	at org.eclipse.ecf.provider.filetransfer.retrieve.AbstractRetrieveFileTransfer.sendRetrieveRequest(AbstractRetrieveFileTransfer.java:885)
	at org.eclipse.ecf.provider.filetransfer.retrieve.AbstractRetrieveFileTransfer.sendRetrieveRequest(AbstractRetrieveFileTransfer.java:576)
	at org.eclipse.ecf.provider.filetransfer.retrieve.MultiProtocolRetrieveAdapter.sendRetrieveRequest(MultiProtocolRetrieveAdapter.java:106)
	at org.eclipse.equinox.internal.p2.transport.ecf.FileReader.sendRetrieveRequest(FileReader.java:389)
	at org.eclipse.equinox.internal.p2.transport.ecf.FileReader.readInto(FileReader.java:322)
	at org.eclipse.equinox.internal.p2.transport.ecf.RepositoryTransport.download(RepositoryTransport.java:101)
	at org.eclipse.equinox.internal.p2.transport.ecf.RepositoryTransport.download(RepositoryTransport.java:156)
	at org.eclipse.equinox.internal.p2.repository.CacheManager.updateCache(CacheManager.java:345)
	... 36 more
[ERROR] 
[ERROR] To see the full stack trace of the errors, re-run Maven with the -e switch.
[ERROR] Re-run Maven using the -X switch to enable full debug logging.
[ERROR] 
[ERROR] For more information about the errors and possible solutions, please read the following articles:
[ERROR] [Help 1] http://cwiki.apache.org/confluence/display/MAVEN/InternalErrorException
[DEBUG] Waiting for process to finish
[DEBUG] Result: 1
Recording fingerprints
Archiving artifacts
Finished: FAILURE