UnstableConsole Output

Skipping 12,165 KB.. Full Log
);
	                     ^^^^^^^^
Discouraged access: The field 'Direction.FORWARDS' is not API (restriction on classpath entry '/jobs/genie.mylyn/mylyn-test-build/workspace/org.eclipse.mylyn.reviews/org.eclipse.mylyn.reviews.ui/target/classes')
[WARNING] /jobs/genie.mylyn/mylyn-test-build/workspace/org.eclipse.mylyn.reviews/org.eclipse.mylyn.reviews.tests/src/org/eclipse/mylyn/reviews/tests/ui/ReviewCompareAnnotationSupportTest.java:[82] 
	assertSide(Direction.FORWARDS, 10, 0, 1, LEFT_SIDE);
	                                         ^^^^^^^^^
Discouraged access: The field 'ReviewCompareAnnotationSupport.Side.LEFT_SIDE' is not API (restriction on classpath entry '/jobs/genie.mylyn/mylyn-test-build/workspace/org.eclipse.mylyn.reviews/org.eclipse.mylyn.reviews.ui/target/classes')
[WARNING] /jobs/genie.mylyn/mylyn-test-build/workspace/org.eclipse.mylyn.reviews/org.eclipse.mylyn.reviews.tests/src/org/eclipse/mylyn/reviews/tests/ui/ReviewCompareAnnotationSupportTest.java:[88] 
	assertSide(Direction.FORWARDS, 10, 0, 10, RIGHT_SIDE);
	           ^^^^^^^^^^^^^^^^^^
Discouraged access: The type 'Direction' is not API (restriction on classpath entry '/jobs/genie.mylyn/mylyn-test-build/workspace/org.eclipse.mylyn.reviews/org.eclipse.mylyn.reviews.ui/target/classes')
[WARNING] /jobs/genie.mylyn/mylyn-test-build/workspace/org.eclipse.mylyn.reviews/org.eclipse.mylyn.reviews.tests/src/org/eclipse/mylyn/reviews/tests/ui/ReviewCompareAnnotationSupportTest.java:[88] 
	assertSide(Direction.FORWARDS, 10, 0, 10, RIGHT_SIDE);
	                     ^^^^^^^^
Discouraged access: The field 'Direction.FORWARDS' is not API (restriction on classpath entry '/jobs/genie.mylyn/mylyn-test-build/workspace/org.eclipse.mylyn.reviews/org.eclipse.mylyn.reviews.ui/target/classes')
[WARNING] /jobs/genie.mylyn/mylyn-test-build/workspace/org.eclipse.mylyn.reviews/org.eclipse.mylyn.reviews.tests/src/org/eclipse/mylyn/reviews/tests/ui/ReviewCompareAnnotationSupportTest.java:[88] 
	assertSide(Direction.FORWARDS, 10, 0, 10, RIGHT_SIDE);
	                                          ^^^^^^^^^^
Discouraged access: The field 'ReviewCompareAnnotationSupport.Side.RIGHT_SIDE' is not API (restriction on classpath entry '/jobs/genie.mylyn/mylyn-test-build/workspace/org.eclipse.mylyn.reviews/org.eclipse.mylyn.reviews.ui/target/classes')
[WARNING] /jobs/genie.mylyn/mylyn-test-build/workspace/org.eclipse.mylyn.reviews/org.eclipse.mylyn.reviews.tests/src/org/eclipse/mylyn/reviews/tests/ui/ReviewCompareAnnotationSupportTest.java:[94] 
	assertSide(Direction.FORWARDS, 10, 0, 0, LEFT_SIDE);
	           ^^^^^^^^^^^^^^^^^^
Discouraged access: The type 'Direction' is not API (restriction on classpath entry '/jobs/genie.mylyn/mylyn-test-build/workspace/org.eclipse.mylyn.reviews/org.eclipse.mylyn.reviews.ui/target/classes')
[WARNING] /jobs/genie.mylyn/mylyn-test-build/workspace/org.eclipse.mylyn.reviews/org.eclipse.mylyn.reviews.tests/src/org/eclipse/mylyn/reviews/tests/ui/ReviewCompareAnnotationSupportTest.java:[94] 
	assertSide(Direction.FORWARDS, 10, 0, 0, LEFT_SIDE);
	                     ^^^^^^^^
Discouraged access: The field 'Direction.FORWARDS' is not API (restriction on classpath entry '/jobs/genie.mylyn/mylyn-test-build/workspace/org.eclipse.mylyn.reviews/org.eclipse.mylyn.reviews.ui/target/classes')
[WARNING] /jobs/genie.mylyn/mylyn-test-build/workspace/org.eclipse.mylyn.reviews/org.eclipse.mylyn.reviews.tests/src/org/eclipse/mylyn/reviews/tests/ui/ReviewCompareAnnotationSupportTest.java:[94] 
	assertSide(Direction.FORWARDS, 10, 0, 0, LEFT_SIDE);
	                                         ^^^^^^^^^
Discouraged access: The field 'ReviewCompareAnnotationSupport.Side.LEFT_SIDE' is not API (restriction on classpath entry '/jobs/genie.mylyn/mylyn-test-build/workspace/org.eclipse.mylyn.reviews/org.eclipse.mylyn.reviews.ui/target/classes')
[WARNING] /jobs/genie.mylyn/mylyn-test-build/workspace/org.eclipse.mylyn.reviews/org.eclipse.mylyn.reviews.tests/src/org/eclipse/mylyn/reviews/tests/ui/ReviewCompareAnnotationSupportTest.java:[100] 
	assertSide(Direction.FORWARDS, 0, 10, 0, RIGHT_SIDE);
	           ^^^^^^^^^^^^^^^^^^
Discouraged access: The type 'Direction' is not API (restriction on classpath entry '/jobs/genie.mylyn/mylyn-test-build/workspace/org.eclipse.mylyn.reviews/org.eclipse.mylyn.reviews.ui/target/classes')
[WARNING] /jobs/genie.mylyn/mylyn-test-build/workspace/org.eclipse.mylyn.reviews/org.eclipse.mylyn.reviews.tests/src/org/eclipse/mylyn/reviews/tests/ui/ReviewCompareAnnotationSupportTest.java:[100] 
	assertSide(Direction.FORWARDS, 0, 10, 0, RIGHT_SIDE);
	                     ^^^^^^^^
Discouraged access: The field 'Direction.FORWARDS' is not API (restriction on classpath entry '/jobs/genie.mylyn/mylyn-test-build/workspace/org.eclipse.mylyn.reviews/org.eclipse.mylyn.reviews.ui/target/classes')
[WARNING] /jobs/genie.mylyn/mylyn-test-build/workspace/org.eclipse.mylyn.reviews/org.eclipse.mylyn.reviews.tests/src/org/eclipse/mylyn/reviews/tests/ui/ReviewCompareAnnotationSupportTest.java:[100] 
	assertSide(Direction.FORWARDS, 0, 10, 0, RIGHT_SIDE);
	                                         ^^^^^^^^^^
Discouraged access: The field 'ReviewCompareAnnotationSupport.Side.RIGHT_SIDE' is not API (restriction on classpath entry '/jobs/genie.mylyn/mylyn-test-build/workspace/org.eclipse.mylyn.reviews/org.eclipse.mylyn.reviews.ui/target/classes')
[WARNING] /jobs/genie.mylyn/mylyn-test-build/workspace/org.eclipse.mylyn.reviews/org.eclipse.mylyn.reviews.tests/src/org/eclipse/mylyn/reviews/tests/ui/ReviewCompareAnnotationSupportTest.java:[106] 
	assertSide(Direction.FORWARDS, 0, 10, 10, LEFT_SIDE);
	           ^^^^^^^^^^^^^^^^^^
Discouraged access: The type 'Direction' is not API (restriction on classpath entry '/jobs/genie.mylyn/mylyn-test-build/workspace/org.eclipse.mylyn.reviews/org.eclipse.mylyn.reviews.ui/target/classes')
[WARNING] /jobs/genie.mylyn/mylyn-test-build/workspace/org.eclipse.mylyn.reviews/org.eclipse.mylyn.reviews.tests/src/org/eclipse/mylyn/reviews/tests/ui/ReviewCompareAnnotationSupportTest.java:[106] 
	assertSide(Direction.FORWARDS, 0, 10, 10, LEFT_SIDE);
	                     ^^^^^^^^
Discouraged access: The field 'Direction.FORWARDS' is not API (restriction on classpath entry '/jobs/genie.mylyn/mylyn-test-build/workspace/org.eclipse.mylyn.reviews/org.eclipse.mylyn.reviews.ui/target/classes')
[WARNING] /jobs/genie.mylyn/mylyn-test-build/workspace/org.eclipse.mylyn.reviews/org.eclipse.mylyn.reviews.tests/src/org/eclipse/mylyn/reviews/tests/ui/ReviewCompareAnnotationSupportTest.java:[106] 
	assertSide(Direction.FORWARDS, 0, 10, 10, LEFT_SIDE);
	                                          ^^^^^^^^^
Discouraged access: The field 'ReviewCompareAnnotationSupport.Side.LEFT_SIDE' is not API (restriction on classpath entry '/jobs/genie.mylyn/mylyn-test-build/workspace/org.eclipse.mylyn.reviews/org.eclipse.mylyn.reviews.ui/target/classes')
[WARNING] /jobs/genie.mylyn/mylyn-test-build/workspace/org.eclipse.mylyn.reviews/org.eclipse.mylyn.reviews.tests/src/org/eclipse/mylyn/reviews/tests/ui/ReviewCompareAnnotationSupportTest.java:[112] 
	assertSide(Direction.BACKWARDS, 20, 15, 10, LEFT_SIDE);
	           ^^^^^^^^^^^^^^^^^^^
Discouraged access: The type 'Direction' is not API (restriction on classpath entry '/jobs/genie.mylyn/mylyn-test-build/workspace/org.eclipse.mylyn.reviews/org.eclipse.mylyn.reviews.ui/target/classes')
[WARNING] /jobs/genie.mylyn/mylyn-test-build/workspace/org.eclipse.mylyn.reviews/org.eclipse.mylyn.reviews.tests/src/org/eclipse/mylyn/reviews/tests/ui/ReviewCompareAnnotationSupportTest.java:[112] 
	assertSide(Direction.BACKWARDS, 20, 15, 10, LEFT_SIDE);
	                     ^^^^^^^^^
Discouraged access: The field 'Direction.BACKWARDS' is not API (restriction on classpath entry '/jobs/genie.mylyn/mylyn-test-build/workspace/org.eclipse.mylyn.reviews/org.eclipse.mylyn.reviews.ui/target/classes')
[WARNING] /jobs/genie.mylyn/mylyn-test-build/workspace/org.eclipse.mylyn.reviews/org.eclipse.mylyn.reviews.tests/src/org/eclipse/mylyn/reviews/tests/ui/ReviewCompareAnnotationSupportTest.java:[112] 
	assertSide(Direction.BACKWARDS, 20, 15, 10, LEFT_SIDE);
	                                            ^^^^^^^^^
Discouraged access: The field 'ReviewCompareAnnotationSupport.Side.LEFT_SIDE' is not API (restriction on classpath entry '/jobs/genie.mylyn/mylyn-test-build/workspace/org.eclipse.mylyn.reviews/org.eclipse.mylyn.reviews.ui/target/classes')
[WARNING] /jobs/genie.mylyn/mylyn-test-build/workspace/org.eclipse.mylyn.reviews/org.eclipse.mylyn.reviews.tests/src/org/eclipse/mylyn/reviews/tests/ui/ReviewCompareAnnotationSupportTest.java:[118] 
	assertSide(Direction.BACKWARDS, 20, 25, 10, RIGHT_SIDE);
	           ^^^^^^^^^^^^^^^^^^^
Discouraged access: The type 'Direction' is not API (restriction on classpath entry '/jobs/genie.mylyn/mylyn-test-build/workspace/org.eclipse.mylyn.reviews/org.eclipse.mylyn.reviews.ui/target/classes')
[WARNING] /jobs/genie.mylyn/mylyn-test-build/workspace/org.eclipse.mylyn.reviews/org.eclipse.mylyn.reviews.tests/src/org/eclipse/mylyn/reviews/tests/ui/ReviewCompareAnnotationSupportTest.java:[118] 
	assertSide(Direction.BACKWARDS, 20, 25, 10, RIGHT_SIDE);
	                     ^^^^^^^^^
Discouraged access: The field 'Direction.BACKWARDS' is not API (restriction on classpath entry '/jobs/genie.mylyn/mylyn-test-build/workspace/org.eclipse.mylyn.reviews/org.eclipse.mylyn.reviews.ui/target/classes')
[WARNING] /jobs/genie.mylyn/mylyn-test-build/workspace/org.eclipse.mylyn.reviews/org.eclipse.mylyn.reviews.tests/src/org/eclipse/mylyn/reviews/tests/ui/ReviewCompareAnnotationSupportTest.java:[118] 
	assertSide(Direction.BACKWARDS, 20, 25, 10, RIGHT_SIDE);
	                                            ^^^^^^^^^^
Discouraged access: The field 'ReviewCompareAnnotationSupport.Side.RIGHT_SIDE' is not API (restriction on classpath entry '/jobs/genie.mylyn/mylyn-test-build/workspace/org.eclipse.mylyn.reviews/org.eclipse.mylyn.reviews.ui/target/classes')
[WARNING] /jobs/genie.mylyn/mylyn-test-build/workspace/org.eclipse.mylyn.reviews/org.eclipse.mylyn.reviews.tests/src/org/eclipse/mylyn/reviews/tests/ui/ReviewCompareAnnotationSupportTest.java:[124] 
	assertSide(Direction.BACKWARDS, 10, 0, 15, LEFT_SIDE);
	           ^^^^^^^^^^^^^^^^^^^
Discouraged access: The type 'Direction' is not API (restriction on classpath entry '/jobs/genie.mylyn/mylyn-test-build/workspace/org.eclipse.mylyn.reviews/org.eclipse.mylyn.reviews.ui/target/classes')
[WARNING] /jobs/genie.mylyn/mylyn-test-build/workspace/org.eclipse.mylyn.reviews/org.eclipse.mylyn.reviews.tests/src/org/eclipse/mylyn/reviews/tests/ui/ReviewCompareAnnotationSupportTest.java:[124] 
	assertSide(Direction.BACKWARDS, 10, 0, 15, LEFT_SIDE);
	                     ^^^^^^^^^
Discouraged access: The field 'Direction.BACKWARDS' is not API (restriction on classpath entry '/jobs/genie.mylyn/mylyn-test-build/workspace/org.eclipse.mylyn.reviews/org.eclipse.mylyn.reviews.ui/target/classes')
[WARNING] /jobs/genie.mylyn/mylyn-test-build/workspace/org.eclipse.mylyn.reviews/org.eclipse.mylyn.reviews.tests/src/org/eclipse/mylyn/reviews/tests/ui/ReviewCompareAnnotationSupportTest.java:[124] 
	assertSide(Direction.BACKWARDS, 10, 0, 15, LEFT_SIDE);
	                                           ^^^^^^^^^
Discouraged access: The field 'ReviewCompareAnnotationSupport.Side.LEFT_SIDE' is not API (restriction on classpath entry '/jobs/genie.mylyn/mylyn-test-build/workspace/org.eclipse.mylyn.reviews/org.eclipse.mylyn.reviews.ui/target/classes')
[WARNING] /jobs/genie.mylyn/mylyn-test-build/workspace/org.eclipse.mylyn.reviews/org.eclipse.mylyn.reviews.tests/src/org/eclipse/mylyn/reviews/tests/ui/ReviewCompareAnnotationSupportTest.java:[130] 
	assertSide(Direction.BACKWARDS, 5, 8, 10, RIGHT_SIDE);
	           ^^^^^^^^^^^^^^^^^^^
Discouraged access: The type 'Direction' is not API (restriction on classpath entry '/jobs/genie.mylyn/mylyn-test-build/workspace/org.eclipse.mylyn.reviews/org.eclipse.mylyn.reviews.ui/target/classes')
[WARNING] /jobs/genie.mylyn/mylyn-test-build/workspace/org.eclipse.mylyn.reviews/org.eclipse.mylyn.reviews.tests/src/org/eclipse/mylyn/reviews/tests/ui/ReviewCompareAnnotationSupportTest.java:[130] 
	assertSide(Direction.BACKWARDS, 5, 8, 10, RIGHT_SIDE);
	                     ^^^^^^^^^
Discouraged access: The field 'Direction.BACKWARDS' is not API (restriction on classpath entry '/jobs/genie.mylyn/mylyn-test-build/workspace/org.eclipse.mylyn.reviews/org.eclipse.mylyn.reviews.ui/target/classes')
[WARNING] /jobs/genie.mylyn/mylyn-test-build/workspace/org.eclipse.mylyn.reviews/org.eclipse.mylyn.reviews.tests/src/org/eclipse/mylyn/reviews/tests/ui/ReviewCompareAnnotationSupportTest.java:[130] 
	assertSide(Direction.BACKWARDS, 5, 8, 10, RIGHT_SIDE);
	                                          ^^^^^^^^^^
Discouraged access: The field 'ReviewCompareAnnotationSupport.Side.RIGHT_SIDE' is not API (restriction on classpath entry '/jobs/genie.mylyn/mylyn-test-build/workspace/org.eclipse.mylyn.reviews/org.eclipse.mylyn.reviews.ui/target/classes')
[WARNING] /jobs/genie.mylyn/mylyn-test-build/workspace/org.eclipse.mylyn.reviews/org.eclipse.mylyn.reviews.tests/src/org/eclipse/mylyn/reviews/tests/ui/ReviewCompareAnnotationSupportTest.java:[136] 
	assertSide(Direction.BACKWARDS, 10, 0, 1, RIGHT_SIDE);
	           ^^^^^^^^^^^^^^^^^^^
Discouraged access: The type 'Direction' is not API (restriction on classpath entry '/jobs/genie.mylyn/mylyn-test-build/workspace/org.eclipse.mylyn.reviews/org.eclipse.mylyn.reviews.ui/target/classes')
[WARNING] /jobs/genie.mylyn/mylyn-test-build/workspace/org.eclipse.mylyn.reviews/org.eclipse.mylyn.reviews.tests/src/org/eclipse/mylyn/reviews/tests/ui/ReviewCompareAnnotationSupportTest.java:[136] 
	assertSide(Direction.BACKWARDS, 10, 0, 1, RIGHT_SIDE);
	                     ^^^^^^^^^
Discouraged access: The field 'Direction.BACKWARDS' is not API (restriction on classpath entry '/jobs/genie.mylyn/mylyn-test-build/workspace/org.eclipse.mylyn.reviews/org.eclipse.mylyn.reviews.ui/target/classes')
[WARNING] /jobs/genie.mylyn/mylyn-test-build/workspace/org.eclipse.mylyn.reviews/org.eclipse.mylyn.reviews.tests/src/org/eclipse/mylyn/reviews/tests/ui/ReviewCompareAnnotationSupportTest.java:[136] 
	assertSide(Direction.BACKWARDS, 10, 0, 1, RIGHT_SIDE);
	                                          ^^^^^^^^^^
Discouraged access: The field 'ReviewCompareAnnotationSupport.Side.RIGHT_SIDE' is not API (restriction on classpath entry '/jobs/genie.mylyn/mylyn-test-build/workspace/org.eclipse.mylyn.reviews/org.eclipse.mylyn.reviews.ui/target/classes')
[WARNING] /jobs/genie.mylyn/mylyn-test-build/workspace/org.eclipse.mylyn.reviews/org.eclipse.mylyn.reviews.tests/src/org/eclipse/mylyn/reviews/tests/ui/ReviewCompareAnnotationSupportTest.java:[142] 
	assertSide(Direction.BACKWARDS, 5, 15, 10, LEFT_SIDE);
	           ^^^^^^^^^^^^^^^^^^^
Discouraged access: The type 'Direction' is not API (restriction on classpath entry '/jobs/genie.mylyn/mylyn-test-build/workspace/org.eclipse.mylyn.reviews/org.eclipse.mylyn.reviews.ui/target/classes')
[WARNING] /jobs/genie.mylyn/mylyn-test-build/workspace/org.eclipse.mylyn.reviews/org.eclipse.mylyn.reviews.tests/src/org/eclipse/mylyn/reviews/tests/ui/ReviewCompareAnnotationSupportTest.java:[142] 
	assertSide(Direction.BACKWARDS, 5, 15, 10, LEFT_SIDE);
	                     ^^^^^^^^^
Discouraged access: The field 'Direction.BACKWARDS' is not API (restriction on classpath entry '/jobs/genie.mylyn/mylyn-test-build/workspace/org.eclipse.mylyn.reviews/org.eclipse.mylyn.reviews.ui/target/classes')
[WARNING] /jobs/genie.mylyn/mylyn-test-build/workspace/org.eclipse.mylyn.reviews/org.eclipse.mylyn.reviews.tests/src/org/eclipse/mylyn/reviews/tests/ui/ReviewCompareAnnotationSupportTest.java:[142] 
	assertSide(Direction.BACKWARDS, 5, 15, 10, LEFT_SIDE);
	                                           ^^^^^^^^^
Discouraged access: The field 'ReviewCompareAnnotationSupport.Side.LEFT_SIDE' is not API (restriction on classpath entry '/jobs/genie.mylyn/mylyn-test-build/workspace/org.eclipse.mylyn.reviews/org.eclipse.mylyn.reviews.ui/target/classes')
[WARNING] /jobs/genie.mylyn/mylyn-test-build/workspace/org.eclipse.mylyn.reviews/org.eclipse.mylyn.reviews.tests/src/org/eclipse/mylyn/reviews/tests/ui/ReviewCompareAnnotationSupportTest.java:[148] 
	assertSide(Direction.BACKWARDS, 10, 0, 10, RIGHT_SIDE);
	           ^^^^^^^^^^^^^^^^^^^
Discouraged access: The type 'Direction' is not API (restriction on classpath entry '/jobs/genie.mylyn/mylyn-test-build/workspace/org.eclipse.mylyn.reviews/org.eclipse.mylyn.reviews.ui/target/classes')
[WARNING] /jobs/genie.mylyn/mylyn-test-build/workspace/org.eclipse.mylyn.reviews/org.eclipse.mylyn.reviews.tests/src/org/eclipse/mylyn/reviews/tests/ui/ReviewCompareAnnotationSupportTest.java:[148] 
	assertSide(Direction.BACKWARDS, 10, 0, 10, RIGHT_SIDE);
	                     ^^^^^^^^^
Discouraged access: The field 'Direction.BACKWARDS' is not API (restriction on classpath entry '/jobs/genie.mylyn/mylyn-test-build/workspace/org.eclipse.mylyn.reviews/org.eclipse.mylyn.reviews.ui/target/classes')
[WARNING] /jobs/genie.mylyn/mylyn-test-build/workspace/org.eclipse.mylyn.reviews/org.eclipse.mylyn.reviews.tests/src/org/eclipse/mylyn/reviews/tests/ui/ReviewCompareAnnotationSupportTest.java:[148] 
	assertSide(Direction.BACKWARDS, 10, 0, 10, RIGHT_SIDE);
	                                           ^^^^^^^^^^
Discouraged access: The field 'ReviewCompareAnnotationSupport.Side.RIGHT_SIDE' is not API (restriction on classpath entry '/jobs/genie.mylyn/mylyn-test-build/workspace/org.eclipse.mylyn.reviews/org.eclipse.mylyn.reviews.ui/target/classes')
[WARNING] /jobs/genie.mylyn/mylyn-test-build/workspace/org.eclipse.mylyn.reviews/org.eclipse.mylyn.reviews.tests/src/org/eclipse/mylyn/reviews/tests/ui/ReviewCompareAnnotationSupportTest.java:[154] 
	assertSide(Direction.BACKWARDS, 10, 0, 0, LEFT_SIDE);
	           ^^^^^^^^^^^^^^^^^^^
Discouraged access: The type 'Direction' is not API (restriction on classpath entry '/jobs/genie.mylyn/mylyn-test-build/workspace/org.eclipse.mylyn.reviews/org.eclipse.mylyn.reviews.ui/target/classes')
[WARNING] /jobs/genie.mylyn/mylyn-test-build/workspace/org.eclipse.mylyn.reviews/org.eclipse.mylyn.reviews.tests/src/org/eclipse/mylyn/reviews/tests/ui/ReviewCompareAnnotationSupportTest.java:[154] 
	assertSide(Direction.BACKWARDS, 10, 0, 0, LEFT_SIDE);
	                     ^^^^^^^^^
Discouraged access: The field 'Direction.BACKWARDS' is not API (restriction on classpath entry '/jobs/genie.mylyn/mylyn-test-build/workspace/org.eclipse.mylyn.reviews/org.eclipse.mylyn.reviews.ui/target/classes')
[WARNING] /jobs/genie.mylyn/mylyn-test-build/workspace/org.eclipse.mylyn.reviews/org.eclipse.mylyn.reviews.tests/src/org/eclipse/mylyn/reviews/tests/ui/ReviewCompareAnnotationSupportTest.java:[154] 
	assertSide(Direction.BACKWARDS, 10, 0, 0, LEFT_SIDE);
	                                          ^^^^^^^^^
Discouraged access: The field 'ReviewCompareAnnotationSupport.Side.LEFT_SIDE' is not API (restriction on classpath entry '/jobs/genie.mylyn/mylyn-test-build/workspace/org.eclipse.mylyn.reviews/org.eclipse.mylyn.reviews.ui/target/classes')
[WARNING] /jobs/genie.mylyn/mylyn-test-build/workspace/org.eclipse.mylyn.reviews/org.eclipse.mylyn.reviews.tests/src/org/eclipse/mylyn/reviews/tests/ui/ReviewCompareAnnotationSupportTest.java:[160] 
	assertSide(Direction.BACKWARDS, 0, 10, 0, RIGHT_SIDE);
	           ^^^^^^^^^^^^^^^^^^^
Discouraged access: The type 'Direction' is not API (restriction on classpath entry '/jobs/genie.mylyn/mylyn-test-build/workspace/org.eclipse.mylyn.reviews/org.eclipse.mylyn.reviews.ui/target/classes')
[WARNING] /jobs/genie.mylyn/mylyn-test-build/workspace/org.eclipse.mylyn.reviews/org.eclipse.mylyn.reviews.tests/src/org/eclipse/mylyn/reviews/tests/ui/ReviewCompareAnnotationSupportTest.java:[160] 
	assertSide(Direction.BACKWARDS, 0, 10, 0, RIGHT_SIDE);
	                     ^^^^^^^^^
Discouraged access: The field 'Direction.BACKWARDS' is not API (restriction on classpath entry '/jobs/genie.mylyn/mylyn-test-build/workspace/org.eclipse.mylyn.reviews/org.eclipse.mylyn.reviews.ui/target/classes')
[WARNING] /jobs/genie.mylyn/mylyn-test-build/workspace/org.eclipse.mylyn.reviews/org.eclipse.mylyn.reviews.tests/src/org/eclipse/mylyn/reviews/tests/ui/ReviewCompareAnnotationSupportTest.java:[160] 
	assertSide(Direction.BACKWARDS, 0, 10, 0, RIGHT_SIDE);
	                                          ^^^^^^^^^^
Discouraged access: The field 'ReviewCompareAnnotationSupport.Side.RIGHT_SIDE' is not API (restriction on classpath entry '/jobs/genie.mylyn/mylyn-test-build/workspace/org.eclipse.mylyn.reviews/org.eclipse.mylyn.reviews.ui/target/classes')
[WARNING] /jobs/genie.mylyn/mylyn-test-build/workspace/org.eclipse.mylyn.reviews/org.eclipse.mylyn.reviews.tests/src/org/eclipse/mylyn/reviews/tests/ui/ReviewCompareAnnotationSupportTest.java:[166] 
	assertSide(Direction.BACKWARDS, 0, 10, 10, LEFT_SIDE);
	           ^^^^^^^^^^^^^^^^^^^
Discouraged access: The type 'Direction' is not API (restriction on classpath entry '/jobs/genie.mylyn/mylyn-test-build/workspace/org.eclipse.mylyn.reviews/org.eclipse.mylyn.reviews.ui/target/classes')
[WARNING] /jobs/genie.mylyn/mylyn-test-build/workspace/org.eclipse.mylyn.reviews/org.eclipse.mylyn.reviews.tests/src/org/eclipse/mylyn/reviews/tests/ui/ReviewCompareAnnotationSupportTest.java:[166] 
	assertSide(Direction.BACKWARDS, 0, 10, 10, LEFT_SIDE);
	                     ^^^^^^^^^
Discouraged access: The field 'Direction.BACKWARDS' is not API (restriction on classpath entry '/jobs/genie.mylyn/mylyn-test-build/workspace/org.eclipse.mylyn.reviews/org.eclipse.mylyn.reviews.ui/target/classes')
[WARNING] /jobs/genie.mylyn/mylyn-test-build/workspace/org.eclipse.mylyn.reviews/org.eclipse.mylyn.reviews.tests/src/org/eclipse/mylyn/reviews/tests/ui/ReviewCompareAnnotationSupportTest.java:[166] 
	assertSide(Direction.BACKWARDS, 0, 10, 10, LEFT_SIDE);
	                                           ^^^^^^^^^
Discouraged access: The field 'ReviewCompareAnnotationSupport.Side.LEFT_SIDE' is not API (restriction on classpath entry '/jobs/genie.mylyn/mylyn-test-build/workspace/org.eclipse.mylyn.reviews/org.eclipse.mylyn.reviews.ui/target/classes')
[WARNING] /jobs/genie.mylyn/mylyn-test-build/workspace/org.eclipse.mylyn.reviews/org.eclipse.mylyn.reviews.tests/src/org/eclipse/mylyn/reviews/tests/ui/ReviewCompareAnnotationSupportTest.java:[169] 
	private void assertSide(Direction direction, int left, int right, int currentLeftOffset, Side expectedSide) {
	                        ^^^^^^^^^
Discouraged access: The type 'Direction' is not API (restriction on classpath entry '/jobs/genie.mylyn/mylyn-test-build/workspace/org.eclipse.mylyn.reviews/org.eclipse.mylyn.reviews.ui/target/classes')
[WARNING] /jobs/genie.mylyn/mylyn-test-build/workspace/org.eclipse.mylyn.reviews/org.eclipse.mylyn.reviews.tests/src/org/eclipse/mylyn/reviews/tests/ui/ReviewCompareAnnotationSupportTest.java:[169] 
	private void assertSide(Direction direction, int left, int right, int currentLeftOffset, Side expectedSide) {
	                                                                                         ^^^^
Discouraged access: The type 'ReviewCompareAnnotationSupport.Side' is not API (restriction on classpath entry '/jobs/genie.mylyn/mylyn-test-build/workspace/org.eclipse.mylyn.reviews/org.eclipse.mylyn.reviews.ui/target/classes')
[WARNING] /jobs/genie.mylyn/mylyn-test-build/workspace/org.eclipse.mylyn.reviews/org.eclipse.mylyn.reviews.tests/src/org/eclipse/mylyn/reviews/tests/ui/ReviewCompareAnnotationSupportTest.java:[172] 
	Side side = rcaSupportspy.calculateNextAnnotation(direction, nextLeftPosition, nextRightPosition,
	^^^^
Discouraged access: The type 'ReviewCompareAnnotationSupport.Side' is not API (restriction on classpath entry '/jobs/genie.mylyn/mylyn-test-build/workspace/org.eclipse.mylyn.reviews/org.eclipse.mylyn.reviews.ui/target/classes')
[WARNING] /jobs/genie.mylyn/mylyn-test-build/workspace/org.eclipse.mylyn.reviews/org.eclipse.mylyn.reviews.tests/src/org/eclipse/mylyn/reviews/tests/ui/ReviewCompareAnnotationSupportTest.java:[172] 
	Side side = rcaSupportspy.calculateNextAnnotation(direction, nextLeftPosition, nextRightPosition,
				currentLeftOffset);
	            ^^^^^^^^^^^^^^^^^^^^^^^^^^^^^^^^^^^^^^^^^^^^^^^^^^^^^^^^^^^^^^^^^^^^^^^^^^^^^^^^^^^^^^^^^^^^^^^^^^^^^^^^^^^^
Discouraged access: The method 'ReviewCompareAnnotationSupport.calculateNextAnnotation(Direction, Position, Position, Integer)' is not API (restriction on classpath entry '/jobs/genie.mylyn/mylyn-test-build/workspace/org.eclipse.mylyn.reviews/org.eclipse.mylyn.reviews.ui/target/classes')
[WARNING] /jobs/genie.mylyn/mylyn-test-build/workspace/org.eclipse.mylyn.reviews/org.eclipse.mylyn.reviews.tests/src/org/eclipse/mylyn/reviews/tests/ui/ReviewColumnLabelProviderTest.java:[18] 
	import org.eclipse.mylyn.internal.reviews.ui.ReviewColumnLabelProvider;
	       ^^^^^^^^^^^^^^^^^^^^^^^^^^^^^^^^^^^^^^^^^^^^^^^^^^^^^^^^^^^^^^^
Discouraged access: The type 'ReviewColumnLabelProvider' is not API (restriction on classpath entry '/jobs/genie.mylyn/mylyn-test-build/workspace/org.eclipse.mylyn.reviews/org.eclipse.mylyn.reviews.ui/target/classes')
[WARNING] /jobs/genie.mylyn/mylyn-test-build/workspace/org.eclipse.mylyn.reviews/org.eclipse.mylyn.reviews.tests/src/org/eclipse/mylyn/reviews/tests/ui/ReviewColumnLabelProviderTest.java:[19] 
	import org.eclipse.mylyn.internal.reviews.ui.editors.parts.TaskReview;
	       ^^^^^^^^^^^^^^^^^^^^^^^^^^^^^^^^^^^^^^^^^^^^^^^^^^^^^^^^^^^^^^
Discouraged access: The type 'TaskReview' is not API (restriction on classpath entry '/jobs/genie.mylyn/mylyn-test-build/workspace/org.eclipse.mylyn.reviews/org.eclipse.mylyn.reviews.ui/target/classes')
[WARNING] /jobs/genie.mylyn/mylyn-test-build/workspace/org.eclipse.mylyn.reviews/org.eclipse.mylyn.reviews.tests/src/org/eclipse/mylyn/reviews/tests/ui/ReviewColumnLabelProviderTest.java:[20] 
	import org.eclipse.mylyn.internal.tasks.core.TaskTask;
	       ^^^^^^^^^^^^^^^^^^^^^^^^^^^^^^^^^^^^^^^^^^^^^^
Discouraged access: The type 'TaskTask' is not API (restriction on classpath entry '/jobs/genie.mylyn/mylyn-test-build/workspace/org.eclipse.mylyn.tasks/org.eclipse.mylyn.tasks.core/target/classes')
[WARNING] /jobs/genie.mylyn/mylyn-test-build/workspace/org.eclipse.mylyn.reviews/org.eclipse.mylyn.reviews.tests/src/org/eclipse/mylyn/reviews/tests/ui/ReviewColumnLabelProviderTest.java:[33] 
	TaskReview myTaskReview1, myTaskReview2;
	^^^^^^^^^^
Discouraged access: The type 'TaskReview' is not API (restriction on classpath entry '/jobs/genie.mylyn/mylyn-test-build/workspace/org.eclipse.mylyn.reviews/org.eclipse.mylyn.reviews.ui/target/classes')
[WARNING] /jobs/genie.mylyn/mylyn-test-build/workspace/org.eclipse.mylyn.reviews/org.eclipse.mylyn.reviews.tests/src/org/eclipse/mylyn/reviews/tests/ui/ReviewColumnLabelProviderTest.java:[35] 
	ReviewColumnLabelProvider myLabelProvider;
	^^^^^^^^^^^^^^^^^^^^^^^^^
Discouraged access: The type 'ReviewColumnLabelProvider' is not API (restriction on classpath entry '/jobs/genie.mylyn/mylyn-test-build/workspace/org.eclipse.mylyn.reviews/org.eclipse.mylyn.reviews.ui/target/classes')
[WARNING] /jobs/genie.mylyn/mylyn-test-build/workspace/org.eclipse.mylyn.reviews/org.eclipse.mylyn.reviews.tests/src/org/eclipse/mylyn/reviews/tests/ui/ReviewColumnLabelProviderTest.java:[39] 
	mockTask1 = new TaskTask("mock", "http://mock", "taskID");
	            ^^^^^^^^^^^^^^^^^^^^^^^^^^^^^^^^^^^^^^^^^^^^^
Discouraged access: The constructor 'TaskTask(String, String, String)' is not API (restriction on classpath entry '/jobs/genie.mylyn/mylyn-test-build/workspace/org.eclipse.mylyn.tasks/org.eclipse.mylyn.tasks.core/target/classes')
[WARNING] /jobs/genie.mylyn/mylyn-test-build/workspace/org.eclipse.mylyn.reviews/org.eclipse.mylyn.reviews.tests/src/org/eclipse/mylyn/reviews/tests/ui/ReviewColumnLabelProviderTest.java:[39] 
	mockTask1 = new TaskTask("mock", "http://mock", "taskID");
	                ^^^^^^^^
Discouraged access: The type 'TaskTask' is not API (restriction on classpath entry '/jobs/genie.mylyn/mylyn-test-build/workspace/org.eclipse.mylyn.tasks/org.eclipse.mylyn.tasks.core/target/classes')
[WARNING] /jobs/genie.mylyn/mylyn-test-build/workspace/org.eclipse.mylyn.reviews/org.eclipse.mylyn.reviews.tests/src/org/eclipse/mylyn/reviews/tests/ui/ReviewColumnLabelProviderTest.java:[45] 
	myTaskReview1 = new TaskReview(mockTask1);
	                ^^^^^^^^^^^^^^^^^^^^^^^^^
Discouraged access: The constructor 'TaskReview(ITask)' is not API (restriction on classpath entry '/jobs/genie.mylyn/mylyn-test-build/workspace/org.eclipse.mylyn.reviews/org.eclipse.mylyn.reviews.ui/target/classes')
[WARNING] /jobs/genie.mylyn/mylyn-test-build/workspace/org.eclipse.mylyn.reviews/org.eclipse.mylyn.reviews.tests/src/org/eclipse/mylyn/reviews/tests/ui/ReviewColumnLabelProviderTest.java:[45] 
	myTaskReview1 = new TaskReview(mockTask1);
	                    ^^^^^^^^^^
Discouraged access: The type 'TaskReview' is not API (restriction on classpath entry '/jobs/genie.mylyn/mylyn-test-build/workspace/org.eclipse.mylyn.reviews/org.eclipse.mylyn.reviews.ui/target/classes')
[WARNING] /jobs/genie.mylyn/mylyn-test-build/workspace/org.eclipse.mylyn.reviews/org.eclipse.mylyn.reviews.tests/src/org/eclipse/mylyn/reviews/tests/ui/ReviewColumnLabelProviderTest.java:[47] 
	mockTask2 = new TaskTask("mock", "http://mock", "taskID");
	            ^^^^^^^^^^^^^^^^^^^^^^^^^^^^^^^^^^^^^^^^^^^^^
Discouraged access: The constructor 'TaskTask(String, String, String)' is not API (restriction on classpath entry '/jobs/genie.mylyn/mylyn-test-build/workspace/org.eclipse.mylyn.tasks/org.eclipse.mylyn.tasks.core/target/classes')
[WARNING] /jobs/genie.mylyn/mylyn-test-build/workspace/org.eclipse.mylyn.reviews/org.eclipse.mylyn.reviews.tests/src/org/eclipse/mylyn/reviews/tests/ui/ReviewColumnLabelProviderTest.java:[47] 
	mockTask2 = new TaskTask("mock", "http://mock", "taskID");
	                ^^^^^^^^
Discouraged access: The type 'TaskTask' is not API (restriction on classpath entry '/jobs/genie.mylyn/mylyn-test-build/workspace/org.eclipse.mylyn.tasks/org.eclipse.mylyn.tasks.core/target/classes')
[WARNING] /jobs/genie.mylyn/mylyn-test-build/workspace/org.eclipse.mylyn.reviews/org.eclipse.mylyn.reviews.tests/src/org/eclipse/mylyn/reviews/tests/ui/ReviewColumnLabelProviderTest.java:[54] 
	myTaskReview2 = new TaskReview(mockTask2);
	                ^^^^^^^^^^^^^^^^^^^^^^^^^
Discouraged access: The constructor 'TaskReview(ITask)' is not API (restriction on classpath entry '/jobs/genie.mylyn/mylyn-test-build/workspace/org.eclipse.mylyn.reviews/org.eclipse.mylyn.reviews.ui/target/classes')
[WARNING] /jobs/genie.mylyn/mylyn-test-build/workspace/org.eclipse.mylyn.reviews/org.eclipse.mylyn.reviews.tests/src/org/eclipse/mylyn/reviews/tests/ui/ReviewColumnLabelProviderTest.java:[54] 
	myTaskReview2 = new TaskReview(mockTask2);
	                    ^^^^^^^^^^
Discouraged access: The type 'TaskReview' is not API (restriction on classpath entry '/jobs/genie.mylyn/mylyn-test-build/workspace/org.eclipse.mylyn.reviews/org.eclipse.mylyn.reviews.ui/target/classes')
[WARNING] /jobs/genie.mylyn/mylyn-test-build/workspace/org.eclipse.mylyn.reviews/org.eclipse.mylyn.reviews.tests/src/org/eclipse/mylyn/reviews/tests/ui/ReviewColumnLabelProviderTest.java:[56] 
	myLabelProvider = new ReviewColumnLabelProvider();
	                  ^^^^^^^^^^^^^^^^^^^^^^^^^^^^^^^
Discouraged access: The constructor 'ReviewColumnLabelProvider()' is not API (restriction on classpath entry '/jobs/genie.mylyn/mylyn-test-build/workspace/org.eclipse.mylyn.reviews/org.eclipse.mylyn.reviews.ui/target/classes')
[WARNING] /jobs/genie.mylyn/mylyn-test-build/workspace/org.eclipse.mylyn.reviews/org.eclipse.mylyn.reviews.tests/src/org/eclipse/mylyn/reviews/tests/ui/ReviewColumnLabelProviderTest.java:[56] 
	myLabelProvider = new ReviewColumnLabelProvider();
	                      ^^^^^^^^^^^^^^^^^^^^^^^^^
Discouraged access: The type 'ReviewColumnLabelProvider' is not API (restriction on classpath entry '/jobs/genie.mylyn/mylyn-test-build/workspace/org.eclipse.mylyn.reviews/org.eclipse.mylyn.reviews.ui/target/classes')
[WARNING] /jobs/genie.mylyn/mylyn-test-build/workspace/org.eclipse.mylyn.reviews/org.eclipse.mylyn.reviews.tests/src/org/eclipse/mylyn/reviews/tests/ui/ReviewColumnLabelProviderTest.java:[63] 
	assertNotNull(myLabelProvider.getColumnImage(myTaskReview1, 0));
	              ^^^^^^^^^^^^^^^^^^^^^^^^^^^^^^^^^^^^^^^^^^^^^^^^
Discouraged access: The method 'ReviewColumnLabelProvider.getColumnImage(Object, int)' is not API (restriction on classpath entry '/jobs/genie.mylyn/mylyn-test-build/workspace/org.eclipse.mylyn.reviews/org.eclipse.mylyn.reviews.ui/target/classes')
[WARNING] /jobs/genie.mylyn/mylyn-test-build/workspace/org.eclipse.mylyn.reviews/org.eclipse.mylyn.reviews.tests/src/org/eclipse/mylyn/reviews/tests/ui/ReviewColumnLabelProviderTest.java:[64] 
	assertNotNull(myLabelProvider.getColumnImage(myTaskReview1, 1));
	              ^^^^^^^^^^^^^^^^^^^^^^^^^^^^^^^^^^^^^^^^^^^^^^^^
Discouraged access: The method 'ReviewColumnLabelProvider.getColumnImage(Object, int)' is not API (restriction on classpath entry '/jobs/genie.mylyn/mylyn-test-build/workspace/org.eclipse.mylyn.reviews/org.eclipse.mylyn.reviews.ui/target/classes')
[WARNING] /jobs/genie.mylyn/mylyn-test-build/workspace/org.eclipse.mylyn.reviews/org.eclipse.mylyn.reviews.tests/src/org/eclipse/mylyn/reviews/tests/ui/ReviewColumnLabelProviderTest.java:[65] 
	assertNotNull(myLabelProvider.getColumnImage(myTaskReview1, 2));
	              ^^^^^^^^^^^^^^^^^^^^^^^^^^^^^^^^^^^^^^^^^^^^^^^^
Discouraged access: The method 'ReviewColumnLabelProvider.getColumnImage(Object, int)' is not API (restriction on classpath entry '/jobs/genie.mylyn/mylyn-test-build/workspace/org.eclipse.mylyn.reviews/org.eclipse.mylyn.reviews.ui/target/classes')
[WARNING] /jobs/genie.mylyn/mylyn-test-build/workspace/org.eclipse.mylyn.reviews/org.eclipse.mylyn.reviews.tests/src/org/eclipse/mylyn/reviews/tests/ui/ReviewColumnLabelProviderTest.java:[66] 
	assertNotNull(myLabelProvider.getColumnImage(myTaskReview1, 3));
	              ^^^^^^^^^^^^^^^^^^^^^^^^^^^^^^^^^^^^^^^^^^^^^^^^
Discouraged access: The method 'ReviewColumnLabelProvider.getColumnImage(Object, int)' is not API (restriction on classpath entry '/jobs/genie.mylyn/mylyn-test-build/workspace/org.eclipse.mylyn.reviews/org.eclipse.mylyn.reviews.ui/target/classes')
[WARNING] /jobs/genie.mylyn/mylyn-test-build/workspace/org.eclipse.mylyn.reviews/org.eclipse.mylyn.reviews.tests/src/org/eclipse/mylyn/reviews/tests/ui/ReviewColumnLabelProviderTest.java:[72] 
	assertEquals(summaryString, myTaskReview2.getSummary());
	                            ^^^^^^^^^^^^^^^^^^^^^^^^^^
Discouraged access: The method 'TaskReview.getSummary()' is not API (restriction on classpath entry '/jobs/genie.mylyn/mylyn-test-build/workspace/org.eclipse.mylyn.reviews/org.eclipse.mylyn.reviews.ui/target/classes')
[WARNING] /jobs/genie.mylyn/mylyn-test-build/workspace/org.eclipse.mylyn.reviews/org.eclipse.mylyn.reviews.tests/src/org/eclipse/mylyn/reviews/tests/ui/ReviewColumnLabelProviderTest.java:[74] 
	assertEquals(summaryString, myLabelProvider.getColumnText(myTaskReview2, 0));
	                            ^^^^^^^^^^^^^^^^^^^^^^^^^^^^^^^^^^^^^^^^^^^^^^^
Discouraged access: The method 'ReviewColumnLabelProvider.getColumnText(Object, int)' is not API (restriction on classpath entry '/jobs/genie.mylyn/mylyn-test-build/workspace/org.eclipse.mylyn.reviews/org.eclipse.mylyn.reviews.ui/target/classes')
[WARNING] /jobs/genie.mylyn/mylyn-test-build/workspace/org.eclipse.mylyn.reviews/org.eclipse.mylyn.reviews.tests/src/org/eclipse/mylyn/reviews/tests/ui/ReviewColumnLabelProviderTest.java:[75] 
	assertEquals(incomingString, myLabelProvider.getColumnText(myTaskReview2, 3));
	                             ^^^^^^^^^^^^^^^^^^^^^^^^^^^^^^^^^^^^^^^^^^^^^^^
Discouraged access: The method 'ReviewColumnLabelProvider.getColumnText(Object, int)' is not API (restriction on classpath entry '/jobs/genie.mylyn/mylyn-test-build/workspace/org.eclipse.mylyn.reviews/org.eclipse.mylyn.reviews.ui/target/classes')
[WARNING] /jobs/genie.mylyn/mylyn-test-build/workspace/org.eclipse.mylyn.reviews/org.eclipse.mylyn.reviews.tests/src/org/eclipse/mylyn/reviews/tests/ui/ReviewColumnLabelProviderTest.java:[78] 
	assertEquals("", myLabelProvider.getColumnText(myTaskReview2, 1));
	                 ^^^^^^^^^^^^^^^^^^^^^^^^^^^^^^^^^^^^^^^^^^^^^^^
Discouraged access: The method 'ReviewColumnLabelProvider.getColumnText(Object, int)' is not API (restriction on classpath entry '/jobs/genie.mylyn/mylyn-test-build/workspace/org.eclipse.mylyn.reviews/org.eclipse.mylyn.reviews.ui/target/classes')
[WARNING] /jobs/genie.mylyn/mylyn-test-build/workspace/org.eclipse.mylyn.reviews/org.eclipse.mylyn.reviews.tests/src/org/eclipse/mylyn/reviews/tests/ui/ReviewColumnLabelProviderTest.java:[79] 
	assertEquals("", myLabelProvider.getColumnText(myTaskReview2, 2));
	                 ^^^^^^^^^^^^^^^^^^^^^^^^^^^^^^^^^^^^^^^^^^^^^^^
Discouraged access: The method 'ReviewColumnLabelProvider.getColumnText(Object, int)' is not API (restriction on classpath entry '/jobs/genie.mylyn/mylyn-test-build/workspace/org.eclipse.mylyn.reviews/org.eclipse.mylyn.reviews.ui/target/classes')
[WARNING] /jobs/genie.mylyn/mylyn-test-build/workspace/org.eclipse.mylyn.reviews/org.eclipse.mylyn.reviews.tests/src/org/eclipse/mylyn/reviews/tests/ui/ReviewColumnLabelProviderTest.java:[82] 
	assertEquals("", myLabelProvider.getColumnText(myTaskReview2, 5));
	                 ^^^^^^^^^^^^^^^^^^^^^^^^^^^^^^^^^^^^^^^^^^^^^^^
Discouraged access: The method 'ReviewColumnLabelProvider.getColumnText(Object, int)' is not API (restriction on classpath entry '/jobs/genie.mylyn/mylyn-test-build/workspace/org.eclipse.mylyn.reviews/org.eclipse.mylyn.reviews.ui/target/classes')
[WARNING] /jobs/genie.mylyn/mylyn-test-build/workspace/org.eclipse.mylyn.reviews/org.eclipse.mylyn.reviews.tests/src/org/eclipse/mylyn/reviews/tests/ui/ReviewColumnLabelProviderTest.java:[83] 
	assertEquals("", myLabelProvider.getColumnText(myTaskReview2, 4));
	                 ^^^^^^^^^^^^^^^^^^^^^^^^^^^^^^^^^^^^^^^^^^^^^^^
Discouraged access: The method 'ReviewColumnLabelProvider.getColumnText(Object, int)' is not API (restriction on classpath entry '/jobs/genie.mylyn/mylyn-test-build/workspace/org.eclipse.mylyn.reviews/org.eclipse.mylyn.reviews.ui/target/classes')
[WARNING] /jobs/genie.mylyn/mylyn-test-build/workspace/org.eclipse.mylyn.reviews/org.eclipse.mylyn.reviews.tests/src/org/eclipse/mylyn/reviews/tests/ui/ReviewColumnLabelProviderTest.java:[90] 
	assertNotNull(myLabelProvider.getColumnImage(myTaskReview1, 0));
	              ^^^^^^^^^^^^^^^^^^^^^^^^^^^^^^^^^^^^^^^^^^^^^^^^
Discouraged access: The method 'ReviewColumnLabelProvider.getColumnImage(Object, int)' is not API (restriction on classpath entry '/jobs/genie.mylyn/mylyn-test-build/workspace/org.eclipse.mylyn.reviews/org.eclipse.mylyn.reviews.ui/target/classes')
[WARNING] /jobs/genie.mylyn/mylyn-test-build/workspace/org.eclipse.mylyn.reviews/org.eclipse.mylyn.reviews.tests/src/org/eclipse/mylyn/reviews/tests/ui/ReviewColumnLabelProviderTest.java:[91] 
	assertNotNull(myLabelProvider.getColumnImage(myTaskReview1, 1));
	              ^^^^^^^^^^^^^^^^^^^^^^^^^^^^^^^^^^^^^^^^^^^^^^^^
Discouraged access: The method 'ReviewColumnLabelProvider.getColumnImage(Object, int)' is not API (restriction on classpath entry '/jobs/genie.mylyn/mylyn-test-build/workspace/org.eclipse.mylyn.reviews/org.eclipse.mylyn.reviews.ui/target/classes')
[WARNING] /jobs/genie.mylyn/mylyn-test-build/workspace/org.eclipse.mylyn.reviews/org.eclipse.mylyn.reviews.tests/src/org/eclipse/mylyn/reviews/tests/ui/ReviewColumnLabelProviderTest.java:[92] 
	assertNotNull(myLabelProvider.getColumnImage(myTaskReview1, 2));
	              ^^^^^^^^^^^^^^^^^^^^^^^^^^^^^^^^^^^^^^^^^^^^^^^^
Discouraged access: The method 'ReviewColumnLabelProvider.getColumnImage(Object, int)' is not API (restriction on classpath entry '/jobs/genie.mylyn/mylyn-test-build/workspace/org.eclipse.mylyn.reviews/org.eclipse.mylyn.reviews.ui/target/classes')
[WARNING] /jobs/genie.mylyn/mylyn-test-build/workspace/org.eclipse.mylyn.reviews/org.eclipse.mylyn.reviews.tests/src/org/eclipse/mylyn/reviews/tests/ui/ReviewColumnLabelProviderTest.java:[93] 
	assertNotNull(myLabelProvider.getColumnImage(myTaskReview1, 3));
	              ^^^^^^^^^^^^^^^^^^^^^^^^^^^^^^^^^^^^^^^^^^^^^^^^
Discouraged access: The method 'ReviewColumnLabelProvider.getColumnImage(Object, int)' is not API (restriction on classpath entry '/jobs/genie.mylyn/mylyn-test-build/workspace/org.eclipse.mylyn.reviews/org.eclipse.mylyn.reviews.ui/target/classes')
[WARNING] /jobs/genie.mylyn/mylyn-test-build/workspace/org.eclipse.mylyn.reviews/org.eclipse.mylyn.reviews.tests/src/org/eclipse/mylyn/reviews/tests/ui/ReviewColumnLabelProviderTest.java:[96] 
	myLabelProvider.getColumnImage(myTaskReview1, 0));
	^^^^^^^^^^^^^^^^^^^^^^^^^^^^^^^^^^^^^^^^^^^^^^^^
Discouraged access: The method 'ReviewColumnLabelProvider.getColumnImage(Object, int)' is not API (restriction on classpath entry '/jobs/genie.mylyn/mylyn-test-build/workspace/org.eclipse.mylyn.reviews/org.eclipse.mylyn.reviews.ui/target/classes')
[WARNING] /jobs/genie.mylyn/mylyn-test-build/workspace/org.eclipse.mylyn.reviews/org.eclipse.mylyn.reviews.tests/src/org/eclipse/mylyn/reviews/tests/ui/ReviewColumnLabelProviderTest.java:[98] 
	myLabelProvider.getColumnImage(myTaskReview1, 0));
	^^^^^^^^^^^^^^^^^^^^^^^^^^^^^^^^^^^^^^^^^^^^^^^^
Discouraged access: The method 'ReviewColumnLabelProvider.getColumnImage(Object, int)' is not API (restriction on classpath entry '/jobs/genie.mylyn/mylyn-test-build/workspace/org.eclipse.mylyn.reviews/org.eclipse.mylyn.reviews.ui/target/classes')
[WARNING] /jobs/genie.mylyn/mylyn-test-build/workspace/org.eclipse.mylyn.reviews/org.eclipse.mylyn.reviews.tests/src/org/eclipse/mylyn/reviews/tests/ui/ReviewColumnLabelProviderTest.java:[100] 
	myLabelProvider.getColumnImage(myTaskReview1, 0));
	^^^^^^^^^^^^^^^^^^^^^^^^^^^^^^^^^^^^^^^^^^^^^^^^
Discouraged access: The method 'ReviewColumnLabelProvider.getColumnImage(Object, int)' is not API (restriction on classpath entry '/jobs/genie.mylyn/mylyn-test-build/workspace/org.eclipse.mylyn.reviews/org.eclipse.mylyn.reviews.ui/target/classes')
[WARNING] /jobs/genie.mylyn/mylyn-test-build/workspace/org.eclipse.mylyn.reviews/org.eclipse.mylyn.reviews.tests/src/org/eclipse/mylyn/reviews/tests/ui/ReviewColumnLabelProviderTest.java:[102] 
	myLabelProvider.getColumnImage(myTaskReview1, 0));
	^^^^^^^^^^^^^^^^^^^^^^^^^^^^^^^^^^^^^^^^^^^^^^^^
Discouraged access: The method 'ReviewColumnLabelProvider.getColumnImage(Object, int)' is not API (restriction on classpath entry '/jobs/genie.mylyn/mylyn-test-build/workspace/org.eclipse.mylyn.reviews/org.eclipse.mylyn.reviews.ui/target/classes')
[WARNING] /jobs/genie.mylyn/mylyn-test-build/workspace/org.eclipse.mylyn.reviews/org.eclipse.mylyn.reviews.tests/src/org/eclipse/mylyn/reviews/tests/ui/ReviewColumnLabelProviderTest.java:[109] 
	assertNotNull(myLabelProvider.getColumnImage(myTaskReview1, 0));
	              ^^^^^^^^^^^^^^^^^^^^^^^^^^^^^^^^^^^^^^^^^^^^^^^^
Discouraged access: The method 'ReviewColumnLabelProvider.getColumnImage(Object, int)' is not API (restriction on classpath entry '/jobs/genie.mylyn/mylyn-test-build/workspace/org.eclipse.mylyn.reviews/org.eclipse.mylyn.reviews.ui/target/classes')
[WARNING] /jobs/genie.mylyn/mylyn-test-build/workspace/org.eclipse.mylyn.reviews/org.eclipse.mylyn.reviews.tests/src/org/eclipse/mylyn/reviews/tests/ui/ReviewColumnLabelProviderTest.java:[110] 
	assertNotNull(myLabelProvider.getColumnImage(myTaskReview1, 1));
	              ^^^^^^^^^^^^^^^^^^^^^^^^^^^^^^^^^^^^^^^^^^^^^^^^
Discouraged access: The method 'ReviewColumnLabelProvider.getColumnImage(Object, int)' is not API (restriction on classpath entry '/jobs/genie.mylyn/mylyn-test-build/workspace/org.eclipse.mylyn.reviews/org.eclipse.mylyn.reviews.ui/target/classes')
[WARNING] /jobs/genie.mylyn/mylyn-test-build/workspace/org.eclipse.mylyn.reviews/org.eclipse.mylyn.reviews.tests/src/org/eclipse/mylyn/reviews/tests/ui/ReviewColumnLabelProviderTest.java:[111] 
	assertNotNull(myLabelProvider.getColumnImage(myTaskReview1, 2));
	              ^^^^^^^^^^^^^^^^^^^^^^^^^^^^^^^^^^^^^^^^^^^^^^^^
Discouraged access: The method 'ReviewColumnLabelProvider.getColumnImage(Object, int)' is not API (restriction on classpath entry '/jobs/genie.mylyn/mylyn-test-build/workspace/org.eclipse.mylyn.reviews/org.eclipse.mylyn.reviews.ui/target/classes')
[WARNING] /jobs/genie.mylyn/mylyn-test-build/workspace/org.eclipse.mylyn.reviews/org.eclipse.mylyn.reviews.tests/src/org/eclipse/mylyn/reviews/tests/ui/ReviewColumnLabelProviderTest.java:[112] 
	assertNotNull(myLabelProvider.getColumnImage(myTaskReview1, 3));
	              ^^^^^^^^^^^^^^^^^^^^^^^^^^^^^^^^^^^^^^^^^^^^^^^^
Discouraged access: The method 'ReviewColumnLabelProvider.getColumnImage(Object, int)' is not API (restriction on classpath entry '/jobs/genie.mylyn/mylyn-test-build/workspace/org.eclipse.mylyn.reviews/org.eclipse.mylyn.reviews.ui/target/classes')
[WARNING] /jobs/genie.mylyn/mylyn-test-build/workspace/org.eclipse.mylyn.reviews/org.eclipse.mylyn.reviews.tests/src/org/eclipse/mylyn/reviews/tests/ui/ReviewColumnLabelProviderTest.java:[115] 
	myLabelProvider.getColumnImage(myTaskReview1, 0));
	^^^^^^^^^^^^^^^^^^^^^^^^^^^^^^^^^^^^^^^^^^^^^^^^
Discouraged access: The method 'ReviewColumnLabelProvider.getColumnImage(Object, int)' is not API (restriction on classpath entry '/jobs/genie.mylyn/mylyn-test-build/workspace/org.eclipse.mylyn.reviews/org.eclipse.mylyn.reviews.ui/target/classes')
[WARNING] /jobs/genie.mylyn/mylyn-test-build/workspace/org.eclipse.mylyn.reviews/org.eclipse.mylyn.reviews.tests/src/org/eclipse/mylyn/reviews/tests/ui/ReviewColumnLabelProviderTest.java:[117] 
	myLabelProvider.getColumnImage(myTaskReview1, 0));
	^^^^^^^^^^^^^^^^^^^^^^^^^^^^^^^^^^^^^^^^^^^^^^^^
Discouraged access: The method 'ReviewColumnLabelProvider.getColumnImage(Object, int)' is not API (restriction on classpath entry '/jobs/genie.mylyn/mylyn-test-build/workspace/org.eclipse.mylyn.reviews/org.eclipse.mylyn.reviews.ui/target/classes')
[WARNING] /jobs/genie.mylyn/mylyn-test-build/workspace/org.eclipse.mylyn.reviews/org.eclipse.mylyn.reviews.tests/src/org/eclipse/mylyn/reviews/tests/ui/ReviewColumnLabelProviderTest.java:[119] 
	myLabelProvider.getColumnImage(myTaskReview1, 0));
	^^^^^^^^^^^^^^^^^^^^^^^^^^^^^^^^^^^^^^^^^^^^^^^^
Discouraged access: The method 'ReviewColumnLabelProvider.getColumnImage(Object, int)' is not API (restriction on classpath entry '/jobs/genie.mylyn/mylyn-test-build/workspace/org.eclipse.mylyn.reviews/org.eclipse.mylyn.reviews.ui/target/classes')
[WARNING] /jobs/genie.mylyn/mylyn-test-build/workspace/org.eclipse.mylyn.reviews/org.eclipse.mylyn.reviews.tests/src/org/eclipse/mylyn/reviews/tests/ui/ReviewColumnLabelProviderTest.java:[121] 
	myLabelProvider.getColumnImage(myTaskReview1, 0));
	^^^^^^^^^^^^^^^^^^^^^^^^^^^^^^^^^^^^^^^^^^^^^^^^
Discouraged access: The method 'ReviewColumnLabelProvider.getColumnImage(Object, int)' is not API (restriction on classpath entry '/jobs/genie.mylyn/mylyn-test-build/workspace/org.eclipse.mylyn.reviews/org.eclipse.mylyn.reviews.ui/target/classes')
[WARNING] /jobs/genie.mylyn/mylyn-test-build/workspace/org.eclipse.mylyn.reviews/org.eclipse.mylyn.reviews.tests/src/org/eclipse/mylyn/reviews/tests/ui/UiDataLocatorTest.java:[23] 
	import org.eclipse.mylyn.reviews.core.spi.remote.ReviewsDataLocator;
	       ^^^^^^^^^^^^^^^^^^^^^^^^^^^^^^^^^^^^^^^^^^^^^^^^^^^^^^^^^^^^
Discouraged access: The type 'ReviewsDataLocator' is not API (restriction on classpath entry '/jobs/genie.mylyn/mylyn-test-build/workspace/org.eclipse.mylyn.reviews/org.eclipse.mylyn.reviews.core/target/classes')
[WARNING] /jobs/genie.mylyn/mylyn-test-build/workspace/org.eclipse.mylyn.reviews/org.eclipse.mylyn.reviews.tests/src/org/eclipse/mylyn/reviews/tests/ui/UiDataLocatorTest.java:[24] 
	import org.eclipse.mylyn.reviews.ui.spi.factories.ReviewsUiDataLocator;
	       ^^^^^^^^^^^^^^^^^^^^^^^^^^^^^^^^^^^^^^^^^^^^^^^^^^^^^^^^^^^^^^^
Discouraged access: The type 'ReviewsUiDataLocator' is not API (restriction on classpath entry '/jobs/genie.mylyn/mylyn-test-build/workspace/org.eclipse.mylyn.reviews/org.eclipse.mylyn.reviews.ui/target/classes')
[WARNING] /jobs/genie.mylyn/mylyn-test-build/workspace/org.eclipse.mylyn.reviews/org.eclipse.mylyn.reviews.tests/src/org/eclipse/mylyn/reviews/tests/ui/UiDataLocatorTest.java:[34] 
	ReviewsDataLocator locator = new ReviewsUiDataLocator();
	^^^^^^^^^^^^^^^^^^
Discouraged access: The type 'ReviewsDataLocator' is not API (restriction on classpath entry '/jobs/genie.mylyn/mylyn-test-build/workspace/org.eclipse.mylyn.reviews/org.eclipse.mylyn.reviews.core/target/classes')
[WARNING] /jobs/genie.mylyn/mylyn-test-build/workspace/org.eclipse.mylyn.reviews/org.eclipse.mylyn.reviews.tests/src/org/eclipse/mylyn/reviews/tests/ui/UiDataLocatorTest.java:[34] 
	ReviewsDataLocator locator = new ReviewsUiDataLocator();
	                             ^^^^^^^^^^^^^^^^^^^^^^^^^^
Discouraged access: The constructor 'ReviewsUiDataLocator()' is not API (restriction on classpath entry '/jobs/genie.mylyn/mylyn-test-build/workspace/org.eclipse.mylyn.reviews/org.eclipse.mylyn.reviews.ui/target/classes')
[WARNING] /jobs/genie.mylyn/mylyn-test-build/workspace/org.eclipse.mylyn.reviews/org.eclipse.mylyn.reviews.tests/src/org/eclipse/mylyn/reviews/tests/ui/UiDataLocatorTest.java:[34] 
	ReviewsDataLocator locator = new ReviewsUiDataLocator();
	                                 ^^^^^^^^^^^^^^^^^^^^
Discouraged access: The type 'ReviewsUiDataLocator' is not API (restriction on classpath entry '/jobs/genie.mylyn/mylyn-test-build/workspace/org.eclipse.mylyn.reviews/org.eclipse.mylyn.reviews.ui/target/classes')
[WARNING] /jobs/genie.mylyn/mylyn-test-build/workspace/org.eclipse.mylyn.reviews/org.eclipse.mylyn.reviews.tests/src/org/eclipse/mylyn/reviews/tests/ui/UiDataLocatorTest.java:[38] 
	IPath fileLocation = locator.getFilePath("", "Class", "MyFile", "txt"); //$NON-NLS-1$ //$NON-NLS-2$ //$NON-NLS-3$ //$NON-NLS-4$
	                     ^^^^^^^^^^^^^^^^^^^^^^^^^^^^^^^^^^^^^^^^^^^^^^^^^
Discouraged access: The method 'AbstractDataLocator.getFilePath(String, String, String, String)' is not API (restriction on classpath entry '/jobs/genie.mylyn/mylyn-test-build/workspace/org.eclipse.mylyn.reviews/org.eclipse.mylyn.reviews.core/target/classes')
[WARNING] /jobs/genie.mylyn/mylyn-test-build/workspace/org.eclipse.mylyn.reviews/org.eclipse.mylyn.reviews.tests/src/org/eclipse/mylyn/reviews/tests/util/MockReviewBehavior.java:[16] 
	import org.eclipse.mylyn.reviews.core.model.IComment;
	       ^^^^^^^^^^^^^^^^^^^^^^^^^^^^^^^^^^^^^^^^^^^^^
Discouraged access: The type 'IComment' is not API (restriction on classpath entry '/jobs/genie.mylyn/mylyn-test-build/workspace/org.eclipse.mylyn.reviews/org.eclipse.mylyn.reviews.core/target/classes')
[WARNING] /jobs/genie.mylyn/mylyn-test-build/workspace/org.eclipse.mylyn.reviews/org.eclipse.mylyn.reviews.tests/src/org/eclipse/mylyn/reviews/tests/util/MockReviewBehavior.java:[17] 
	import org.eclipse.mylyn.reviews.core.model.IFileVersion;
	       ^^^^^^^^^^^^^^^^^^^^^^^^^^^^^^^^^^^^^^^^^^^^^^^^^
Discouraged access: The type 'IFileVersion' is not API (restriction on classpath entry '/jobs/genie.mylyn/mylyn-test-build/workspace/org.eclipse.mylyn.reviews/org.eclipse.mylyn.reviews.core/target/classes')
[WARNING] /jobs/genie.mylyn/mylyn-test-build/workspace/org.eclipse.mylyn.reviews/org.eclipse.mylyn.reviews.tests/src/org/eclipse/mylyn/reviews/tests/util/MockReviewBehavior.java:[18] 
	import org.eclipse.mylyn.reviews.core.model.IReviewItem;
	       ^^^^^^^^^^^^^^^^^^^^^^^^^^^^^^^^^^^^^^^^^^^^^^^^
Discouraged access: The type 'IReviewItem' is not API (restriction on classpath entry '/jobs/genie.mylyn/mylyn-test-build/workspace/org.eclipse.mylyn.reviews/org.eclipse.mylyn.reviews.core/target/classes')
[WARNING] /jobs/genie.mylyn/mylyn-test-build/workspace/org.eclipse.mylyn.reviews/org.eclipse.mylyn.reviews.tests/src/org/eclipse/mylyn/reviews/tests/util/MockReviewBehavior.java:[19] 
	import org.eclipse.mylyn.reviews.ui.ReviewBehavior;
	       ^^^^^^^^^^^^^^^^^^^^^^^^^^^^^^^^^^^^^^^^^^^
Discouraged access: The type 'ReviewBehavior' is not API (restriction on classpath entry '/jobs/genie.mylyn/mylyn-test-build/workspace/org.eclipse.mylyn.reviews/org.eclipse.mylyn.reviews.ui/target/classes')
[WARNING] /jobs/genie.mylyn/mylyn-test-build/workspace/org.eclipse.mylyn.reviews/org.eclipse.mylyn.reviews.tests/src/org/eclipse/mylyn/reviews/tests/util/MockReviewBehavior.java:[22] 
	public class MockReviewBehavior extends ReviewBehavior {
	                                        ^^^^^^^^^^^^^^
Discouraged access: The type 'ReviewBehavior' is not API (restriction on classpath entry '/jobs/genie.mylyn/mylyn-test-build/workspace/org.eclipse.mylyn.reviews/org.eclipse.mylyn.reviews.ui/target/classes')
[WARNING] /jobs/genie.mylyn/mylyn-test-build/workspace/org.eclipse.mylyn.reviews/org.eclipse.mylyn.reviews.tests/src/org/eclipse/mylyn/reviews/tests/util/MockReviewBehavior.java:[25] 
	super(null);
	^^^^^^^^^^^^
Discouraged access: The constructor 'ReviewBehavior(ITask)' is not API (restriction on classpath entry '/jobs/genie.mylyn/mylyn-test-build/workspace/org.eclipse.mylyn.reviews/org.eclipse.mylyn.reviews.ui/target/classes')
[WARNING] /jobs/genie.mylyn/mylyn-test-build/workspace/org.eclipse.mylyn.reviews/org.eclipse.mylyn.reviews.tests/src/org/eclipse/mylyn/reviews/tests/util/MockReviewBehavior.java:[29] 
	public IStatus addComment(IReviewItem fileItem, IComment comment, IProgressMonitor monitor) {
	                          ^^^^^^^^^^^
Discouraged access: The type 'IReviewItem' is not API (restriction on classpath entry '/jobs/genie.mylyn/mylyn-test-build/workspace/org.eclipse.mylyn.reviews/org.eclipse.mylyn.reviews.core/target/classes')
[WARNING] /jobs/genie.mylyn/mylyn-test-build/workspace/org.eclipse.mylyn.reviews/org.eclipse.mylyn.reviews.tests/src/org/eclipse/mylyn/reviews/tests/util/MockReviewBehavior.java:[29] 
	public IStatus addComment(IReviewItem fileItem, IComment comment, IProgressMonitor monitor) {
	                                                ^^^^^^^^
Discouraged access: The type 'IComment' is not API (restriction on classpath entry '/jobs/genie.mylyn/mylyn-test-build/workspace/org.eclipse.mylyn.reviews/org.eclipse.mylyn.reviews.core/target/classes')
[WARNING] /jobs/genie.mylyn/mylyn-test-build/workspace/org.eclipse.mylyn.reviews/org.eclipse.mylyn.reviews.tests/src/org/eclipse/mylyn/reviews/tests/util/MockReviewBehavior.java:[34] 
	public IFileRevision getFileRevision(IFileVersion reviewFileVersion) {
	                                     ^^^^^^^^^^^^
Discouraged access: The type 'IFileVersion' is not API (restriction on classpath entry '/jobs/genie.mylyn/mylyn-test-build/workspace/org.eclipse.mylyn.reviews/org.eclipse.mylyn.reviews.core/target/classes')
[WARNING] /jobs/genie.mylyn/mylyn-test-build/workspace/org.eclipse.mylyn.reviews/org.eclipse.mylyn.reviews.tests/src/org/eclipse/mylyn/reviews/tests/util/MockReviewBehavior.java:[39] 
	public IStatus discardComment(IReviewItem fileItem, IComment comment, IProgressMonitor monitor) {
	                              ^^^^^^^^^^^
Discouraged access: The type 'IReviewItem' is not API (restriction on classpath entry '/jobs/genie.mylyn/mylyn-test-build/workspace/org.eclipse.mylyn.reviews/org.eclipse.mylyn.reviews.core/target/classes')
[WARNING] /jobs/genie.mylyn/mylyn-test-build/workspace/org.eclipse.mylyn.reviews/org.eclipse.mylyn.reviews.tests/src/org/eclipse/mylyn/reviews/tests/util/MockReviewBehavior.java:[39] 
	public IStatus discardComment(IReviewItem fileItem, IComment comment, IProgressMonitor monitor) {
	                                                    ^^^^^^^^
Discouraged access: The type 'IComment' is not API (restriction on classpath entry '/jobs/genie.mylyn/mylyn-test-build/workspace/org.eclipse.mylyn.reviews/org.eclipse.mylyn.reviews.core/target/classes')
277 problems (277 warnings)
[INFO] 
[INFO] --- tycho-source-plugin:1.0.0:plugin-source (attach-source) @ org.eclipse.mylyn.reviews.tests ---
[WARNING] bundle localization file /jobs/genie.mylyn/mylyn-test-build/workspace/org.eclipse.mylyn.reviews/org.eclipse.mylyn.reviews.tests/plugin.properties not found
[INFO] Building jar: /jobs/genie.mylyn/mylyn-test-build/workspace/org.eclipse.mylyn.reviews/org.eclipse.mylyn.reviews.tests/target/org.eclipse.mylyn.reviews.tests-2.15.0-SNAPSHOT-sources.jar
[INFO] 
[INFO] --- maven-resources-plugin:2.4.1:testResources (default-testResources) @ org.eclipse.mylyn.reviews.tests ---
[INFO] Using 'ISO-8859-1' encoding to copy filtered resources.
[INFO] skip non existing resourceDirectory /jobs/genie.mylyn/mylyn-test-build/workspace/org.eclipse.mylyn.reviews/org.eclipse.mylyn.reviews.tests/src/test/resources
[INFO] 
[INFO] --- target-platform-configuration:1.0.0:target-platform (default-target-platform) @ org.eclipse.mylyn.reviews.tests ---
[INFO] 
[INFO] --- tycho-packaging-plugin:1.0.0:package-plugin (default-package-plugin) @ org.eclipse.mylyn.reviews.tests ---
[INFO] Building jar: /jobs/genie.mylyn/mylyn-test-build/workspace/org.eclipse.mylyn.reviews/org.eclipse.mylyn.reviews.tests/target/org.eclipse.mylyn.reviews.tests-2.15.0-SNAPSHOT.jar
[INFO] 
[INFO] --- tycho-p2-plugin:1.0.0:p2-metadata-default (default-p2-metadata-default) @ org.eclipse.mylyn.reviews.tests ---
[INFO] 
[INFO] --- tycho-surefire-plugin:1.0.0:test (default-test) @ org.eclipse.mylyn.reviews.tests ---
[INFO] Expected eclipse log file: /jobs/genie.mylyn/mylyn-test-build/workspace/org.eclipse.mylyn.reviews/org.eclipse.mylyn.reviews.tests/target/work/data/.metadata/.log
[INFO] Command line:
	[/opt/public/common/jdk1.8.0_131.x64/jre/bin/java, -Dosgi.noShutdown=false, -Dosgi.os=linux, -Dosgi.ws=gtk, -Dosgi.arch=x86_64, -Xmx512m, -Djava.io.tmpdir=/jobs/genie.mylyn/mylyn-test-build/workspace/org.eclipse.mylyn.reviews/org.eclipse.mylyn.reviews.tests/target, -ea, -Dmylyn.credentials=/shared/mylyn/.credentials.properties, -Dorg.eclipse.mylyn.wikitext.tests.disableOutput=true, -Dhttp.proxyHost=proxy.eclipse.org, -Dhttp.proxyPort=9898, -Dhttps.proxyHost=proxy.eclipse.org, -Dhttps.proxyPort=9898, -Dhttp.nonProxyHosts=*.eclipse.org, -Dorg.eclipse.mylyn.gerrit.tests.alternate.push=true, -Dosgi.clean=true, -jar, /jobs/genie.mylyn/mylyn-test-build/workspace/.maven/repo/p2/osgi/bundle/org.eclipse.equinox.launcher/1.4.0.v20161219-1356/org.eclipse.equinox.launcher-1.4.0.v20161219-1356.jar, -data, /jobs/genie.mylyn/mylyn-test-build/workspace/org.eclipse.mylyn.reviews/org.eclipse.mylyn.reviews.tests/target/work/data, -install, /jobs/genie.mylyn/mylyn-test-build/workspace/org.eclipse.mylyn.reviews/org.eclipse.mylyn.reviews.tests/target/work, -configuration, /jobs/genie.mylyn/mylyn-test-build/workspace/org.eclipse.mylyn.reviews/org.eclipse.mylyn.reviews.tests/target/work/configuration, -application, org.eclipse.tycho.surefire.osgibooter.uitest, -testproperties, /jobs/genie.mylyn/mylyn-test-build/workspace/org.eclipse.mylyn.reviews/org.eclipse.mylyn.reviews.tests/target/surefire.properties, -testApplication, org.eclipse.ui.ide.workbench, -product, org.eclipse.sdk.ide, -eclipse.keyring, /jobs/genie.mylyn/mylyn-test-build/workspace/org.eclipse.mylyn.reviews/org.eclipse.mylyn.reviews.tests/target/.eclipse.keyring, -eclipse.password, /jobs/genie.mylyn/mylyn-test-build/workspace/org.eclipse.mylyn.reviews/org.eclipse.mylyn.reviews.tests/target/../../.gitignore]
Launching application org.eclipse.ui.ide.workbench...

-------------------------------------------------------
 T E S T S
-------------------------------------------------------
Running org.eclipse.mylyn.reviews.tests.AllReviewsTests
[2017-12-28T6-16-41] Status ERROR: org.eclipse.mylyn.reviews.edit code=0 Problem with model file. Will be recreated at: file:/jobs/genie.mylyn/mylyn-test-build/workspace/org.eclipse.mylyn.reviews/org.eclipse.mylyn.reviews.tests/target/org.eclipse.mylyn.reviews.tests/RemoteEditFactoryTest/Container/EClass/123.ecore org.eclipse.emf.ecore.resource.impl.ResourceSetImpl$1DiagnosticWrappedException: org.xml.sax.SAXParseExceptionpublicId: file:/jobs/genie.mylyn/mylyn-test-build/workspace/org.eclipse.mylyn.reviews/org.eclipse.mylyn.reviews.tests/target/org.eclipse.mylyn.reviews.tests/RemoteEditFactoryTest/Container/EClass/123.ecore; systemId: file:/jobs/genie.mylyn/mylyn-test-build/workspace/org.eclipse.mylyn.reviews/org.eclipse.mylyn.reviews.tests/target/org.eclipse.mylyn.reviews.tests/RemoteEditFactoryTest/Container/EClass/123.ecore; lineNumber: 1; columnNumber: 1; Content is not allowed in prolog., Exception:
org.eclipse.emf.ecore.resource.impl.ResourceSetImpl$1DiagnosticWrappedException: org.xml.sax.SAXParseExceptionpublicId: file:/jobs/genie.mylyn/mylyn-test-build/workspace/org.eclipse.mylyn.reviews/org.eclipse.mylyn.reviews.tests/target/org.eclipse.mylyn.reviews.tests/RemoteEditFactoryTest/Container/EClass/123.ecore; systemId: file:/jobs/genie.mylyn/mylyn-test-build/workspace/org.eclipse.mylyn.reviews/org.eclipse.mylyn.reviews.tests/target/org.eclipse.mylyn.reviews.tests/RemoteEditFactoryTest/Container/EClass/123.ecore; lineNumber: 1; columnNumber: 1; Content is not allowed in prolog.
	at org.eclipse.emf.ecore.resource.impl.ResourceSetImpl.handleDemandLoadException(ResourceSetImpl.java:319)
	at org.eclipse.emf.ecore.resource.impl.ResourceSetImpl.demandLoadHelper(ResourceSetImpl.java:278)
	at org.eclipse.emf.ecore.resource.impl.ResourceSetImpl.getResource(ResourceSetImpl.java:406)
	at org.eclipse.mylyn.reviews.spi.edit.remote.AbstractRemoteEditFactoryProvider.getResourceImpl(AbstractRemoteEditFactoryProvider.java:135)
	at org.eclipse.mylyn.reviews.spi.edit.remote.AbstractRemoteEditFactoryProvider.open(AbstractRemoteEditFactoryProvider.java:189)
	at org.eclipse.mylyn.reviews.spi.edit.remote.AbstractRemoteEditFactoryProvider.open(AbstractRemoteEditFactoryProvider.java:107)
	at org.eclipse.mylyn.reviews.spi.edit.remote.AbstractRemoteEditFactoryProviderTest.testBadChild(AbstractRemoteEditFactoryProviderTest.java:206)
	at sun.reflect.NativeMethodAccessorImpl.invoke0(Native Method)
	at sun.reflect.NativeMethodAccessorImpl.invoke(NativeMethodAccessorImpl.java:62)
	at sun.reflect.DelegatingMethodAccessorImpl.invoke(DelegatingMethodAccessorImpl.java:43)
	at java.lang.reflect.Method.invoke(Method.java:498)
	at junit.framework.TestCase.runTest(TestCase.java:176)
	at junit.framework.TestCase.runBare(TestCase.java:141)
	at junit.framework.TestResult$1.protect(TestResult.java:122)
	at junit.framework.TestResult.runProtected(TestResult.java:142)
	at junit.framework.TestResult.run(TestResult.java:125)
	at junit.framework.TestCase.run(TestCase.java:129)
	at junit.framework.TestSuite.runTest(TestSuite.java:252)
	at junit.framework.TestSuite.run(TestSuite.java:247)
	at junit.framework.TestSuite.runTest(TestSuite.java:252)
	at junit.framework.TestSuite.run(TestSuite.java:247)
	at org.junit.internal.runners.JUnit38ClassRunner.run(JUnit38ClassRunner.java:86)
	at org.apache.maven.surefire.junit4.JUnit4Provider.execute(JUnit4Provider.java:264)
	at org.apache.maven.surefire.junit4.JUnit4Provider.executeTestSet(JUnit4Provider.java:153)
	at org.apache.maven.surefire.junit4.JUnit4Provider.invoke(JUnit4Provider.java:124)
	at sun.reflect.NativeMethodAccessorImpl.invoke0(Native Method)
	at sun.reflect.NativeMethodAccessorImpl.invoke(NativeMethodAccessorImpl.java:62)
	at sun.reflect.DelegatingMethodAccessorImpl.invoke(DelegatingMethodAccessorImpl.java:43)
	at java.lang.reflect.Method.invoke(Method.java:498)
	at org.apache.maven.surefire.util.ReflectionUtils.invokeMethodWithArray2(ReflectionUtils.java:208)
	at org.apache.maven.surefire.booter.ProviderFactory$ProviderProxy.invoke(ProviderFactory.java:156)
	at org.apache.maven.surefire.booter.ProviderFactory.invokeProvider(ProviderFactory.java:82)
	at org.eclipse.tycho.surefire.osgibooter.OsgiSurefireBooter.run(OsgiSurefireBooter.java:95)
	at org.eclipse.tycho.surefire.osgibooter.AbstractUITestApplication$1.run(AbstractUITestApplication.java:35)
	at org.eclipse.swt.widgets.RunnableLock.run(RunnableLock.java:37)
	at org.eclipse.swt.widgets.Synchronizer.runAsyncMessages(Synchronizer.java:182)
	at org.eclipse.swt.widgets.Display.runAsyncMessages(Display.java:4577)
	at org.eclipse.swt.widgets.Display.readAndDispatch(Display.java:4186)
	at org.eclipse.e4.ui.internal.workbench.swt.PartRenderingEngine$5.run(PartRenderingEngine.java:1150)
	at org.eclipse.core.databinding.observable.Realm.runWithDefault(Realm.java:336)
	at org.eclipse.e4.ui.internal.workbench.swt.PartRenderingEngine.run(PartRenderingEngine.java:1039)
	at org.eclipse.e4.ui.internal.workbench.E4Workbench.createAndRunUI(E4Workbench.java:153)
	at org.eclipse.ui.internal.Workbench.lambda$3(Workbench.java:680)
	at org.eclipse.core.databinding.observable.Realm.runWithDefault(Realm.java:336)
	at org.eclipse.ui.internal.Workbench.createAndRunWorkbench(Workbench.java:594)
	at org.eclipse.ui.PlatformUI.createAndRunWorkbench(PlatformUI.java:148)
	at org.eclipse.ui.internal.ide.application.IDEApplication.start(IDEApplication.java:151)
	at org.eclipse.tycho.surefire.osgibooter.UITestApplication.runApplication(UITestApplication.java:31)
	at org.eclipse.tycho.surefire.osgibooter.AbstractUITestApplication.run(AbstractUITestApplication.java:120)
	at org.eclipse.tycho.surefire.osgibooter.UITestApplication.start(UITestApplication.java:37)
	at org.eclipse.equinox.internal.app.EclipseAppHandle.run(EclipseAppHandle.java:196)
	at org.eclipse.core.runtime.internal.adaptor.EclipseAppLauncher.runApplication(EclipseAppLauncher.java:134)
	at org.eclipse.core.runtime.internal.adaptor.EclipseAppLauncher.start(EclipseAppLauncher.java:104)
	at org.eclipse.core.runtime.adaptor.EclipseStarter.run(EclipseStarter.java:388)
	at org.eclipse.core.runtime.adaptor.EclipseStarter.run(EclipseStarter.java:243)
	at sun.reflect.NativeMethodAccessorImpl.invoke0(Native Method)
	at sun.reflect.NativeMethodAccessorImpl.invoke(NativeMethodAccessorImpl.java:62)
	at sun.reflect.DelegatingMethodAccessorImpl.invoke(DelegatingMethodAccessorImpl.java:43)
	at java.lang.reflect.Method.invoke(Method.java:498)
	at org.eclipse.equinox.launcher.Main.invokeFramework(Main.java:653)
	at org.eclipse.equinox.launcher.Main.basicRun(Main.java:590)
	at org.eclipse.equinox.launcher.Main.run(Main.java:1499)
	at org.eclipse.equinox.launcher.Main.main(Main.java:1472)
Caused by: org.xml.sax.SAXParseExceptionpublicId: file:/jobs/genie.mylyn/mylyn-test-build/workspace/org.eclipse.mylyn.reviews/org.eclipse.mylyn.reviews.tests/target/org.eclipse.mylyn.reviews.tests/RemoteEditFactoryTest/Container/EClass/123.ecore; systemId: file:/jobs/genie.mylyn/mylyn-test-build/workspace/org.eclipse.mylyn.reviews/org.eclipse.mylyn.reviews.tests/target/org.eclipse.mylyn.reviews.tests/RemoteEditFactoryTest/Container/EClass/123.ecore; lineNumber: 1; columnNumber: 1; Content is not allowed in prolog.
	at com.sun.org.apache.xerces.internal.util.ErrorHandlerWrapper.createSAXParseException(ErrorHandlerWrapper.java:203)
	at com.sun.org.apache.xerces.internal.util.ErrorHandlerWrapper.fatalError(ErrorHandlerWrapper.java:177)
	at com.sun.org.apache.xerces.internal.impl.XMLErrorReporter.reportError(XMLErrorReporter.java:400)
	at com.sun.org.apache.xerces.internal.impl.XMLErrorReporter.reportError(XMLErrorReporter.java:327)
	at com.sun.org.apache.xerces.internal.impl.XMLScanner.reportFatalError(XMLScanner.java:1472)
	at com.sun.org.apache.xerces.internal.impl.XMLDocumentScannerImpl$PrologDriver.next(XMLDocumentScannerImpl.java:994)
	at com.sun.org.apache.xerces.internal.impl.XMLDocumentScannerImpl.next(XMLDocumentScannerImpl.java:602)
	at com.sun.org.apache.xerces.internal.impl.XMLDocumentFragmentScannerImpl.scanDocument(XMLDocumentFragmentScannerImpl.java:505)
	at com.sun.org.apache.xerces.internal.parsers.XML11Configuration.parse(XML11Configuration.java:841)
	at com.sun.org.apache.xerces.internal.parsers.XML11Configuration.parse(XML11Configuration.java:770)
	at com.sun.org.apache.xerces.internal.parsers.XMLParser.parse(XMLParser.java:141)
	at com.sun.org.apache.xerces.internal.parsers.AbstractSAXParser.parse(AbstractSAXParser.java:1213)
	at com.sun.org.apache.xerces.internal.jaxp.SAXParserImpl$JAXPSAXParser.parse(SAXParserImpl.java:643)
	at com.sun.org.apache.xerces.internal.jaxp.SAXParserImpl.parse(SAXParserImpl.java:327)
	at org.eclipse.emf.ecore.xmi.impl.XMLLoadImpl.load(XMLLoadImpl.java:175)
	at org.eclipse.emf.ecore.xmi.impl.XMLResourceImpl.doLoad(XMLResourceImpl.java:261)
	at org.eclipse.emf.ecore.resource.impl.ResourceImpl.load(ResourceImpl.java:1518)
	at org.eclipse.emf.ecore.resource.impl.ResourceImpl.load(ResourceImpl.java:1297)
	at org.eclipse.emf.ecore.resource.impl.ResourceSetImpl.demandLoad(ResourceSetImpl.java:259)
	at org.eclipse.emf.ecore.resource.impl.ResourceSetImpl.demandLoadHelper(ResourceSetImpl.java:274)
	... 61 more

[2017-12-28T6-16-41] Status ERROR: org.eclipse.mylyn.reviews.edit code=0 Problem with model file. Will be recreated at: file:/jobs/genie.mylyn/mylyn-test-build/workspace/org.eclipse.mylyn.reviews/org.eclipse.mylyn.reviews.tests/target/org.eclipse.mylyn.reviews.tests/RemoteEditFactoryTest/Container/EPackage/EPackage.ecore org.eclipse.emf.ecore.resource.impl.ResourceSetImpl$1DiagnosticWrappedException: org.xml.sax.SAXParseExceptionpublicId: file:/jobs/genie.mylyn/mylyn-test-build/workspace/org.eclipse.mylyn.reviews/org.eclipse.mylyn.reviews.tests/target/org.eclipse.mylyn.reviews.tests/RemoteEditFactoryTest/Container/EPackage/EPackage.ecore; systemId: file:/jobs/genie.mylyn/mylyn-test-build/workspace/org.eclipse.mylyn.reviews/org.eclipse.mylyn.reviews.tests/target/org.eclipse.mylyn.reviews.tests/RemoteEditFactoryTest/Container/EPackage/EPackage.ecore; lineNumber: 1; columnNumber: 1; Content is not allowed in prolog., Exception:
org.eclipse.emf.ecore.resource.impl.ResourceSetImpl$1DiagnosticWrappedException: org.xml.sax.SAXParseExceptionpublicId: file:/jobs/genie.mylyn/mylyn-test-build/workspace/org.eclipse.mylyn.reviews/org.eclipse.mylyn.reviews.tests/target/org.eclipse.mylyn.reviews.tests/RemoteEditFactoryTest/Container/EPackage/EPackage.ecore; systemId: file:/jobs/genie.mylyn/mylyn-test-build/workspace/org.eclipse.mylyn.reviews/org.eclipse.mylyn.reviews.tests/target/org.eclipse.mylyn.reviews.tests/RemoteEditFactoryTest/Container/EPackage/EPackage.ecore; lineNumber: 1; columnNumber: 1; Content is not allowed in prolog.
	at org.eclipse.emf.ecore.resource.impl.ResourceSetImpl.handleDemandLoadException(ResourceSetImpl.java:319)
	at org.eclipse.emf.ecore.resource.impl.ResourceSetImpl.demandLoadHelper(ResourceSetImpl.java:278)
	at org.eclipse.emf.ecore.resource.impl.ResourceSetImpl.getResource(ResourceSetImpl.java:406)
	at org.eclipse.mylyn.reviews.spi.edit.remote.AbstractRemoteEditFactoryProvider.getResourceImpl(AbstractRemoteEditFactoryProvider.java:135)
	at org.eclipse.mylyn.reviews.spi.edit.remote.AbstractRemoteEditFactoryProvider.open(AbstractRemoteEditFactoryProvider.java:189)
	at org.eclipse.mylyn.reviews.spi.edit.remote.AbstractRemoteEditFactoryProvider.open(AbstractRemoteEditFactoryProvider.java:95)
	at org.eclipse.mylyn.reviews.spi.edit.remote.AbstractRemoteEditFactoryProviderTest.testBadFile(AbstractRemoteEditFactoryProviderTest.java:138)
	at sun.reflect.NativeMethodAccessorImpl.invoke0(Native Method)
	at sun.reflect.NativeMethodAccessorImpl.invoke(NativeMethodAccessorImpl.java:62)
	at sun.reflect.DelegatingMethodAccessorImpl.invoke(DelegatingMethodAccessorImpl.java:43)
	at java.lang.reflect.Method.invoke(Method.java:498)
	at junit.framework.TestCase.runTest(TestCase.java:176)
	at junit.framework.TestCase.runBare(TestCase.java:141)
	at junit.framework.TestResult$1.protect(TestResult.java:122)
	at junit.framework.TestResult.runProtected(TestResult.java:142)
	at junit.framework.TestResult.run(TestResult.java:125)
	at junit.framework.TestCase.run(TestCase.java:129)
	at junit.framework.TestSuite.runTest(TestSuite.java:252)
	at junit.framework.TestSuite.run(TestSuite.java:247)
	at junit.framework.TestSuite.runTest(TestSuite.java:252)
	at junit.framework.TestSuite.run(TestSuite.java:247)
	at org.junit.internal.runners.JUnit38ClassRunner.run(JUnit38ClassRunner.java:86)
	at org.apache.maven.surefire.junit4.JUnit4Provider.execute(JUnit4Provider.java:264)
	at org.apache.maven.surefire.junit4.JUnit4Provider.executeTestSet(JUnit4Provider.java:153)
	at org.apache.maven.surefire.junit4.JUnit4Provider.invoke(JUnit4Provider.java:124)
	at sun.reflect.NativeMethodAccessorImpl.invoke0(Native Method)
	at sun.reflect.NativeMethodAccessorImpl.invoke(NativeMethodAccessorImpl.java:62)
	at sun.reflect.DelegatingMethodAccessorImpl.invoke(DelegatingMethodAccessorImpl.java:43)
	at java.lang.reflect.Method.invoke(Method.java:498)
	at org.apache.maven.surefire.util.ReflectionUtils.invokeMethodWithArray2(ReflectionUtils.java:208)
	at org.apache.maven.surefire.booter.ProviderFactory$ProviderProxy.invoke(ProviderFactory.java:156)
	at org.apache.maven.surefire.booter.ProviderFactory.invokeProvider(ProviderFactory.java:82)
	at org.eclipse.tycho.surefire.osgibooter.OsgiSurefireBooter.run(OsgiSurefireBooter.java:95)
	at org.eclipse.tycho.surefire.osgibooter.AbstractUITestApplication$1.run(AbstractUITestApplication.java:35)
	at org.eclipse.swt.widgets.RunnableLock.run(RunnableLock.java:37)
	at org.eclipse.swt.widgets.Synchronizer.runAsyncMessages(Synchronizer.java:182)
	at org.eclipse.swt.widgets.Display.runAsyncMessages(Display.java:4577)
	at org.eclipse.swt.widgets.Display.readAndDispatch(Display.java:4186)
	at org.eclipse.e4.ui.internal.workbench.swt.PartRenderingEngine$5.run(PartRenderingEngine.java:1150)
	at org.eclipse.core.databinding.observable.Realm.runWithDefault(Realm.java:336)
	at org.eclipse.e4.ui.internal.workbench.swt.PartRenderingEngine.run(PartRenderingEngine.java:1039)
	at org.eclipse.e4.ui.internal.workbench.E4Workbench.createAndRunUI(E4Workbench.java:153)
	at org.eclipse.ui.internal.Workbench.lambda$3(Workbench.java:680)
	at org.eclipse.core.databinding.observable.Realm.runWithDefault(Realm.java:336)
	at org.eclipse.ui.internal.Workbench.createAndRunWorkbench(Workbench.java:594)
	at org.eclipse.ui.PlatformUI.createAndRunWorkbench(PlatformUI.java:148)
	at org.eclipse.ui.internal.ide.application.IDEApplication.start(IDEApplication.java:151)
	at org.eclipse.tycho.surefire.osgibooter.UITestApplication.runApplication(UITestApplication.java:31)
	at org.eclipse.tycho.surefire.osgibooter.AbstractUITestApplication.run(AbstractUITestApplication.java:120)
	at org.eclipse.tycho.surefire.osgibooter.UITestApplication.start(UITestApplication.java:37)
	at org.eclipse.equinox.internal.app.EclipseAppHandle.run(EclipseAppHandle.java:196)
	at org.eclipse.core.runtime.internal.adaptor.EclipseAppLauncher.runApplication(EclipseAppLauncher.java:134)
	at org.eclipse.core.runtime.internal.adaptor.EclipseAppLauncher.start(EclipseAppLauncher.java:104)
	at org.eclipse.core.runtime.adaptor.EclipseStarter.run(EclipseStarter.java:388)
	at org.eclipse.core.runtime.adaptor.EclipseStarter.run(EclipseStarter.java:243)
	at sun.reflect.NativeMethodAccessorImpl.invoke0(Native Method)
	at sun.reflect.NativeMethodAccessorImpl.invoke(NativeMethodAccessorImpl.java:62)
	at sun.reflect.DelegatingMethodAccessorImpl.invoke(DelegatingMethodAccessorImpl.java:43)
	at java.lang.reflect.Method.invoke(Method.java:498)
	at org.eclipse.equinox.launcher.Main.invokeFramework(Main.java:653)
	at org.eclipse.equinox.launcher.Main.basicRun(Main.java:590)
	at org.eclipse.equinox.launcher.Main.run(Main.java:1499)
	at org.eclipse.equinox.launcher.Main.main(Main.java:1472)
Caused by: org.xml.sax.SAXParseExceptionpublicId: file:/jobs/genie.mylyn/mylyn-test-build/workspace/org.eclipse.mylyn.reviews/org.eclipse.mylyn.reviews.tests/target/org.eclipse.mylyn.reviews.tests/RemoteEditFactoryTest/Container/EPackage/EPackage.ecore; systemId: file:/jobs/genie.mylyn/mylyn-test-build/workspace/org.eclipse.mylyn.reviews/org.eclipse.mylyn.reviews.tests/target/org.eclipse.mylyn.reviews.tests/RemoteEditFactoryTest/Container/EPackage/EPackage.ecore; lineNumber: 1; columnNumber: 1; Content is not allowed in prolog.
	at com.sun.org.apache.xerces.internal.util.ErrorHandlerWrapper.createSAXParseException(ErrorHandlerWrapper.java:203)
	at com.sun.org.apache.xerces.internal.util.ErrorHandlerWrapper.fatalError(ErrorHandlerWrapper.java:177)
	at com.sun.org.apache.xerces.internal.impl.XMLErrorReporter.reportError(XMLErrorReporter.java:400)
	at com.sun.org.apache.xerces.internal.impl.XMLErrorReporter.reportError(XMLErrorReporter.java:327)
	at com.sun.org.apache.xerces.internal.impl.XMLScanner.reportFatalError(XMLScanner.java:1472)
	at com.sun.org.apache.xerces.internal.impl.XMLDocumentScannerImpl$PrologDriver.next(XMLDocumentScannerImpl.java:994)
	at com.sun.org.apache.xerces.internal.impl.XMLDocumentScannerImpl.next(XMLDocumentScannerImpl.java:602)
	at com.sun.org.apache.xerces.internal.impl.XMLDocumentFragmentScannerImpl.scanDocument(XMLDocumentFragmentScannerImpl.java:505)
	at com.sun.org.apache.xerces.internal.parsers.XML11Configuration.parse(XML11Configuration.java:841)
	at com.sun.org.apache.xerces.internal.parsers.XML11Configuration.parse(XML11Configuration.java:770)
	at com.sun.org.apache.xerces.internal.parsers.XMLParser.parse(XMLParser.java:141)
	at com.sun.org.apache.xerces.internal.parsers.AbstractSAXParser.parse(AbstractSAXParser.java:1213)
	at com.sun.org.apache.xerces.internal.jaxp.SAXParserImpl$JAXPSAXParser.parse(SAXParserImpl.java:643)
	at com.sun.org.apache.xerces.internal.jaxp.SAXParserImpl.parse(SAXParserImpl.java:327)
	at org.eclipse.emf.ecore.xmi.impl.XMLLoadImpl.load(XMLLoadImpl.java:175)
	at org.eclipse.emf.ecore.xmi.impl.XMLResourceImpl.doLoad(XMLResourceImpl.java:261)
	at org.eclipse.emf.ecore.resource.impl.ResourceImpl.load(ResourceImpl.java:1518)
	at org.eclipse.emf.ecore.resource.impl.ResourceImpl.load(ResourceImpl.java:1297)
	at org.eclipse.emf.ecore.resource.impl.ResourceSetImpl.demandLoad(ResourceSetImpl.java:259)
	at org.eclipse.emf.ecore.resource.impl.ResourceSetImpl.demandLoadHelper(ResourceSetImpl.java:274)
	... 61 more

Tests run: 31, Failures: 0, Errors: 0, Skipped: 0, Time elapsed: 0.705 sec - in org.eclipse.mylyn.reviews.tests.AllReviewsTests
testGetActiveReview(org.eclipse.mylyn.reviews.tests.ui.ReviewUiTest)  Time elapsed: 0.002 sec
testGetLocation(org.eclipse.mylyn.reviews.tests.ui.UiDataLocatorTest)  Time elapsed: 0.004 sec
testDeleteCache(org.eclipse.mylyn.reviews.spi.edit.remote.AbstractRemoteEditFactoryProviderTest)  Time elapsed: 0.045 sec
testBadChild(org.eclipse.mylyn.reviews.spi.edit.remote.AbstractRemoteEditFactoryProviderTest)  Time elapsed: 0.097 sec
testCreateChild(org.eclipse.mylyn.reviews.spi.edit.remote.AbstractRemoteEditFactoryProviderTest)  Time elapsed: 0.027 sec
testBadFile(org.eclipse.mylyn.reviews.spi.edit.remote.AbstractRemoteEditFactoryProviderTest)  Time elapsed: 0.015 sec
testCreateRoot(org.eclipse.mylyn.reviews.spi.edit.remote.AbstractRemoteEditFactoryProviderTest)  Time elapsed: 0.008 sec
testBadContents(org.eclipse.mylyn.reviews.spi.edit.remote.AbstractRemoteEditFactoryProviderTest)  Time elapsed: 0.014 sec
testSpaces(org.eclipse.mylyn.reviews.spi.edit.remote.AbstractRemoteEditFactoryProviderTest)  Time elapsed: 0.041 sec
testNotifyChanged(org.eclipse.mylyn.reviews.tests.ui.ReviewAnnotationModelTest)  Time elapsed: 0.022 sec
testConnect(org.eclipse.mylyn.reviews.tests.ui.ReviewAnnotationModelTest)  Time elapsed: 0 sec
testNextAnnotFwdLeftBeforeRightOffsetBeforeBoth(org.eclipse.mylyn.reviews.tests.ui.ReviewCompareAnnotationSupportTest)  Time elapsed: 0.042 sec
testNextAnnotBwdLeftBeforeRightOffsetBeforeBoth(org.eclipse.mylyn.reviews.tests.ui.ReviewCompareAnnotationSupportTest)  Time elapsed: 0.003 sec
testNextAnnotFwdLeftAfterRightOffsetBeforeLeftAfterRight(org.eclipse.mylyn.reviews.tests.ui.ReviewCompareAnnotationSupportTest)  Time elapsed: 0.002 sec
testNextAnnotBwdLeftAfterRightOffsetBeforeLeftEqualRight(org.eclipse.mylyn.reviews.tests.ui.ReviewCompareAnnotationSupportTest)  Time elapsed: 0.002 sec
testNextAnnotBwdLeftAfterRightOffsetAfterBoth(org.eclipse.mylyn.reviews.tests.ui.ReviewCompareAnnotationSupportTest)  Time elapsed: 0.002 sec
testNextAnnotBwdLeftBeforeRightOffsetAfterLeftEqualRight(org.eclipse.mylyn.reviews.tests.ui.ReviewCompareAnnotationSupportTest)  Time elapsed: 0.002 sec
testNextAnnotFwdLeftBeforeRightOffsetAfterBoth(org.eclipse.mylyn.reviews.tests.ui.ReviewCompareAnnotationSupportTest)  Time elapsed: 0.002 sec
testNextAnnotFwdLeftAfterRightOffsetAfterBoth(org.eclipse.mylyn.reviews.tests.ui.ReviewCompareAnnotationSupportTest)  Time elapsed: 0.002 sec
testNextAnnotBwdLeftBeforeRightOffsetAfterBoth(org.eclipse.mylyn.reviews.tests.ui.ReviewCompareAnnotationSupportTest)  Time elapsed: 0.001 sec
testNextAnnotBwdLeftAfterRightOffsetEqualLeftAfterRight(org.eclipse.mylyn.reviews.tests.ui.ReviewCompareAnnotationSupportTest)  Time elapsed: 0.002 sec
testNextAnnotFwdLeftAfterRightOffsetBeforeBoth(org.eclipse.mylyn.reviews.tests.ui.ReviewCompareAnnotationSupportTest)  Time elapsed: 0.002 sec
testNextAnnotBwdLeftAfterRightOffsetBeforeBoth(org.eclipse.mylyn.reviews.tests.ui.ReviewCompareAnnotationSupportTest)  Time elapsed: 0.001 sec
testNextAnnotFwdLeftAfterRightOffsetEqualLeftAfterRight(org.eclipse.mylyn.reviews.tests.ui.ReviewCompareAnnotationSupportTest)  Time elapsed: 0.002 sec
testNextAnnotBwdLeftBeforeRightOffsetLeftBeforeRightAfter(org.eclipse.mylyn.reviews.tests.ui.ReviewCompareAnnotationSupportTest)  Time elapsed: 0.002 sec
testNextAnnotFwdLeftAfterRightOffsetBeforeLeftEqualRight(org.eclipse.mylyn.reviews.tests.ui.ReviewCompareAnnotationSupportTest)  Time elapsed: 0.006 sec
testNextAnnotBwdLeftAfterRightOffsetLeftAfterRightBefore(org.eclipse.mylyn.reviews.tests.ui.ReviewCompareAnnotationSupportTest)  Time elapsed: 0.002 sec
testNextAnnotFwdLeftBeforeRightOffsetAfterLeftEqualRight(org.eclipse.mylyn.reviews.tests.ui.ReviewCompareAnnotationSupportTest)  Time elapsed: 0.001 sec
testNextAnnotBwdLeftBeforeRightOffsetEqualLeftBeforeRight(org.eclipse.mylyn.reviews.tests.ui.ReviewCompareAnnotationSupportTest)  Time elapsed: 0.002 sec
testNextAnnotFwdLeftBeforeRightOffsetEqualLeftBeforeRight(org.eclipse.mylyn.reviews.tests.ui.ReviewCompareAnnotationSupportTest)  Time elapsed: 0.002 sec
testNextAnnotFwdLeftBeforeRightOffsetAfterLeftBeforeRightAfter(org.eclipse.mylyn.reviews.tests.ui.ReviewCompareAnnotationSupportTest)  Time elapsed: 0.002 sec

Results :

Tests run: 31, Failures: 0, Errors: 0, Skipped: 0

[INFO] All tests passed!
[INFO]                                                                         
[INFO] ------------------------------------------------------------------------
[INFO] Building org.eclipse.mylyn.reviews.development.feature 2.15.0-SNAPSHOT
[INFO] ------------------------------------------------------------------------
[INFO] 
[INFO] --- maven-clean-plugin:2.4.1:clean (default-clean) @ org.eclipse.mylyn.reviews.development.feature ---
[INFO] 
[INFO] --- tycho-packaging-plugin:1.0.0:build-qualifier-aggregator (default-build-qualifier-aggregator) @ org.eclipse.mylyn.reviews.development.feature ---
[INFO] The project's OSGi version is 2.15.0.x20170710-1844
[INFO] 
[INFO] --- tycho-packaging-plugin:1.0.0:validate-id (default-validate-id) @ org.eclipse.mylyn.reviews.development.feature ---
[INFO] 
[INFO] --- tycho-packaging-plugin:1.0.0:validate-version (default-validate-version) @ org.eclipse.mylyn.reviews.development.feature ---
[INFO] 
[INFO] --- jacoco-maven-plugin:0.5.6.201201232323:prepare-agent (default) @ org.eclipse.mylyn.reviews.development.feature ---
[INFO] Skipping JaCoCo execution
[INFO] 
[INFO] --- target-platform-configuration:1.0.0:target-platform (default-target-platform) @ org.eclipse.mylyn.reviews.development.feature ---
[INFO] 
[INFO] --- tycho-packaging-plugin:1.0.0:package-feature (default-package-feature) @ org.eclipse.mylyn.reviews.development.feature ---
[INFO] Building jar: /jobs/genie.mylyn/mylyn-test-build/workspace/org.eclipse.mylyn.reviews/org.eclipse.mylyn.reviews.development.feature/target/org.eclipse.mylyn.reviews.development.feature-2.15.0-SNAPSHOT.jar
[INFO] 
[INFO] --- tycho-p2-plugin:1.0.0:p2-metadata-default (default-p2-metadata-default) @ org.eclipse.mylyn.reviews.development.feature ---
[INFO] 
[INFO] --- tycho-p2-plugin:1.0.0:feature-p2-metadata (default-feature-p2-metadata) @ org.eclipse.mylyn.reviews.development.feature ---
[INFO]                                                                         
[INFO] ------------------------------------------------------------------------
[INFO] Building org.eclipse.mylyn.reviews.ui.tests 2.15.0-SNAPSHOT
[INFO] ------------------------------------------------------------------------
[INFO] 
[INFO] --- maven-clean-plugin:2.4.1:clean (default-clean) @ org.eclipse.mylyn.reviews.ui.tests ---
[INFO] 
[INFO] --- tycho-packaging-plugin:1.0.0:build-qualifier (default-build-qualifier) @ org.eclipse.mylyn.reviews.ui.tests ---
[INFO] The project's OSGi version is 2.15.0.x20170629-2231
[INFO] 
[INFO] --- tycho-packaging-plugin:1.0.0:validate-id (default-validate-id) @ org.eclipse.mylyn.reviews.ui.tests ---
[INFO] 
[INFO] --- tycho-packaging-plugin:1.0.0:validate-version (default-validate-version) @ org.eclipse.mylyn.reviews.ui.tests ---
[INFO] 
[INFO] --- jacoco-maven-plugin:0.5.6.201201232323:prepare-agent (default) @ org.eclipse.mylyn.reviews.ui.tests ---
[INFO] Skipping JaCoCo execution
[INFO] 
[INFO] --- maven-resources-plugin:2.4.1:resources (default-resources) @ org.eclipse.mylyn.reviews.ui.tests ---
[INFO] Using 'ISO-8859-1' encoding to copy filtered resources.
[INFO] skip non existing resourceDirectory /jobs/genie.mylyn/mylyn-test-build/workspace/org.eclipse.mylyn.reviews/org.eclipse.mylyn.reviews.ui.tests/src/main/resources
[INFO] 
[INFO] --- tycho-compiler-plugin:1.0.0:compile (default-compile) @ org.eclipse.mylyn.reviews.ui.tests ---
[INFO] Compiling 2 source files to /jobs/genie.mylyn/mylyn-test-build/workspace/org.eclipse.mylyn.reviews/org.eclipse.mylyn.reviews.ui.tests/target/classes
[WARNING] /jobs/genie.mylyn/mylyn-test-build/workspace/org.eclipse.mylyn.reviews/org.eclipse.mylyn.reviews.ui.tests/src/org/eclipse/mylyn/internal/reviews/ui/annotations/CommentPopupDialogTest.java:[35] 
	import org.eclipse.mylyn.internal.gerrit.ui.GerritReviewBehavior;
	       ^^^^^^^^^^^^^^^^^^^^^^^^^^^^^^^^^^^^^^^^^^^^^^^^^^^^^^^^^
Discouraged access: The type 'GerritReviewBehavior' is not API (restriction on classpath entry '/jobs/genie.mylyn/mylyn-test-build/workspace/org.eclipse.mylyn.reviews/org.eclipse.mylyn.gerrit.ui/target/classes')
[WARNING] /jobs/genie.mylyn/mylyn-test-build/workspace/org.eclipse.mylyn.reviews/org.eclipse.mylyn.reviews.ui.tests/src/org/eclipse/mylyn/internal/reviews/ui/annotations/CommentPopupDialogTest.java:[36] 
	import org.eclipse.mylyn.internal.tasks.ui.TasksUiPlugin;
	       ^^^^^^^^^^^^^^^^^^^^^^^^^^^^^^^^^^^^^^^^^^^^^^^^^
Discouraged access: The type 'TasksUiPlugin' is not API (restriction on classpath entry '/jobs/genie.mylyn/mylyn-test-build/workspace/org.eclipse.mylyn.tasks/org.eclipse.mylyn.tasks.ui/target/classes')
[WARNING] /jobs/genie.mylyn/mylyn-test-build/workspace/org.eclipse.mylyn.reviews/org.eclipse.mylyn.reviews.ui.tests/src/org/eclipse/mylyn/internal/reviews/ui/annotations/CommentPopupDialogTest.java:[99] 
	ReviewBehavior reviewBehavior = new GerritReviewBehavior(task);
	                                ^^^^^^^^^^^^^^^^^^^^^^^^^^^^^^
Discouraged access: The constructor 'GerritReviewBehavior(ITask)' is not API (restriction on classpath entry '/jobs/genie.mylyn/mylyn-test-build/workspace/org.eclipse.mylyn.reviews/org.eclipse.mylyn.gerrit.ui/target/classes')
[WARNING] /jobs/genie.mylyn/mylyn-test-build/workspace/org.eclipse.mylyn.reviews/org.eclipse.mylyn.reviews.ui.tests/src/org/eclipse/mylyn/internal/reviews/ui/annotations/CommentPopupDialogTest.java:[99] 
	ReviewBehavior reviewBehavior = new GerritReviewBehavior(task);
	                                    ^^^^^^^^^^^^^^^^^^^^
Discouraged access: The type 'GerritReviewBehavior' is not API (restriction on classpath entry '/jobs/genie.mylyn/mylyn-test-build/workspace/org.eclipse.mylyn.reviews/org.eclipse.mylyn.gerrit.ui/target/classes')
[WARNING] /jobs/genie.mylyn/mylyn-test-build/workspace/org.eclipse.mylyn.reviews/org.eclipse.mylyn.reviews.ui.tests/src/org/eclipse/mylyn/internal/reviews/ui/annotations/CommentPopupDialogTest.java:[119] 
	TasksUiPlugin.getTaskList().deleteTask(task);
	^^^^^^^^^^^^^
Discouraged access: The type 'TasksUiPlugin' is not API (restriction on classpath entry '/jobs/genie.mylyn/mylyn-test-build/workspace/org.eclipse.mylyn.tasks/org.eclipse.mylyn.tasks.ui/target/classes')
[WARNING] /jobs/genie.mylyn/mylyn-test-build/workspace/org.eclipse.mylyn.reviews/org.eclipse.mylyn.reviews.ui.tests/src/org/eclipse/mylyn/internal/reviews/ui/annotations/CommentPopupDialogTest.java:[119] 
	TasksUiPlugin.getTaskList().deleteTask(task);
	^^^^^^^^^^^^^^^^^^^^^^^^^^^
Discouraged access: The method 'TasksUiPlugin.getTaskList()' is not API (restriction on classpath entry '/jobs/genie.mylyn/mylyn-test-build/workspace/org.eclipse.mylyn.tasks/org.eclipse.mylyn.tasks.ui/target/classes')
[WARNING] /jobs/genie.mylyn/mylyn-test-build/workspace/org.eclipse.mylyn.reviews/org.eclipse.mylyn.reviews.ui.tests/src/org/eclipse/mylyn/internal/reviews/ui/annotations/CommentPopupDialogTest.java:[119] 
	TasksUiPlugin.getTaskList().deleteTask(task);
	^^^^^^^^^^^^^^^^^^^^^^^^^^^^^^^^^^^^^^^^^^^^
Discouraged access: The method 'TaskList.deleteTask(ITask)' is not API (restriction on classpath entry '/jobs/genie.mylyn/mylyn-test-build/workspace/org.eclipse.mylyn.tasks/org.eclipse.mylyn.tasks.core/target/classes')
[WARNING] /jobs/genie.mylyn/mylyn-test-build/workspace/org.eclipse.mylyn.reviews/org.eclipse.mylyn.reviews.ui.tests/src/org/eclipse/mylyn/internal/reviews/ui/annotations/CommentPopupDialogTest.java:[122] 
	IJobManager jobManager = Platform.getJobManager();
	                                  ^^^^^^^^^^^^^^^
The method getJobManager() from the type Platform is deprecated
[WARNING] /jobs/genie.mylyn/mylyn-test-build/workspace/org.eclipse.mylyn.reviews/org.eclipse.mylyn.reviews.ui.tests/src/org/eclipse/mylyn/internal/reviews/ui/annotations/CommentPopupDialogTest.java:[762] 
	IJobManager jobManager = Platform.getJobManager();
	                                  ^^^^^^^^^^^^^^^
The method getJobManager() from the type Platform is deprecated
9 problems (9 warnings)
[INFO] 
[INFO] --- tycho-source-plugin:1.0.0:plugin-source (attach-source) @ org.eclipse.mylyn.reviews.ui.tests ---
[WARNING] bundle localization file /jobs/genie.mylyn/mylyn-test-build/workspace/org.eclipse.mylyn.reviews/org.eclipse.mylyn.reviews.ui.tests/plugin.properties not found
[INFO] Building jar: /jobs/genie.mylyn/mylyn-test-build/workspace/org.eclipse.mylyn.reviews/org.eclipse.mylyn.reviews.ui.tests/target/org.eclipse.mylyn.reviews.ui.tests-2.15.0-SNAPSHOT-sources.jar
[INFO] 
[INFO] --- maven-resources-plugin:2.4.1:testResources (default-testResources) @ org.eclipse.mylyn.reviews.ui.tests ---
[INFO] Using 'ISO-8859-1' encoding to copy filtered resources.
[INFO] skip non existing resourceDirectory /jobs/genie.mylyn/mylyn-test-build/workspace/org.eclipse.mylyn.reviews/org.eclipse.mylyn.reviews.ui.tests/src/test/resources
[INFO] 
[INFO] --- target-platform-configuration:1.0.0:target-platform (default-target-platform) @ org.eclipse.mylyn.reviews.ui.tests ---
[INFO] 
[INFO] --- tycho-packaging-plugin:1.0.0:package-plugin (default-package-plugin) @ org.eclipse.mylyn.reviews.ui.tests ---
[INFO] Building jar: /jobs/genie.mylyn/mylyn-test-build/workspace/org.eclipse.mylyn.reviews/org.eclipse.mylyn.reviews.ui.tests/target/org.eclipse.mylyn.reviews.ui.tests-2.15.0-SNAPSHOT.jar
[INFO] 
[INFO] --- tycho-p2-plugin:1.0.0:p2-metadata-default (default-p2-metadata-default) @ org.eclipse.mylyn.reviews.ui.tests ---
[INFO] 
[INFO] --- tycho-surefire-plugin:1.0.0:test (default-test) @ org.eclipse.mylyn.reviews.ui.tests ---
[INFO] Expected eclipse log file: /jobs/genie.mylyn/mylyn-test-build/workspace/org.eclipse.mylyn.reviews/org.eclipse.mylyn.reviews.ui.tests/target/work/data/.metadata/.log
[INFO] Command line:
	[/opt/public/common/jdk1.8.0_131.x64/jre/bin/java, -Dosgi.noShutdown=false, -Dosgi.os=linux, -Dosgi.ws=gtk, -Dosgi.arch=x86_64, -Xmx512m, -Djava.io.tmpdir=/jobs/genie.mylyn/mylyn-test-build/workspace/org.eclipse.mylyn.reviews/org.eclipse.mylyn.reviews.ui.tests/target, -ea, -Dmylyn.credentials=/shared/mylyn/.credentials.properties, -Dorg.eclipse.mylyn.wikitext.tests.disableOutput=true, -Dhttp.proxyHost=proxy.eclipse.org, -Dhttp.proxyPort=9898, -Dhttps.proxyHost=proxy.eclipse.org, -Dhttps.proxyPort=9898, -Dhttp.nonProxyHosts=*.eclipse.org, -Dorg.eclipse.mylyn.gerrit.tests.alternate.push=true, -Dosgi.clean=true, -jar, /jobs/genie.mylyn/mylyn-test-build/workspace/.maven/repo/p2/osgi/bundle/org.eclipse.equinox.launcher/1.4.0.v20161219-1356/org.eclipse.equinox.launcher-1.4.0.v20161219-1356.jar, -data, /jobs/genie.mylyn/mylyn-test-build/workspace/org.eclipse.mylyn.reviews/org.eclipse.mylyn.reviews.ui.tests/target/work/data, -install, /jobs/genie.mylyn/mylyn-test-build/workspace/org.eclipse.mylyn.reviews/org.eclipse.mylyn.reviews.ui.tests/target/work, -configuration, /jobs/genie.mylyn/mylyn-test-build/workspace/org.eclipse.mylyn.reviews/org.eclipse.mylyn.reviews.ui.tests/target/work/configuration, -application, org.eclipse.tycho.surefire.osgibooter.uitest, -testproperties, /jobs/genie.mylyn/mylyn-test-build/workspace/org.eclipse.mylyn.reviews/org.eclipse.mylyn.reviews.ui.tests/target/surefire.properties, -testApplication, org.eclipse.ui.ide.workbench, -product, org.eclipse.sdk.ide, -eclipse.keyring, /jobs/genie.mylyn/mylyn-test-build/workspace/org.eclipse.mylyn.reviews/org.eclipse.mylyn.reviews.ui.tests/target/.eclipse.keyring, -eclipse.password, /jobs/genie.mylyn/mylyn-test-build/workspace/org.eclipse.mylyn.reviews/org.eclipse.mylyn.reviews.ui.tests/target/../../.gitignore]
Launching application org.eclipse.ui.ide.workbench...
SLF4J: Failed to load class "org.slf4j.impl.StaticLoggerBinder".
SLF4J: Defaulting to no-operation (NOP) logger implementation
SLF4J: See http://www.slf4j.org/codes.html#StaticLoggerBinder for further details.

-------------------------------------------------------
 T E S T S
-------------------------------------------------------
Running org.eclipse.mylyn.reviews.ui.tests.AllReviewsUiTests
Tests run: 23, Failures: 0, Errors: 0, Skipped: 0, Time elapsed: 5.933 sec - in org.eclipse.mylyn.reviews.ui.tests.AllReviewsUiTests
testReplyDoneComment(org.eclipse.mylyn.internal.reviews.ui.annotations.CommentPopupDialogTest)  Time elapsed: 0.469 sec
testCommentSections(org.eclipse.mylyn.internal.reviews.ui.annotations.CommentPopupDialogTest)  Time elapsed: 0.099 sec
testTextListenerNoDraft(org.eclipse.mylyn.internal.reviews.ui.annotations.CommentPopupDialogTest)  Time elapsed: 0.058 sec
testEditableHoverCommentOpennedFirst(org.eclipse.mylyn.internal.reviews.ui.annotations.CommentPopupDialogTest)  Time elapsed: 0.096 sec
testCommentEditorButtonsNoDraft(org.eclipse.mylyn.internal.reviews.ui.annotations.CommentPopupDialogTest)  Time elapsed: 0.082 sec
testClose(org.eclipse.mylyn.internal.reviews.ui.annotations.CommentPopupDialogTest)  Time elapsed: 0.06 sec
testCommentEditorButtonsWithDraft(org.eclipse.mylyn.internal.reviews.ui.annotations.CommentPopupDialogTest)  Time elapsed: 0.107 sec
testDuplicateHoverAndNavigatorCommentEditor(org.eclipse.mylyn.internal.reviews.ui.annotations.CommentPopupDialogTest)  Time elapsed: 0.103 sec
testForceClose(org.eclipse.mylyn.internal.reviews.ui.annotations.CommentPopupDialogTest)  Time elapsed: 0.077 sec
testEditableHoverCommentAndEditorOpennedFirst(org.eclipse.mylyn.internal.reviews.ui.annotations.CommentPopupDialogTest)  Time elapsed: 0.107 sec
testRemoveEditor(org.eclipse.mylyn.internal.reviews.ui.annotations.CommentPopupDialogTest)  Time elapsed: 0.054 sec
testHelpText(org.eclipse.mylyn.internal.reviews.ui.annotations.CommentPopupDialogTest)  Time elapsed: 0.051 sec
testDiscardDraft(org.eclipse.mylyn.internal.reviews.ui.annotations.CommentPopupDialogTest)  Time elapsed: 0.071 sec
testCloseForCommentEditorText(org.eclipse.mylyn.internal.reviews.ui.annotations.CommentPopupDialogTest)  Time elapsed: 0.048 sec
testSetHeightBasedOnMouse(org.eclipse.mylyn.internal.reviews.ui.annotations.CommentPopupDialogTest)  Time elapsed: 3.694 sec
testSaveDraft(org.eclipse.mylyn.internal.reviews.ui.annotations.CommentPopupDialogTest)  Time elapsed: 0.134 sec
testMovable(org.eclipse.mylyn.internal.reviews.ui.annotations.CommentPopupDialogTest)  Time elapsed: 0.049 sec
testGetLastComment(org.eclipse.mylyn.internal.reviews.ui.annotations.CommentPopupDialogTest)  Time elapsed: 0.075 sec
testSaveComment(org.eclipse.mylyn.internal.reviews.ui.annotations.CommentPopupDialogTest)  Time elapsed: 0.049 sec
testEditableNavigatorCommentOpennedFirst(org.eclipse.mylyn.internal.reviews.ui.annotations.CommentPopupDialogTest)  Time elapsed: 0.072 sec
testCancel(org.eclipse.mylyn.internal.reviews.ui.annotations.CommentPopupDialogTest)  Time elapsed: 0.066 sec
testTextListenerWithDraft(org.eclipse.mylyn.internal.reviews.ui.annotations.CommentPopupDialogTest)  Time elapsed: 0.118 sec
testDuplicateHoverCommentEditors(org.eclipse.mylyn.internal.reviews.ui.annotations.CommentPopupDialogTest)  Time elapsed: 0.159 sec

Results :

Tests run: 23, Failures: 0, Errors: 0, Skipped: 0

[INFO] All tests passed!
[INFO]                                                                         
[INFO] ------------------------------------------------------------------------
[INFO] Building org.eclipse.mylyn.reviews.site 2.15.0-SNAPSHOT
[INFO] ------------------------------------------------------------------------
[INFO] 
[INFO] --- maven-clean-plugin:2.4.1:clean (default-clean) @ org.eclipse.mylyn.reviews.site ---
[INFO] 
[INFO] --- tycho-packaging-plugin:1.0.0:build-qualifier (default-build-qualifier) @ org.eclipse.mylyn.reviews.site ---
[INFO] The project's OSGi version is 2.15.0.x20170629-2231
[INFO] 
[INFO] --- jacoco-maven-plugin:0.5.6.201201232323:prepare-agent (default) @ org.eclipse.mylyn.reviews.site ---
[INFO] Skipping JaCoCo execution
[INFO] 
[INFO] --- tycho-packaging-plugin:1.0.0:update-site (default-update-site) @ org.eclipse.mylyn.reviews.site ---
[INFO] 
[INFO] --- tycho-p2-plugin:1.0.0:update-site-p2-metadata (default-update-site-p2-metadata) @ org.eclipse.mylyn.reviews.site ---
[INFO] Command line:
	[/opt/public/common/jdk1.8.0_131.x64/jre/bin/java, -jar, /jobs/genie.mylyn/mylyn-test-build/workspace/.maven/repo/org/eclipse/tycho/tycho-bundles-external/1.0.0/eclipse/plugins/org.eclipse.equinox.launcher_1.3.201.v20161025-1711.jar, -configuration, /tmp/tycho-p2-runtime3862454413250664059.tmp/configuration, -nosplash, -application, org.eclipse.equinox.p2.publisher.UpdateSitePublisher, -source, /jobs/genie.mylyn/mylyn-test-build/workspace/org.eclipse.mylyn.reviews/org.eclipse.mylyn.reviews.site/target/site, -metadataRepository, file:/jobs/genie.mylyn/mylyn-test-build/workspace/org.eclipse.mylyn.reviews/org.eclipse.mylyn.reviews.site/target/site/, -metadataRepositoryName, org.eclipse.mylyn.reviews.site, -artifactRepository, file:/jobs/genie.mylyn/mylyn-test-build/workspace/org.eclipse.mylyn.reviews/org.eclipse.mylyn.reviews.site/target/site/, -artifactRepositoryName, org.eclipse.mylyn.reviews.site Artifacts, -noDefaultIUs, -compress]
Generating metadata for ..
Generation completed with success [0 seconds].
[INFO] 
[INFO] --- tycho-packaging-plugin:1.0.0:update-site-packaging (default-update-site-packaging) @ org.eclipse.mylyn.reviews.site ---
[INFO] Building zip: /jobs/genie.mylyn/mylyn-test-build/workspace/org.eclipse.mylyn.reviews/org.eclipse.mylyn.reviews.site/target/site.zip
[INFO]                                                                         
[INFO] ------------------------------------------------------------------------
[INFO] Building org.eclipse.mylyn.all 3.24.0-SNAPSHOT
[INFO] ------------------------------------------------------------------------
[INFO] 
[INFO] --- maven-clean-plugin:2.4.1:clean (default-clean) @ org.eclipse.mylyn.all ---
[INFO] 
[INFO] --- jacoco-maven-plugin:0.5.6.201201232323:prepare-agent (default) @ org.eclipse.mylyn.all ---
[INFO] Skipping JaCoCo for project with packaging type 'pom'
[INFO]                                                                         
[INFO] ------------------------------------------------------------------------
[INFO] Building org.eclipse.mylyn.all 3.24.0-SNAPSHOT
[INFO] ------------------------------------------------------------------------
[INFO] 
[INFO] --- maven-help-plugin:2.2:effective-pom (default-cli) @ org.eclipse.mylyn.all ---
Downloading: https://repo.eclipse.org/content/repositories/maven_central/org/apache/maven/maven-artifact/2.2.1/maven-artifact-2.2.1.pom
Downloaded: https://repo.eclipse.org/content/repositories/maven_central/org/apache/maven/maven-artifact/2.2.1/maven-artifact-2.2.1.pom (2 KB at 19.1 KB/sec)
Downloading: https://repo.eclipse.org/content/repositories/maven_central/org/apache/maven/maven/2.2.1/maven-2.2.1.pom
Downloaded: https://repo.eclipse.org/content/repositories/maven_central/org/apache/maven/maven/2.2.1/maven-2.2.1.pom (22 KB at 951.5 KB/sec)
Downloading: https://repo.eclipse.org/content/repositories/maven_central/org/apache/maven/maven-core/2.2.1/maven-core-2.2.1.pom
Downloaded: https://repo.eclipse.org/content/repositories/maven_central/org/apache/maven/maven-core/2.2.1/maven-core-2.2.1.pom (12 KB at 597.9 KB/sec)
Downloading: https://repo.eclipse.org/content/repositories/maven_central/org/apache/maven/maven-settings/2.2.1/maven-settings-2.2.1.pom
Downloaded: https://repo.eclipse.org/content/repositories/maven_central/org/apache/maven/maven-settings/2.2.1/maven-settings-2.2.1.pom (3 KB at 118.2 KB/sec)
Downloading: https://repo.eclipse.org/content/repositories/maven_central/org/apache/maven/maven-model/2.2.1/maven-model-2.2.1.pom
Downloaded: https://repo.eclipse.org/content/repositories/maven_central/org/apache/maven/maven-model/2.2.1/maven-model-2.2.1.pom (4 KB at 166.5 KB/sec)
Downloading: https://repo.eclipse.org/content/repositories/maven_central/org/codehaus/plexus/plexus-interpolation/1.11/plexus-interpolation-1.11.pom
Downloaded: https://repo.eclipse.org/content/repositories/maven_central/org/codehaus/plexus/plexus-interpolation/1.11/plexus-interpolation-1.11.pom (889 B at 48.2 KB/sec)
Downloading: https://repo.eclipse.org/content/repositories/maven_central/org/apache/maven/maven-plugin-parameter-documenter/2.2.1/maven-plugin-parameter-documenter-2.2.1.pom
Downloaded: https://repo.eclipse.org/content/repositories/maven_central/org/apache/maven/maven-plugin-parameter-documenter/2.2.1/maven-plugin-parameter-documenter-2.2.1.pom (2 KB at 106.2 KB/sec)
Downloading: https://repo.eclipse.org/content/repositories/maven_central/org/slf4j/slf4j-jdk14/1.5.6/slf4j-jdk14-1.5.6.pom
Downloaded: https://repo.eclipse.org/content/repositories/maven_central/org/slf4j/slf4j-jdk14/1.5.6/slf4j-jdk14-1.5.6.pom (2 KB at 97.6 KB/sec)
Downloading: https://repo.eclipse.org/content/repositories/maven_central/org/slf4j/slf4j-parent/1.5.6/slf4j-parent-1.5.6.pom
Downloaded: https://repo.eclipse.org/content/repositories/maven_central/org/slf4j/slf4j-parent/1.5.6/slf4j-parent-1.5.6.pom (8 KB at 386.7 KB/sec)
Downloading: https://repo.eclipse.org/content/repositories/maven_central/org/slf4j/slf4j-api/1.5.6/slf4j-api-1.5.6.pom
Downloaded: https://repo.eclipse.org/content/repositories/maven_central/org/slf4j/slf4j-api/1.5.6/slf4j-api-1.5.6.pom (3 KB at 138.8 KB/sec)
Downloading: https://repo.eclipse.org/content/repositories/maven_central/org/slf4j/jcl-over-slf4j/1.5.6/jcl-over-slf4j-1.5.6.pom
Downloaded: https://repo.eclipse.org/content/repositories/maven_central/org/slf4j/jcl-over-slf4j/1.5.6/jcl-over-slf4j-1.5.6.pom (3 KB at 111.5 KB/sec)
Downloading: https://repo.eclipse.org/content/repositories/maven_central/org/apache/maven/reporting/maven-reporting-api/2.2.1/maven-reporting-api-2.2.1.pom
Downloaded: https://repo.eclipse.org/content/repositories/maven_central/org/apache/maven/reporting/maven-reporting-api/2.2.1/maven-reporting-api-2.2.1.pom (2 KB at 95.2 KB/sec)
Downloading: https://repo.eclipse.org/content/repositories/maven_central/org/apache/maven/reporting/maven-reporting/2.2.1/maven-reporting-2.2.1.pom
Downloaded: https://repo.eclipse.org/content/repositories/maven_central/org/apache/maven/reporting/maven-reporting/2.2.1/maven-reporting-2.2.1.pom (2 KB at 74.2 KB/sec)
Downloading: https://repo.eclipse.org/content/repositories/maven_central/org/apache/maven/maven-profile/2.2.1/maven-profile-2.2.1.pom
Downloaded: https://repo.eclipse.org/content/repositories/maven_central/org/apache/maven/maven-profile/2.2.1/maven-profile-2.2.1.pom (3 KB at 117.8 KB/sec)
Downloading: https://repo.eclipse.org/content/repositories/maven_central/org/apache/maven/maven-repository-metadata/2.2.1/maven-repository-metadata-2.2.1.pom
Downloaded: https://repo.eclipse.org/content/repositories/maven_central/org/apache/maven/maven-repository-metadata/2.2.1/maven-repository-metadata-2.2.1.pom (2 KB at 101.5 KB/sec)
Downloading: https://repo.eclipse.org/content/repositories/maven_central/org/apache/maven/maven-error-diagnostics/2.2.1/maven-error-diagnostics-2.2.1.pom
Downloaded: https://repo.eclipse.org/content/repositories/maven_central/org/apache/maven/maven-error-diagnostics/2.2.1/maven-error-diagnostics-2.2.1.pom (2 KB at 49.1 KB/sec)
Downloading: https://repo.eclipse.org/content/repositories/maven_central/org/apache/maven/maven-project/2.2.1/maven-project-2.2.1.pom
Downloaded: https://repo.eclipse.org/content/repositories/maven_central/org/apache/maven/maven-project/2.2.1/maven-project-2.2.1.pom (3 KB at 123.1 KB/sec)
Downloading: https://repo.eclipse.org/content/repositories/maven_central/org/apache/maven/maven-artifact-manager/2.2.1/maven-artifact-manager-2.2.1.pom
Downloaded: https://repo.eclipse.org/content/repositories/maven_central/org/apache/maven/maven-artifact-manager/2.2.1/maven-artifact-manager-2.2.1.pom (4 KB at 144.3 KB/sec)
Downloading: https://repo.eclipse.org/content/repositories/maven_central/org/apache/maven/maven-plugin-registry/2.2.1/maven-plugin-registry-2.2.1.pom
Downloaded: https://repo.eclipse.org/content/repositories/maven_central/org/apache/maven/maven-plugin-registry/2.2.1/maven-plugin-registry-2.2.1.pom (2 KB at 104.7 KB/sec)
Downloading: https://repo.eclipse.org/content/repositories/maven_central/commons-cli/commons-cli/1.2/commons-cli-1.2.pom
Downloaded: https://repo.eclipse.org/content/repositories/maven_central/commons-cli/commons-cli/1.2/commons-cli-1.2.pom (8 KB at 389.6 KB/sec)
Downloading: https://repo.eclipse.org/content/repositories/maven_central/org/apache/maven/maven-plugin-api/2.2.1/maven-plugin-api-2.2.1.pom
Downloaded: https://repo.eclipse.org/content/repositories/maven_central/org/apache/maven/maven-plugin-api/2.2.1/maven-plugin-api-2.2.1.pom (2 KB at 83.8 KB/sec)
Downloading: https://repo.eclipse.org/content/repositories/maven_central/org/apache/maven/maven-plugin-descriptor/2.2.1/maven-plugin-descriptor-2.2.1.pom
Downloaded: https://repo.eclipse.org/content/repositories/maven_central/org/apache/maven/maven-plugin-descriptor/2.2.1/maven-plugin-descriptor-2.2.1.pom (3 KB at 106.1 KB/sec)
Downloading: https://repo.eclipse.org/content/repositories/maven_central/org/apache/maven/maven-monitor/2.2.1/maven-monitor-2.2.1.pom
Downloaded: https://repo.eclipse.org/content/repositories/maven_central/org/apache/maven/maven-monitor/2.2.1/maven-monitor-2.2.1.pom (2 KB at 68.2 KB/sec)
Downloading: https://repo.eclipse.org/content/repositories/maven_central/org/sonatype/plexus/plexus-cipher/1.4/plexus-cipher-1.4.pom
Downloaded: https://repo.eclipse.org/content/repositories/maven_central/org/sonatype/plexus/plexus-cipher/1.4/plexus-cipher-1.4.pom (3 KB at 106.1 KB/sec)
Downloading: https://repo.eclipse.org/content/repositories/maven_central/org/apache/maven/plugin-tools/maven-plugin-tools-api/2.4.3/maven-plugin-tools-api-2.4.3.pom
Downloaded: https://repo.eclipse.org/content/repositories/maven_central/org/apache/maven/plugin-tools/maven-plugin-tools-api/2.4.3/maven-plugin-tools-api-2.4.3.pom (5 KB at 87.1 KB/sec)
Downloading: https://repo.eclipse.org/content/repositories/maven_central/org/apache/maven/plugin-tools/maven-plugin-tools/2.4.3/maven-plugin-tools-2.4.3.pom
Downloaded: https://repo.eclipse.org/content/repositories/maven_central/org/apache/maven/plugin-tools/maven-plugin-tools/2.4.3/maven-plugin-tools-2.4.3.pom (10 KB at 220.2 KB/sec)
Downloading: https://repo.eclipse.org/content/repositories/maven_central/jtidy/jtidy/4aug2000r7-dev/jtidy-4aug2000r7-dev.pom
Downloaded: https://repo.eclipse.org/content/repositories/maven_central/jtidy/jtidy/4aug2000r7-dev/jtidy-4aug2000r7-dev.pom (2 KB at 24.1 KB/sec)
Downloading: https://repo.eclipse.org/content/repositories/maven_central/org/codehaus/plexus/plexus-container-default/1.0-alpha-7/plexus-container-default-1.0-alpha-7.pom
Downloaded: https://repo.eclipse.org/content/repositories/maven_central/org/codehaus/plexus/plexus-container-default/1.0-alpha-7/plexus-container-default-1.0-alpha-7.pom (2 KB at 36.0 KB/sec)
Downloading: https://repo.eclipse.org/content/repositories/maven_central/plexus/plexus-containers/1.0.2/plexus-containers-1.0.2.pom
Downloaded: https://repo.eclipse.org/content/repositories/maven_central/plexus/plexus-containers/1.0.2/plexus-containers-1.0.2.pom (471 B at 11.5 KB/sec)
Downloading: https://repo.eclipse.org/content/repositories/maven_central/plexus/plexus-root/1.0.3/plexus-root-1.0.3.pom
Downloaded: https://repo.eclipse.org/content/repositories/maven_central/plexus/plexus-root/1.0.3/plexus-root-1.0.3.pom (6 KB at 127.8 KB/sec)
Downloading: https://repo.eclipse.org/content/repositories/maven_central/com/thoughtworks/xstream/xstream/1.4.3/xstream-1.4.3.pom
Downloaded: https://repo.eclipse.org/content/repositories/maven_central/com/thoughtworks/xstream/xstream/1.4.3/xstream-1.4.3.pom (9 KB at 152.3 KB/sec)
Downloading: https://repo.eclipse.org/content/repositories/maven_central/com/thoughtworks/xstream/xstream-parent/1.4.3/xstream-parent-1.4.3.pom
Downloaded: https://repo.eclipse.org/content/repositories/maven_central/com/thoughtworks/xstream/xstream-parent/1.4.3/xstream-parent-1.4.3.pom (19 KB at 492.7 KB/sec)
Downloading: https://repo.eclipse.org/content/repositories/maven_central/xmlpull/xmlpull/1.1.3.1/xmlpull-1.1.3.1.pom
Downloaded: https://repo.eclipse.org/content/repositories/maven_central/xmlpull/xmlpull/1.1.3.1/xmlpull-1.1.3.1.pom (386 B at 13.5 KB/sec)
Downloading: https://repo.eclipse.org/content/repositories/maven_central/xpp3/xpp3_min/1.1.4c/xpp3_min-1.1.4c.pom
Downloaded: https://repo.eclipse.org/content/repositories/maven_central/xpp3/xpp3_min/1.1.4c/xpp3_min-1.1.4c.pom (2 KB at 32.8 KB/sec)
Downloading: https://repo.eclipse.org/content/repositories/maven_central/org/slf4j/slf4j-jdk14/1.5.6/slf4j-jdk14-1.5.6.jar
Downloading: https://repo.eclipse.org/content/repositories/maven_central/org/slf4j/slf4j-api/1.5.6/slf4j-api-1.5.6.jar
Downloading: https://repo.eclipse.org/content/repositories/maven_central/org/slf4j/jcl-over-slf4j/1.5.6/jcl-over-slf4j-1.5.6.jar
Downloading: https://repo.eclipse.org/content/repositories/maven_central/org/apache/maven/reporting/maven-reporting-api/2.2.1/maven-reporting-api-2.2.1.jar
Downloading: https://repo.eclipse.org/content/repositories/maven_central/commons-cli/commons-cli/1.2/commons-cli-1.2.jar
Downloaded: https://repo.eclipse.org/content/repositories/maven_central/org/slf4j/slf4j-jdk14/1.5.6/slf4j-jdk14-1.5.6.jar (9 KB at 374.3 KB/sec)
Downloading: https://repo.eclipse.org/content/repositories/maven_central/org/sonatype/plexus/plexus-cipher/1.4/plexus-cipher-1.4.jar
Downloaded: https://repo.eclipse.org/content/repositories/maven_central/org/apache/maven/reporting/maven-reporting-api/2.2.1/maven-reporting-api-2.2.1.jar (10 KB at 318.6 KB/sec)
Downloading: https://repo.eclipse.org/content/repositories/maven_central/org/codehaus/plexus/plexus-interpolation/1.11/plexus-interpolation-1.11.jar
Downloaded: https://repo.eclipse.org/content/repositories/maven_central/org/slf4j/slf4j-api/1.5.6/slf4j-api-1.5.6.jar (22 KB at 703.7 KB/sec)
Downloading: https://repo.eclipse.org/content/repositories/maven_central/org/apache/maven/plugin-tools/maven-plugin-tools-api/2.4.3/maven-plugin-tools-api-2.4.3.jar
Downloaded: https://repo.eclipse.org/content/repositories/maven_central/commons-cli/commons-cli/1.2/commons-cli-1.2.jar (41 KB at 1255.0 KB/sec)
Downloading: https://repo.eclipse.org/content/repositories/maven_central/jtidy/jtidy/4aug2000r7-dev/jtidy-4aug2000r7-dev.jar
Downloaded: https://repo.eclipse.org/content/repositories/maven_central/org/slf4j/jcl-over-slf4j/1.5.6/jcl-over-slf4j-1.5.6.jar (17 KB at 418.7 KB/sec)
Downloading: https://repo.eclipse.org/content/repositories/maven_central/org/codehaus/plexus/plexus-utils/1.5.7/plexus-utils-1.5.7.jar
Downloaded: https://repo.eclipse.org/content/repositories/maven_central/org/sonatype/plexus/plexus-cipher/1.4/plexus-cipher-1.4.jar (14 KB at 693.6 KB/sec)
Downloading: https://repo.eclipse.org/content/repositories/maven_central/com/thoughtworks/xstream/xstream/1.4.3/xstream-1.4.3.jar
Downloaded: https://repo.eclipse.org/content/repositories/maven_central/org/codehaus/plexus/plexus-interpolation/1.11/plexus-interpolation-1.11.jar (50 KB at 2618.0 KB/sec)
Downloading: https://repo.eclipse.org/content/repositories/maven_central/xmlpull/xmlpull/1.1.3.1/xmlpull-1.1.3.1.jar
Downloaded: https://repo.eclipse.org/content/repositories/maven_central/org/apache/maven/plugin-tools/maven-plugin-tools-api/2.4.3/maven-plugin-tools-api-2.4.3.jar (51 KB at 833.6 KB/sec)
Downloading: https://repo.eclipse.org/content/repositories/maven_central/xpp3/xpp3_min/1.1.4c/xpp3_min-1.1.4c.jar
Downloaded: https://repo.eclipse.org/content/repositories/maven_central/xmlpull/xmlpull/1.1.3.1/xmlpull-1.1.3.1.jar (8 KB at 135.0 KB/sec)
Downloaded: https://repo.eclipse.org/content/repositories/maven_central/jtidy/jtidy/4aug2000r7-dev/jtidy-4aug2000r7-dev.jar (135 KB at 1895.8 KB/sec)
Downloaded: https://repo.eclipse.org/content/repositories/maven_central/com/thoughtworks/xstream/xstream/1.4.3/xstream-1.4.3.jar (471 KB at 7351.2 KB/sec)
Downloaded: https://repo.eclipse.org/content/repositories/maven_central/org/codehaus/plexus/plexus-utils/1.5.7/plexus-utils-1.5.7.jar (260 KB at 3557.5 KB/sec)
Downloaded: https://repo.eclipse.org/content/repositories/maven_central/xpp3/xpp3_min/1.1.4c/xpp3_min-1.1.4c.jar (25 KB at 812.4 KB/sec)
[INFO] 
Effective POMs, after inheritance, interpolation, and profiles are applied:

<?xml version="1.0" encoding="UTF-8"?>
<!-- ====================================================================== -->
<!--                                                                        -->
<!-- Generated by Maven Help Plugin on 2017-12-28T06:17:02                  -->
<!-- See: http://maven.apache.org/plugins/maven-help-plugin/                -->
<!--                                                                        -->
<!-- ====================================================================== -->

<!-- ====================================================================== -->
<!--                                                                        -->
<!-- Effective POM for project                                              -->
<!-- 'org.eclipse.mylyn:org.eclipse.mylyn.all:pom:3.24.0-SNAPSHOT'          -->
<!--                                                                        -->
<!-- ====================================================================== -->

<project xmlns="http://maven.apache.org/POM/4.0.0" xmlns:xsi="http://www.w3.org/2001/XMLSchema-instance" xsi:schemaLocation="http://maven.apache.org/POM/4.0.0 http://maven.apache.org/xsd/maven-4.0.0.xsd">
  <modelVersion>4.0.0</modelVersion>
  <parent>
    <groupId>org.eclipse.mylyn</groupId>
    <artifactId>org.eclipse.mylyn-parent</artifactId>
    <version>3.24.0-SNAPSHOT</version>
    <relativePath>org.eclipse.mylyn/org.eclipse.mylyn-parent</relativePath>
  </parent>
  <groupId>org.eclipse.mylyn</groupId>
  <artifactId>org.eclipse.mylyn.all</artifactId>
  <version>3.24.0-SNAPSHOT</version>
  <packaging>pom</packaging>
  <organization>
    <name>Eclipse Foundation</name>
    <url>http://www.eclipse.org/</url>
  </organization>
  <licenses>
    <license>
      <name>Eclipse Public License v1.0</name>
      <url>http://www.eclipse.org/legal/epl-v10.html</url>
      <distribution>repo</distribution>
      <comments>All rights reserved.

        This program and the accompanying materials are made
        available under the terms of the Eclipse Public License v1.0
        which accompanies this distribution, and is available at
        http://www.eclipse.org/legal/epl-v10.htm</comments>
    </license>
  </licenses>
  <mailingLists>
    <mailingList>
      <name>Mylyn Mailing List</name>
      <subscribe>https://dev.eclipse.org/mailman/listinfo/mylyn-dev</subscribe>
      <unsubscribe>https://dev.eclipse.org/mailman/listinfo/mylyn-dev</unsubscribe>
      <post>mylyn-dev@eclipse.org</post>
      <archive>http://dev.eclipse.org/mhonarc/lists/mylyn-dev</archive>
    </mailingList>
  </mailingLists>
  <modules>
    <module>org.eclipse.mylyn</module>
    <module>org.eclipse.mylyn.commons</module>
    <module>org.eclipse.mylyn.versions</module>
    <module>org.eclipse.mylyn.tasks</module>
    <module>org.eclipse.mylyn.context</module>
    <module>org.eclipse.mylyn.builds</module>
    <module>org.eclipse.mylyn.reviews</module>
  </modules>
  <issueManagement>
    <system>Bugzilla</system>
    <url>https://bugs.eclipse.org/bugs/buglist.cgi?query_format=advanced;classification=Mylyn</url>
  </issueManagement>
  <distributionManagement>
    <repository>
      <id>repo.eclipse.org</id>
      <name>Mylyn Repository - Releases</name>
      <url>https://repo.eclipse.org/content/repositories/mylyn-releases/</url>
    </repository>
    <snapshotRepository>
      <id>repo.eclipse.org</id>
      <name>Mylyn Repository - Snapshots</name>
      <url>https://repo.eclipse.org/content/repositories/mylyn-snapshots/</url>
    </snapshotRepository>
  </distributionManagement>
  <properties>
    <alt-platform-repository-url>http://download.eclipse.org/releases/oxygen/</alt-platform-repository-url>
    <alt-target-version>4.7</alt-target-version>
    <analysis.skip>true</analysis.skip>
    <coverage.destFile>../target/jacoco.exec</coverage.destFile>
    <coverage.filter>org.eclipse.mylyn.*</coverage.filter>
    <coverage.skip>true</coverage.skip>
    <dist.archive>/jobs/genie.mylyn/mylyn-test-build/workspace/target/drops</dist.archive>
    <dist.pack200>/shared/common/jdk-1.5.0-22.x86_64/bin</dist.pack200>
    <dist.qualifier>'x'yyyyMMdd-HHmm</dist.qualifier>
    <dist.releases.url>https://repo.eclipse.org/content/repositories/mylyn-releases/</dist.releases.url>
    <dist.repository>${project.name}</dist.repository>
    <dist.site>/home/data/httpd/download.eclipse.org/mylyn/snapshots</dist.site>
    <dist.snapshots.url>https://repo.eclipse.org/content/repositories/mylyn-snapshots/</dist.snapshots.url>
    <egit-repository-url>http://download.eclipse.org/egit/updates-1.3/</egit-repository-url>
    <jdt-annotation-repository-url>http://download.eclipse.org/mylyn/snapshots/jdt-annotation/</jdt-annotation-repository-url>
    <maven.test.error.ignore>true</maven.test.error.ignore>
    <maven.test.failure.ignore>true</maven.test.failure.ignore>
    <mylyn-builds-repository-url>http://download.eclipse.org/mylyn/snapshots/nightly/builds/</mylyn-builds-repository-url>
    <mylyn-commons-repository-url>http://download.eclipse.org/mylyn/snapshots/nightly/commons/</mylyn-commons-repository-url>
    <mylyn-context-repository-url>http://download.eclipse.org/mylyn/snapshots/nightly/context/</mylyn-context-repository-url>
    <mylyn-credentials>/shared/mylyn/.credentials.properties</mylyn-credentials>
    <mylyn-docs-repository-url>http://download.eclipse.org/mylyn/snapshots/nightly/docs/</mylyn-docs-repository-url>
    <mylyn-repository-url>http://download.eclipse.org/mylyn/snapshots/nightly/</mylyn-repository-url>
    <mylyn-reviews-repository-url>http://download.eclipse.org/mylyn/snapshots/nightly/reviews/</mylyn-reviews-repository-url>
    <mylyn-tasks-repository-url>http://download.eclipse.org/mylyn/snapshots/nightly/tasks/</mylyn-tasks-repository-url>
    <mylyn-test-append />
    <mylyn-versions-repository-url>http://download.eclipse.org/mylyn/snapshots/nightly/versions/</mylyn-versions-repository-url>
    <orbit-repository-url>http://download.eclipse.org/tools/orbit/downloads/drops/R20170516192513/repository/</orbit-repository-url>
    <pack.skip>false</pack.skip>
    <platform-repository-url>http://download.eclipse.org/releases/oxygen/</platform-repository-url>
    <promote.skip>true</promote.skip>
    <sign.skip>true</sign.skip>
    <sonar.core.codeCoveragePlugin>jacoco</sonar.core.codeCoveragePlugin>
    <sonar.dynamicAnalysis>reuseReports</sonar.dynamicAnalysis>
    <sonar.jacoco.reportPath>../target/jacoco.exec</sonar.jacoco.reportPath>
    <swtbot-repository-url>http://download.eclipse.org/technology/swtbot/helios/dev-build/update-site/</swtbot-repository-url>
    <target-platform>mylyn-e4.7</target-platform>
    <target-version>4.7</target-version>
    <test.all.skip>false</test.all.skip>
    <test.args>-eclipse.keyring /jobs/genie.mylyn/mylyn-test-build/workspace/target/.eclipse.keyring -eclipse.password /jobs/genie.mylyn/mylyn-test-build/workspace/target/../../.gitignore</test.args>
    <test.component.skip>false</test.component.skip>
    <test.integration.skip>false</test.integration.skip>
    <test.keyring.file>/jobs/genie.mylyn/mylyn-test-build/workspace/target/.eclipse.keyring</test.keyring.file>
    <test.keyring.password>/jobs/genie.mylyn/mylyn-test-build/workspace/target/../../.gitignore</test.keyring.password>
    <test.osvmargs />
    <test.performance.skip>false</test.performance.skip>
    <test.skip>false</test.skip>
    <test.system.skip>false</test.system.skip>
    <test.userargs />
    <test.uservmargs />
    <test.vmargs>-ea -Dmylyn.credentials=/shared/mylyn/.credentials.properties -Dorg.eclipse.mylyn.wikitext.tests.disableOutput=true -Dhttp.proxyHost=proxy.eclipse.org -Dhttp.proxyPort=9898 -Dhttps.proxyHost=proxy.eclipse.org -Dhttps.proxyPort=9898 -Dhttp.nonProxyHosts=*.eclipse.org -Dorg.eclipse.mylyn.gerrit.tests.alternate.push=true</test.vmargs>
    <tycho-extras-version>1.0.0</tycho-extras-version>
    <tycho-version>1.0.0</tycho-version>
    <tycho.testArgLine />
  </properties>
  <repositories>
    <repository>
      <snapshots>
        <enabled>true</enabled>
      </snapshots>
      <id>mylyn-snapshots</id>
      <url>https://repo.eclipse.org/content/repositories/mylyn-snapshots/</url>
    </repository>
    <repository>
      <id>mylyn-releases</id>
      <url>https://repo.eclipse.org/content/repositories/mylyn-releases/</url>
    </repository>
    <repository>
      <snapshots>
        <enabled>false</enabled>
      </snapshots>
      <id>central</id>
      <name>Central Repository</name>
      <url>http://repo.maven.apache.org/maven2</url>
    </repository>
  </repositories>
  <pluginRepositories>
    <pluginRepository>
      <releases>
        <updatePolicy>never</updatePolicy>
      </releases>
      <snapshots>
        <enabled>false</enabled>
      </snapshots>
      <id>central</id>
      <name>Central Repository</name>
      <url>http://repo.maven.apache.org/maven2</url>
    </pluginRepository>
  </pluginRepositories>
  <build>
    <sourceDirectory>/jobs/genie.mylyn/mylyn-test-build/workspace/src/main/java</sourceDirectory>
    <scriptSourceDirectory>/jobs/genie.mylyn/mylyn-test-build/workspace/src/main/scripts</scriptSourceDirectory>
    <testSourceDirectory>/jobs/genie.mylyn/mylyn-test-build/workspace/src/test/java</testSourceDirectory>
    <outputDirectory>/jobs/genie.mylyn/mylyn-test-build/workspace/target/classes</outputDirectory>
    <testOutputDirectory>/jobs/genie.mylyn/mylyn-test-build/workspace/target/test-classes</testOutputDirectory>
    <resources>
      <resource>
        <directory>/jobs/genie.mylyn/mylyn-test-build/workspace/src/main/resources</directory>
      </resource>
    </resources>
    <testResources>
      <testResource>
        <directory>/jobs/genie.mylyn/mylyn-test-build/workspace/src/test/resources</directory>
      </testResource>
    </testResources>
    <directory>/jobs/genie.mylyn/mylyn-test-build/workspace/target</directory>
    <finalName>org.eclipse.mylyn.all-3.24.0-SNAPSHOT</finalName>
    <pluginManagement>
      <plugins>
        <plugin>
          <artifactId>maven-antrun-plugin</artifactId>
          <version>1.3</version>
        </plugin>
        <plugin>
          <artifactId>maven-assembly-plugin</artifactId>
          <version>2.2-beta-5</version>
        </plugin>
        <plugin>
          <artifactId>maven-dependency-plugin</artifactId>
          <version>2.1</version>
        </plugin>
        <plugin>
          <artifactId>maven-release-plugin</artifactId>
          <version>2.0</version>
        </plugin>
        <plugin>
          <groupId>org.eclipse.tycho</groupId>
          <artifactId>tycho-source-plugin</artifactId>
          <version>1.0.0</version>
          <executions>
            <execution>
              <id>attach-source</id>
              <phase>process-classes</phase>
              <goals>
                <goal>plugin-source</goal>
              </goals>
            </execution>
          </executions>
        </plugin>
        <plugin>
          <groupId>org.eclipse.tycho</groupId>
          <artifactId>tycho-compiler-plugin</artifactId>
          <version>1.0.0</version>
          <configuration>
            <encoding>UTF-8</encoding>
          </configuration>
        </plugin>
        <plugin>
          <artifactId>maven-compiler-plugin</artifactId>
          <version>2.0.2</version>
          <configuration>
            <source>1.8</source>
            <target>1.8</target>
          </configuration>
        </plugin>
        <plugin>
          <artifactId>maven-resources-plugin</artifactId>
          <version>2.4.1</version>
          <configuration>
            <encoding>ISO-8859-1</encoding>
          </configuration>
        </plugin>
        <plugin>
          <groupId>org.eclipse.tycho</groupId>
          <artifactId>tycho-packaging-plugin</artifactId>
          <version>1.0.0</version>
          <dependencies>
            <dependency>
              <groupId>org.eclipse.tycho.extras</groupId>
              <artifactId>tycho-buildtimestamp-jgit</artifactId>
              <version>1.0.0</version>
            </dependency>
            <dependency>
              <groupId>org.eclipse.tycho.extras</groupId>
              <artifactId>tycho-sourceref-jgit</artifactId>
              <version>1.0.0</version>
            </dependency>
          </dependencies>
          <configuration>
            <format>'x'yyyyMMdd-HHmm</format>
            <archiveSite>false</archiveSite>
            <archive>
              <addMavenDescriptor>false</addMavenDescriptor>
            </archive>
            <sourceReferences>
              <generate>true</generate>
            </sourceReferences>
            <timestampProvider>jgit</timestampProvider>
          </configuration>
        </plugin>
        <plugin>
          <groupId>org.codehaus.mojo</groupId>
          <artifactId>findbugs-maven-plugin</artifactId>
          <version>2.3.2</version>
          <executions>
            <execution>
              <goals>
                <goal>check</goal>
              </goals>
              <configuration>
                <findbugsXmlOutput>true</findbugsXmlOutput>
                <failOnError>false</failOnError>
                <skip>true</skip>
              </configuration>
            </execution>
          </executions>
          <configuration>
            <findbugsXmlOutput>true</findbugsXmlOutput>
            <failOnError>false</failOnError>
            <skip>true</skip>
          </configuration>
        </plugin>
        <plugin>
          <artifactId>maven-pmd-plugin</artifactId>
          <version>2.5</version>
          <executions>
            <execution>
              <goals>
                <goal>cpd-check</goal>
              </goals>
              <configuration>
                <sourceEncoding>utf-8</sourceEncoding>
                <minimumTokens>100</minimumTokens>
                <targetJdk>1.8</targetJdk>
                <format>xml</format>
                <failOnViolation>false</failOnViolation>
                <skip>true</skip>
              </configuration>
            </execution>
          </executions>
          <configuration>
            <sourceEncoding>utf-8</sourceEncoding>
            <minimumTokens>100</minimumTokens>
            <targetJdk>1.8</targetJdk>
            <format>xml</format>
            <failOnViolation>false</failOnViolation>
            <skip>true</skip>
          </configuration>
        </plugin>
        <plugin>
          <artifactId>maven-deploy-plugin</artifactId>
          <version>2.5</version>
          <configuration>
            <uniqueVersion>false</uniqueVersion>
          </configuration>
        </plugin>
        <plugin>
          <groupId>org.codehaus.mojo</groupId>
          <artifactId>exec-maven-plugin</artifactId>
          <version>1.1.1</version>
          <executions>
            <execution>
              <phase>validate</phase>
              <goals>
                <goal>exec</goal>
              </goals>
              <configuration>
                <executable>git</executable>
                <arguments>
                  <argument>log</argument>
                  <argument>--pretty=format:source.control.id=%H</argument>
                  <argument>-n1</argument>
                </arguments>
                <outputFile>/jobs/genie.mylyn/mylyn-test-build/workspace/target/git.properties</outputFile>
                <successCodes>
                  <successCode>0</successCode>
                  <successCode>1</successCode>
                  <successCode>127</successCode>
                  <successCode>128</successCode>
                </successCodes>
              </configuration>
            </execution>
          </executions>
          <configuration>
            <executable>git</executable>
            <arguments>
              <argument>log</argument>
              <argument>--pretty=format:source.control.id=%H</argument>
              <argument>-n1</argument>
            </arguments>
            <outputFile>/jobs/genie.mylyn/mylyn-test-build/workspace/target/git.properties</outputFile>
            <successCodes>
              <successCode>0</successCode>
              <successCode>1</successCode>
              <successCode>127</successCode>
              <successCode>128</successCode>
            </successCodes>
          </configuration>
        </plugin>
        <plugin>
          <groupId>org.codehaus.mojo</groupId>
          <artifactId>properties-maven-plugin</artifactId>
          <version>1.0-alpha-2</version>
          <executions>
            <execution>
              <phase>initialize</phase>
              <goals>
                <goal>read-project-properties</goal>
              </goals>
              <configuration>
                <files>
                  <file>/jobs/genie.mylyn/mylyn-test-build/workspace/target/git.properties</file>
                </files>
                <quiet>true</quiet>
              </configuration>
            </execution>
          </executions>
        </plugin>
        <plugin>
          <groupId>org.eclipse.tycho</groupId>
          <artifactId>tycho-surefire-plugin</artifactId>
          <version>1.0.0</version>
          <configuration>
            <skip>false</skip>
            <useUIThread>${test.useUIThread}</useUIThread>
            <useUIHarness>true</useUIHarness>
            <failIfNoTests>true</failIfNoTests>
            <forkedProcessTimeoutInSeconds>10800</forkedProcessTimeoutInSeconds>
            <product>org.eclipse.sdk.ide</product>
            <application>org.eclipse.ui.ide.workbench</application>
            <argLine>-Xmx512m -Djava.io.tmpdir=/jobs/genie.mylyn/mylyn-test-build/workspace/target -ea -Dmylyn.credentials=/shared/mylyn/.credentials.properties -Dorg.eclipse.mylyn.wikitext.tests.disableOutput=true -Dhttp.proxyHost=proxy.eclipse.org -Dhttp.proxyPort=9898 -Dhttps.proxyHost=proxy.eclipse.org -Dhttps.proxyPort=9898 -Dhttp.nonProxyHosts=*.eclipse.org -Dorg.eclipse.mylyn.gerrit.tests.alternate.push=true</argLine>
            <appArgLine>-eclipse.keyring /jobs/genie.mylyn/mylyn-test-build/workspace/target/.eclipse.keyring -eclipse.password /jobs/genie.mylyn/mylyn-test-build/workspace/target/../../.gitignore</appArgLine>
            <application>org.eclipse.ui.ide.workbench</application>
            <dependency-resolution>
              <extraRequirements>
                <requirement>
                  <type>p2-installable-unit</type>
                  <id>org.eclipse.sdk.feature.group</id>
                  <versionRange>${platform-version}</versionRange>
                </requirement>
              </extraRequirements>
            </dependency-resolution>
          </configuration>
        </plugin>
      </plugins>
    </pluginManagement>
    <plugins>
      <plugin>
        <groupId>org.eclipse.tycho</groupId>
        <artifactId>tycho-maven-plugin</artifactId>
        <version>1.0.0</version>
        <extensions>true</extensions>
      </plugin>
      <plugin>
        <groupId>org.jacoco</groupId>
        <artifactId>jacoco-maven-plugin</artifactId>
        <version>0.5.6.201201232323</version>
        <executions>
          <execution>
            <goals>
              <goal>prepare-agent</goal>
            </goals>
            <configuration>
              <skip>true</skip>
              <destFile>../target/jacoco.exec</destFile>
              <includes>
                <include>org.eclipse.mylyn.*</include>
              </includes>
              <append>true</append>
            </configuration>
          </execution>
        </executions>
      </plugin>
      <plugin>
        <groupId>org.eclipse.tycho</groupId>
        <artifactId>target-platform-configuration</artifactId>
        <version>1.0.0</version>
        <configuration>
          <resolver>p2</resolver>
          <target>
            <artifact>
              <groupId>org.eclipse.mylyn</groupId>
              <artifactId>org.eclipse.mylyn-target</artifactId>
              <version>3.24.0-SNAPSHOT</version>
              <classifier>mylyn-e4.7</classifier>
            </artifact>
          </target>
          <ignoreTychoRepositories>true</ignoreTychoRepositories>
          <dependency-resolution>
            <optionalDependencies>ignore</optionalDependencies>
          </dependency-resolution>
          <environments>
            <environment>
              <os>macosx</os>
              <ws>cocoa</ws>
              <arch>x86_64</arch>
            </environment>
            <environment>
              <os>win32</os>
              <ws>win32</ws>
              <arch>x86</arch>
            </environment>
            <environment>
              <os>win32</os>
              <ws>win32</ws>
              <arch>x86_64</arch>
            </environment>
            <environment>
              <os>linux</os>
              <ws>gtk</ws>
              <arch>x86</arch>
            </environment>
            <environment>
              <os>linux</os>
              <ws>gtk</ws>
              <arch>x86_64</arch>
            </environment>
            <environment>
              <os>linux</os>
              <ws>gtk</ws>
              <arch>ppc64</arch>
            </environment>
          </environments>
        </configuration>
      </plugin>
      <plugin>
        <artifactId>maven-clean-plugin</artifactId>
        <version>2.4.1</version>
        <executions>
          <execution>
            <id>default-clean</id>
            <phase>clean</phase>
            <goals>
              <goal>clean</goal>
            </goals>
          </execution>
        </executions>
      </plugin>
      <plugin>
        <artifactId>maven-install-plugin</artifactId>
        <version>2.3.1</version>
        <executions>
          <execution>
            <id>default-install</id>
            <phase>install</phase>
            <goals>
              <goal>install</goal>
            </goals>
          </execution>
        </executions>
      </plugin>
      <plugin>
        <artifactId>maven-deploy-plugin</artifactId>
        <version>2.5</version>
        <executions>
          <execution>
            <id>default-deploy</id>
            <phase>deploy</phase>
            <goals>
              <goal>deploy</goal>
            </goals>
            <configuration>
              <uniqueVersion>false</uniqueVersion>
            </configuration>
          </execution>
        </executions>
        <configuration>
          <uniqueVersion>false</uniqueVersion>
        </configuration>
      </plugin>
      <plugin>
        <artifactId>maven-site-plugin</artifactId>
        <version>3.0</version>
        <executions>
          <execution>
            <id>default-site</id>
            <phase>site</phase>
            <goals>
              <goal>site</goal>
            </goals>
            <configuration>
              <outputDirectory>/jobs/genie.mylyn/mylyn-test-build/workspace/target/site</outputDirectory>
              <reportPlugins>
                <reportPlugin>
                  <groupId>org.apache.maven.plugins</groupId>
                  <artifactId>maven-project-info-reports-plugin</artifactId>
                </reportPlugin>
              </reportPlugins>
            </configuration>
          </execution>
          <execution>
            <id>default-deploy</id>
            <phase>site-deploy</phase>
            <goals>
              <goal>deploy</goal>
            </goals>
            <configuration>
              <outputDirectory>/jobs/genie.mylyn/mylyn-test-build/workspace/target/site</outputDirectory>
              <reportPlugins>
                <reportPlugin>
                  <groupId>org.apache.maven.plugins</groupId>
                  <artifactId>maven-project-info-reports-plugin</artifactId>
                </reportPlugin>
              </reportPlugins>
            </configuration>
          </execution>
        </executions>
        <configuration>
          <outputDirectory>/jobs/genie.mylyn/mylyn-test-build/workspace/target/site</outputDirectory>
          <reportPlugins>
            <reportPlugin>
              <groupId>org.apache.maven.plugins</groupId>
              <artifactId>maven-project-info-reports-plugin</artifactId>
            </reportPlugin>
          </reportPlugins>
        </configuration>
      </plugin>
    </plugins>
  </build>
  <reporting>
    <outputDirectory>/jobs/genie.mylyn/mylyn-test-build/workspace/target/site</outputDirectory>
  </reporting>
</project>

[INFO] ------------------------------------------------------------------------
[INFO] Reactor Summary:
[INFO] 
[INFO] org.eclipse.mylyn-parent .......................... SUCCESS [7.942s]
[INFO] Mylyn Releng ...................................... SUCCESS [0.046s]
[INFO] org.eclipse.mylyn.discovery ....................... SUCCESS [4.786s]
[INFO] Mylyn Commons ..................................... SUCCESS [0.045s]
[INFO] org.eclipse.mylyn.commons.core .................... SUCCESS [13.733s]
[INFO] org.eclipse.mylyn.commons.screenshots ............. SUCCESS [0.595s]
[INFO] org.eclipse.mylyn.commons.ui ...................... SUCCESS [0.977s]
[INFO] org.eclipse.mylyn.commons.workbench ............... SUCCESS [0.644s]
[INFO] org.eclipse.mylyn.commons ......................... SUCCESS [0.238s]
[INFO] org.eclipse.mylyn.commons.identity.core ........... SUCCESS [0.333s]
[INFO] org.eclipse.mylyn.commons.identity ................ SUCCESS [1.638s]
[INFO] org.eclipse.mylyn.commons.net ..................... SUCCESS [0.524s]
[INFO] org.eclipse.mylyn.commons.notifications.core ...... SUCCESS [0.275s]
[INFO] org.eclipse.mylyn.commons.notifications.feed ...... SUCCESS [0.318s]
[INFO] org.eclipse.mylyn.commons.notifications.ui ........ SUCCESS [0.516s]
[INFO] org.eclipse.mylyn.commons.notifications ........... SUCCESS [0.264s]
[INFO] org.eclipse.mylyn.commons.repositories.core ....... SUCCESS [0.363s]
[INFO] org.eclipse.mylyn.commons.repositories.ui ......... SUCCESS [0.693s]
[INFO] org.eclipse.mylyn.commons.repositories ............ SUCCESS [0.169s]
[INFO] org.eclipse.mylyn.monitor.core .................... SUCCESS [0.373s]
[INFO] Mylyn Context ..................................... SUCCESS [0.044s]
[INFO] org.eclipse.mylyn.context.core .................... SUCCESS [0.504s]
[INFO] org.eclipse.mylyn.monitor.ui ...................... SUCCESS [0.378s]
[INFO] org.eclipse.mylyn.context.ui ...................... SUCCESS [0.690s]
[INFO] Mylyn Tasks ....................................... SUCCESS [0.046s]
[INFO] org.eclipse.mylyn.tasks.core ...................... SUCCESS [1.126s]
[INFO] org.eclipse.mylyn.discovery.core .................. SUCCESS [0.391s]
[INFO] org.eclipse.mylyn.discovery.ui .................... SUCCESS [0.614s]
[INFO] org.eclipse.mylyn.tasks.ui ........................ SUCCESS [2.999s]
[INFO] org.eclipse.mylyn.context.tasks.ui ................ SUCCESS [0.637s]
[INFO] org.eclipse.mylyn.discovery ....................... SUCCESS [0.138s]
[INFO] org.eclipse.mylyn.monitor ......................... SUCCESS [0.147s]
[INFO] org.eclipse.mylyn.tasks.index.core ................ SUCCESS [0.586s]
[INFO] org.eclipse.mylyn.tasks.index.ui .................. SUCCESS [0.513s]
[INFO] org.eclipse.mylyn.tasks.search .................... SUCCESS [0.796s]
[INFO] org.eclipse.mylyn_feature ......................... SUCCESS [0.644s]
[INFO] org.eclipse.mylyn.resources.ui .................... SUCCESS [0.543s]
[INFO] org.eclipse.mylyn.context_feature ................. SUCCESS [0.225s]
[INFO] org.eclipse.cdt.mylyn.ui .......................... SUCCESS [0.577s]
[INFO] org.eclipse.cdt.mylyn ............................. SUCCESS [0.194s]
[INFO] org.eclipse.mylyn.commons.xmlrpc .................. SUCCESS [0.312s]
[INFO] org.eclipse.mylyn.bugzilla.core ................... SUCCESS [1.118s]
[INFO] org.eclipse.mylyn.bugzilla.ui ..................... SUCCESS [0.859s]
[INFO] org.eclipse.mylyn.bugzilla_feature ................ SUCCESS [0.292s]
[INFO] Mylyn Versions .................................... SUCCESS [0.040s]
[INFO] org.eclipse.mylyn.versions.core ................... SUCCESS [0.222s]
[INFO] org.eclipse.mylyn.cvs.core ........................ SUCCESS [0.207s]
[INFO] org.eclipse.mylyn.versions.ui ..................... SUCCESS [0.380s]
[INFO] org.eclipse.mylyn.versions ........................ SUCCESS [0.105s]
[INFO] org.eclipse.mylyn.cvs ............................. SUCCESS [0.099s]
[INFO] Mylyn Reviews ..................................... SUCCESS [0.045s]
[INFO] org.eclipse.mylyn.reviews.core .................... SUCCESS [1.042s]
[INFO] org.eclipse.mylyn.reviews.edit .................... SUCCESS [0.388s]
[INFO] org.eclipse.mylyn.gerrit.core ..................... SUCCESS [0.634s]
[INFO] org.eclipse.mylyn.reviews.ui ...................... SUCCESS [0.718s]
[INFO] org.eclipse.mylyn.reviews.feature ................. SUCCESS [0.218s]
[INFO] org.eclipse.mylyn.gerrit.ui ....................... SUCCESS [0.675s]
[INFO] org.eclipse.mylyn.gerrit.feature .................. SUCCESS [0.157s]
[INFO] org.eclipse.mylyn.gerrit.dashboard.core ........... SUCCESS [0.208s]
[INFO] org.eclipse.mylyn.gerrit.dashboard.ui ............. SUCCESS [0.632s]
[INFO] org.eclipse.mylyn.gerrit.dashboard.feature ........ SUCCESS [0.169s]
[INFO] org.eclipse.mylyn.git.core ........................ SUCCESS [0.278s]
[INFO] org.eclipse.mylyn.git.ui .......................... SUCCESS [3.640s]
[INFO] org.eclipse.mylyn.git ............................. SUCCESS [0.373s]
[INFO] Mylyn Builds ...................................... SUCCESS [0.045s]
[INFO] org.eclipse.mylyn.builds.core ..................... SUCCESS [0.468s]
[INFO] org.eclipse.mylyn.team.ui ......................... SUCCESS [0.619s]
[INFO] org.eclipse.mylyn.team_feature .................... SUCCESS [0.212s]
[INFO] org.eclipse.mylyn.builds.ui ....................... SUCCESS [1.109s]
[INFO] org.eclipse.mylyn.builds .......................... SUCCESS [0.128s]
[INFO] org.eclipse.mylyn.commons.repositories.http.core .. SUCCESS [0.333s]
[INFO] org.eclipse.mylyn.commons.repositories.http ....... SUCCESS [0.164s]
[INFO] org.eclipse.mylyn.hudson.core ..................... SUCCESS [0.503s]
[INFO] org.eclipse.mylyn.hudson.ui ....................... SUCCESS [0.490s]
[INFO] org.eclipse.mylyn.hudson .......................... SUCCESS [0.151s]
[INFO] org.eclipse.mylyn.bugzilla.ide .................... SUCCESS [0.183s]
[INFO] org.eclipse.mylyn.ide.ui .......................... SUCCESS [0.429s]
[INFO] org.eclipse.mylyn.tasks.bugs ...................... SUCCESS [0.743s]
[INFO] org.eclipse.mylyn.help.ui ......................... SUCCESS [0.535s]
[INFO] org.eclipse.mylyn.tasks.ide ....................... SUCCESS [0.400s]
[INFO] org.eclipse.mylyn.ide_feature ..................... SUCCESS [0.226s]
[INFO] org.eclipse.mylyn.debug.ui ........................ SUCCESS [0.523s]
[INFO] org.eclipse.mylyn.ide.ant ......................... SUCCESS [0.722s]
[INFO] org.eclipse.mylyn.java.tasks ...................... SUCCESS [0.711s]
[INFO] org.eclipse.mylyn.java.ui ......................... SUCCESS [1.094s]
[INFO] org.eclipse.mylyn.java_feature .................... SUCCESS [0.293s]
[INFO] org.eclipse.mylyn.pde.ui .......................... SUCCESS [0.723s]
[INFO] org.eclipse.mylyn.pde_feature ..................... SUCCESS [0.206s]
[INFO] org.eclipse.mylyn.team.cvs ........................ SUCCESS [0.591s]
[INFO] org.eclipse.mylyn.team.cvs ........................ SUCCESS [0.246s]
[INFO] org.eclipse.mylyn.subclipse.core .................. SUCCESS [0.258s]
[INFO] org.eclipse.mylyn.subclipse.ui .................... SUCCESS [0.313s]
[INFO] org.eclipse.mylyn.subclipse ....................... SUCCESS [0.097s]
[INFO] org.eclipse.mylyn.trac.core ....................... SUCCESS [0.730s]
[INFO] org.eclipse.mylyn.trac.ui ......................... SUCCESS [0.843s]
[INFO] org.eclipse.mylyn.trac_feature .................... SUCCESS [0.372s]
[INFO] org.eclipse.mylyn.builds.sdk ...................... SUCCESS [0.184s]
[INFO] org.eclipse.mylyn.commons.sdk.util ................ SUCCESS [0.466s]
[INFO] org.eclipse.mylyn.commons.sdk ..................... SUCCESS [0.291s]
[INFO] org.eclipse.mylyn.context.sdk.util ................ SUCCESS [0.524s]
[INFO] org.eclipse.mylyn.context.sdk.java ................ SUCCESS [0.662s]
[INFO] org.eclipse.mylyn.context.sdk ..................... SUCCESS [0.416s]
[INFO] org.eclipse.mylyn.reviews.sdk.feature ............. SUCCESS [0.385s]
[INFO] org.eclipse.mylyn.tests.util ...................... SUCCESS [0.583s]
[INFO] org.eclipse.mylyn.sdk_feature ..................... SUCCESS [0.408s]
[INFO] org.eclipse.mylyn.bugzilla.tests .................. SUCCESS [13:41.719s]
[INFO] org.eclipse.mylyn.tasks.core.tests ................ SUCCESS [20.981s]
[INFO] org.eclipse.mylyn.tasks.tests ..................... SUCCESS [1:16.306s]
[INFO] org.eclipse.mylyn.tasks.index.tests ............... SUCCESS [15.254s]
[INFO] org.eclipse.mylyn.tasks.ui.tests .................. SUCCESS [58.438s]
[INFO] org.eclipse.mylyn.trac.tests ...................... SUCCESS [6.336s]
[INFO] org.eclipse.mylyn.trac.core.tests ................. SUCCESS [4.320s]
[INFO] org.eclipse.mylyn.trac.ui.tests ................... SUCCESS [6.043s]
[INFO] org.eclipse.mylyn.test_feature .................... SUCCESS [0.632s]
[INFO] org.eclipse.mylyn.versions.sdk .................... SUCCESS [0.135s]
[INFO] Mylyn for Eclipse 4.x ............................. SUCCESS [20.112s]
[INFO] org.eclipse.mylyn-target .......................... SUCCESS [1.156s]
[INFO] org.eclipse.mylyn.commons.tck ..................... SUCCESS [0.199s]
[INFO] Mylyn Commons ..................................... SUCCESS [2.730s]
[INFO] org.eclipse.mylyn.commons-target .................. SUCCESS [0.046s]
[INFO] org.eclipse.mylyn.commons.tests ................... SUCCESS [15.873s]
[INFO] org.eclipse.mylyn.commons.ui.tests ................ SUCCESS [5.594s]
[INFO] org.eclipse.mylyn.commons.activity.ui ............. SUCCESS [0.366s]
[INFO] org.eclipse.mylyn.commons.activity ................ SUCCESS [1.451s]
[INFO] org.eclipse.mylyn.commons.activity.tests .......... SUCCESS [4.553s]
[INFO] org.eclipse.mylyn.monitor.tests ................... SUCCESS [6.016s]
[INFO] org.eclipse.mylyn.commons.notifications.tests ..... SUCCESS [5.361s]
[INFO] org.eclipse.mylyn.commons.repositories.http.tests . SUCCESS [7.984s]
[INFO] org.eclipse.mylyn.commons.repositories.tests ...... SUCCESS [7.303s]
[INFO] org.eclipse.mylyn.discovery.tests ................. SUCCESS [12.371s]
[INFO] org.eclipse.mylyn.commons.development ............. SUCCESS [0.237s]
[INFO] org.eclipse.mylyn.commons.identity.ui ............. SUCCESS [0.497s]
[INFO] Mylyn Versions .................................... SUCCESS [2.744s]
[INFO] org.eclipse.mylyn.versions.tests .................. SUCCESS [5.607s]
[INFO] org.eclipse.mylyn.versions.development ............ SUCCESS [0.132s]
[INFO] org.eclipse.mylyn.help.sdk ........................ SUCCESS [0.434s]
[INFO] org.eclipse.mylyn.tasks.index ..................... SUCCESS [0.371s]
[INFO] Mylyn Tasks ....................................... SUCCESS [3.155s]
[INFO] org.eclipse.mylyn.tasks-target .................... SUCCESS [0.046s]
[INFO] org.eclipse.mylyn.tasks.activity.core ............. SUCCESS [0.448s]
[INFO] org.eclipse.mylyn.tasks.activity.ui ............... SUCCESS [1.035s]
[INFO] org.eclipse.mylyn.tasks.activity.tests ............ SUCCESS [12.103s]
[INFO] org.eclipse.mylyn.tasks.connector-bugzilla-rest ... SUCCESS [0.044s]
[INFO] org.eclipse.mylyn.bugzilla.rest.core .............. SUCCESS [0.836s]
[INFO] org.eclipse.mylyn.bugzilla.rest.ui ................ SUCCESS [0.775s]
[INFO] org.eclipse.mylyn.bugzilla.rest ................... SUCCESS [0.477s]
[INFO] org.eclipse.mylyn.bugzilla.rest.core.tests ........ SUCCESS [5:23.098s]
[INFO] org.eclipse.mylyn.bugzilla.rest.tests ............. SUCCESS [14.681s]
[INFO] org.eclipse.mylyn.bugzilla.rest.ui.tests .......... SUCCESS [7.184s]
[INFO] org.eclipse.mylyn.cdt.tests ....................... SUCCESS [10.431s]
[INFO] Mylyn Context ..................................... SUCCESS [2.806s]
[INFO] org.eclipse.mylyn.context-target .................. SUCCESS [0.047s]
[INFO] org.eclipse.mylyn.context.tasks.tests ............. SUCCESS [12.902s]
[INFO] org.eclipse.mylyn.context.tests ................... SUCCESS [9.867s]
[INFO] org.eclipse.mylyn.debug.tests ..................... SUCCESS [9.164s]
[INFO] org.eclipse.mylyn.ide.tests ....................... SUCCESS [8.954s]
[INFO] org.eclipse.mylyn.java.tests ...................... SUCCESS [1:04.322s]
[INFO] org.eclipse.mylyn.resources.tests ................. SUCCESS [7.118s]
[INFO] org.eclipse.mylyn.team.tests ...................... SUCCESS [8.316s]
[INFO] org.eclipse.mylyn.context.development ............. SUCCESS [0.341s]
[INFO] org.eclipse.mylyn.context.tasks.ui.tests .......... SUCCESS [16.343s]
[INFO] Mylyn Builds ...................................... SUCCESS [2.699s]
[INFO] org.eclipse.mylyn.builds.tests .................... SUCCESS [7.346s]
[INFO] org.eclipse.mylyn.hudson.tests .................... SUCCESS [16.592s]
[INFO] org.eclipse.mylyn.builds.development .............. SUCCESS [0.182s]
[INFO] org.eclipse.mylyn.gerrit.core.tests ............... SUCCESS [5.424s]
[INFO] org.eclipse.mylyn.gerrit.target ................... SUCCESS [0.069s]
[INFO] org.eclipse.mylyn.gerrit.tests .................... SUCCESS [8.177s]
[INFO] org.eclipse.mylyn.gerrit.ui.tests ................. SUCCESS [8.317s]
[INFO] org.eclipse.mylyn.reviews.core.tests .............. SUCCESS [9.748s]
[INFO] org.eclipse.mylyn.reviews.tests ................... SUCCESS [8.404s]
[INFO] org.eclipse.mylyn.reviews.development.feature ..... SUCCESS [0.205s]
[INFO] org.eclipse.mylyn.reviews.ui.tests ................ SUCCESS [12.979s]
[INFO] org.eclipse.mylyn.reviews.site .................... SUCCESS [3.163s]
[INFO] org.eclipse.mylyn.all ............................. SUCCESS [2.878s]
[INFO] ------------------------------------------------------------------------
[INFO] BUILD SUCCESS
[INFO] ------------------------------------------------------------------------
[INFO] Total time: 34:11.643s
[INFO] Finished at: Thu Dec 28 18:17:02 EST 2017
[INFO] Final Memory: 609M/9466M
[INFO] ------------------------------------------------------------------------
[DEBUG] Closing connection to remote
[DEBUG] Waiting for process to finish
[DEBUG] Result: 0
Terminating xvnc.
Recording fingerprints
Archiving artifacts
Recording test results
Finished: UNSTABLE