FailedConsole Output

Started by user sam.davis@tasktop.com
Checkout:workspace / /home/hudson/genie.mylyn/.hudson/jobs/mylyn-test-build/workspace - hudson.remoting.LocalChannel@6db576a3
Using strategy: Default
Last Built Revision: Revision d9d4fdca68574becd7438e1ab481317ff2721a6f (refs/heads/master)
Checkout:workspace / /home/hudson/genie.mylyn/.hudson/jobs/mylyn-test-build/workspace - hudson.remoting.LocalChannel@6db576a3
Wiping out workspace first.
Cloning the remote Git repository
Cloning repository origin
Fetching upstream changes from git://git.eclipse.org/gitroot/mylyn/org.eclipse.mylyn.all
Commencing build of Revision bde58d00c63e0f881b75c8dfb455a42e5380cd94 (refs/heads/master)
Checking out Revision bde58d00c63e0f881b75c8dfb455a42e5380cd94 (refs/heads/master)
The origin is non-bare.
Starting xvnc
[workspace] $ Xvnc :962 -geometry 1024x768 -depth 24 -ac -SecurityTypes none -noreset
[workspace] $ /bin/sh -xe /tmp/hudson2842837756522880583.sh
+ cd org.eclipse.mylyn
+ sed '/.*org.eclipse.mylyn.tests.*/d' pom.xml
+ rm pom.xml
+ mv pom pom.xml
[workspace] $ /bin/sh -xe /tmp/hudson202678934113310682.sh
+ '[' '' '!=' '' ']'
+ '[' '' '!=' '' ']'
+ '[' '' '!=' '' ']'
+ '[' '' '!=' '' ']'
+ '[' '' '!=' '' ']'
+ '[' '' '!=' '' ']'
+ '[' '' '!=' '' ']'
+ '[' '' '!=' '' ']'
[INFO] Using Maven 3 installation: Maven 3.0.5
[INFO] Checking Maven 3 installation environment
[workspace] $ /shared/common/apache-maven-3.0.5/bin/mvn --help
[INFO] Checking Maven 3 installation version
[INFO] Detected Maven 3 installation version: 3.0.5
[workspace] $ /shared/common/apache-maven-3.0.5/bin/mvn -Pmars -Ptest-build clean verify help:effective-pom -V -B -DGERRIT_REFSPEC_DOCS= -DGERRIT_REFSPEC_REVIEWS= -DGERRIT_REFSPEC= -DGERRIT_REFSPEC_COMMONS= -DGERRIT_REFSPEC_BUILDS= -DGERRIT_REFSPEC_VERSIONS= -DGERRIT_REFSPEC_CONTEXT= -DGERRIT_REFSPEC_TASKS= -Dtest.component.skip=false -Dpack.skip=true -Dtest.integration.skip=false -Dmaven.test.skip=false -Dexplicit-target=true -Dtest.uservmargs=-Dorg.eclipse.mylyn.gerrit.tests.alternate.push=true -Dtest.integration.suite=org.eclipse.mylyn.tests.AllConnectorTests -Dmaven.test.failure.ignore=true -Dmaven.test.error.ignore=true -Dmaven.ext.class.path=/home/hudson/genie.mylyn/.hudson/maven/slavebundle/resources:/home/hudson/genie.mylyn/.hudson/maven/slavebundle/lib/maven3-eventspy-3.0.jar:/home/hudson/genie.mylyn/.hudson/war/webapp/WEB-INF/lib/hudson-remoting-3.0.0.jar -Dhudson.eventspy.port=55477 -Dmaven.repo.local=/home/hudson/genie.mylyn/.hudson/jobs/mylyn-test-build/workspace/.maven/repo -f pom.xml
[DEBUG] Waiting for connection on port: 55477

Xvnc TigerVNC 1.4.1 - built ??? ?? ???? ??:??:??
Copyright (C) 1999-2013 TigerVNC Team and many others (see README.txt)
See http://www.tigervnc.org for information on TigerVNC.
Underlying X server release 11502000, The X.Org Foundation

Initializing built-in extension VNC-EXTENSION
Initializing built-in extension Generic Event Extension
Initializing built-in extension SHAPE
Initializing built-in extension MIT-SHM
Initializing built-in extension XInputExtension
Initializing built-in extension XTEST
Initializing built-in extension BIG-REQUESTS
Initializing built-in extension SYNC
Initializing built-in extension XKEYBOARD
Initializing built-in extension XC-MISC
Initializing built-in extension XFIXES
Initializing built-in extension RENDER
Initializing built-in extension RANDR
Initializing built-in extension COMPOSITE
Initializing built-in extension DAMAGE
Initializing built-in extension MIT-SCREEN-SAVER
Initializing built-in extension DOUBLE-BUFFER
Initializing built-in extension RECORD
Initializing built-in extension DPMS
Initializing built-in extension Present
Initializing built-in extension X-Resource
Initializing built-in extension XVideo
Initializing built-in extension XVideo-MotionCompensation
Initializing built-in extension GLX

Thu Dec 28 16:48:42 2017
 vncext:      VNC extension running!
 vncext:      Listening for VNC connections on all interface(s), port 6862
 vncext:      created VNC server for screen 0
Apache Maven 3.0.5 (r01de14724cdef164cd33c7c8c2fe155faf9602da; 2013-02-19 08:51:28-0500)
Maven home: /shared/common/apache-maven-3.0.5
Java version: 1.8.0_131, vendor: Oracle Corporation
Java home: /opt/public/common/jdk1.8.0_131.x64/jre
Default locale: en_US, platform encoding: UTF-8
OS name: "linux", version: "3.12.60-52.54-default", arch: "amd64", family: "unix"
[dix] Could not init font path element /usr/share/fonts/TTF/, removing from list!
[dix] Could not init font path element /usr/share/fonts/OTF/, removing from list!
[DEBUG] Connected to remote
[INFO] Scanning for projects...
[INFO] o.h.m.e.h.MavenExecutionResultHandler - Build failed with exception(s)
[INFO] o.h.m.e.h.MavenExecutionResultHandler - [1] org.apache.maven.project.ProjectBuildingException: Some problems were encountered while processing the POMs:
[FATAL] Non-resolvable parent POM: Could not find artifact org.eclipse.mylyn:org.eclipse.mylyn-parent:pom:3.24.0-SNAPSHOT and 'parent.relativePath' points at wrong local POM @ line 6, column 11

[DEBUG] Closing connection to remote
[ERROR] The build could not read 1 project -> [Help 1]
[ERROR]   
[ERROR]   The project org.eclipse.mylyn:org.eclipse.mylyn.all:3.24.0-SNAPSHOT (/jobs/genie.mylyn/mylyn-test-build/workspace/pom.xml) has 1 error
[ERROR]     Non-resolvable parent POM: Could not find artifact org.eclipse.mylyn:org.eclipse.mylyn-parent:pom:3.24.0-SNAPSHOT and 'parent.relativePath' points at wrong local POM @ line 6, column 11 -> [Help 2]
[ERROR] 
[ERROR] To see the full stack trace of the errors, re-run Maven with the -e switch.
[ERROR] Re-run Maven using the -X switch to enable full debug logging.
[ERROR] 
[ERROR] For more information about the errors and possible solutions, please read the following articles:
[ERROR] [Help 1] http://cwiki.apache.org/confluence/display/MAVEN/ProjectBuildingException
[ERROR] [Help 2] http://cwiki.apache.org/confluence/display/MAVEN/UnresolvableModelException
[DEBUG] Waiting for process to finish
[DEBUG] Result: 1
Terminating xvnc.
Recording fingerprints
Archiving artifacts
Recording test results
Finished: FAILURE