UnstableConsole Output

Skipping 1,527 KB.. Full Log
st
  [javadoc] import com.google.common.base.Objects;
  [javadoc]                              ^
  [javadoc] /jobs/genie.mylyn/mylyn-test-build/workspace/org.eclipse.mylyn.docs/org.eclipse.mylyn.wikitext.core/src/org/eclipse/mylyn/wikitext/core/parser/builder/event/ImageLinkEvent.java:14: error: package com.google.common.base does not exist
  [javadoc] import static com.google.common.base.Preconditions.checkNotNull;
  [javadoc]                                     ^
  [javadoc] /jobs/genie.mylyn/mylyn-test-build/workspace/org.eclipse.mylyn.docs/org.eclipse.mylyn.wikitext.core/src/org/eclipse/mylyn/wikitext/core/parser/builder/event/ImageLinkEvent.java:14: error: static import only from classes and interfaces
  [javadoc] import static com.google.common.base.Preconditions.checkNotNull;
  [javadoc] ^
  [javadoc] /jobs/genie.mylyn/mylyn-test-build/workspace/org.eclipse.mylyn.docs/org.eclipse.mylyn.wikitext.core/src/org/eclipse/mylyn/wikitext/core/parser/builder/event/ImageLinkEvent.java:19: error: package com.google.common.base does not exist
  [javadoc] import com.google.common.base.Objects;
  [javadoc]                              ^
  [javadoc] /jobs/genie.mylyn/mylyn-test-build/workspace/org.eclipse.mylyn.docs/org.eclipse.mylyn.wikitext.core/src/org/eclipse/mylyn/wikitext/core/parser/builder/event/LineBreakEvent.java:16: error: package com.google.common.base does not exist
  [javadoc] import com.google.common.base.Objects;
  [javadoc]                              ^
  [javadoc] /jobs/genie.mylyn/mylyn-test-build/workspace/org.eclipse.mylyn.docs/org.eclipse.mylyn.wikitext.core/src/org/eclipse/mylyn/wikitext/core/parser/builder/event/LinkEvent.java:14: error: package com.google.common.base does not exist
  [javadoc] import static com.google.common.base.Preconditions.checkNotNull;
  [javadoc]                                     ^
  [javadoc] /jobs/genie.mylyn/mylyn-test-build/workspace/org.eclipse.mylyn.docs/org.eclipse.mylyn.wikitext.core/src/org/eclipse/mylyn/wikitext/core/parser/builder/event/LinkEvent.java:14: error: static import only from classes and interfaces
  [javadoc] import static com.google.common.base.Preconditions.checkNotNull;
  [javadoc] ^
  [javadoc] /jobs/genie.mylyn/mylyn-test-build/workspace/org.eclipse.mylyn.docs/org.eclipse.mylyn.wikitext.core/src/org/eclipse/mylyn/wikitext/core/parser/builder/event/LinkEvent.java:19: error: package com.google.common.base does not exist
  [javadoc] import com.google.common.base.Objects;
  [javadoc]                              ^
  [javadoc] /jobs/genie.mylyn/mylyn-test-build/workspace/org.eclipse.mylyn.docs/org.eclipse.mylyn.wikitext.core/src/org/eclipse/mylyn/wikitext/core/parser/markup/MarkupLanguageProvider.java:14: error: package com.google.common.base does not exist
  [javadoc] import static com.google.common.base.Preconditions.checkNotNull;
  [javadoc]                                     ^
  [javadoc] /jobs/genie.mylyn/mylyn-test-build/workspace/org.eclipse.mylyn.docs/org.eclipse.mylyn.wikitext.core/src/org/eclipse/mylyn/wikitext/core/parser/markup/MarkupLanguageProvider.java:14: error: static import only from classes and interfaces
  [javadoc] import static com.google.common.base.Preconditions.checkNotNull;
  [javadoc] ^
  [javadoc] Creating destination directory: "/jobs/genie.mylyn/mylyn-test-build/workspace/org.eclipse.mylyn.docs/org.eclipse.mylyn.wikitext-standalone/target/wikitext-apidoc/"
  [javadoc] Standard Doclet version 1.8.0_51
  [javadoc] Building tree for all the packages and classes...
  [javadoc] /jobs/genie.mylyn/mylyn-test-build/workspace/org.eclipse.mylyn.docs/org.eclipse.mylyn.wikitext.core/src/org/eclipse/mylyn/wikitext/core/parser/markup/MarkupLanguage.java:126: error: invalid use of @return
  [javadoc] 	 * @return the file extensions
  [javadoc] 	   ^
  [javadoc] /jobs/genie.mylyn/mylyn-test-build/workspace/org.eclipse.mylyn.docs/org.eclipse.mylyn.wikitext.mediawiki.core/src/org/eclipse/mylyn/wikitext/mediawiki/core/MediaWikiLanguage.java:76: error: reference not found
  [javadoc] 	 * @see MarkupLanguage#getInternalLinkPattern()
  [javadoc] 	        ^
  [javadoc] /jobs/genie.mylyn/mylyn-test-build/workspace/org.eclipse.mylyn.docs/org.eclipse.mylyn.wikitext.mediawiki.core/src/org/eclipse/mylyn/wikitext/mediawiki/core/MediaWikiLanguage.java:49: error: malformed HTML
  [javadoc]  * <a href="http://en.wikipedia.org/wiki/Wikitext">Wikitext markup</a>, which is the wiki format used by <a href=
  [javadoc]                                                                                                          ^
  [javadoc] /jobs/genie.mylyn/mylyn-test-build/workspace/org.eclipse.mylyn.docs/org.eclipse.mylyn.wikitext.mediawiki.core/src/org/eclipse/mylyn/wikitext/mediawiki/core/MediaWikiLanguage.java:50: error: bad use of '>'
  [javadoc]  * "http://www.wikipedia.org>WikiPedia</a> and <a href="http://www.wikimedia.org/">several other major sites</a>.
  [javadoc]                             ^
  [javadoc] /jobs/genie.mylyn/mylyn-test-build/workspace/org.eclipse.mylyn.docs/org.eclipse.mylyn.wikitext.mediawiki.core/src/org/eclipse/mylyn/wikitext/mediawiki/core/MediaWikiLanguage.java:50: error: unexpected end tag: </a>
  [javadoc]  * "http://www.wikipedia.org>WikiPedia</a> and <a href="http://www.wikimedia.org/">several other major sites</a>.
  [javadoc]                                       ^
  [javadoc] /jobs/genie.mylyn/mylyn-test-build/workspace/org.eclipse.mylyn.docs/org.eclipse.mylyn.wikitext.core/src/org/eclipse/mylyn/wikitext/core/parser/markup/Block.java:57: error: reference not found
  [javadoc] 	 * {@link #processLine(String, int, int)}. Calling this method must cause any previous state to be reset. Note that
  [javadoc] 	          ^
  [javadoc] /jobs/genie.mylyn/mylyn-test-build/workspace/org.eclipse.mylyn.docs/org.eclipse.mylyn.wikitext.core/src/org/eclipse/mylyn/wikitext/core/parser/markup/block/BugzillaQuoteBlock.java:23: error: bad use of '>'
  [javadoc]  * A quote block that detects lines that start with '>' (email-style quoting)
  [javadoc]                                                      ^
  [javadoc] /jobs/genie.mylyn/mylyn-test-build/workspace/org.eclipse.mylyn.docs/org.eclipse.mylyn.wikitext.core/src/org/eclipse/mylyn/wikitext/core/parser/markup/block/EclipseErrorDetailsBlock.java:24: error: reference not found
  [javadoc]  * block terminates with the first {@link MarkupLanguage#isEmptyLine(String) empty line}.
  [javadoc]                                           ^
  [javadoc] /jobs/genie.mylyn/mylyn-test-build/workspace/org.eclipse.mylyn.docs/org.eclipse.mylyn.wikitext.core/src/org/eclipse/mylyn/wikitext/core/validation/ValidationProblem.java:53: error: malformed HTML
  [javadoc] 	 *             if the severity is invalid, the offset is < 0, the length is < 0, or if no message is provided
  [javadoc] 	                                                         ^
  [javadoc] /jobs/genie.mylyn/mylyn-test-build/workspace/org.eclipse.mylyn.docs/org.eclipse.mylyn.wikitext.core/src/org/eclipse/mylyn/wikitext/core/validation/ValidationProblem.java:53: error: malformed HTML
  [javadoc] 	 *             if the severity is invalid, the offset is < 0, the length is < 0, or if no message is provided
  [javadoc] 	                                                                            ^
  [javadoc] /jobs/genie.mylyn/mylyn-test-build/workspace/org.eclipse.mylyn.docs/org.eclipse.mylyn.wikitext.core/src/org/eclipse/mylyn/wikitext/core/parser/builder/event/DocumentBuilderEvent.java:25: error: unknown tag: noextend
  [javadoc]  * @noextend This class is not intended to be subclassed by clients.
  [javadoc]    ^
  [javadoc] /jobs/genie.mylyn/mylyn-test-build/workspace/org.eclipse.mylyn.docs/org.eclipse.mylyn.wikitext.core/src/org/eclipse/mylyn/wikitext/core/parser/builder/event/DocumentBuilderEvents.java:30: error: unknown tag: noextend
  [javadoc]  * @noextend This class is not intended to be subclassed by clients.
  [javadoc]    ^
  [javadoc] /jobs/genie.mylyn/mylyn-test-build/workspace/org.eclipse.mylyn.docs/org.eclipse.mylyn.wikitext.core/src/org/eclipse/mylyn/wikitext/core/parser/DocumentBuilder.java:205: error: bad use of '>'
  [javadoc] 	 * <code>&lt;a href="...">&lt;img src="..."/>&lt;/a></code>. In this case if the attributes define a css class then
  [javadoc] 	                         ^
  [javadoc] /jobs/genie.mylyn/mylyn-test-build/workspace/org.eclipse.mylyn.docs/org.eclipse.mylyn.wikitext.core/src/org/eclipse/mylyn/wikitext/core/parser/DocumentBuilder.java:205: error: bad use of '>'
  [javadoc] 	 * <code>&lt;a href="...">&lt;img src="..."/>&lt;/a></code>. In this case if the attributes define a css class then
  [javadoc] 	                                            ^
  [javadoc] /jobs/genie.mylyn/mylyn-test-build/workspace/org.eclipse.mylyn.docs/org.eclipse.mylyn.wikitext.core/src/org/eclipse/mylyn/wikitext/core/parser/DocumentBuilder.java:205: error: bad use of '>'
  [javadoc] 	 * <code>&lt;a href="...">&lt;img src="..."/>&lt;/a></code>. In this case if the attributes define a css class then
  [javadoc] 	                                                   ^
  [javadoc] /jobs/genie.mylyn/mylyn-test-build/workspace/org.eclipse.mylyn.docs/org.eclipse.mylyn.wikitext.core/src/org/eclipse/mylyn/wikitext/core/parser/DocumentBuilder.java:206: error: bad use of '>'
  [javadoc] 	 * the resulting HTML should look like this: <code>&lt;a href="...">&lt;img src="..." class="..."/>&lt;/a></code>
  [javadoc] 	                                                                   ^
  [javadoc] /jobs/genie.mylyn/mylyn-test-build/workspace/org.eclipse.mylyn.docs/org.eclipse.mylyn.wikitext.core/src/org/eclipse/mylyn/wikitext/core/parser/DocumentBuilder.java:206: error: bad use of '>'
  [javadoc] 	 * the resulting HTML should look like this: <code>&lt;a href="...">&lt;img src="..." class="..."/>&lt;/a></code>
  [javadoc] 	                                                                                                  ^
  [javadoc] /jobs/genie.mylyn/mylyn-test-build/workspace/org.eclipse.mylyn.docs/org.eclipse.mylyn.wikitext.core/src/org/eclipse/mylyn/wikitext/core/parser/DocumentBuilder.java:206: error: bad use of '>'
  [javadoc] 	 * the resulting HTML should look like this: <code>&lt;a href="...">&lt;img src="..." class="..."/>&lt;/a></code>
  [javadoc] 	                                                                                                         ^
  [javadoc] /jobs/genie.mylyn/mylyn-test-build/workspace/org.eclipse.mylyn.docs/org.eclipse.mylyn.wikitext.core/src/org/eclipse/mylyn/wikitext/core/parser/DocumentBuilder.java:222: error: bad use of '>'
  [javadoc] 	 * <code>&lt;a href="...">&lt;img src="..."/>&lt;/a></code>. In this case if the attributes define a css class then
  [javadoc] 	                         ^
  [javadoc] /jobs/genie.mylyn/mylyn-test-build/workspace/org.eclipse.mylyn.docs/org.eclipse.mylyn.wikitext.core/src/org/eclipse/mylyn/wikitext/core/parser/DocumentBuilder.java:222: error: bad use of '>'
  [javadoc] 	 * <code>&lt;a href="...">&lt;img src="..."/>&lt;/a></code>. In this case if the attributes define a css class then
  [javadoc] 	                                            ^
  [javadoc] /jobs/genie.mylyn/mylyn-test-build/workspace/org.eclipse.mylyn.docs/org.eclipse.mylyn.wikitext.core/src/org/eclipse/mylyn/wikitext/core/parser/DocumentBuilder.java:222: error: bad use of '>'
  [javadoc] 	 * <code>&lt;a href="...">&lt;img src="..."/>&lt;/a></code>. In this case if the attributes define a css class then
  [javadoc] 	                                                   ^
  [javadoc] /jobs/genie.mylyn/mylyn-test-build/workspace/org.eclipse.mylyn.docs/org.eclipse.mylyn.wikitext.core/src/org/eclipse/mylyn/wikitext/core/parser/DocumentBuilder.java:223: error: bad use of '>'
  [javadoc] 	 * the resulting HTML should look like this: <code>&lt;a href="...">&lt;img src="..." class="..."/>&lt;/a></code>
  [javadoc] 	                                                                   ^
  [javadoc] /jobs/genie.mylyn/mylyn-test-build/workspace/org.eclipse.mylyn.docs/org.eclipse.mylyn.wikitext.core/src/org/eclipse/mylyn/wikitext/core/parser/DocumentBuilder.java:223: error: bad use of '>'
  [javadoc] 	 * the resulting HTML should look like this: <code>&lt;a href="...">&lt;img src="..." class="..."/>&lt;/a></code>
  [javadoc] 	                                                                                                  ^
  [javadoc] /jobs/genie.mylyn/mylyn-test-build/workspace/org.eclipse.mylyn.docs/org.eclipse.mylyn.wikitext.core/src/org/eclipse/mylyn/wikitext/core/parser/DocumentBuilder.java:223: error: bad use of '>'
  [javadoc] 	 * the resulting HTML should look like this: <code>&lt;a href="...">&lt;img src="..." class="..."/>&lt;/a></code>
  [javadoc] 	                                                                                                         ^
  [javadoc] /jobs/genie.mylyn/mylyn-test-build/workspace/org.eclipse.mylyn.docs/org.eclipse.mylyn.wikitext.core/src/org/eclipse/mylyn/wikitext/core/parser/outline/OutlineItem.java:126: error: malformed HTML
  [javadoc] 	 * the level of the document which is positive and usually <= 6 except for the root item where the value is
  [javadoc] 	                                                           ^
  [javadoc] /jobs/genie.mylyn/mylyn-test-build/workspace/org.eclipse.mylyn.docs/org.eclipse.mylyn.wikitext.twiki.core/src/org/eclipse/mylyn/wikitext/twiki/core/TWikiLanguage.java:106: error: reference not found
  [javadoc] 	 * @see #getInternalPageHrefPrefix()
  [javadoc] 	        ^
  [javadoc] /jobs/genie.mylyn/mylyn-test-build/workspace/org.eclipse.mylyn.docs/org.eclipse.mylyn.wikitext.core/src/org/eclipse/mylyn/wikitext/core/util/ServiceLocator.java:270: error: @param name not found
  [javadoc] 	 * @param resourceUrl
  [javadoc] 	          ^
  [javadoc] /jobs/genie.mylyn/mylyn-test-build/workspace/org.eclipse.mylyn.docs/org.eclipse.mylyn.wikitext.core/src/org/eclipse/mylyn/wikitext/core/util/ServiceLocator.java:55: error: unexpected end tag: </p>
  [javadoc]  * </p>
  [javadoc]    ^
  [javadoc] /jobs/genie.mylyn/mylyn-test-build/workspace/org.eclipse.mylyn.docs/org.eclipse.mylyn.wikitext.core.osgi/src/org/eclipse/mylyn/wikitext/core/osgi/OsgiServiceLocator.java:36: error: reference not found
  [javadoc]  * A {@link ServiceLocator} for use in an OSGi runtime environment. Uses OSGI {@link Bundle bundles} to load markup
  [javadoc]                                                                                      ^
  [javadoc] /jobs/genie.mylyn/mylyn-test-build/workspace/org.eclipse.mylyn.docs/org.eclipse.mylyn.wikitext.creole.core/src/org/eclipse/mylyn/wikitext/creole/core/CreoleLanguage.java:57: error: reference not found
  [javadoc] 	 * @see WikiWordReplacementToken
  [javadoc] 	        ^
  [javadoc] /jobs/genie.mylyn/mylyn-test-build/workspace/org.eclipse.mylyn.docs/org.eclipse.mylyn.wikitext.creole.core/src/org/eclipse/mylyn/wikitext/creole/core/CreoleLanguage.java:69: error: reference not found
  [javadoc] 	 * @see #getInternalPageHrefPrefix()
  [javadoc] 	        ^
  [javadoc] /jobs/genie.mylyn/mylyn-test-build/workspace/org.eclipse.mylyn.docs/org.eclipse.mylyn.wikitext.core/src/org/eclipse/mylyn/wikitext/core/parser/util/MarkupToEclipseToc.java:186: error: bad use of '>'
  [javadoc] 	 *            a number >= 0 and <= 6
  [javadoc] 	                       ^
  [javadoc] /jobs/genie.mylyn/mylyn-test-build/workspace/org.eclipse.mylyn.docs/org.eclipse.mylyn.wikitext.core/src/org/eclipse/mylyn/wikitext/core/parser/util/MarkupToEclipseToc.java:186: error: malformed HTML
  [javadoc] 	 *            a number >= 0 and <= 6
  [javadoc] 	                                ^
  [javadoc] /jobs/genie.mylyn/mylyn-test-build/workspace/org.eclipse.mylyn.docs/org.eclipse.mylyn.wikitext.tracwiki.core/src/org/eclipse/mylyn/wikitext/tracwiki/core/TracWikiLanguage.java:67: error: reference not found
  [javadoc] 	 * @see MarkupLanguage#getInternalLinkPattern()
  [javadoc] 	        ^
  [javadoc] /jobs/genie.mylyn/mylyn-test-build/workspace/org.eclipse.mylyn.docs/org.eclipse.mylyn.wikitext.core/src/org/eclipse/mylyn/wikitext/core/parser/builder/AbstractMarkupDocumentBuilder.java:303: error: reference not found
  [javadoc] 	 * Indicate that the next content to be emitted requires adjacent {@link #isSeparator(char) separator}. When
  [javadoc] 	                                                                         ^
  [javadoc] /jobs/genie.mylyn/mylyn-test-build/workspace/org.eclipse.mylyn.docs/org.eclipse.mylyn.wikitext.core/src/org/eclipse/mylyn/wikitext/core/parser/builder/AbstractXmlDocumentBuilder.java:50: error: unknown tag: noreference
  [javadoc] 	 * @noreference This method is not intended to be referenced by clients.
  [javadoc] 	   ^
  [javadoc] /jobs/genie.mylyn/mylyn-test-build/workspace/org.eclipse.mylyn.docs/org.eclipse.mylyn.wikitext.core/src/org/eclipse/mylyn/wikitext/core/parser/builder/AbstractXmlDocumentBuilder.java:126: error: reference not found
  [javadoc] 	 * value is false. Ignored unless {@link #isEmitAsDocument()}
  [javadoc] 	                                         ^
  [javadoc] /jobs/genie.mylyn/mylyn-test-build/workspace/org.eclipse.mylyn.docs/org.eclipse.mylyn.wikitext.core/src/org/eclipse/mylyn/wikitext/core/parser/builder/AbstractXmlDocumentBuilder.java:134: error: reference not found
  [javadoc] 	 * value is false. Ignored unless {@link #isEmitAsDocument()}
  [javadoc] 	                                         ^
  [javadoc] /jobs/genie.mylyn/mylyn-test-build/workspace/org.eclipse.mylyn.docs/org.eclipse.mylyn.wikitext.core/src/org/eclipse/mylyn/wikitext/core/parser/builder/DitaBookMapDocumentBuilder.java:37: error: reference not found
  [javadoc]  * @see MarkupToDitaTask
  [javadoc]         ^
  [javadoc] /jobs/genie.mylyn/mylyn-test-build/workspace/org.eclipse.mylyn.docs/org.eclipse.mylyn.wikitext.core/src/org/eclipse/mylyn/wikitext/core/parser/builder/DocBookDocumentBuilder.java:37: error: bad use of '>'
  [javadoc]  * @author Peter Friese bug 273355 Support image scaling for Textile -> DocBook
  [javadoc]                                                                       ^
  [javadoc] /jobs/genie.mylyn/mylyn-test-build/workspace/org.eclipse.mylyn.docs/org.eclipse.mylyn.wikitext.core/src/org/eclipse/mylyn/wikitext/core/parser/builder/DocBookDocumentBuilder.java:39: error: reference not found
  [javadoc]  * @see MarkupToDocbookTask
  [javadoc]         ^
  [javadoc] /jobs/genie.mylyn/mylyn-test-build/workspace/org.eclipse.mylyn.docs/org.eclipse.mylyn.wikitext.core/src/org/eclipse/mylyn/wikitext/core/parser/builder/HtmlDocumentBuilder.java:396: error: bad use of '>'
  [javadoc] 	 *   &lt;link type="text/css" rel="stylesheet" href="url"/>
  [javadoc] 	                                                          ^
  [javadoc] /jobs/genie.mylyn/mylyn-test-build/workspace/org.eclipse.mylyn.docs/org.eclipse.mylyn.wikitext.core/src/org/eclipse/mylyn/wikitext/core/parser/builder/HtmlDocumentBuilder.java:401: error: invalid use of @return
  [javadoc] 	 * @return the stylesheet, whose attributes may be modified
  [javadoc] 	   ^
  [javadoc] /jobs/genie.mylyn/mylyn-test-build/workspace/org.eclipse.mylyn.docs/org.eclipse.mylyn.wikitext.core/src/org/eclipse/mylyn/wikitext/core/parser/builder/HtmlDocumentBuilder.java:425: error: invalid use of @return
  [javadoc] 	 * @return the stylesheet, whose attributes may be modified
  [javadoc] 	   ^
  [javadoc] /jobs/genie.mylyn/mylyn-test-build/workspace/org.eclipse.mylyn.docs/org.eclipse.mylyn.wikitext.core/src/org/eclipse/mylyn/wikitext/core/parser/builder/HtmlDocumentHandler.java:28: error: unknown tag: Override
  [javadoc]  * 	@Override
  [javadoc]    	^
  [javadoc] /jobs/genie.mylyn/mylyn-test-build/workspace/org.eclipse.mylyn.docs/org.eclipse.mylyn.wikitext.core/src/org/eclipse/mylyn/wikitext/core/parser/builder/HtmlDocumentHandler.java:36: error: unknown tag: Override
  [javadoc]  * 	@Override
  [javadoc]    	^
  [javadoc] /jobs/genie.mylyn/mylyn-test-build/workspace/org.eclipse.mylyn.docs/org.eclipse.mylyn.wikitext.core/src/org/eclipse/mylyn/wikitext/core/parser/builder/XslfoDocumentBuilder.java:1612: error: @param name not found
  [javadoc] 		 * @param boduMargins
  [javadoc] 		          ^
  [javadoc] /jobs/genie.mylyn/mylyn-test-build/workspace/org.eclipse.mylyn.docs/org.eclipse.mylyn.wikitext.html.core/src/org/eclipse/mylyn/wikitext/html/core/HtmlLanguage.java:37: error: bad use of '>'
  [javadoc]  * <li>{@link BlockType#CODE} maps to HTML tags <code>&lt;pre>&lt;code></code></li>
  [javadoc]                                                              ^
  [javadoc] /jobs/genie.mylyn/mylyn-test-build/workspace/org.eclipse.mylyn.docs/org.eclipse.mylyn.wikitext.html.core/src/org/eclipse/mylyn/wikitext/html/core/HtmlLanguage.java:37: error: bad use of '>'
  [javadoc]  * <li>{@link BlockType#CODE} maps to HTML tags <code>&lt;pre>&lt;code></code></li>
  [javadoc]                                                                       ^
  [javadoc] Building index for all the packages and classes...
  [javadoc] Building index for all classes...
  [javadoc] Generating /jobs/genie.mylyn/mylyn-test-build/workspace/org.eclipse.mylyn.docs/org.eclipse.mylyn.wikitext-standalone/target/wikitext-apidoc/help-doc.html...
  [javadoc] 49 errors
  [javadoc] 100 warnings
      [zip] Building zip: /jobs/genie.mylyn/mylyn-test-build/workspace/org.eclipse.mylyn.docs/org.eclipse.mylyn.wikitext-standalone/target/wikitext-standalone-latest.zip
[INFO] Executed tasks
[INFO]                                                                         
[INFO] ------------------------------------------------------------------------
[INFO] Building org.eclipse.mylyn.docs.epub.ant.core 2.2.0-SNAPSHOT
[INFO] ------------------------------------------------------------------------
[INFO] 
[INFO] --- maven-clean-plugin:2.4.1:clean (default-clean) @ org.eclipse.mylyn.docs.epub.ant.core ---
[INFO] 
[INFO] --- tycho-packaging-plugin:0.21.0:build-qualifier (default-build-qualifier) @ org.eclipse.mylyn.docs.epub.ant.core ---
[INFO] The project's OSGi version is 2.2.0.x20160429-2231
[INFO] 
[INFO] --- tycho-packaging-plugin:0.21.0:validate-id (default-validate-id) @ org.eclipse.mylyn.docs.epub.ant.core ---
[INFO] 
[INFO] --- tycho-packaging-plugin:0.21.0:validate-version (default-validate-version) @ org.eclipse.mylyn.docs.epub.ant.core ---
[INFO] 
[INFO] --- jacoco-maven-plugin:0.5.6.201201232323:prepare-agent (default) @ org.eclipse.mylyn.docs.epub.ant.core ---
[INFO] Skipping JaCoCo execution
[INFO] 
[INFO] --- maven-resources-plugin:2.4.1:resources (default-resources) @ org.eclipse.mylyn.docs.epub.ant.core ---
[INFO] Using 'ISO-8859-1' encoding to copy filtered resources.
[INFO] skip non existing resourceDirectory /jobs/genie.mylyn/mylyn-test-build/workspace/org.eclipse.mylyn.docs/org.eclipse.mylyn.docs.epub.ant.core/src/main/resources
[INFO] 
[INFO] --- tycho-compiler-plugin:0.21.0:compile (default-compile) @ org.eclipse.mylyn.docs.epub.ant.core ---
[INFO] Compiling 23 source files to /jobs/genie.mylyn/mylyn-test-build/workspace/org.eclipse.mylyn.docs/org.eclipse.mylyn.docs.epub.ant.core/target/classes
[INFO] 
[INFO] --- tycho-source-plugin:0.21.0:plugin-source (attach-source) @ org.eclipse.mylyn.docs.epub.ant.core ---
[INFO] Building jar: /jobs/genie.mylyn/mylyn-test-build/workspace/org.eclipse.mylyn.docs/org.eclipse.mylyn.docs.epub.ant.core/target/org.eclipse.mylyn.docs.epub.ant.core-2.2.0-SNAPSHOT-sources.jar
[INFO] 
[INFO] --- maven-resources-plugin:2.4.1:testResources (default-testResources) @ org.eclipse.mylyn.docs.epub.ant.core ---
[INFO] Using 'ISO-8859-1' encoding to copy filtered resources.
[INFO] skip non existing resourceDirectory /jobs/genie.mylyn/mylyn-test-build/workspace/org.eclipse.mylyn.docs/org.eclipse.mylyn.docs.epub.ant.core/src/test/resources
[INFO] 
[INFO] --- target-platform-configuration:0.21.0:target-platform (default-target-platform) @ org.eclipse.mylyn.docs.epub.ant.core ---
[INFO] 
[INFO] --- tycho-packaging-plugin:0.21.0:package-plugin (default-package-plugin) @ org.eclipse.mylyn.docs.epub.ant.core ---
[INFO] Building jar: /jobs/genie.mylyn/mylyn-test-build/workspace/org.eclipse.mylyn.docs/org.eclipse.mylyn.docs.epub.ant.core/target/org.eclipse.mylyn.docs.epub.ant.core-2.2.0-SNAPSHOT.jar
[INFO] 
[INFO] --- tycho-p2-plugin:0.21.0:p2-metadata-default (default-p2-metadata-default) @ org.eclipse.mylyn.docs.epub.ant.core ---
[INFO] 
[INFO] >>> findbugs-maven-plugin:2.3.2:check (default) @ org.eclipse.mylyn.docs.epub.ant.core >>>
[INFO] 
[INFO] --- findbugs-maven-plugin:2.3.2:findbugs (findbugs) @ org.eclipse.mylyn.docs.epub.ant.core ---
[INFO] ****** FindBugsMojo execute *******
[INFO] canGenerate is false
[INFO] 
[INFO] <<< findbugs-maven-plugin:2.3.2:check (default) @ org.eclipse.mylyn.docs.epub.ant.core <<<
[INFO] 
[INFO] --- findbugs-maven-plugin:2.3.2:check (default) @ org.eclipse.mylyn.docs.epub.ant.core ---
[INFO] 
[INFO] >>> maven-pmd-plugin:2.5:cpd-check (default) @ org.eclipse.mylyn.docs.epub.ant.core >>>
[INFO] 
[INFO] --- maven-pmd-plugin:2.5:cpd (cpd) @ org.eclipse.mylyn.docs.epub.ant.core ---
[INFO] 
[INFO] <<< maven-pmd-plugin:2.5:cpd-check (default) @ org.eclipse.mylyn.docs.epub.ant.core <<<
[INFO] 
[INFO] --- maven-pmd-plugin:2.5:cpd-check (default) @ org.eclipse.mylyn.docs.epub.ant.core ---
[INFO]                                                                         
[INFO] ------------------------------------------------------------------------
[INFO] Building Mylyn Docs 2.9.0-SNAPSHOT
[INFO] ------------------------------------------------------------------------
[INFO] 
[INFO] --- maven-clean-plugin:2.4.1:clean (default-clean) @ org.eclipse.mylyn.docs-site ---
[INFO] 
[INFO] --- tycho-packaging-plugin:0.21.0:build-qualifier (default-build-qualifier) @ org.eclipse.mylyn.docs-site ---
[INFO] The project's OSGi version is 2.9.0.x20160420-2216
[INFO] 
[INFO] --- jacoco-maven-plugin:0.5.6.201201232323:prepare-agent (default) @ org.eclipse.mylyn.docs-site ---
[INFO] Skipping JaCoCo execution
[INFO] 
[INFO] --- tycho-packaging-plugin:0.21.0:update-site (default-update-site) @ org.eclipse.mylyn.docs-site ---
[INFO] 
[INFO] --- tycho-p2-plugin:0.21.0:update-site-p2-metadata (default-update-site-p2-metadata) @ org.eclipse.mylyn.docs-site ---
[INFO] Command line:
	[/opt/public/common/jdk1.8.0_51.x64/jre/bin/java, -jar, /jobs/genie.mylyn/mylyn-test-build/workspace/.maven/repo/org/eclipse/tycho/tycho-bundles-external/0.21.0/eclipse/plugins/org.eclipse.equinox.launcher_1.3.0.v20140415-2008.jar, -configuration, /tmp/tycho-p2-runtime326842808762174821.tmp/configuration, -nosplash, -application, org.eclipse.equinox.p2.publisher.UpdateSitePublisher, -source, /jobs/genie.mylyn/mylyn-test-build/workspace/org.eclipse.mylyn.docs/org.eclipse.mylyn.docs-site/target/site, -metadataRepository, file:/jobs/genie.mylyn/mylyn-test-build/workspace/org.eclipse.mylyn.docs/org.eclipse.mylyn.docs-site/target/site/, -metadataRepositoryName, Mylyn Docs, -artifactRepository, file:/jobs/genie.mylyn/mylyn-test-build/workspace/org.eclipse.mylyn.docs/org.eclipse.mylyn.docs-site/target/site/, -artifactRepositoryName, Mylyn Docs Artifacts, -noDefaultIUs, -compress]
Generating metadata for ..
Generation completed with success [0 seconds].
[INFO] 
[INFO] --- tycho-packaging-plugin:0.21.0:update-site-packaging (default-update-site-packaging) @ org.eclipse.mylyn.docs-site ---
[INFO] Building zip: /jobs/genie.mylyn/mylyn-test-build/workspace/org.eclipse.mylyn.docs/org.eclipse.mylyn.docs-site/target/site.zip
[INFO]                                                                         
[INFO] ------------------------------------------------------------------------
[INFO] Building org.eclipse.mylyn.gerrit.core.tests 2.11.0-SNAPSHOT
[INFO] ------------------------------------------------------------------------
[INFO] 
[INFO] --- maven-clean-plugin:2.4.1:clean (default-clean) @ org.eclipse.mylyn.gerrit.core.tests ---
[INFO] 
[INFO] --- tycho-packaging-plugin:0.21.0:build-qualifier (default-build-qualifier) @ org.eclipse.mylyn.gerrit.core.tests ---
[INFO] The project's OSGi version is 2.11.0.x20160421-1821
[INFO] 
[INFO] --- tycho-packaging-plugin:0.21.0:validate-id (default-validate-id) @ org.eclipse.mylyn.gerrit.core.tests ---
[INFO] 
[INFO] --- tycho-packaging-plugin:0.21.0:validate-version (default-validate-version) @ org.eclipse.mylyn.gerrit.core.tests ---
[INFO] 
[INFO] --- jacoco-maven-plugin:0.5.6.201201232323:prepare-agent (default) @ org.eclipse.mylyn.gerrit.core.tests ---
[INFO] Skipping JaCoCo execution
[INFO] 
[INFO] --- maven-resources-plugin:2.4.1:resources (default-resources) @ org.eclipse.mylyn.gerrit.core.tests ---
[INFO] Using 'ISO-8859-1' encoding to copy filtered resources.
[INFO] skip non existing resourceDirectory /jobs/genie.mylyn/mylyn-test-build/workspace/org.eclipse.mylyn.reviews/org.eclipse.mylyn.gerrit.core.tests/src/main/resources
[INFO] 
[INFO] --- tycho-compiler-plugin:0.21.0:compile (default-compile) @ org.eclipse.mylyn.gerrit.core.tests ---
[INFO] Compiling 10 source files to /jobs/genie.mylyn/mylyn-test-build/workspace/org.eclipse.mylyn.reviews/org.eclipse.mylyn.gerrit.core.tests/target/classes
[INFO] 
[INFO] --- tycho-source-plugin:0.21.0:plugin-source (attach-source) @ org.eclipse.mylyn.gerrit.core.tests ---
[WARNING] bundle localization file /jobs/genie.mylyn/mylyn-test-build/workspace/org.eclipse.mylyn.reviews/org.eclipse.mylyn.gerrit.core.tests/plugin.properties not found
[INFO] Building jar: /jobs/genie.mylyn/mylyn-test-build/workspace/org.eclipse.mylyn.reviews/org.eclipse.mylyn.gerrit.core.tests/target/org.eclipse.mylyn.gerrit.core.tests-2.11.0-SNAPSHOT-sources.jar
[INFO] 
[INFO] --- maven-resources-plugin:2.4.1:testResources (default-testResources) @ org.eclipse.mylyn.gerrit.core.tests ---
[INFO] Using 'ISO-8859-1' encoding to copy filtered resources.
[INFO] skip non existing resourceDirectory /jobs/genie.mylyn/mylyn-test-build/workspace/org.eclipse.mylyn.reviews/org.eclipse.mylyn.gerrit.core.tests/src/test/resources
[INFO] 
[INFO] --- target-platform-configuration:0.21.0:target-platform (default-target-platform) @ org.eclipse.mylyn.gerrit.core.tests ---
[INFO] 
[INFO] --- tycho-packaging-plugin:0.21.0:package-plugin (default-package-plugin) @ org.eclipse.mylyn.gerrit.core.tests ---
[INFO] Building jar: /jobs/genie.mylyn/mylyn-test-build/workspace/org.eclipse.mylyn.reviews/org.eclipse.mylyn.gerrit.core.tests/target/org.eclipse.mylyn.gerrit.core.tests-2.11.0-SNAPSHOT.jar
[INFO] 
[INFO] --- tycho-p2-plugin:0.21.0:p2-metadata-default (default-p2-metadata-default) @ org.eclipse.mylyn.gerrit.core.tests ---
[INFO] 
[INFO] --- tycho-surefire-plugin:0.21.0:test (default-test) @ org.eclipse.mylyn.gerrit.core.tests ---
[INFO] Expected eclipse log file: /jobs/genie.mylyn/mylyn-test-build/workspace/org.eclipse.mylyn.reviews/org.eclipse.mylyn.gerrit.core.tests/target/work/data/.metadata/.log
[INFO] Command line:
	[/opt/public/common/jdk1.8.0_51.x64/jre/bin/java, -Dosgi.noShutdown=false, -Dosgi.os=linux, -Dosgi.ws=gtk, -Dosgi.arch=x86_64, -Xmx512m, -XX:MaxPermSize=256m, -Djava.io.tmpdir=/jobs/genie.mylyn/mylyn-test-build/workspace/org.eclipse.mylyn.reviews/org.eclipse.mylyn.gerrit.core.tests/target, -ea, -Dmylyn.credentials=/shared/mylyn/.credentials.properties, -Dorg.eclipse.mylyn.wikitext.tests.disableOutput=true, -Dhttp.proxyHost=proxy.eclipse.org, -Dhttp.proxyPort=9898, -Dhttps.proxyHost=proxy.eclipse.org, -Dhttps.proxyPort=9898, -DhttpnonProxyHosts=*.eclipse.org, -Dorg.eclipse.mylyn.gerrit.tests.alternate.push=true, -Dosgi.clean=true, -jar, /jobs/genie.mylyn/mylyn-test-build/workspace/.maven/repo/p2/osgi/bundle/org.eclipse.equinox.launcher/1.3.100.v20150511-1540/org.eclipse.equinox.launcher-1.3.100.v20150511-1540.jar, -data, /jobs/genie.mylyn/mylyn-test-build/workspace/org.eclipse.mylyn.reviews/org.eclipse.mylyn.gerrit.core.tests/target/work/data, -install, /jobs/genie.mylyn/mylyn-test-build/workspace/org.eclipse.mylyn.reviews/org.eclipse.mylyn.gerrit.core.tests/target/work, -configuration, /jobs/genie.mylyn/mylyn-test-build/workspace/org.eclipse.mylyn.reviews/org.eclipse.mylyn.gerrit.core.tests/target/work/configuration, -application, org.eclipse.tycho.surefire.osgibooter.uitest, -testproperties, /jobs/genie.mylyn/mylyn-test-build/workspace/org.eclipse.mylyn.reviews/org.eclipse.mylyn.gerrit.core.tests/target/surefire.properties, -testApplication, org.eclipse.ui.ide.workbench, -product, org.eclipse.sdk.ide, -eclipse.keyring, /jobs/genie.mylyn/mylyn-test-build/workspace/org.eclipse.mylyn.reviews/org.eclipse.mylyn.gerrit.core.tests/target/.eclipse.keyring, -eclipse.password, /jobs/genie.mylyn/mylyn-test-build/workspace/org.eclipse.mylyn.reviews/org.eclipse.mylyn.gerrit.core.tests/target/../../.gitignore]
Java HotSpot(TM) 64-Bit Server VM warning: ignoring option MaxPermSize=256m; support was removed in 8.0

-------------------------------------------------------
 T E S T S
-------------------------------------------------------
Running org.eclipse.mylyn.internal.gerrit.core.client.GerritHttpClientTest
Tests run: 5, Failures: 0, Errors: 0, Skipped: 0, Time elapsed: 0.447 sec
Running org.eclipse.mylyn.internal.gerrit.core.client.ProjectByNameComparatorTest
Tests run: 1, Failures: 0, Errors: 0, Skipped: 0, Time elapsed: 0.002 sec
Running org.eclipse.mylyn.internal.gerrit.core.client.GerritHtmlProcessorTest
Tests run: 2, Failures: 0, Errors: 0, Skipped: 0, Time elapsed: 0.04 sec
Running org.eclipse.mylyn.internal.gerrit.core.client.JSonSupportTest
Tests run: 3, Failures: 0, Errors: 0, Skipped: 0, Time elapsed: 0.003 sec
Running org.eclipse.mylyn.internal.gerrit.core.GerritAttributeTest
Tests run: 1, Failures: 0, Errors: 0, Skipped: 0, Time elapsed: 0.004 sec
Running org.eclipse.mylyn.internal.gerrit.core.GerritTaskDataHandlerTest
Tests run: 4, Failures: 0, Errors: 0, Skipped: 0, Time elapsed: 0.134 sec
Running org.eclipse.mylyn.internal.gerrit.core.egit.GerritToGitMappingTest
SLF4J: Failed to load class "org.slf4j.impl.StaticLoggerBinder".
SLF4J: Defaulting to no-operation (NOP) logger implementation
SLF4J: See http://www.slf4j.org/codes.html#StaticLoggerBinder for further details.
Tests run: 15, Failures: 0, Errors: 0, Skipped: 0, Time elapsed: 0.095 sec
Running org.eclipse.mylyn.internal.gerrit.core.HudsonCommentParserTest
Tests run: 14, Failures: 0, Errors: 0, Skipped: 0, Time elapsed: 0.009 sec
Running org.eclipse.mylyn.internal.gerrit.core.GerritConnectorTest
Tests run: 20, Failures: 0, Errors: 0, Skipped: 0, Time elapsed: 0.205 sec
Running org.eclipse.mylyn.internal.gerrit.core.GerritUtilTest
Tests run: 1, Failures: 0, Errors: 0, Skipped: 0, Time elapsed: 0.001 sec

Results :

Tests run: 66, Failures: 0, Errors: 0, Skipped: 0

[INFO] All tests passed!
[INFO]                                                                         
[INFO] ------------------------------------------------------------------------
[INFO] Building org.eclipse.mylyn.gerrit.target 2.11.0-SNAPSHOT
[INFO] ------------------------------------------------------------------------
[INFO] 
[INFO] --- maven-clean-plugin:2.4.1:clean (default-clean) @ org.eclipse.mylyn.gerrit.target ---
[INFO] 
[INFO] --- jacoco-maven-plugin:0.5.6.201201232323:prepare-agent (default) @ org.eclipse.mylyn.gerrit.target ---
[INFO] Skipping JaCoCo for project with packaging type 'pom'
[INFO]                                                                         
[INFO] ------------------------------------------------------------------------
[INFO] Building org.eclipse.mylyn.gerrit.tests 2.11.0-SNAPSHOT
[INFO] ------------------------------------------------------------------------
[INFO] 
[INFO] --- maven-clean-plugin:2.4.1:clean (default-clean) @ org.eclipse.mylyn.gerrit.tests ---
[INFO] 
[INFO] --- tycho-packaging-plugin:0.21.0:build-qualifier (default-build-qualifier) @ org.eclipse.mylyn.gerrit.tests ---
[INFO] The project's OSGi version is 2.11.0.x20160421-1821
[INFO] 
[INFO] --- tycho-packaging-plugin:0.21.0:validate-id (default-validate-id) @ org.eclipse.mylyn.gerrit.tests ---
[INFO] 
[INFO] --- tycho-packaging-plugin:0.21.0:validate-version (default-validate-version) @ org.eclipse.mylyn.gerrit.tests ---
[INFO] 
[INFO] --- jacoco-maven-plugin:0.5.6.201201232323:prepare-agent (default) @ org.eclipse.mylyn.gerrit.tests ---
[INFO] Skipping JaCoCo execution
[INFO] 
[INFO] --- maven-resources-plugin:2.4.1:resources (default-resources) @ org.eclipse.mylyn.gerrit.tests ---
[INFO] Using 'ISO-8859-1' encoding to copy filtered resources.
[INFO] skip non existing resourceDirectory /jobs/genie.mylyn/mylyn-test-build/workspace/org.eclipse.mylyn.reviews/org.eclipse.mylyn.gerrit.tests/src/main/resources
[INFO] 
[INFO] --- tycho-compiler-plugin:0.21.0:compile (default-compile) @ org.eclipse.mylyn.gerrit.tests ---
[INFO] Compiling 39 source files to /jobs/genie.mylyn/mylyn-test-build/workspace/org.eclipse.mylyn.reviews/org.eclipse.mylyn.gerrit.tests/target/classes
[INFO] 
[INFO] --- tycho-source-plugin:0.21.0:plugin-source (attach-source) @ org.eclipse.mylyn.gerrit.tests ---
[WARNING] bundle localization file /jobs/genie.mylyn/mylyn-test-build/workspace/org.eclipse.mylyn.reviews/org.eclipse.mylyn.gerrit.tests/plugin.properties not found
[INFO] Building jar: /jobs/genie.mylyn/mylyn-test-build/workspace/org.eclipse.mylyn.reviews/org.eclipse.mylyn.gerrit.tests/target/org.eclipse.mylyn.gerrit.tests-2.11.0-SNAPSHOT-sources.jar
[INFO] 
[INFO] --- maven-resources-plugin:2.4.1:testResources (default-testResources) @ org.eclipse.mylyn.gerrit.tests ---
[INFO] Using 'ISO-8859-1' encoding to copy filtered resources.
[INFO] skip non existing resourceDirectory /jobs/genie.mylyn/mylyn-test-build/workspace/org.eclipse.mylyn.reviews/org.eclipse.mylyn.gerrit.tests/src/test/resources
[INFO] 
[INFO] --- target-platform-configuration:0.21.0:target-platform (default-target-platform) @ org.eclipse.mylyn.gerrit.tests ---
[INFO] 
[INFO] --- tycho-packaging-plugin:0.21.0:package-plugin (default-package-plugin) @ org.eclipse.mylyn.gerrit.tests ---
[INFO] Building jar: /jobs/genie.mylyn/mylyn-test-build/workspace/org.eclipse.mylyn.reviews/org.eclipse.mylyn.gerrit.tests/target/org.eclipse.mylyn.gerrit.tests-2.11.0-SNAPSHOT.jar
[INFO] 
[INFO] --- tycho-p2-plugin:0.21.0:p2-metadata-default (default-p2-metadata-default) @ org.eclipse.mylyn.gerrit.tests ---
[INFO] 
[INFO] --- tycho-surefire-plugin:0.21.0:test (default-test) @ org.eclipse.mylyn.gerrit.tests ---
[INFO] Expected eclipse log file: /jobs/genie.mylyn/mylyn-test-build/workspace/org.eclipse.mylyn.reviews/org.eclipse.mylyn.gerrit.tests/target/work/data/.metadata/.log
[INFO] Command line:
	[/opt/public/common/jdk1.8.0_51.x64/jre/bin/java, -Dosgi.noShutdown=false, -Dosgi.os=linux, -Dosgi.ws=gtk, -Dosgi.arch=x86_64, -Xmx512m, -XX:MaxPermSize=256m, -Djava.io.tmpdir=/jobs/genie.mylyn/mylyn-test-build/workspace/org.eclipse.mylyn.reviews/org.eclipse.mylyn.gerrit.tests/target, -ea, -Dmylyn.credentials=/shared/mylyn/.credentials.properties, -Dorg.eclipse.mylyn.wikitext.tests.disableOutput=true, -Dhttp.proxyHost=proxy.eclipse.org, -Dhttp.proxyPort=9898, -Dhttps.proxyHost=proxy.eclipse.org, -Dhttps.proxyPort=9898, -DhttpnonProxyHosts=*.eclipse.org, -Dorg.eclipse.mylyn.gerrit.tests.alternate.push=true, -Dosgi.clean=true, -jar, /jobs/genie.mylyn/mylyn-test-build/workspace/.maven/repo/p2/osgi/bundle/org.eclipse.equinox.launcher/1.3.100.v20150511-1540/org.eclipse.equinox.launcher-1.3.100.v20150511-1540.jar, -data, /jobs/genie.mylyn/mylyn-test-build/workspace/org.eclipse.mylyn.reviews/org.eclipse.mylyn.gerrit.tests/target/work/data, -install, /jobs/genie.mylyn/mylyn-test-build/workspace/org.eclipse.mylyn.reviews/org.eclipse.mylyn.gerrit.tests/target/work, -configuration, /jobs/genie.mylyn/mylyn-test-build/workspace/org.eclipse.mylyn.reviews/org.eclipse.mylyn.gerrit.tests/target/work/configuration, -application, org.eclipse.tycho.surefire.osgibooter.uitest, -testproperties, /jobs/genie.mylyn/mylyn-test-build/workspace/org.eclipse.mylyn.reviews/org.eclipse.mylyn.gerrit.tests/target/surefire.properties, -testApplication, org.eclipse.ui.ide.workbench, -product, org.eclipse.sdk.ide, -eclipse.keyring, /jobs/genie.mylyn/mylyn-test-build/workspace/org.eclipse.mylyn.reviews/org.eclipse.mylyn.gerrit.tests/target/.eclipse.keyring, -eclipse.password, /jobs/genie.mylyn/mylyn-test-build/workspace/org.eclipse.mylyn.reviews/org.eclipse.mylyn.gerrit.tests/target/../../.gitignore]
Java HotSpot(TM) 64-Bit Server VM warning: ignoring option MaxPermSize=256m; support was removed in 8.0
SLF4J: Failed to load class "org.slf4j.impl.StaticLoggerBinder".
SLF4J: Defaulting to no-operation (NOP) logger implementation
SLF4J: See http://www.slf4j.org/codes.html#StaticLoggerBinder for further details.

-------------------------------------------------------
 T E S T S
-------------------------------------------------------
Running org.eclipse.mylyn.gerrit.tests.AllGerritTests
Forcing manual proxy configuration
System: Linux 3.12.51-52.39-default (amd64) / linux-x86_64-gtk / Oracle Corporation Java HotSpot(TM) 64-Bit Server VM 1.8.0_51
HTTP Proxy : HTTP @ proxy.eclipse.org/172.30.206.220:9898 (Platform) / [HTTP @ proxy.eclipse.org/172.30.206.220:9898] (Java)
HTTPS Proxy : null (Platform) / [DIRECT] (Java)

Running testParseShortId(org.eclipse.mylyn.internal.gerrit.core.remote.ReviewHarnessTest)
Running testParse_27xxx31(org.eclipse.mylyn.gerrit.tests.core.client.GerritVersionTest)
Running testParse_123q(org.eclipse.mylyn.gerrit.tests.core.client.GerritVersionTest)
Running testParse_2861(org.eclipse.mylyn.gerrit.tests.core.client.GerritVersionTest)
Running testParse_null(org.eclipse.mylyn.gerrit.tests.core.client.GerritVersionTest)
Running testIsVersion2112OrLater(org.eclipse.mylyn.gerrit.tests.core.client.GerritVersionTest)
Running testParse_254(org.eclipse.mylyn.gerrit.tests.core.client.GerritVersionTest)
Running testParse_26rc3(org.eclipse.mylyn.gerrit.tests.core.client.GerritVersionTest)
Running testParse_empty(org.eclipse.mylyn.gerrit.tests.core.client.GerritVersionTest)
Running testParse_27rc2637g76c7890(org.eclipse.mylyn.gerrit.tests.core.client.GerritVersionTest)
Running testParse_invalid(org.eclipse.mylyn.gerrit.tests.core.client.GerritVersionTest)
Running testParse_21(org.eclipse.mylyn.gerrit.tests.core.client.GerritVersionTest)
Running testParse_V221NQT012(org.eclipse.mylyn.gerrit.tests.core.client.GerritVersionTest)
Running testFromNull(org.eclipse.mylyn.gerrit.tests.core.client.rest.AbandonInputTest)
Running testFromEmpty(org.eclipse.mylyn.gerrit.tests.core.client.rest.AbandonInputTest)
Running testFromValid(org.eclipse.mylyn.gerrit.tests.core.client.rest.AbandonInputTest)
Running testFromEmptyJson(org.eclipse.mylyn.gerrit.tests.core.client.rest.AccountInfoTest)
Running testFromValid(org.eclipse.mylyn.gerrit.tests.core.client.rest.AccountInfoTest)
Running testFromInvalid(org.eclipse.mylyn.gerrit.tests.core.client.rest.AccountInfoTest)
Running testFromEmptyJson(org.eclipse.mylyn.gerrit.tests.core.client.rest.AddReviewerResultTest)
Running testFromValid(org.eclipse.mylyn.gerrit.tests.core.client.rest.AddReviewerResultTest)
Running testFromInvalid(org.eclipse.mylyn.gerrit.tests.core.client.rest.AddReviewerResultTest)
Running testNoReviews(org.eclipse.mylyn.gerrit.tests.core.client.rest.ChangeInfoTest)
Running testFromEmptyJson(org.eclipse.mylyn.gerrit.tests.core.client.rest.ChangeInfoTest)
Running testFromAbandoned(org.eclipse.mylyn.gerrit.tests.core.client.rest.ChangeInfoTest)
Running testCustomApprovalType(org.eclipse.mylyn.gerrit.tests.core.client.rest.ChangeInfoTest)
Running testNewChangeInfo(org.eclipse.mylyn.gerrit.tests.core.client.rest.ChangeInfoTest)
Running testCodeReviewMinusOne(org.eclipse.mylyn.gerrit.tests.core.client.rest.ChangeInfoTest)
Running testThreeApprovalTypes(org.eclipse.mylyn.gerrit.tests.core.client.rest.ChangeInfoTest)
Running testFromInvalid(org.eclipse.mylyn.gerrit.tests.core.client.rest.ChangeInfoTest)
Running testTwoRevisions(org.eclipse.mylyn.gerrit.tests.core.client.rest.ChangeInfoTest)
Running testFromEmptyJson(org.eclipse.mylyn.gerrit.tests.core.client.rest.ProjectInfoTest)
Running testFromSingleProject(org.eclipse.mylyn.gerrit.tests.core.client.rest.ProjectInfoTest)
Running testFromInvalid(org.eclipse.mylyn.gerrit.tests.core.client.rest.ProjectInfoTest)
Running testFromProjects(org.eclipse.mylyn.gerrit.tests.core.client.rest.ProjectInfoTest)
Running testFromNull(org.eclipse.mylyn.gerrit.tests.core.client.rest.RestoreInputTest)
Running testFromEmpty(org.eclipse.mylyn.gerrit.tests.core.client.rest.RestoreInputTest)
Running testFromValid(org.eclipse.mylyn.gerrit.tests.core.client.rest.RestoreInputTest)
Running testFromEmptyJson(org.eclipse.mylyn.gerrit.tests.core.client.rest.ReviewerInfoTest)
Running testFromValid(org.eclipse.mylyn.gerrit.tests.core.client.rest.ReviewerInfoTest)
Running testFromInvalid(org.eclipse.mylyn.gerrit.tests.core.client.rest.ReviewerInfoTest)
Running testFromNull(org.eclipse.mylyn.gerrit.tests.core.client.rest.ReviewerInputTest)
Running testFromEmpty(org.eclipse.mylyn.gerrit.tests.core.client.rest.ReviewerInputTest)
Running testFromValid(org.eclipse.mylyn.gerrit.tests.core.client.rest.ReviewerInputTest)
Running testFromEmptyJson(org.eclipse.mylyn.gerrit.tests.core.client.rest.ReviewInfoTest)
Running testFromVerifyZero(org.eclipse.mylyn.gerrit.tests.core.client.rest.ReviewInfoTest)
Running testFromCodeReviewMinusOne(org.eclipse.mylyn.gerrit.tests.core.client.rest.ReviewInfoTest)
Running testFromInvalid(org.eclipse.mylyn.gerrit.tests.core.client.rest.ReviewInfoTest)
Running testFromNull(org.eclipse.mylyn.gerrit.tests.core.client.rest.ReviewInputTest)
Running testSetNullApprovals(org.eclipse.mylyn.gerrit.tests.core.client.rest.ReviewInputTest)
Running testSetApprovals(org.eclipse.mylyn.gerrit.tests.core.client.rest.ReviewInputTest)
Running testSetEmptyApprovals(org.eclipse.mylyn.gerrit.tests.core.client.rest.ReviewInputTest)
Running testFromEmpty(org.eclipse.mylyn.gerrit.tests.core.client.rest.ReviewInputTest)
Running testFromValid(org.eclipse.mylyn.gerrit.tests.core.client.rest.ReviewInputTest)
Running testFromValid(org.eclipse.mylyn.gerrit.tests.core.client.rest.SubmitInfoTest)
Running testFromValid(org.eclipse.mylyn.gerrit.tests.core.client.rest.SubmitInputTest)
Running testAbandoned(org.eclipse.mylyn.gerrit.tests.core.client.compat.ChangeDetailXTest)
Running testConvertWhenApprovalTypesNotNull(org.eclipse.mylyn.gerrit.tests.core.client.compat.ChangeDetailXTest)
Running testContinousIntegrationCommentsAreRemoved(org.eclipse.mylyn.gerrit.tests.core.client.compat.ChangeDetailXTest)
Running testCustomLabel(org.eclipse.mylyn.gerrit.tests.core.client.compat.ChangeDetailXTest)
Running testPatchScriptIsNotBinary(org.eclipse.mylyn.gerrit.tests.core.client.compat.PatchScriptXTest)
Running testPatchScriptIsBinary(org.eclipse.mylyn.gerrit.tests.core.client.compat.PatchScriptXTest)
Running testExecuteOpenIdProviderNullCredentials(org.eclipse.mylyn.gerrit.tests.core.client.OpenIdAuthenticationTest)
 Authentication failed: [ |  | ]
Running testExecuteNullOpenIdProviderNullCredentials(org.eclipse.mylyn.gerrit.tests.core.client.OpenIdAuthenticationTest)
Running repository: http://mylyn.org/gerrit-2.10/ [@2.10](org.eclipse.mylyn.tests.util.TestFixture$Activation)
Running testExecuteQueryWithEmptyOption(org.eclipse.mylyn.gerrit.tests.core.client.GerritClientTest)
Running testExecuteQueryDraftsCommentsReviews(org.eclipse.mylyn.gerrit.tests.core.client.GerritClientTest)
Running testToReviewIdWithChangeId(org.eclipse.mylyn.gerrit.tests.core.client.GerritClientTest)
Response message:
remote: 
remote: Processing changes: new: 1, refs: 1        
remote: Processing changes: new: 1, refs: 1, done            
remote: 
remote: New Changes:        
remote:   http://lvps92-51-163-75.dedicated.hosteurope.de/gerrit-2.10/673 lqrRfO        
remote: 
To http:\\tests:mylyntest@mylyn.org\gerrit-2.10\org.eclipse.mylyn.test\
 * [new branch]      HEAD -> refs\for\master

######
Running testToReviewId(org.eclipse.mylyn.gerrit.tests.core.client.GerritClientTest)
Running testExecuteQueryWithOption(org.eclipse.mylyn.gerrit.tests.core.client.GerritClientTest)
Running testGetAccount(org.eclipse.mylyn.gerrit.tests.core.client.GerritClientTest)
Running testExecuteQueryAllMerged(org.eclipse.mylyn.gerrit.tests.core.client.GerritClientTest)
Running testGetInfo(org.eclipse.mylyn.gerrit.tests.core.client.GerritClientTest)
Running testRefreshConfig(org.eclipse.mylyn.gerrit.tests.core.client.GerritClientTest)
Running testFetchLeftBinaryContent(org.eclipse.mylyn.gerrit.tests.core.client.GerritClientTest)
Running testExecuteQueryisStarred(org.eclipse.mylyn.gerrit.tests.core.client.GerritClientTest)
Running testExecuteQueryWithMultipleOptions(org.eclipse.mylyn.gerrit.tests.core.client.GerritClientTest)
Running testIsZippedContent(org.eclipse.mylyn.gerrit.tests.core.client.GerritClientTest)
Running testExecuteQueryWithNullOption(org.eclipse.mylyn.gerrit.tests.core.client.GerritClientTest)
Running testFetchRightBinaryContent(org.eclipse.mylyn.gerrit.tests.core.client.GerritClientTest)
Running testGetUrlForPatchSet(org.eclipse.mylyn.gerrit.tests.core.client.GerritClientTest)
Running testExecuteQueryDraftsReviews(org.eclipse.mylyn.gerrit.tests.core.client.GerritClientTest)
Running testExecuteQueryHasComments(org.eclipse.mylyn.gerrit.tests.core.client.GerritClientTest)
Running testExecuteQueryWithEmptyList(org.eclipse.mylyn.gerrit.tests.core.client.GerritClientTest)
Running testExecuteQueryAllAbandoned(org.eclipse.mylyn.gerrit.tests.core.client.GerritClientTest)
Running testGetVersion(org.eclipse.mylyn.gerrit.tests.core.client.GerritClientTest)
Running testToReviewIdWithInvalidId(org.eclipse.mylyn.gerrit.tests.core.client.GerritClientTest)
Running testInvalidXrsfKey(org.eclipse.mylyn.gerrit.tests.core.client.GerritClientTest)
Running testExecuteQueryWithoutOption(org.eclipse.mylyn.gerrit.tests.core.client.GerritClientTest)
Running testGetAccountAnonymous(org.eclipse.mylyn.gerrit.tests.core.client.GerritClientTest)
Running testPerformQueryAnonymous(org.eclipse.mylyn.gerrit.tests.core.GerritConnectorTest)
Response message:
remote: 
remote: Processing changes: new: 1, refs: 1        
remote: Processing changes: new: 1, refs: 1        
remote: Processing changes: new: 1, refs: 1        
remote: Processing changes: new: 1, refs: 1, done            
remote: 
remote: New Changes:        
remote:   http://lvps92-51-163-75.dedicated.hosteurope.de/gerrit-2.10/674 uibPrv        
remote: 
To http:\\tests:mylyntest@mylyn.org\gerrit-2.10\org.eclipse.mylyn.test\
 * [new branch]      HEAD -> refs\for\master

######
Running testSynchronizeTaskUpdated(org.eclipse.mylyn.gerrit.tests.core.GerritSynchronizationTest)
[2016-06-01T4-44-25] Status WARNING: org.eclipse.mylyn.tasks.ui code=0 No search provider was registered. Tasks search is not available. null, 
Response message:
remote: 
remote: Processing changes: new: 1, refs: 1        
remote: Processing changes: new: 1, refs: 1, done            
remote: 
remote: New Changes:        
remote:   http://lvps92-51-163-75.dedicated.hosteurope.de/gerrit-2.10/675 xkQUvK        
remote: 
To http:\\tests:mylyntest@mylyn.org\gerrit-2.10\org.eclipse.mylyn.test\
 * [new branch]      HEAD -> refs\for\master

######
Running testSynchronizeBackgroundTaskUpdated(org.eclipse.mylyn.gerrit.tests.core.GerritSynchronizationTest)
Response message:
remote: 
remote: Processing changes: new: 1, refs: 1        
remote: Processing changes: new: 1, refs: 1, done            
remote: 
remote: New Changes:        
remote:   http://lvps92-51-163-75.dedicated.hosteurope.de/gerrit-2.10/676 Djjltj        
remote: 
To http:\\tests:mylyntest@mylyn.org\gerrit-2.10\org.eclipse.mylyn.test\
 * [new branch]      HEAD -> refs\for\master

######
Running testGetFromChangeId(org.eclipse.mylyn.gerrit.tests.core.GerritSynchronizationTest)
Response message:
remote: 
remote: Processing changes: new: 1, refs: 1        
remote: Processing changes: new: 1, refs: 1, done            
remote: 
remote: New Changes:        
remote:   http://lvps92-51-163-75.dedicated.hosteurope.de/gerrit-2.10/677 BoEdwe        
remote: 
To http:\\tests:mylyntest@mylyn.org\gerrit-2.10\org.eclipse.mylyn.test\
 * [new branch]      HEAD -> refs\for\master

######
Running testSynchronizeQueryTaskUpdated(org.eclipse.mylyn.gerrit.tests.core.GerritSynchronizationTest)
Response message:
remote: 
remote: Processing changes: new: 1, refs: 1        
remote: Processing changes: new: 1, refs: 1, done            
remote: 
remote: New Changes:        
remote:   http://lvps92-51-163-75.dedicated.hosteurope.de/gerrit-2.10/678 uJabXY        
remote: 
To http:\\tests:mylyntest@mylyn.org\gerrit-2.10\org.eclipse.mylyn.test\
 * [new branch]      HEAD -> refs\for\master

######
Running testSynchronizeQueryNewTask(org.eclipse.mylyn.gerrit.tests.core.GerritSynchronizationTest)
Response message:
remote: 
remote: Processing changes: new: 1, refs: 1        
remote: Processing changes: new: 1, refs: 1, done            
remote: 
remote: New Changes:        
remote:   http://lvps92-51-163-75.dedicated.hosteurope.de/gerrit-2.10/679 FVPEVa        
remote: 
To http:\\tests:mylyntest@mylyn.org\gerrit-2.10\org.eclipse.mylyn.test\
 * [new branch]      HEAD -> refs\for\master

######
Running testSynchronizeBackgroundQueryTaskUpdated(org.eclipse.mylyn.gerrit.tests.core.GerritSynchronizationTest)
Response message:
remote: 
remote: Processing changes: new: 1, refs: 1        
remote: Processing changes: new: 1, refs: 1, done            
remote: 
remote: New Changes:        
remote:   http://lvps92-51-163-75.dedicated.hosteurope.de/gerrit-2.10/680 SZIiLR        
remote: 
To http:\\tests:mylyntest@mylyn.org\gerrit-2.10\org.eclipse.mylyn.test\
 * [new branch]      HEAD -> refs\for\master

######
Running testCreateChild(org.eclipse.mylyn.internal.gerrit.core.remote.GerritDataLocatorTest)
Running testCreateRoot(org.eclipse.mylyn.internal.gerrit.core.remote.GerritDataLocatorTest)
Running testMigrate(org.eclipse.mylyn.internal.gerrit.core.remote.GerritDataLocatorTest)
Running testGlobalComments(org.eclipse.mylyn.internal.gerrit.core.remote.GerritReviewRemoteFactoryTest)
Response message:
remote: 
remote: Processing changes: new: 1, refs: 1        
remote: Processing changes: new: 1, refs: 1, done            
remote: 
remote: New Changes:        
remote:   http://lvps92-51-163-75.dedicated.hosteurope.de/gerrit-2.10/681 Test Change I7fba12f28de182ecbca7d803cf0444ceda3e6675        
remote: 
To http:\\tests:mylyntest@mylyn.org\gerrit-2.10\org.eclipse.mylyn.test\
 * [new branch]      HEAD -> refs\for\master

######
Running testAddEmptyReviewers(org.eclipse.mylyn.internal.gerrit.core.remote.GerritReviewRemoteFactoryTest)
Response message:
remote: 
remote: Processing changes: new: 1, refs: 1        
remote: Processing changes: new: 1, refs: 1, done            
remote: 
remote: New Changes:        
remote:   http://lvps92-51-163-75.dedicated.hosteurope.de/gerrit-2.10/682 Test Change I6d0ddf25c892c635d103e3af797be1f568e8f10f        
remote: 
To http:\\tests:mylyntest@mylyn.org\gerrit-2.10\org.eclipse.mylyn.test\
 * [new branch]      HEAD -> refs\for\master

######
Running testAddInvalidReviewers(org.eclipse.mylyn.internal.gerrit.core.remote.GerritReviewRemoteFactoryTest)
Response message:
remote: 
remote: Processing changes: new: 1, refs: 1        
remote: Processing changes: new: 1, refs: 1, done            
remote: 
remote: New Changes:        
remote:   http://lvps92-51-163-75.dedicated.hosteurope.de/gerrit-2.10/683 Test Change I7edb924208a344415b09e6d1d107356401ee5aef        
remote: 
To http:\\tests:mylyntest@mylyn.org\gerrit-2.10\org.eclipse.mylyn.test\
 * [new branch]      HEAD -> refs\for\master

######
Running testAccount(org.eclipse.mylyn.internal.gerrit.core.remote.GerritReviewRemoteFactoryTest)
Response message:
remote: 
remote: Processing changes: new: 1, refs: 1        
remote: Processing changes: new: 1, refs: 1, done            
remote: 
remote: New Changes:        
remote:   http://lvps92-51-163-75.dedicated.hosteurope.de/gerrit-2.10/684 Test Change I2c2ed321d10d31fa537229ebe51a7fce64062ca4        
remote: 
To http:\\tests:mylyntest@mylyn.org\gerrit-2.10\org.eclipse.mylyn.test\
 * [new branch]      HEAD -> refs\for\master

######
Running testApprovals(org.eclipse.mylyn.internal.gerrit.core.remote.GerritReviewRemoteFactoryTest)
Response message:
remote: 
remote: Processing changes: new: 1, refs: 1        
remote: Processing changes: new: 1, refs: 1, done            
remote: 
remote: New Changes:        
remote:   http://lvps92-51-163-75.dedicated.hosteurope.de/gerrit-2.10/685 Test Change Ic09037e5f5b99dcf70aff5859428a917c7c95d5f        
remote: 
To http:\\tests:mylyntest@mylyn.org\gerrit-2.10\org.eclipse.mylyn.test\
 * [new branch]      HEAD -> refs\for\master

######
Running testGetPatchSetPublishDetail(org.eclipse.mylyn.internal.gerrit.core.remote.GerritReviewRemoteFactoryTest)
Response message:
remote: 
remote: Processing changes: new: 1, refs: 1        
remote: Processing changes: new: 1, refs: 1, done            
remote: 
remote: New Changes:        
remote:   http://lvps92-51-163-75.dedicated.hosteurope.de/gerrit-2.10/686 Test Change I138695d8c0b5b878ec89ec6f53b2fbcd9d722a3f        
remote: 
To http:\\tests:mylyntest@mylyn.org\gerrit-2.10\org.eclipse.mylyn.test\
 * [new branch]      HEAD -> refs\for\master

######
Running testCannotRebaseChangeAlreadyUpToDate(org.eclipse.mylyn.internal.gerrit.core.remote.GerritReviewRemoteFactoryTest)
Response message:
remote: 
remote: Processing changes: new: 1, refs: 1        
remote: Processing changes: new: 1, refs: 1, done            
remote: 
remote: New Changes:        
remote:   http://lvps92-51-163-75.dedicated.hosteurope.de/gerrit-2.10/687 Test Change I6d39fec622bde1e3443b7a6f9af925dde922bed5        
remote: 
To http:\\tests:mylyntest@mylyn.org\gerrit-2.10\org.eclipse.mylyn.test\
 * [new branch]      HEAD -> refs\for\master

######
Running testCherryPick(org.eclipse.mylyn.internal.gerrit.core.remote.GerritReviewRemoteFactoryTest)
Response message:
remote: 
remote: Processing changes: new: 1, refs: 1        
remote: Processing changes: new: 1, refs: 1, done            
remote: 
remote: New Changes:        
remote:   http://lvps92-51-163-75.dedicated.hosteurope.de/gerrit-2.10/688 Test Change I74e44f1ff5da5979ca90bfae70445b2b3657bb95        
remote: 
To http:\\tests:mylyntest@mylyn.org\gerrit-2.10\org.eclipse.mylyn.test\
 * [new branch]      HEAD -> refs\for\master

######
Running testCannotCherryPick(org.eclipse.mylyn.internal.gerrit.core.remote.GerritReviewRemoteFactoryTest)
Response message:
remote: 
remote: Processing changes: new: 1, refs: 1        
remote: Processing changes: new: 1, refs: 1, done            
remote: 
remote: New Changes:        
remote:   http://lvps92-51-163-75.dedicated.hosteurope.de/gerrit-2.10/690 Test Change I34d6d68b43fa0f4537585ecfd4a445d27b5b08b2        
remote: 
To http:\\tests:mylyntest@mylyn.org\gerrit-2.10\org.eclipse.mylyn.test\
 * [new branch]      HEAD -> refs\for\master

######
Running testGetChangeInfo(org.eclipse.mylyn.internal.gerrit.core.remote.GerritReviewRemoteFactoryTest)
Response message:
remote: 
remote: Processing changes: new: 1, refs: 1        
remote: Processing changes: new: 1, refs: 1, done            
remote: 
remote: New Changes:        
remote:   http://lvps92-51-163-75.dedicated.hosteurope.de/gerrit-2.10/691 Test Change I720a9df81760da385be57afc15fcff362f97dfe9        
remote: 
To http:\\tests:mylyntest@mylyn.org\gerrit-2.10\org.eclipse.mylyn.test\
 * [new branch]      HEAD -> refs\for\master

######
Running testGetCachedBranches(org.eclipse.mylyn.internal.gerrit.core.remote.GerritReviewRemoteFactoryTest)
Response message:
remote: 
remote: Processing changes: new: 1, refs: 1        
remote: Processing changes: new: 1, refs: 1        
remote: Processing changes: new: 1, refs: 1        
remote: Processing changes: new: 1, refs: 1, done            
remote: 
remote: New Changes:        
remote:   http://lvps92-51-163-75.dedicated.hosteurope.de/gerrit-2.10/692 Test Change I4dc87f884f8d8789c4c5f7943ee95b98b49ae98a        
remote: 
To http:\\tests:mylyntest@mylyn.org\gerrit-2.10\org.eclipse.mylyn.test\
 * [new branch]      HEAD -> refs\for\master

######
Running testUnpermittedApproval(org.eclipse.mylyn.internal.gerrit.core.remote.GerritReviewRemoteFactoryTest)
Response message:
remote: 
remote: Processing changes: new: 1, refs: 1        
remote: Processing changes: new: 1, refs: 1        
remote: Processing changes: new: 1, refs: 1        
remote: Processing changes: new: 1, refs: 1, done            
remote: 
remote: New Changes:        
remote:   http://lvps92-51-163-75.dedicated.hosteurope.de/gerrit-2.10/693 Test Change I4101916f7b1bb7406f8b0688cbf1be496b9fefdb        
remote: 
To http:\\tests:mylyntest@mylyn.org\gerrit-2.10\org.eclipse.mylyn.test\
 * [new branch]      HEAD -> refs\for\master

######
Running testNewChange(org.eclipse.mylyn.internal.gerrit.core.remote.GerritReviewRemoteFactoryTest)
Response message:
remote: 
remote: Processing changes: new: 1, refs: 1        
remote: Processing changes: new: 1, refs: 1, done            
remote: 
remote: New Changes:        
remote:   http://lvps92-51-163-75.dedicated.hosteurope.de/gerrit-2.10/694 Test Change I548fa914087ae9b56fe490f913799608c1611588        
remote: 
To http:\\tests:mylyntest@mylyn.org\gerrit-2.10\org.eclipse.mylyn.test\
 * [new branch]      HEAD -> refs\for\master

######
Response message:
remote: 
remote: Processing changes: updated: 1, refs: 1        
remote: Processing changes: updated: 1, refs: 1, done            
remote: 
remote: Updated Changes:        
remote:   http://lvps92-51-163-75.dedicated.hosteurope.de/gerrit-2.10/694 Test Change I548fa914087ae9b56fe490f913799608c1611588        
remote: 
To http:\\tests:mylyntest@mylyn.org\gerrit-2.10\org.eclipse.mylyn.test\
 * [new branch]      HEAD -> refs\for\master

######
Running testCannotSubmitChange(org.eclipse.mylyn.internal.gerrit.core.remote.GerritReviewRemoteFactoryTest)
Response message:
remote: 
remote: Processing changes: new: 1, refs: 1        
remote: Processing changes: new: 1, refs: 1        
remote: Processing changes: new: 1, refs: 1        
remote: Processing changes: new: 1, refs: 1, done            
remote: 
remote: New Changes:        
remote:   http://lvps92-51-163-75.dedicated.hosteurope.de/gerrit-2.10/695 Test Change I22bd0f5ebb08c21472c3d0426c7d705379088b2b        
remote: 
To http:\\tests:mylyntest@mylyn.org\gerrit-2.10\org.eclipse.mylyn.test\
 * [new branch]      HEAD -> refs\for\master

######
Running testReviewStatus(org.eclipse.mylyn.internal.gerrit.core.remote.GerritReviewRemoteFactoryTest)
Response message:
remote: 
remote: Processing changes: new: 1, refs: 1        
remote: Processing changes: new: 1, refs: 1, done            
remote: 
remote: New Changes:        
remote:   http://lvps92-51-163-75.dedicated.hosteurope.de/gerrit-2.10/696 Test Change I2635958b6a3238b96479049b8c5970891680c797        
remote: 
To http:\\tests:mylyntest@mylyn.org\gerrit-2.10\org.eclipse.mylyn.test\
 * [new branch]      HEAD -> refs\for\master

######
Running testGetChangeDetailWithNoApprovals(org.eclipse.mylyn.internal.gerrit.core.remote.GerritReviewRemoteFactoryTest)
Response message:
remote: 
remote: Processing changes: new: 1, refs: 1        
remote: Processing changes: new: 1, refs: 1, done            
remote: 
remote: New Changes:        
remote:   http://lvps92-51-163-75.dedicated.hosteurope.de/gerrit-2.10/697 Test Change I583d7cd6b539f51305ff1622516ba2bf98d13945        
remote: 
To http:\\tests:mylyntest@mylyn.org\gerrit-2.10\org.eclipse.mylyn.test\
 * [new branch]      HEAD -> refs\for\master

######
Running testSetStarred(org.eclipse.mylyn.internal.gerrit.core.remote.GerritReviewRemoteFactoryTest)
Response message:
remote: 
remote: Processing changes: new: 1, refs: 1        
remote: Processing changes: new: 1, refs: 1, done            
remote: 
remote: New Changes:        
remote:   http://lvps92-51-163-75.dedicated.hosteurope.de/gerrit-2.10/698 Test Change I1685d920c1944d455a83a75b8f199c420728dd31        
remote: 
To http:\\tests:mylyntest@mylyn.org\gerrit-2.10\org.eclipse.mylyn.test\
 * [new branch]      HEAD -> refs\for\master

######
Running testAddSomeInvalidReviewers(org.eclipse.mylyn.internal.gerrit.core.remote.GerritReviewRemoteFactoryTest)
Response message:
remote: 
remote: Processing changes: new: 1, refs: 1        
remote: Processing changes: new: 1, refs: 1, done            
remote: 
remote: New Changes:        
remote:   http://lvps92-51-163-75.dedicated.hosteurope.de/gerrit-2.10/699 Test Change I35421d2a72ed27f7e1774ad5cd7a8497c6717fd1        
remote: 
To http:\\tests:mylyntest@mylyn.org\gerrit-2.10\org.eclipse.mylyn.test\
 * [new branch]      HEAD -> refs\for\master

######
Running testRestoreChange(org.eclipse.mylyn.internal.gerrit.core.remote.GerritReviewRemoteFactoryTest)
Response message:
remote: 
remote: Processing changes: new: 1, refs: 1        
remote: Processing changes: new: 1, refs: 1        
remote: Processing changes: new: 1, refs: 1        
remote: Processing changes: new: 1, refs: 1, done            
remote: 
remote: New Changes:        
remote:   http://lvps92-51-163-75.dedicated.hosteurope.de/gerrit-2.10/700 Test Change I2bac31a2a4d8275ea9c88c3e02be29ed99d26119        
remote: 
To http:\\tests:mylyntest@mylyn.org\gerrit-2.10\org.eclipse.mylyn.test\
 * [new branch]      HEAD -> refs\for\master

######
Running testReviewsWithSameChangeId(org.eclipse.mylyn.internal.gerrit.core.remote.GerritReviewRemoteFactoryTest)
Response message:
remote: 
remote: Processing changes: new: 1, refs: 1        
remote: Processing changes: new: 1, refs: 1, done            
remote: 
remote: New Changes:        
remote:   http://lvps92-51-163-75.dedicated.hosteurope.de/gerrit-2.10/701 Test Change I7ccd400d9be93ff57d87ada318e037b44c546f2d        
remote: 
To http:\\tests:mylyntest@mylyn.org\gerrit-2.10\org.eclipse.mylyn.test\
 * [new branch]      HEAD -> refs\for\master

######
Response message:
remote: 
remote: Processing changes: new: 1, refs: 1        
remote: Processing changes: new: 1, refs: 1, done            
remote: 
remote: New Changes:        
remote:   http://lvps92-51-163-75.dedicated.hosteurope.de/gerrit-2.10/702 Test Change I7ccd400d9be93ff57d87ada318e037b44c546f2d        
remote: 
To http:\\tests:mylyntest@mylyn.org\gerrit-2.10\org.eclipse.mylyn.test\
 * [new branch]      HEAD -> refs\for\test_side_branch

######
Running testAddNullReviewers(org.eclipse.mylyn.internal.gerrit.core.remote.GerritReviewRemoteFactoryTest)
Response message:
remote: 
remote: Processing changes: new: 1, refs: 1        
remote: Processing changes: new: 1, refs: 1, done            
remote: 
remote: New Changes:        
remote:   http://lvps92-51-163-75.dedicated.hosteurope.de/gerrit-2.10/703 Test Change I1e01ef11fb16d646e03eeade4631c95e04cb1acd        
remote: 
To http:\\tests:mylyntest@mylyn.org\gerrit-2.10\org.eclipse.mylyn.test\
 * [new branch]      HEAD -> refs\for\master

######
Running testAddReviewersByEmail(org.eclipse.mylyn.internal.gerrit.core.remote.GerritReviewRemoteFactoryTest)
Response message:
remote: 
remote: Processing changes: new: 1, refs: 1        
remote: Processing changes: new: 1, refs: 1        
remote: Processing changes: new: 1, refs: 1        
remote: Processing changes: new: 1, refs: 1, done            
remote: 
remote: New Changes:        
remote:   http://lvps92-51-163-75.dedicated.hosteurope.de/gerrit-2.10/704 Test Change I5902194f46359e5c85816a8c0b67fa5e60dadecf        
remote: 
To http:\\tests:mylyntest@mylyn.org\gerrit-2.10\org.eclipse.mylyn.test\
 * [new branch]      HEAD -> refs\for\master

######
Running testNoLabels(org.eclipse.mylyn.internal.gerrit.core.remote.GerritReviewRemoteFactoryTest)
Response message:
remote: 
remote: Processing changes: new: 1, refs: 1        
remote: Processing changes: new: 1, refs: 1, done            
remote: 
remote: New Changes:        
remote:   http://lvps92-51-163-75.dedicated.hosteurope.de/gerrit-2.10/705 Test Change I7ac2c0f877535dd03f8055b448541abe6508455c        
remote: 
To http:\\tests:mylyntest@mylyn.org\gerrit-2.10\org.eclipse.mylyn.test\
 * [new branch]      HEAD -> refs\for\master

######
Running testAbandonChange(org.eclipse.mylyn.internal.gerrit.core.remote.GerritReviewRemoteFactoryTest)
Response message:
remote: 
remote: Processing changes: new: 1, refs: 1        
remote: Processing changes: new: 1, refs: 1        
remote: Processing changes: new: 1, refs: 1, done            
remote: 
remote: New Changes:        
remote:   http://lvps92-51-163-75.dedicated.hosteurope.de/gerrit-2.10/706 Test Change I6cfa4fdbd651c33ef7ad9d4f8a2a1a26d40024c4        
remote: 
To http:\\tests:mylyntest@mylyn.org\gerrit-2.10\org.eclipse.mylyn.test\
 * [new branch]      HEAD -> refs\for\master

######
Running testAddReviewers(org.eclipse.mylyn.internal.gerrit.core.remote.GerritReviewRemoteFactoryTest)
Response message:
remote: 
remote: Processing changes: new: 1, refs: 1        
remote: Processing changes: new: 1, refs: 1, done            
remote: 
remote: New Changes:        
remote:   http://lvps92-51-163-75.dedicated.hosteurope.de/gerrit-2.10/707 Test Change I7f85543f468296e9707610877ec5ee35f1de0264        
remote: 
To http:\\tests:mylyntest@mylyn.org\gerrit-2.10\org.eclipse.mylyn.test\
 * [new branch]      HEAD -> refs\for\master

######
Running testDependencies(org.eclipse.mylyn.internal.gerrit.core.remote.GerritReviewRemoteFactoryTest)
Response message:
remote: 
remote: Processing changes: new: 1, refs: 1        
remote: Processing changes: new: 1, refs: 1, done            
remote: 
remote: New Changes:        
remote:   http://lvps92-51-163-75.dedicated.hosteurope.de/gerrit-2.10/708 Test Change I57f8a26187651bf4f4c4cc6385e1625344edd2c9        
remote: 
To http:\\tests:mylyntest@mylyn.org\gerrit-2.10\org.eclipse.mylyn.test\
 * [new branch]      HEAD -> refs\for\master

######
Response message:
remote: 
remote: Processing changes: new: 1, refs: 1        
remote: Processing changes: new: 1, refs: 1, done            
remote: 
remote: New Changes:        
remote:   http://lvps92-51-163-75.dedicated.hosteurope.de/gerrit-2.10/709 Test Change I1464814210537aaaaaaaaaaaaaaaaaaaaaaaaaaa        
remote: 
To http:\\tests:mylyntest@mylyn.org\gerrit-2.10\org.eclipse.mylyn.test\
 * [new branch]      HEAD -> refs\for\master

######
Running testParentCommit(org.eclipse.mylyn.internal.gerrit.core.remote.GerritReviewRemoteFactoryTest)
Response message:
remote: 
remote: Processing changes: new: 1, refs: 1        
remote: Processing changes: new: 1, refs: 1, done            
remote: 
remote: New Changes:        
remote:   http://lvps92-51-163-75.dedicated.hosteurope.de/gerrit-2.10/710 Test Change I7beebd9382ea3b4be0d20dc0e02b5a973d12e95f        
remote: 
To http:\\tests:mylyntest@mylyn.org\gerrit-2.10\org.eclipse.mylyn.test\
 * [new branch]      HEAD -> refs\for\master

######
Response message:
remote: 
remote: Processing changes: new: 1, refs: 1        
remote: Processing changes: new: 1, refs: 1, done            
remote: 
remote: New Changes:        
remote:   http://lvps92-51-163-75.dedicated.hosteurope.de/gerrit-2.10/711 Test Change I2b698cdea60947dafa2e714a7d179492206b3b8b        
remote: 
To http:\\tests:mylyntest@mylyn.org\gerrit-2.10\org.eclipse.mylyn.test\
 * [new branch]      HEAD -> refs\for\master

######
Running testGlobalCommentByGerrit(org.eclipse.mylyn.internal.gerrit.core.remote.GerritReviewRemoteFactoryTest)
Response message:
remote: 
remote: Processing changes: new: 1, refs: 1        
remote: Processing changes: new: 1, refs: 1, done            
remote: 
remote: New Changes:        
remote:   http://lvps92-51-163-75.dedicated.hosteurope.de/gerrit-2.10/712 Test Change I32b0e313c889d217a7ec4049bd16e8ec10c42b5f        
remote: 
To http:\\tests:mylyntest@mylyn.org\gerrit-2.10\org.eclipse.mylyn.test\
 * [new branch]      HEAD -> refs\for\master

######
Response message:
remote: 
remote: Processing changes: new: 1, refs: 1        
remote: Processing changes: new: 1, refs: 1, done            
remote: 
remote: New Changes:        
remote:   http://lvps92-51-163-75.dedicated.hosteurope.de/gerrit-2.10/713 Test Change I670dc5147ee919ff35384e41238f7060527ffba8        
remote: 
To http:\\tests:mylyntest@mylyn.org\gerrit-2.10\org.eclipse.mylyn.test\
 * [new branch]      HEAD -> refs\for\master

######
Response message:
remote: Resolving deltas: 100% (1/1)           
remote: Resolving deltas: 100% (1/1)        
remote: 
remote: Processing changes: updated: 1, refs: 1        
remote: Processing changes: updated: 1, refs: 1        
remote: Processing changes: updated: 1, refs: 1        
remote: Processing changes: updated: 1, refs: 1, done            
remote: 
remote: Updated Changes:        
remote:   http://lvps92-51-163-75.dedicated.hosteurope.de/gerrit-2.10/712 Test Change I32b0e313c889d217a7ec4049bd16e8ec10c42b5f        
remote: 
To http:\\tests:mylyntest@mylyn.org\gerrit-2.10\org.eclipse.mylyn.test\
 * [new branch]      HEAD -> refs\for\master

######
Running testRestoreNewChange(org.eclipse.mylyn.internal.gerrit.core.remote.GerritReviewRemoteFactoryTest)
Response message:
remote: 
remote: Processing changes: new: 1, refs: 1        
remote: Processing changes: new: 1, refs: 1, done            
remote: 
remote: New Changes:        
remote:   http://lvps92-51-163-75.dedicated.hosteurope.de/gerrit-2.10/714 Test Change I16df23b753250d0dd5e2fdeedba21b18828ab716        
remote: 
To http:\\tests:mylyntest@mylyn.org\gerrit-2.10\org.eclipse.mylyn.test\
 * [new branch]      HEAD -> refs\for\master

######
Running testBaseAndPatchSetComments(org.eclipse.mylyn.internal.gerrit.core.remote.PatchSetRemoteFactoryTest)
Response message:
remote: 
remote: Processing changes: new: 1, refs: 1        
remote: Processing changes: new: 1, refs: 1, done            
remote: 
remote: New Changes:        
remote:   http://lvps92-51-163-75.dedicated.hosteurope.de/gerrit-2.10/715 Test Change I7fb0ed22ebb3b05e6855a6ded8a0cfac1e45b4af        
remote: 
To http:\\tests:mylyntest@mylyn.org\gerrit-2.10\org.eclipse.mylyn.test\
 * [new branch]      HEAD -> refs\for\master

######
Response message:
remote: 
remote: Processing changes: updated: 1, refs: 1        
remote: Processing changes: updated: 1, refs: 1        
remote: Processing changes: updated: 1, refs: 1        
remote: Processing changes: updated: 1, refs: 1, done            
remote: 
remote: Updated Changes:        
remote:   http://lvps92-51-163-75.dedicated.hosteurope.de/gerrit-2.10/715 Test Change I7fb0ed22ebb3b05e6855a6ded8a0cfac1e45b4af        
remote: 
To http:\\tests:mylyntest@mylyn.org\gerrit-2.10\org.eclipse.mylyn.test\
 * [new branch]      HEAD -> refs\for\master

######
Running testBaseComment(org.eclipse.mylyn.internal.gerrit.core.remote.PatchSetRemoteFactoryTest)
Response message:
remote: 
remote: Processing changes: new: 1, refs: 1        
remote: Processing changes: new: 1, refs: 1, done            
remote: 
remote: New Changes:        
remote:   http://lvps92-51-163-75.dedicated.hosteurope.de/gerrit-2.10/716 Test Change I361cff228b252d0ec19f29098c9b6597b18bce97        
remote: 
To http:\\tests:mylyntest@mylyn.org\gerrit-2.10\org.eclipse.mylyn.test\
 * [new branch]      HEAD -> refs\for\master

######
Response message:
remote: 
remote: Processing changes: updated: 1, refs: 1        
remote: Processing changes: updated: 1, refs: 1, done            
remote: 
remote: Updated Changes:        
remote:   http://lvps92-51-163-75.dedicated.hosteurope.de/gerrit-2.10/716 Test Change I361cff228b252d0ec19f29098c9b6597b18bce97        
remote: 
To http:\\tests:mylyntest@mylyn.org\gerrit-2.10\org.eclipse.mylyn.test\
 * [new branch]      HEAD -> refs\for\master

######
Running testLoadPatchSet(org.eclipse.mylyn.internal.gerrit.core.remote.PatchSetRemoteFactoryTest)
Response message:
remote: 
remote: Processing changes: new: 1, refs: 1        
remote: Processing changes: new: 1, refs: 1, done            
remote: 
remote: New Changes:        
remote:   http://lvps92-51-163-75.dedicated.hosteurope.de/gerrit-2.10/717 Test Change I248f18be4fa9c2a4003c88bbc6cb09a2b4a8835d        
remote: 
To http:\\tests:mylyntest@mylyn.org\gerrit-2.10\org.eclipse.mylyn.test\
 * [new branch]      HEAD -> refs\for\master

######
Running testCompareBinaryContent(org.eclipse.mylyn.internal.gerrit.core.remote.PatchSetRemoteFactoryTest)
Response message:
remote: 
remote: Processing changes: new: 1, refs: 1        
remote: Processing changes: new: 1, refs: 1, done            
remote: 
remote: New Changes:        
remote:   http://lvps92-51-163-75.dedicated.hosteurope.de/gerrit-2.10/718 Test Change I6ffa9f1da08e7fc3d5f84cfd17b93cb43b743757        
remote: 
To http:\\tests:mylyntest@mylyn.org\gerrit-2.10\org.eclipse.mylyn.test\
 * [new branch]      HEAD -> refs\for\master

######
Response message:
remote: 
remote: Processing changes: updated: 1, refs: 1        
remote: Processing changes: updated: 1, refs: 1, done            
remote: 
remote: Updated Changes:        
remote:   http://lvps92-51-163-75.dedicated.hosteurope.de/gerrit-2.10/718 Test Change I6ffa9f1da08e7fc3d5f84cfd17b93cb43b743757        
remote: 
To http:\\tests:mylyntest@mylyn.org\gerrit-2.10\org.eclipse.mylyn.test\
 * [new branch]      HEAD -> refs\for\master

######
Response message:
remote: 
remote: Processing changes: updated: 1, refs: 1        
remote: Processing changes: updated: 1, refs: 1, done            
remote: 
remote: Updated Changes:        
remote:   http://lvps92-51-163-75.dedicated.hosteurope.de/gerrit-2.10/718 Test Change I6ffa9f1da08e7fc3d5f84cfd17b93cb43b743757        
remote: 
To http:\\tests:mylyntest@mylyn.org\gerrit-2.10\org.eclipse.mylyn.test\
 * [new branch]      HEAD -> refs\for\master

######
Response message:
remote: 
remote: Processing changes: updated: 1, refs: 1        
remote: Processing changes: updated: 1, refs: 1, done            
remote: 
remote: Updated Changes:        
remote:   http://lvps92-51-163-75.dedicated.hosteurope.de/gerrit-2.10/718 Test Change I6ffa9f1da08e7fc3d5f84cfd17b93cb43b743757        
remote: 
To http:\\tests:mylyntest@mylyn.org\gerrit-2.10\org.eclipse.mylyn.test\
 * [new branch]      HEAD -> refs\for\master

######
Running testPatchSetComments(org.eclipse.mylyn.internal.gerrit.core.remote.PatchSetRemoteFactoryTest)
Response message:
remote: 
remote: Processing changes: new: 1, refs: 1        
remote: Processing changes: new: 1, refs: 1, done            
remote: 
remote: New Changes:        
remote:   http://lvps92-51-163-75.dedicated.hosteurope.de/gerrit-2.10/719 Test Change I5f2476c992d951534fde8be546f3267643412c5e        
remote: 
To http:\\tests:mylyntest@mylyn.org\gerrit-2.10\org.eclipse.mylyn.test\
 * [new branch]      HEAD -> refs\for\master

######
Response message:
remote: 
remote: Processing changes: updated: 1, refs: 1        
remote: Processing changes: updated: 1, refs: 1, done            
remote: 
remote: Updated Changes:        
remote:   http://lvps92-51-163-75.dedicated.hosteurope.de/gerrit-2.10/719 Test Change I5f2476c992d951534fde8be546f3267643412c5e        
remote: 
To http:\\tests:mylyntest@mylyn.org\gerrit-2.10\org.eclipse.mylyn.test\
 * [new branch]      HEAD -> refs\for\master

######
Running testFetchZippedBinaryContent(org.eclipse.mylyn.internal.gerrit.core.remote.PatchSetRemoteFactoryTest)
Response message:
remote: 
remote: Processing changes: new: 1, refs: 1        
remote: Processing changes: new: 1, refs: 1, done            
remote: 
remote: New Changes:        
remote:   http://lvps92-51-163-75.dedicated.hosteurope.de/gerrit-2.10/720 Test Change I746582f11aa84d9bd7e9705411d510e1ad90105d        
remote: 
To http:\\tests:mylyntest@mylyn.org\gerrit-2.10\org.eclipse.mylyn.test\
 * [new branch]      HEAD -> refs\for\master

######
Response message:
remote: 
remote: Processing changes: updated: 1, refs: 1        
remote: Processing changes: updated: 1, refs: 1, done            
remote: 
remote: Updated Changes:        
remote:   http://lvps92-51-163-75.dedicated.hosteurope.de/gerrit-2.10/720 Test Change I746582f11aa84d9bd7e9705411d510e1ad90105d        
remote: 
To http:\\tests:mylyntest@mylyn.org\gerrit-2.10\org.eclipse.mylyn.test\
 * [new branch]      HEAD -> refs\for\master

######
Running testUnzipBinaryContent(org.eclipse.mylyn.internal.gerrit.core.remote.PatchSetRemoteFactoryTest)
Response message:
remote: 
remote: Processing changes: new: 1, refs: 1        
remote: Processing changes: new: 1, refs: 1, done            
remote: 
remote: New Changes:        
remote:   http://lvps92-51-163-75.dedicated.hosteurope.de/gerrit-2.10/721 Test Change I3e93a2fb07ee7d14c9374ab7a3a412436bc63733        
remote: 
To http:\\tests:mylyntest@mylyn.org\gerrit-2.10\org.eclipse.mylyn.test\
 * [new branch]      HEAD -> refs\for\master

######
Running testPatchSetFiles(org.eclipse.mylyn.internal.gerrit.core.remote.PatchSetRemoteFactoryTest)
Response message:
remote: 
remote: Processing changes: new: 1, refs: 1        
remote: Processing changes: new: 1, refs: 1, done            
remote: 
remote: New Changes:        
remote:   http://lvps92-51-163-75.dedicated.hosteurope.de/gerrit-2.10/722 Test Change I7374db632db9bd4273a9878706b5dbc3a4d9908c        
remote: 
To http:\\tests:mylyntest@mylyn.org\gerrit-2.10\org.eclipse.mylyn.test\
 * [new branch]      HEAD -> refs\for\master

######
Response message:
remote: 
remote: Processing changes: updated: 1, refs: 1        
remote: Processing changes: updated: 1, refs: 1, done            
remote: 
remote: Updated Changes:        
remote:   http://lvps92-51-163-75.dedicated.hosteurope.de/gerrit-2.10/722 Test Change I7374db632db9bd4273a9878706b5dbc3a4d9908c        
remote: 
To http:\\tests:mylyntest@mylyn.org\gerrit-2.10\org.eclipse.mylyn.test\
 * [new branch]      HEAD -> refs\for\master

######
Response message:
remote: 
remote: Processing changes: updated: 1, refs: 1        
remote: Processing changes: updated: 1, refs: 1, done            
remote: 
remote: Updated Changes:        
remote:   http://lvps92-51-163-75.dedicated.hosteurope.de/gerrit-2.10/722 Test Change I7374db632db9bd4273a9878706b5dbc3a4d9908c        
remote: 
To http:\\tests:mylyntest@mylyn.org\gerrit-2.10\org.eclipse.mylyn.test\
 * [new branch]      HEAD -> refs\for\master

######
Running testCompareRenamedImage(org.eclipse.mylyn.internal.gerrit.core.remote.PatchSetRemoteFactoryTest)
Response message:
remote: 
remote: Processing changes: new: 1, refs: 1        
remote: Processing changes: new: 1, refs: 1, done            
remote: 
remote: New Changes:        
remote:   http://lvps92-51-163-75.dedicated.hosteurope.de/gerrit-2.10/723 Test Change Id7ab736e7c4308b36600fc9e56ad7104fb62a93d        
remote: 
To http:\\tests:mylyntest@mylyn.org\gerrit-2.10\org.eclipse.mylyn.test\
 * [new branch]      HEAD -> refs\for\master

######
Response message:
remote: 
remote: Processing changes: updated: 1, refs: 1        
remote: Processing changes: updated: 1, refs: 1, done            
remote: 
remote: Updated Changes:        
remote:   http://lvps92-51-163-75.dedicated.hosteurope.de/gerrit-2.10/723 Test Change Id7ab736e7c4308b36600fc9e56ad7104fb62a93d        
remote: 
To http:\\tests:mylyntest@mylyn.org\gerrit-2.10\org.eclipse.mylyn.test\
 * [new branch]      HEAD -> refs\for\master

######
Response message:
remote: 
remote: Processing changes: updated: 1, refs: 1        
remote: Processing changes: updated: 1, refs: 1, done            
remote: 
remote: Updated Changes:        
remote:   http://lvps92-51-163-75.dedicated.hosteurope.de/gerrit-2.10/723 Test Change Id7ab736e7c4308b36600fc9e56ad7104fb62a93d        
remote: 
To http:\\tests:mylyntest@mylyn.org\gerrit-2.10\org.eclipse.mylyn.test\
 * [new branch]      HEAD -> refs\for\master

######
Running testFetchBinaryContent(org.eclipse.mylyn.internal.gerrit.core.remote.PatchSetRemoteFactoryTest)
Response message:
remote: 
remote: Processing changes: new: 1, refs: 1        
remote: Processing changes: new: 1, refs: 1, done            
remote: 
remote: New Changes:        
remote:   http://lvps92-51-163-75.dedicated.hosteurope.de/gerrit-2.10/724 Test Change I2488de78c0683d76eb0d0653f6e6131c6019da05        
remote: 
To http:\\tests:mylyntest@mylyn.org\gerrit-2.10\org.eclipse.mylyn.test\
 * [new branch]      HEAD -> refs\for\master

######
Response message:
remote: 
remote: Processing changes: updated: 1, refs: 1        
remote: Processing changes: updated: 1, refs: 1        
remote: Processing changes: updated: 1, refs: 1        
remote: Processing changes: updated: 1, refs: 1, done            
remote: 
remote: Updated Changes:        
remote:   http://lvps92-51-163-75.dedicated.hosteurope.de/gerrit-2.10/724 Test Change I2488de78c0683d76eb0d0653f6e6131c6019da05        
remote: 
To http:\\tests:mylyntest@mylyn.org\gerrit-2.10\org.eclipse.mylyn.test\
 * [new branch]      HEAD -> refs\for\master

######
Running testGetPatchSetPublishDetailOfDraftIffAdmin(org.eclipse.mylyn.internal.gerrit.core.remote.PatchSetDetailRemoteFactoryTest)
Response message:
remote: 
remote: Processing changes: new: 1, refs: 1        
remote: Processing changes: new: 1, refs: 1, done            
remote: 
remote: New Changes:        
remote:   http://lvps92-51-163-75.dedicated.hosteurope.de/gerrit-2.10/725 Test Change If46715c99bff13169a055408f3fc7a30ddf324c0 [DRAFT]        
remote: 
To http:\\admin:mylyntest@mylyn.org\gerrit-2.10\org.eclipse.mylyn.test\
 * [new branch]      HEAD -> refs\drafts\master

######
Running testUserHasNoAccessToAdminDraft(org.eclipse.mylyn.internal.gerrit.core.remote.PatchSetDetailRemoteFactoryTest)
Response message:
remote: 
remote: Processing changes: new: 1, refs: 1        
remote: Processing changes: new: 1, refs: 1, done            
remote: 
remote: New Changes:        
remote:   http://lvps92-51-163-75.dedicated.hosteurope.de/gerrit-2.10/726 Test Change I7be28508ec36c47a9046ff54e67be4051f392052 [DRAFT]        
remote: 
To http:\\admin:mylyntest@mylyn.org\gerrit-2.10\org.eclipse.mylyn.test\
 * [new branch]      HEAD -> refs\drafts\master

######
Response message:
remote: 
remote: Processing changes: updated: 1, refs: 1        
remote: Processing changes: updated: 1, refs: 1, done            
remote: 
remote: Updated Changes:        
remote:   http://lvps92-51-163-75.dedicated.hosteurope.de/gerrit-2.10/726 Test Change I7be28508ec36c47a9046ff54e67be4051f392052        
remote: 
To http:\\admin:mylyntest@mylyn.org\gerrit-2.10\org.eclipse.mylyn.test\
 * [new branch]      HEAD -> refs\for\master

######
Running testGetChangeDetailOfDraftIffAdmin(org.eclipse.mylyn.internal.gerrit.core.remote.PatchSetDetailRemoteFactoryTest)
Response message:
remote: 
remote: Processing changes: new: 1, refs: 1        
remote: Processing changes: new: 1, refs: 1, done            
remote: 
remote: New Changes:        
remote:   http://lvps92-51-163-75.dedicated.hosteurope.de/gerrit-2.10/727 Test Change I55bb94d1a4e7e815a3e55eb22a5d22fe3ef01168 [DRAFT]        
remote: 
To http:\\admin:mylyntest@mylyn.org\gerrit-2.10\org.eclipse.mylyn.test\
 * [new branch]      HEAD -> refs\drafts\master

######
Running testUserHasAccessToAdminDraft(org.eclipse.mylyn.internal.gerrit.core.remote.PatchSetDetailRemoteFactoryTest)
Response message:
remote: 
remote: Processing changes: new: 1, refs: 1        
remote: Processing changes: new: 1, refs: 1, done            
remote: 
remote: New Changes:        
remote:   http://lvps92-51-163-75.dedicated.hosteurope.de/gerrit-2.10/728 Test Change I24591044259665fcde9a2098e209ee105c5eaf2c [DRAFT]        
remote: 
To http:\\admin:mylyntest@mylyn.org\gerrit-2.10\org.eclipse.mylyn.test\
 * [new branch]      HEAD -> refs\drafts\master

######
Response message:
remote: 
remote: Processing changes: updated: 1, refs: 1        
remote: Processing changes: updated: 1, refs: 1, done            
remote: 
remote: Updated Changes:        
remote:   http://lvps92-51-163-75.dedicated.hosteurope.de/gerrit-2.10/728 Test Change I24591044259665fcde9a2098e209ee105c5eaf2c        
remote: 
To http:\\admin:mylyntest@mylyn.org\gerrit-2.10\org.eclipse.mylyn.test\
 * [new branch]      HEAD -> refs\for\master

######
Running testOpenUrl(org.eclipse.mylyn.gerrit.tests.ui.GerritUrlHandlerTest)
Skipping GerritUrlHandlerTest.testOpenUrl() due to lack of anonymous access
Running testOpenUrlInvalid(org.eclipse.mylyn.gerrit.tests.ui.GerritUrlHandlerTest)
Skipping GerritUrlHandlerTest.testOpenUrlInvalid() due to lack of browser support
Running testIsSupported(org.eclipse.mylyn.gerrit.tests.core.client.GerritCapabilitiesTest)
Running done(org.eclipse.mylyn.tests.util.TestFixture$Activation)

0 out of 147 tests failed
Tests run: 147, Failures: 0, Errors: 0, Skipped: 0, Time elapsed: 628.463 sec

Results :

Tests run: 147, Failures: 0, Errors: 0, Skipped: 0

[INFO] All tests passed!
[INFO]                                                                         
[INFO] ------------------------------------------------------------------------
[INFO] Building org.eclipse.mylyn.gerrit.ui.tests 2.11.0-SNAPSHOT
[INFO] ------------------------------------------------------------------------
[INFO] 
[INFO] --- maven-clean-plugin:2.4.1:clean (default-clean) @ org.eclipse.mylyn.gerrit.ui.tests ---
[INFO] 
[INFO] --- tycho-packaging-plugin:0.21.0:build-qualifier (default-build-qualifier) @ org.eclipse.mylyn.gerrit.ui.tests ---
[INFO] The project's OSGi version is 2.11.0.x20160421-1821
[INFO] 
[INFO] --- tycho-packaging-plugin:0.21.0:validate-id (default-validate-id) @ org.eclipse.mylyn.gerrit.ui.tests ---
[INFO] 
[INFO] --- tycho-packaging-plugin:0.21.0:validate-version (default-validate-version) @ org.eclipse.mylyn.gerrit.ui.tests ---
[INFO] 
[INFO] --- jacoco-maven-plugin:0.5.6.201201232323:prepare-agent (default) @ org.eclipse.mylyn.gerrit.ui.tests ---
[INFO] Skipping JaCoCo execution
[INFO] 
[INFO] --- maven-resources-plugin:2.4.1:resources (default-resources) @ org.eclipse.mylyn.gerrit.ui.tests ---
[INFO] Using 'ISO-8859-1' encoding to copy filtered resources.
[INFO] skip non existing resourceDirectory /jobs/genie.mylyn/mylyn-test-build/workspace/org.eclipse.mylyn.reviews/org.eclipse.mylyn.gerrit.ui.tests/src/main/resources
[INFO] 
[INFO] --- tycho-compiler-plugin:0.21.0:compile (default-compile) @ org.eclipse.mylyn.gerrit.ui.tests ---
[INFO] Compiling 9 source files to /jobs/genie.mylyn/mylyn-test-build/workspace/org.eclipse.mylyn.reviews/org.eclipse.mylyn.gerrit.ui.tests/target/classes
[INFO] 
[INFO] --- tycho-source-plugin:0.21.0:plugin-source (attach-source) @ org.eclipse.mylyn.gerrit.ui.tests ---
[WARNING] bundle localization file /jobs/genie.mylyn/mylyn-test-build/workspace/org.eclipse.mylyn.reviews/org.eclipse.mylyn.gerrit.ui.tests/plugin.properties not found
[INFO] Building jar: /jobs/genie.mylyn/mylyn-test-build/workspace/org.eclipse.mylyn.reviews/org.eclipse.mylyn.gerrit.ui.tests/target/org.eclipse.mylyn.gerrit.ui.tests-2.11.0-SNAPSHOT-sources.jar
[INFO] 
[INFO] --- maven-resources-plugin:2.4.1:testResources (default-testResources) @ org.eclipse.mylyn.gerrit.ui.tests ---
[INFO] Using 'ISO-8859-1' encoding to copy filtered resources.
[INFO] skip non existing resourceDirectory /jobs/genie.mylyn/mylyn-test-build/workspace/org.eclipse.mylyn.reviews/org.eclipse.mylyn.gerrit.ui.tests/src/test/resources
[INFO] 
[INFO] --- target-platform-configuration:0.21.0:target-platform (default-target-platform) @ org.eclipse.mylyn.gerrit.ui.tests ---
[INFO] 
[INFO] --- tycho-packaging-plugin:0.21.0:package-plugin (default-package-plugin) @ org.eclipse.mylyn.gerrit.ui.tests ---
[INFO] Building jar: /jobs/genie.mylyn/mylyn-test-build/workspace/org.eclipse.mylyn.reviews/org.eclipse.mylyn.gerrit.ui.tests/target/org.eclipse.mylyn.gerrit.ui.tests-2.11.0-SNAPSHOT.jar
[INFO] 
[INFO] --- tycho-p2-plugin:0.21.0:p2-metadata-default (default-p2-metadata-default) @ org.eclipse.mylyn.gerrit.ui.tests ---
[INFO] 
[INFO] --- tycho-surefire-plugin:0.21.0:test (default-test) @ org.eclipse.mylyn.gerrit.ui.tests ---
[INFO] Expected eclipse log file: /jobs/genie.mylyn/mylyn-test-build/workspace/org.eclipse.mylyn.reviews/org.eclipse.mylyn.gerrit.ui.tests/target/work/data/.metadata/.log
[INFO] Command line:
	[/opt/public/common/jdk1.8.0_51.x64/jre/bin/java, -Dosgi.noShutdown=false, -Dosgi.os=linux, -Dosgi.ws=gtk, -Dosgi.arch=x86_64, -Xmx512m, -XX:MaxPermSize=256m, -Djava.io.tmpdir=/jobs/genie.mylyn/mylyn-test-build/workspace/org.eclipse.mylyn.reviews/org.eclipse.mylyn.gerrit.ui.tests/target, -ea, -Dmylyn.credentials=/shared/mylyn/.credentials.properties, -Dorg.eclipse.mylyn.wikitext.tests.disableOutput=true, -Dhttp.proxyHost=proxy.eclipse.org, -Dhttp.proxyPort=9898, -Dhttps.proxyHost=proxy.eclipse.org, -Dhttps.proxyPort=9898, -DhttpnonProxyHosts=*.eclipse.org, -Dorg.eclipse.mylyn.gerrit.tests.alternate.push=true, -Dosgi.clean=true, -jar, /jobs/genie.mylyn/mylyn-test-build/workspace/.maven/repo/p2/osgi/bundle/org.eclipse.equinox.launcher/1.3.100.v20150511-1540/org.eclipse.equinox.launcher-1.3.100.v20150511-1540.jar, -data, /jobs/genie.mylyn/mylyn-test-build/workspace/org.eclipse.mylyn.reviews/org.eclipse.mylyn.gerrit.ui.tests/target/work/data, -install, /jobs/genie.mylyn/mylyn-test-build/workspace/org.eclipse.mylyn.reviews/org.eclipse.mylyn.gerrit.ui.tests/target/work, -configuration, /jobs/genie.mylyn/mylyn-test-build/workspace/org.eclipse.mylyn.reviews/org.eclipse.mylyn.gerrit.ui.tests/target/work/configuration, -application, org.eclipse.tycho.surefire.osgibooter.uitest, -testproperties, /jobs/genie.mylyn/mylyn-test-build/workspace/org.eclipse.mylyn.reviews/org.eclipse.mylyn.gerrit.ui.tests/target/surefire.properties, -testApplication, org.eclipse.ui.ide.workbench, -product, org.eclipse.sdk.ide, -eclipse.keyring, /jobs/genie.mylyn/mylyn-test-build/workspace/org.eclipse.mylyn.reviews/org.eclipse.mylyn.gerrit.ui.tests/target/.eclipse.keyring, -eclipse.password, /jobs/genie.mylyn/mylyn-test-build/workspace/org.eclipse.mylyn.reviews/org.eclipse.mylyn.gerrit.ui.tests/target/../../.gitignore]
Java HotSpot(TM) 64-Bit Server VM warning: ignoring option MaxPermSize=256m; support was removed in 8.0

-------------------------------------------------------
 T E S T S
-------------------------------------------------------
Running org.eclipse.mylyn.internal.gerrit.ui.operations.BranchProposalProviderTest
Tests run: 7, Failures: 0, Errors: 0, Skipped: 0, Time elapsed: 0.025 sec
Running org.eclipse.mylyn.internal.gerrit.ui.operations.AddReviewersDialogTest
Tests run: 7, Failures: 0, Errors: 0, Skipped: 0, Time elapsed: 0.204 sec
Running org.eclipse.mylyn.internal.gerrit.ui.ChangeIdHyperlinkTest
Tests run: 9, Failures: 0, Errors: 0, Skipped: 0, Time elapsed: 0.004 sec
Running org.eclipse.mylyn.internal.gerrit.ui.GerritUrlHandlerTest
Tests run: 28, Failures: 0, Errors: 0, Skipped: 0, Time elapsed: 0.221 sec
Running org.eclipse.mylyn.internal.gerrit.ui.editor.GerritTaskEditorTest
Tests run: 1, Failures: 0, Errors: 0, Skipped: 0, Time elapsed: 0.073 sec
Running org.eclipse.mylyn.internal.gerrit.ui.editor.GerritTaskEditorPageTest
Tests run: 4, Failures: 0, Errors: 0, Skipped: 0, Time elapsed: 0.447 sec
Running org.eclipse.mylyn.internal.gerrit.ui.GerritCompareUiTest
Tests run: 5, Failures: 0, Errors: 0, Skipped: 0, Time elapsed: 0.078 sec
Running org.eclipse.mylyn.internal.gerrit.ui.GerritRepositorySettingsPageTest
Tests run: 2, Failures: 0, Errors: 0, Skipped: 0, Time elapsed: 0.275 sec
Running org.eclipse.mylyn.internal.gerrit.ui.GerritCommentLinkDetectorTest
Tests run: 8, Failures: 0, Errors: 0, Skipped: 0, Time elapsed: 0.004 sec

Results :

Tests run: 71, Failures: 0, Errors: 0, Skipped: 0

[2016-06-01T4-54-4] Status ERROR: org.eclipse.mylyn.gerrit.core code=1 Problem while retrieving Gerrit review.: Unknown Host null, 
[2016-06-01T4-54-4] Status ERROR: org.eclipse.mylyn.gerrit.core code=1 Problem while retrieving Gerrit review.: Unknown Host null, 
[2016-06-01T4-54-4] Status ERROR: org.eclipse.mylyn.gerrit.core code=1 Problem while retrieving Gerrit review.: Unknown Host null, 
[2016-06-01T4-54-4] Status ERROR: org.eclipse.mylyn.gerrit.core code=1 Problem while retrieving Gerrit review.: Unknown Host null, 
[INFO] All tests passed!
[INFO]                                                                         
[INFO] ------------------------------------------------------------------------
[INFO] Building org.eclipse.mylyn.reviews.core.tests 2.11.0-SNAPSHOT
[INFO] ------------------------------------------------------------------------
[INFO] 
[INFO] --- maven-clean-plugin:2.4.1:clean (default-clean) @ org.eclipse.mylyn.reviews.core.tests ---
[INFO] 
[INFO] --- tycho-packaging-plugin:0.21.0:build-qualifier (default-build-qualifier) @ org.eclipse.mylyn.reviews.core.tests ---
[INFO] The project's OSGi version is 2.11.0.x20160421-1821
[INFO] 
[INFO] --- tycho-packaging-plugin:0.21.0:validate-id (default-validate-id) @ org.eclipse.mylyn.reviews.core.tests ---
[INFO] 
[INFO] --- tycho-packaging-plugin:0.21.0:validate-version (default-validate-version) @ org.eclipse.mylyn.reviews.core.tests ---
[INFO] 
[INFO] --- jacoco-maven-plugin:0.5.6.201201232323:prepare-agent (default) @ org.eclipse.mylyn.reviews.core.tests ---
[INFO] Skipping JaCoCo execution
[INFO] 
[INFO] --- maven-resources-plugin:2.4.1:resources (default-resources) @ org.eclipse.mylyn.reviews.core.tests ---
[INFO] Using 'ISO-8859-1' encoding to copy filtered resources.
[INFO] skip non existing resourceDirectory /jobs/genie.mylyn/mylyn-test-build/workspace/org.eclipse.mylyn.reviews/org.eclipse.mylyn.reviews.core.tests/src/main/resources
[INFO] 
[INFO] --- tycho-compiler-plugin:0.21.0:compile (default-compile) @ org.eclipse.mylyn.reviews.core.tests ---
[INFO] Compiling 16 source files to /jobs/genie.mylyn/mylyn-test-build/workspace/org.eclipse.mylyn.reviews/org.eclipse.mylyn.reviews.core.tests/target/classes
[INFO] 
[INFO] --- tycho-source-plugin:0.21.0:plugin-source (attach-source) @ org.eclipse.mylyn.reviews.core.tests ---
[WARNING] bundle localization file /jobs/genie.mylyn/mylyn-test-build/workspace/org.eclipse.mylyn.reviews/org.eclipse.mylyn.reviews.core.tests/plugin.properties not found
[INFO] Building jar: /jobs/genie.mylyn/mylyn-test-build/workspace/org.eclipse.mylyn.reviews/org.eclipse.mylyn.reviews.core.tests/target/org.eclipse.mylyn.reviews.core.tests-2.11.0-SNAPSHOT-sources.jar
[INFO] 
[INFO] --- maven-resources-plugin:2.4.1:testResources (default-testResources) @ org.eclipse.mylyn.reviews.core.tests ---
[INFO] Using 'ISO-8859-1' encoding to copy filtered resources.
[INFO] skip non existing resourceDirectory /jobs/genie.mylyn/mylyn-test-build/workspace/org.eclipse.mylyn.reviews/org.eclipse.mylyn.reviews.core.tests/src/test/resources
[INFO] 
[INFO] --- target-platform-configuration:0.21.0:target-platform (default-target-platform) @ org.eclipse.mylyn.reviews.core.tests ---
[INFO] 
[INFO] --- tycho-packaging-plugin:0.21.0:package-plugin (default-package-plugin) @ org.eclipse.mylyn.reviews.core.tests ---
[INFO] Building jar: /jobs/genie.mylyn/mylyn-test-build/workspace/org.eclipse.mylyn.reviews/org.eclipse.mylyn.reviews.core.tests/target/org.eclipse.mylyn.reviews.core.tests-2.11.0-SNAPSHOT.jar
[INFO] 
[INFO] --- tycho-p2-plugin:0.21.0:p2-metadata-default (default-p2-metadata-default) @ org.eclipse.mylyn.reviews.core.tests ---
[INFO] 
[INFO] --- tycho-surefire-plugin:0.21.0:test (default-test) @ org.eclipse.mylyn.reviews.core.tests ---
[INFO] Expected eclipse log file: /jobs/genie.mylyn/mylyn-test-build/workspace/org.eclipse.mylyn.reviews/org.eclipse.mylyn.reviews.core.tests/target/work/data/.metadata/.log
[INFO] Command line:
	[/opt/public/common/jdk1.8.0_51.x64/jre/bin/java, -Dosgi.noShutdown=false, -Dosgi.os=linux, -Dosgi.ws=gtk, -Dosgi.arch=x86_64, -Xmx512m, -XX:MaxPermSize=256m, -Djava.io.tmpdir=/jobs/genie.mylyn/mylyn-test-build/workspace/org.eclipse.mylyn.reviews/org.eclipse.mylyn.reviews.core.tests/target, -ea, -Dmylyn.credentials=/shared/mylyn/.credentials.properties, -Dorg.eclipse.mylyn.wikitext.tests.disableOutput=true, -Dhttp.proxyHost=proxy.eclipse.org, -Dhttp.proxyPort=9898, -Dhttps.proxyHost=proxy.eclipse.org, -Dhttps.proxyPort=9898, -DhttpnonProxyHosts=*.eclipse.org, -Dorg.eclipse.mylyn.gerrit.tests.alternate.push=true, -Dosgi.clean=true, -jar, /jobs/genie.mylyn/mylyn-test-build/workspace/.maven/repo/p2/osgi/bundle/org.eclipse.equinox.launcher/1.3.100.v20150511-1540/org.eclipse.equinox.launcher-1.3.100.v20150511-1540.jar, -data, /jobs/genie.mylyn/mylyn-test-build/workspace/org.eclipse.mylyn.reviews/org.eclipse.mylyn.reviews.core.tests/target/work/data, -install, /jobs/genie.mylyn/mylyn-test-build/workspace/org.eclipse.mylyn.reviews/org.eclipse.mylyn.reviews.core.tests/target/work, -configuration, /jobs/genie.mylyn/mylyn-test-build/workspace/org.eclipse.mylyn.reviews/org.eclipse.mylyn.reviews.core.tests/target/work/configuration, -application, org.eclipse.tycho.surefire.osgibooter.uitest, -testproperties, /jobs/genie.mylyn/mylyn-test-build/workspace/org.eclipse.mylyn.reviews/org.eclipse.mylyn.reviews.core.tests/target/surefire.properties, -testApplication, org.eclipse.ui.ide.workbench, -product, org.eclipse.sdk.ide, -eclipse.keyring, /jobs/genie.mylyn/mylyn-test-build/workspace/org.eclipse.mylyn.reviews/org.eclipse.mylyn.reviews.core.tests/target/.eclipse.keyring, -eclipse.password, /jobs/genie.mylyn/mylyn-test-build/workspace/org.eclipse.mylyn.reviews/org.eclipse.mylyn.reviews.core.tests/target/../../.gitignore]
Java HotSpot(TM) 64-Bit Server VM warning: ignoring option MaxPermSize=256m; support was removed in 8.0

-------------------------------------------------------
 T E S T S
-------------------------------------------------------
Running org.eclipse.mylyn.reviews.core.spi.remote.emf.RemoteServiceTest
Tests run: 6, Failures: 0, Errors: 0, Skipped: 0, Time elapsed: 0.077 sec
Running org.eclipse.mylyn.reviews.core.spi.remote.emf.RemoteEmfFactoryTest
Tests run: 19, Failures: 0, Errors: 0, Skipped: 0, Time elapsed: 3.114 sec
Running org.eclipse.mylyn.reviews.core.spi.remote.emf.RemoteEmfObserverTest
Tests run: 6, Failures: 0, Errors: 0, Skipped: 0, Time elapsed: 1.335 sec
Running org.eclipse.mylyn.reviews.core.spi.remote.AbstractDataLocatorTest
Tests run: 9, Failures: 0, Errors: 0, Skipped: 0, Time elapsed: 0.019 sec
Running org.eclipse.mylyn.reviews.core.spi.remote.ReviewsDataLocatorTest
Tests run: 2, Failures: 0, Errors: 0, Skipped: 0, Time elapsed: 0.012 sec
Running org.eclipse.mylyn.reviews.core.model.IndexedTest
Tests run: 2, Failures: 0, Errors: 0, Skipped: 0, Time elapsed: 0.009 sec
Running org.eclipse.mylyn.reviews.core.model.CommentContainerTest
Tests run: 17, Failures: 0, Errors: 0, Skipped: 0, Time elapsed: 0.038 sec
Running org.eclipse.mylyn.reviews.internal.core.TaskReviewMappingStoreTest
Tests run: 9, Failures: 0, Errors: 0, Skipped: 0, Time elapsed: 0.406 sec
Running org.eclipse.mylyn.reviews.internal.core.ReviewFileCommentsMapperTest
Tests run: 3, Failures: 0, Errors: 0, Skipped: 0, Time elapsed: 0.062 sec
Running org.eclipse.mylyn.reviews.internal.core.TaskBuildStatusMapperTest
Tests run: 4, Failures: 0, Errors: 0, Skipped: 0, Time elapsed: 0.012 sec

Results :

Tests run: 77, Failures: 0, Errors: 0, Skipped: 0

[INFO] All tests passed!
[INFO]                                                                         
[INFO] ------------------------------------------------------------------------
[INFO] Building org.eclipse.mylyn.reviews.tests 2.11.0-SNAPSHOT
[INFO] ------------------------------------------------------------------------
[INFO] 
[INFO] --- maven-clean-plugin:2.4.1:clean (default-clean) @ org.eclipse.mylyn.reviews.tests ---
[INFO] 
[INFO] --- tycho-packaging-plugin:0.21.0:build-qualifier (default-build-qualifier) @ org.eclipse.mylyn.reviews.tests ---
[INFO] The project's OSGi version is 2.11.0.x20160421-1821
[INFO] 
[INFO] --- tycho-packaging-plugin:0.21.0:validate-id (default-validate-id) @ org.eclipse.mylyn.reviews.tests ---
[INFO] 
[INFO] --- tycho-packaging-plugin:0.21.0:validate-version (default-validate-version) @ org.eclipse.mylyn.reviews.tests ---
[INFO] 
[INFO] --- jacoco-maven-plugin:0.5.6.201201232323:prepare-agent (default) @ org.eclipse.mylyn.reviews.tests ---
[INFO] Skipping JaCoCo execution
[INFO] 
[INFO] --- maven-resources-plugin:2.4.1:resources (default-resources) @ org.eclipse.mylyn.reviews.tests ---
[INFO] Using 'ISO-8859-1' encoding to copy filtered resources.
[INFO] skip non existing resourceDirectory /jobs/genie.mylyn/mylyn-test-build/workspace/org.eclipse.mylyn.reviews/org.eclipse.mylyn.reviews.tests/src/main/resources
[INFO] 
[INFO] --- tycho-compiler-plugin:0.21.0:compile (default-compile) @ org.eclipse.mylyn.reviews.tests ---
[INFO] Compiling 8 source files to /jobs/genie.mylyn/mylyn-test-build/workspace/org.eclipse.mylyn.reviews/org.eclipse.mylyn.reviews.tests/target/classes
[INFO] 
[INFO] --- tycho-source-plugin:0.21.0:plugin-source (attach-source) @ org.eclipse.mylyn.reviews.tests ---
[WARNING] bundle localization file /jobs/genie.mylyn/mylyn-test-build/workspace/org.eclipse.mylyn.reviews/org.eclipse.mylyn.reviews.tests/plugin.properties not found
[INFO] Building jar: /jobs/genie.mylyn/mylyn-test-build/workspace/org.eclipse.mylyn.reviews/org.eclipse.mylyn.reviews.tests/target/org.eclipse.mylyn.reviews.tests-2.11.0-SNAPSHOT-sources.jar
[INFO] 
[INFO] --- maven-resources-plugin:2.4.1:testResources (default-testResources) @ org.eclipse.mylyn.reviews.tests ---
[INFO] Using 'ISO-8859-1' encoding to copy filtered resources.
[INFO] skip non existing resourceDirectory /jobs/genie.mylyn/mylyn-test-build/workspace/org.eclipse.mylyn.reviews/org.eclipse.mylyn.reviews.tests/src/test/resources
[INFO] 
[INFO] --- target-platform-configuration:0.21.0:target-platform (default-target-platform) @ org.eclipse.mylyn.reviews.tests ---
[INFO] 
[INFO] --- tycho-packaging-plugin:0.21.0:package-plugin (default-package-plugin) @ org.eclipse.mylyn.reviews.tests ---
[INFO] Building jar: /jobs/genie.mylyn/mylyn-test-build/workspace/org.eclipse.mylyn.reviews/org.eclipse.mylyn.reviews.tests/target/org.eclipse.mylyn.reviews.tests-2.11.0-SNAPSHOT.jar
[INFO] 
[INFO] --- tycho-p2-plugin:0.21.0:p2-metadata-default (default-p2-metadata-default) @ org.eclipse.mylyn.reviews.tests ---
[INFO] 
[INFO] --- tycho-surefire-plugin:0.21.0:test (default-test) @ org.eclipse.mylyn.reviews.tests ---
[INFO] Expected eclipse log file: /jobs/genie.mylyn/mylyn-test-build/workspace/org.eclipse.mylyn.reviews/org.eclipse.mylyn.reviews.tests/target/work/data/.metadata/.log
[INFO] Command line:
	[/opt/public/common/jdk1.8.0_51.x64/jre/bin/java, -Dosgi.noShutdown=false, -Dosgi.os=linux, -Dosgi.ws=gtk, -Dosgi.arch=x86_64, -Xmx512m, -XX:MaxPermSize=256m, -Djava.io.tmpdir=/jobs/genie.mylyn/mylyn-test-build/workspace/org.eclipse.mylyn.reviews/org.eclipse.mylyn.reviews.tests/target, -ea, -Dmylyn.credentials=/shared/mylyn/.credentials.properties, -Dorg.eclipse.mylyn.wikitext.tests.disableOutput=true, -Dhttp.proxyHost=proxy.eclipse.org, -Dhttp.proxyPort=9898, -Dhttps.proxyHost=proxy.eclipse.org, -Dhttps.proxyPort=9898, -DhttpnonProxyHosts=*.eclipse.org, -Dorg.eclipse.mylyn.gerrit.tests.alternate.push=true, -Dosgi.clean=true, -jar, /jobs/genie.mylyn/mylyn-test-build/workspace/.maven/repo/p2/osgi/bundle/org.eclipse.equinox.launcher/1.3.100.v20150511-1540/org.eclipse.equinox.launcher-1.3.100.v20150511-1540.jar, -data, /jobs/genie.mylyn/mylyn-test-build/workspace/org.eclipse.mylyn.reviews/org.eclipse.mylyn.reviews.tests/target/work/data, -install, /jobs/genie.mylyn/mylyn-test-build/workspace/org.eclipse.mylyn.reviews/org.eclipse.mylyn.reviews.tests/target/work, -configuration, /jobs/genie.mylyn/mylyn-test-build/workspace/org.eclipse.mylyn.reviews/org.eclipse.mylyn.reviews.tests/target/work/configuration, -application, org.eclipse.tycho.surefire.osgibooter.uitest, -testproperties, /jobs/genie.mylyn/mylyn-test-build/workspace/org.eclipse.mylyn.reviews/org.eclipse.mylyn.reviews.tests/target/surefire.properties, -testApplication, org.eclipse.ui.ide.workbench, -product, org.eclipse.sdk.ide, -eclipse.keyring, /jobs/genie.mylyn/mylyn-test-build/workspace/org.eclipse.mylyn.reviews/org.eclipse.mylyn.reviews.tests/target/.eclipse.keyring, -eclipse.password, /jobs/genie.mylyn/mylyn-test-build/workspace/org.eclipse.mylyn.reviews/org.eclipse.mylyn.reviews.tests/target/../../.gitignore]
Java HotSpot(TM) 64-Bit Server VM warning: ignoring option MaxPermSize=256m; support was removed in 8.0

-------------------------------------------------------
 T E S T S
-------------------------------------------------------
Running org.eclipse.mylyn.reviews.tests.AllReviewsTests
[2016-06-01T4-54-21] Status ERROR: org.eclipse.mylyn.reviews.edit code=0 Problem with model file. Will be recreated at: file:/jobs/genie.mylyn/mylyn-test-build/workspace/org.eclipse.mylyn.reviews/org.eclipse.mylyn.reviews.tests/target/org.eclipse.mylyn.reviews.tests/RemoteEditFactoryTest/Container/EClass/123.ecore org.eclipse.emf.ecore.resource.impl.ResourceSetImpl$1DiagnosticWrappedException: org.xml.sax.SAXParseExceptionpublicId: file:/jobs/genie.mylyn/mylyn-test-build/workspace/org.eclipse.mylyn.reviews/org.eclipse.mylyn.reviews.tests/target/org.eclipse.mylyn.reviews.tests/RemoteEditFactoryTest/Container/EClass/123.ecore; systemId: file:/jobs/genie.mylyn/mylyn-test-build/workspace/org.eclipse.mylyn.reviews/org.eclipse.mylyn.reviews.tests/target/org.eclipse.mylyn.reviews.tests/RemoteEditFactoryTest/Container/EClass/123.ecore; lineNumber: 1; columnNumber: 1; Content is not allowed in prolog., Exception:
org.eclipse.emf.ecore.resource.impl.ResourceSetImpl$1DiagnosticWrappedException: org.xml.sax.SAXParseExceptionpublicId: file:/jobs/genie.mylyn/mylyn-test-build/workspace/org.eclipse.mylyn.reviews/org.eclipse.mylyn.reviews.tests/target/org.eclipse.mylyn.reviews.tests/RemoteEditFactoryTest/Container/EClass/123.ecore; systemId: file:/jobs/genie.mylyn/mylyn-test-build/workspace/org.eclipse.mylyn.reviews/org.eclipse.mylyn.reviews.tests/target/org.eclipse.mylyn.reviews.tests/RemoteEditFactoryTest/Container/EClass/123.ecore; lineNumber: 1; columnNumber: 1; Content is not allowed in prolog.
	at org.eclipse.emf.ecore.resource.impl.ResourceSetImpl.handleDemandLoadException(ResourceSetImpl.java:319)
	at org.eclipse.emf.ecore.resource.impl.ResourceSetImpl.demandLoadHelper(ResourceSetImpl.java:278)
	at org.eclipse.emf.ecore.resource.impl.ResourceSetImpl.getResource(ResourceSetImpl.java:406)
	at org.eclipse.mylyn.reviews.spi.edit.remote.AbstractRemoteEditFactoryProvider.getResourceImpl(AbstractRemoteEditFactoryProvider.java:135)
	at org.eclipse.mylyn.reviews.spi.edit.remote.AbstractRemoteEditFactoryProvider.open(AbstractRemoteEditFactoryProvider.java:189)
	at org.eclipse.mylyn.reviews.spi.edit.remote.AbstractRemoteEditFactoryProvider.open(AbstractRemoteEditFactoryProvider.java:107)
	at org.eclipse.mylyn.reviews.spi.edit.remote.AbstractRemoteEditFactoryProviderTest.testBadChild(AbstractRemoteEditFactoryProviderTest.java:206)
	at sun.reflect.NativeMethodAccessorImpl.invoke0(Native Method)
	at sun.reflect.NativeMethodAccessorImpl.invoke(NativeMethodAccessorImpl.java:62)
	at sun.reflect.DelegatingMethodAccessorImpl.invoke(DelegatingMethodAccessorImpl.java:43)
	at java.lang.reflect.Method.invoke(Method.java:497)
	at junit.framework.TestCase.runTest(TestCase.java:176)
	at junit.framework.TestCase.runBare(TestCase.java:141)
	at junit.framework.TestResult$1.protect(TestResult.java:122)
	at junit.framework.TestResult.runProtected(TestResult.java:142)
	at junit.framework.TestResult.run(TestResult.java:125)
	at junit.framework.TestCase.run(TestCase.java:129)
	at junit.framework.TestSuite.runTest(TestSuite.java:252)
	at junit.framework.TestSuite.run(TestSuite.java:247)
	at junit.framework.TestSuite.runTest(TestSuite.java:252)
	at junit.framework.TestSuite.run(TestSuite.java:247)
	at org.junit.internal.runners.JUnit38ClassRunner.run(JUnit38ClassRunner.java:86)
	at org.apache.maven.surefire.junit4.JUnit4TestSet.execute(JUnit4TestSet.java:53)
	at org.apache.maven.surefire.junit4.JUnit4Provider.executeTestSet(JUnit4Provider.java:123)
	at org.apache.maven.surefire.junit4.JUnit4Provider.invoke(JUnit4Provider.java:104)
	at sun.reflect.NativeMethodAccessorImpl.invoke0(Native Method)
	at sun.reflect.NativeMethodAccessorImpl.invoke(NativeMethodAccessorImpl.java:62)
	at sun.reflect.DelegatingMethodAccessorImpl.invoke(DelegatingMethodAccessorImpl.java:43)
	at java.lang.reflect.Method.invoke(Method.java:497)
	at org.apache.maven.surefire.util.ReflectionUtils.invokeMethodWithArray(ReflectionUtils.java:164)
	at org.apache.maven.surefire.booter.ProviderFactory$ProviderProxy.invoke(ProviderFactory.java:110)
	at org.apache.maven.surefire.booter.SurefireStarter.invokeProvider(SurefireStarter.java:175)
	at org.apache.maven.surefire.booter.SurefireStarter.runSuitesInProcess(SurefireStarter.java:123)
	at org.eclipse.tycho.surefire.osgibooter.OsgiSurefireBooter.run(OsgiSurefireBooter.java:87)
	at org.eclipse.tycho.surefire.osgibooter.AbstractUITestApplication$1.run(AbstractUITestApplication.java:35)
	at org.eclipse.swt.widgets.RunnableLock.run(RunnableLock.java:35)
	at org.eclipse.swt.widgets.Synchronizer.runAsyncMessages(Synchronizer.java:135)
	at org.eclipse.swt.widgets.Display.runAsyncMessages(Display.java:3794)
	at org.eclipse.swt.widgets.Display.readAndDispatch(Display.java:3433)
	at org.eclipse.e4.ui.internal.workbench.swt.PartRenderingEngine$4.run(PartRenderingEngine.java:1127)
	at org.eclipse.core.databinding.observable.Realm.runWithDefault(Realm.java:337)
	at org.eclipse.e4.ui.internal.workbench.swt.PartRenderingEngine.run(PartRenderingEngine.java:1018)
	at org.eclipse.e4.ui.internal.workbench.E4Workbench.createAndRunUI(E4Workbench.java:156)
	at org.eclipse.ui.internal.Workbench$5.run(Workbench.java:694)
	at org.eclipse.core.databinding.observable.Realm.runWithDefault(Realm.java:337)
	at org.eclipse.ui.internal.Workbench.createAndRunWorkbench(Workbench.java:606)
	at org.eclipse.ui.PlatformUI.createAndRunWorkbench(PlatformUI.java:150)
	at org.eclipse.ui.internal.ide.application.IDEApplication.start(IDEApplication.java:139)
	at org.eclipse.tycho.surefire.osgibooter.UITestApplication.runApplication(UITestApplication.java:31)
	at org.eclipse.tycho.surefire.osgibooter.AbstractUITestApplication.run(AbstractUITestApplication.java:115)
	at org.eclipse.tycho.surefire.osgibooter.UITestApplication.start(UITestApplication.java:37)
	at org.eclipse.equinox.internal.app.EclipseAppHandle.run(EclipseAppHandle.java:196)
	at org.eclipse.core.runtime.internal.adaptor.EclipseAppLauncher.runApplication(EclipseAppLauncher.java:134)
	at org.eclipse.core.runtime.internal.adaptor.EclipseAppLauncher.start(EclipseAppLauncher.java:104)
	at org.eclipse.core.runtime.adaptor.EclipseStarter.run(EclipseStarter.java:380)
	at org.eclipse.core.runtime.adaptor.EclipseStarter.run(EclipseStarter.java:235)
	at sun.reflect.NativeMethodAccessorImpl.invoke0(Native Method)
	at sun.reflect.NativeMethodAccessorImpl.invoke(NativeMethodAccessorImpl.java:62)
	at sun.reflect.DelegatingMethodAccessorImpl.invoke(DelegatingMethodAccessorImpl.java:43)
	at java.lang.reflect.Method.invoke(Method.java:497)
	at org.eclipse.equinox.launcher.Main.invokeFramework(Main.java:669)
	at org.eclipse.equinox.launcher.Main.basicRun(Main.java:608)
	at org.eclipse.equinox.launcher.Main.run(Main.java:1515)
	at org.eclipse.equinox.launcher.Main.main(Main.java:1488)
Caused by: org.xml.sax.SAXParseExceptionpublicId: file:/jobs/genie.mylyn/mylyn-test-build/workspace/org.eclipse.mylyn.reviews/org.eclipse.mylyn.reviews.tests/target/org.eclipse.mylyn.reviews.tests/RemoteEditFactoryTest/Container/EClass/123.ecore; systemId: file:/jobs/genie.mylyn/mylyn-test-build/workspace/org.eclipse.mylyn.reviews/org.eclipse.mylyn.reviews.tests/target/org.eclipse.mylyn.reviews.tests/RemoteEditFactoryTest/Container/EClass/123.ecore; lineNumber: 1; columnNumber: 1; Content is not allowed in prolog.
	at com.sun.org.apache.xerces.internal.util.ErrorHandlerWrapper.createSAXParseException(ErrorHandlerWrapper.java:203)
	at com.sun.org.apache.xerces.internal.util.ErrorHandlerWrapper.fatalError(ErrorHandlerWrapper.java:177)
	at com.sun.org.apache.xerces.internal.impl.XMLErrorReporter.reportError(XMLErrorReporter.java:441)
	at com.sun.org.apache.xerces.internal.impl.XMLErrorReporter.reportError(XMLErrorReporter.java:368)
	at com.sun.org.apache.xerces.internal.impl.XMLScanner.reportFatalError(XMLScanner.java:1437)
	at com.sun.org.apache.xerces.internal.impl.XMLDocumentScannerImpl$PrologDriver.next(XMLDocumentScannerImpl.java:999)
	at com.sun.org.apache.xerces.internal.impl.XMLDocumentScannerImpl.next(XMLDocumentScannerImpl.java:606)
	at com.sun.org.apache.xerces.internal.impl.XMLDocumentFragmentScannerImpl.scanDocument(XMLDocumentFragmentScannerImpl.java:510)
	at com.sun.org.apache.xerces.internal.parsers.XML11Configuration.parse(XML11Configuration.java:848)
	at com.sun.org.apache.xerces.internal.parsers.XML11Configuration.parse(XML11Configuration.java:777)
	at com.sun.org.apache.xerces.internal.parsers.XMLParser.parse(XMLParser.java:141)
	at com.sun.org.apache.xerces.internal.parsers.AbstractSAXParser.parse(AbstractSAXParser.java:1213)
	at com.sun.org.apache.xerces.internal.jaxp.SAXParserImpl$JAXPSAXParser.parse(SAXParserImpl.java:649)
	at com.sun.org.apache.xerces.internal.jaxp.SAXParserImpl.parse(SAXParserImpl.java:333)
	at org.eclipse.emf.ecore.xmi.impl.XMLLoadImpl.load(XMLLoadImpl.java:175)
	at org.eclipse.emf.ecore.xmi.impl.XMLResourceImpl.doLoad(XMLResourceImpl.java:261)
	at org.eclipse.emf.ecore.resource.impl.ResourceImpl.load(ResourceImpl.java:1518)
	at org.eclipse.emf.ecore.resource.impl.ResourceImpl.load(ResourceImpl.java:1297)
	at org.eclipse.emf.ecore.resource.impl.ResourceSetImpl.demandLoad(ResourceSetImpl.java:259)
	at org.eclipse.emf.ecore.resource.impl.ResourceSetImpl.demandLoadHelper(ResourceSetImpl.java:274)
	... 62 more

[2016-06-01T4-54-21] Status ERROR: org.eclipse.mylyn.reviews.edit code=0 Problem with model file. Will be recreated at: file:/jobs/genie.mylyn/mylyn-test-build/workspace/org.eclipse.mylyn.reviews/org.eclipse.mylyn.reviews.tests/target/org.eclipse.mylyn.reviews.tests/RemoteEditFactoryTest/Container/EPackage/EPackage.ecore org.eclipse.emf.ecore.resource.impl.ResourceSetImpl$1DiagnosticWrappedException: org.xml.sax.SAXParseExceptionpublicId: file:/jobs/genie.mylyn/mylyn-test-build/workspace/org.eclipse.mylyn.reviews/org.eclipse.mylyn.reviews.tests/target/org.eclipse.mylyn.reviews.tests/RemoteEditFactoryTest/Container/EPackage/EPackage.ecore; systemId: file:/jobs/genie.mylyn/mylyn-test-build/workspace/org.eclipse.mylyn.reviews/org.eclipse.mylyn.reviews.tests/target/org.eclipse.mylyn.reviews.tests/RemoteEditFactoryTest/Container/EPackage/EPackage.ecore; lineNumber: 1; columnNumber: 1; Content is not allowed in prolog., Exception:
org.eclipse.emf.ecore.resource.impl.ResourceSetImpl$1DiagnosticWrappedException: org.xml.sax.SAXParseExceptionpublicId: file:/jobs/genie.mylyn/mylyn-test-build/workspace/org.eclipse.mylyn.reviews/org.eclipse.mylyn.reviews.tests/target/org.eclipse.mylyn.reviews.tests/RemoteEditFactoryTest/Container/EPackage/EPackage.ecore; systemId: file:/jobs/genie.mylyn/mylyn-test-build/workspace/org.eclipse.mylyn.reviews/org.eclipse.mylyn.reviews.tests/target/org.eclipse.mylyn.reviews.tests/RemoteEditFactoryTest/Container/EPackage/EPackage.ecore; lineNumber: 1; columnNumber: 1; Content is not allowed in prolog.
	at org.eclipse.emf.ecore.resource.impl.ResourceSetImpl.handleDemandLoadException(ResourceSetImpl.java:319)
	at org.eclipse.emf.ecore.resource.impl.ResourceSetImpl.demandLoadHelper(ResourceSetImpl.java:278)
	at org.eclipse.emf.ecore.resource.impl.ResourceSetImpl.getResource(ResourceSetImpl.java:406)
	at org.eclipse.mylyn.reviews.spi.edit.remote.AbstractRemoteEditFactoryProvider.getResourceImpl(AbstractRemoteEditFactoryProvider.java:135)
	at org.eclipse.mylyn.reviews.spi.edit.remote.AbstractRemoteEditFactoryProvider.open(AbstractRemoteEditFactoryProvider.java:189)
	at org.eclipse.mylyn.reviews.spi.edit.remote.AbstractRemoteEditFactoryProvider.open(AbstractRemoteEditFactoryProvider.java:95)
	at org.eclipse.mylyn.reviews.spi.edit.remote.AbstractRemoteEditFactoryProviderTest.testBadFile(AbstractRemoteEditFactoryProviderTest.java:138)
	at sun.reflect.NativeMethodAccessorImpl.invoke0(Native Method)
	at sun.reflect.NativeMethodAccessorImpl.invoke(NativeMethodAccessorImpl.java:62)
	at sun.reflect.DelegatingMethodAccessorImpl.invoke(DelegatingMethodAccessorImpl.java:43)
	at java.lang.reflect.Method.invoke(Method.java:497)
	at junit.framework.TestCase.runTest(TestCase.java:176)
	at junit.framework.TestCase.runBare(TestCase.java:141)
	at junit.framework.TestResult$1.protect(TestResult.java:122)
	at junit.framework.TestResult.runProtected(TestResult.java:142)
	at junit.framework.TestResult.run(TestResult.java:125)
	at junit.framework.TestCase.run(TestCase.java:129)
	at junit.framework.TestSuite.runTest(TestSuite.java:252)
	at junit.framework.TestSuite.run(TestSuite.java:247)
	at junit.framework.TestSuite.runTest(TestSuite.java:252)
	at junit.framework.TestSuite.run(TestSuite.java:247)
	at org.junit.internal.runners.JUnit38ClassRunner.run(JUnit38ClassRunner.java:86)
	at org.apache.maven.surefire.junit4.JUnit4TestSet.execute(JUnit4TestSet.java:53)
	at org.apache.maven.surefire.junit4.JUnit4Provider.executeTestSet(JUnit4Provider.java:123)
	at org.apache.maven.surefire.junit4.JUnit4Provider.invoke(JUnit4Provider.java:104)
	at sun.reflect.NativeMethodAccessorImpl.invoke0(Native Method)
	at sun.reflect.NativeMethodAccessorImpl.invoke(NativeMethodAccessorImpl.java:62)
	at sun.reflect.DelegatingMethodAccessorImpl.invoke(DelegatingMethodAccessorImpl.java:43)
	at java.lang.reflect.Method.invoke(Method.java:497)
	at org.apache.maven.surefire.util.ReflectionUtils.invokeMethodWithArray(ReflectionUtils.java:164)
	at org.apache.maven.surefire.booter.ProviderFactory$ProviderProxy.invoke(ProviderFactory.java:110)
	at org.apache.maven.surefire.booter.SurefireStarter.invokeProvider(SurefireStarter.java:175)
	at org.apache.maven.surefire.booter.SurefireStarter.runSuitesInProcess(SurefireStarter.java:123)
	at org.eclipse.tycho.surefire.osgibooter.OsgiSurefireBooter.run(OsgiSurefireBooter.java:87)
	at org.eclipse.tycho.surefire.osgibooter.AbstractUITestApplication$1.run(AbstractUITestApplication.java:35)
	at org.eclipse.swt.widgets.RunnableLock.run(RunnableLock.java:35)
	at org.eclipse.swt.widgets.Synchronizer.runAsyncMessages(Synchronizer.java:135)
	at org.eclipse.swt.widgets.Display.runAsyncMessages(Display.java:3794)
	at org.eclipse.swt.widgets.Display.readAndDispatch(Display.java:3433)
	at org.eclipse.e4.ui.internal.workbench.swt.PartRenderingEngine$4.run(PartRenderingEngine.java:1127)
	at org.eclipse.core.databinding.observable.Realm.runWithDefault(Realm.java:337)
	at org.eclipse.e4.ui.internal.workbench.swt.PartRenderingEngine.run(PartRenderingEngine.java:1018)
	at org.eclipse.e4.ui.internal.workbench.E4Workbench.createAndRunUI(E4Workbench.java:156)
	at org.eclipse.ui.internal.Workbench$5.run(Workbench.java:694)
	at org.eclipse.core.databinding.observable.Realm.runWithDefault(Realm.java:337)
	at org.eclipse.ui.internal.Workbench.createAndRunWorkbench(Workbench.java:606)
	at org.eclipse.ui.PlatformUI.createAndRunWorkbench(PlatformUI.java:150)
	at org.eclipse.ui.internal.ide.application.IDEApplication.start(IDEApplication.java:139)
	at org.eclipse.tycho.surefire.osgibooter.UITestApplication.runApplication(UITestApplication.java:31)
	at org.eclipse.tycho.surefire.osgibooter.AbstractUITestApplication.run(AbstractUITestApplication.java:115)
	at org.eclipse.tycho.surefire.osgibooter.UITestApplication.start(UITestApplication.java:37)
	at org.eclipse.equinox.internal.app.EclipseAppHandle.run(EclipseAppHandle.java:196)
	at org.eclipse.core.runtime.internal.adaptor.EclipseAppLauncher.runApplication(EclipseAppLauncher.java:134)
	at org.eclipse.core.runtime.internal.adaptor.EclipseAppLauncher.start(EclipseAppLauncher.java:104)
	at org.eclipse.core.runtime.adaptor.EclipseStarter.run(EclipseStarter.java:380)
	at org.eclipse.core.runtime.adaptor.EclipseStarter.run(EclipseStarter.java:235)
	at sun.reflect.NativeMethodAccessorImpl.invoke0(Native Method)
	at sun.reflect.NativeMethodAccessorImpl.invoke(NativeMethodAccessorImpl.java:62)
	at sun.reflect.DelegatingMethodAccessorImpl.invoke(DelegatingMethodAccessorImpl.java:43)
	at java.lang.reflect.Method.invoke(Method.java:497)
	at org.eclipse.equinox.launcher.Main.invokeFramework(Main.java:669)
	at org.eclipse.equinox.launcher.Main.basicRun(Main.java:608)
	at org.eclipse.equinox.launcher.Main.run(Main.java:1515)
	at org.eclipse.equinox.launcher.Main.main(Main.java:1488)
Caused by: org.xml.sax.SAXParseExceptionpublicId: file:/jobs/genie.mylyn/mylyn-test-build/workspace/org.eclipse.mylyn.reviews/org.eclipse.mylyn.reviews.tests/target/org.eclipse.mylyn.reviews.tests/RemoteEditFactoryTest/Container/EPackage/EPackage.ecore; systemId: file:/jobs/genie.mylyn/mylyn-test-build/workspace/org.eclipse.mylyn.reviews/org.eclipse.mylyn.reviews.tests/target/org.eclipse.mylyn.reviews.tests/RemoteEditFactoryTest/Container/EPackage/EPackage.ecore; lineNumber: 1; columnNumber: 1; Content is not allowed in prolog.
	at com.sun.org.apache.xerces.internal.util.ErrorHandlerWrapper.createSAXParseException(ErrorHandlerWrapper.java:203)
	at com.sun.org.apache.xerces.internal.util.ErrorHandlerWrapper.fatalError(ErrorHandlerWrapper.java:177)
	at com.sun.org.apache.xerces.internal.impl.XMLErrorReporter.reportError(XMLErrorReporter.java:441)
	at com.sun.org.apache.xerces.internal.impl.XMLErrorReporter.reportError(XMLErrorReporter.java:368)
	at com.sun.org.apache.xerces.internal.impl.XMLScanner.reportFatalError(XMLScanner.java:1437)
	at com.sun.org.apache.xerces.internal.impl.XMLDocumentScannerImpl$PrologDriver.next(XMLDocumentScannerImpl.java:999)
	at com.sun.org.apache.xerces.internal.impl.XMLDocumentScannerImpl.next(XMLDocumentScannerImpl.java:606)
	at com.sun.org.apache.xerces.internal.impl.XMLDocumentFragmentScannerImpl.scanDocument(XMLDocumentFragmentScannerImpl.java:510)
	at com.sun.org.apache.xerces.internal.parsers.XML11Configuration.parse(XML11Configuration.java:848)
	at com.sun.org.apache.xerces.internal.parsers.XML11Configuration.parse(XML11Configuration.java:777)
	at com.sun.org.apache.xerces.internal.parsers.XMLParser.parse(XMLParser.java:141)
	at com.sun.org.apache.xerces.internal.parsers.AbstractSAXParser.parse(AbstractSAXParser.java:1213)
	at com.sun.org.apache.xerces.internal.jaxp.SAXParserImpl$JAXPSAXParser.parse(SAXParserImpl.java:649)
	at com.sun.org.apache.xerces.internal.jaxp.SAXParserImpl.parse(SAXParserImpl.java:333)
	at org.eclipse.emf.ecore.xmi.impl.XMLLoadImpl.load(XMLLoadImpl.java:175)
	at org.eclipse.emf.ecore.xmi.impl.XMLResourceImpl.doLoad(XMLResourceImpl.java:261)
	at org.eclipse.emf.ecore.resource.impl.ResourceImpl.load(ResourceImpl.java:1518)
	at org.eclipse.emf.ecore.resource.impl.ResourceImpl.load(ResourceImpl.java:1297)
	at org.eclipse.emf.ecore.resource.impl.ResourceSetImpl.demandLoad(ResourceSetImpl.java:259)
	at org.eclipse.emf.ecore.resource.impl.ResourceSetImpl.demandLoadHelper(ResourceSetImpl.java:274)
	... 62 more

Tests run: 31, Failures: 0, Errors: 0, Skipped: 0, Time elapsed: 0.693 sec

Results :

Tests run: 31, Failures: 0, Errors: 0, Skipped: 0

[INFO] All tests passed!
[INFO]                                                                         
[INFO] ------------------------------------------------------------------------
[INFO] Building org.eclipse.mylyn.reviews.development.feature 2.11.0-SNAPSHOT
[INFO] ------------------------------------------------------------------------
[INFO] 
[INFO] --- maven-clean-plugin:2.4.1:clean (default-clean) @ org.eclipse.mylyn.reviews.development.feature ---
[INFO] 
[INFO] --- tycho-packaging-plugin:0.21.0:build-qualifier-aggregator (default-build-qualifier-aggregator) @ org.eclipse.mylyn.reviews.development.feature ---
[INFO] The project's OSGi version is 2.11.0.x20160518-1752
[INFO] 
[INFO] --- tycho-packaging-plugin:0.21.0:validate-id (default-validate-id) @ org.eclipse.mylyn.reviews.development.feature ---
[INFO] 
[INFO] --- tycho-packaging-plugin:0.21.0:validate-version (default-validate-version) @ org.eclipse.mylyn.reviews.development.feature ---
[INFO] 
[INFO] --- jacoco-maven-plugin:0.5.6.201201232323:prepare-agent (default) @ org.eclipse.mylyn.reviews.development.feature ---
[INFO] Skipping JaCoCo execution
[INFO] 
[INFO] --- target-platform-configuration:0.21.0:target-platform (default-target-platform) @ org.eclipse.mylyn.reviews.development.feature ---
[INFO] 
[INFO] --- tycho-packaging-plugin:0.21.0:package-feature (default-package-feature) @ org.eclipse.mylyn.reviews.development.feature ---
[INFO] Building jar: /jobs/genie.mylyn/mylyn-test-build/workspace/org.eclipse.mylyn.reviews/org.eclipse.mylyn.reviews.development.feature/target/org.eclipse.mylyn.reviews.development.feature-2.11.0-SNAPSHOT.jar
[INFO] 
[INFO] --- tycho-p2-plugin:0.21.0:p2-metadata-default (default-p2-metadata-default) @ org.eclipse.mylyn.reviews.development.feature ---
[INFO] 
[INFO] --- tycho-p2-plugin:0.21.0:feature-p2-metadata (default-feature-p2-metadata) @ org.eclipse.mylyn.reviews.development.feature ---
[INFO]                                                                         
[INFO] ------------------------------------------------------------------------
[INFO] Building org.eclipse.mylyn.reviews.ui.tests 2.11.0-SNAPSHOT
[INFO] ------------------------------------------------------------------------
[INFO] 
[INFO] --- maven-clean-plugin:2.4.1:clean (default-clean) @ org.eclipse.mylyn.reviews.ui.tests ---
[INFO] 
[INFO] --- tycho-packaging-plugin:0.21.0:build-qualifier (default-build-qualifier) @ org.eclipse.mylyn.reviews.ui.tests ---
[INFO] The project's OSGi version is 2.11.0.x20160421-1821
[INFO] 
[INFO] --- tycho-packaging-plugin:0.21.0:validate-id (default-validate-id) @ org.eclipse.mylyn.reviews.ui.tests ---
[INFO] 
[INFO] --- tycho-packaging-plugin:0.21.0:validate-version (default-validate-version) @ org.eclipse.mylyn.reviews.ui.tests ---
[INFO] 
[INFO] --- jacoco-maven-plugin:0.5.6.201201232323:prepare-agent (default) @ org.eclipse.mylyn.reviews.ui.tests ---
[INFO] Skipping JaCoCo execution
[INFO] 
[INFO] --- maven-resources-plugin:2.4.1:resources (default-resources) @ org.eclipse.mylyn.reviews.ui.tests ---
[INFO] Using 'ISO-8859-1' encoding to copy filtered resources.
[INFO] skip non existing resourceDirectory /jobs/genie.mylyn/mylyn-test-build/workspace/org.eclipse.mylyn.reviews/org.eclipse.mylyn.reviews.ui.tests/src/main/resources
[INFO] 
[INFO] --- tycho-compiler-plugin:0.21.0:compile (default-compile) @ org.eclipse.mylyn.reviews.ui.tests ---
[INFO] Compiling 2 source files to /jobs/genie.mylyn/mylyn-test-build/workspace/org.eclipse.mylyn.reviews/org.eclipse.mylyn.reviews.ui.tests/target/classes
[INFO] 
[INFO] --- tycho-source-plugin:0.21.0:plugin-source (attach-source) @ org.eclipse.mylyn.reviews.ui.tests ---
[WARNING] bundle localization file /jobs/genie.mylyn/mylyn-test-build/workspace/org.eclipse.mylyn.reviews/org.eclipse.mylyn.reviews.ui.tests/plugin.properties not found
[INFO] Building jar: /jobs/genie.mylyn/mylyn-test-build/workspace/org.eclipse.mylyn.reviews/org.eclipse.mylyn.reviews.ui.tests/target/org.eclipse.mylyn.reviews.ui.tests-2.11.0-SNAPSHOT-sources.jar
[INFO] 
[INFO] --- maven-resources-plugin:2.4.1:testResources (default-testResources) @ org.eclipse.mylyn.reviews.ui.tests ---
[INFO] Using 'ISO-8859-1' encoding to copy filtered resources.
[INFO] skip non existing resourceDirectory /jobs/genie.mylyn/mylyn-test-build/workspace/org.eclipse.mylyn.reviews/org.eclipse.mylyn.reviews.ui.tests/src/test/resources
[INFO] 
[INFO] --- target-platform-configuration:0.21.0:target-platform (default-target-platform) @ org.eclipse.mylyn.reviews.ui.tests ---
[INFO] 
[INFO] --- tycho-packaging-plugin:0.21.0:package-plugin (default-package-plugin) @ org.eclipse.mylyn.reviews.ui.tests ---
[INFO] Building jar: /jobs/genie.mylyn/mylyn-test-build/workspace/org.eclipse.mylyn.reviews/org.eclipse.mylyn.reviews.ui.tests/target/org.eclipse.mylyn.reviews.ui.tests-2.11.0-SNAPSHOT.jar
[INFO] 
[INFO] --- tycho-p2-plugin:0.21.0:p2-metadata-default (default-p2-metadata-default) @ org.eclipse.mylyn.reviews.ui.tests ---
[INFO] 
[INFO] --- tycho-surefire-plugin:0.21.0:test (default-test) @ org.eclipse.mylyn.reviews.ui.tests ---
[INFO] Expected eclipse log file: /jobs/genie.mylyn/mylyn-test-build/workspace/org.eclipse.mylyn.reviews/org.eclipse.mylyn.reviews.ui.tests/target/work/data/.metadata/.log
[INFO] Command line:
	[/opt/public/common/jdk1.8.0_51.x64/jre/bin/java, -Dosgi.noShutdown=false, -Dosgi.os=linux, -Dosgi.ws=gtk, -Dosgi.arch=x86_64, -Xmx512m, -XX:MaxPermSize=256m, -Djava.io.tmpdir=/jobs/genie.mylyn/mylyn-test-build/workspace/org.eclipse.mylyn.reviews/org.eclipse.mylyn.reviews.ui.tests/target, -ea, -Dmylyn.credentials=/shared/mylyn/.credentials.properties, -Dorg.eclipse.mylyn.wikitext.tests.disableOutput=true, -Dhttp.proxyHost=proxy.eclipse.org, -Dhttp.proxyPort=9898, -Dhttps.proxyHost=proxy.eclipse.org, -Dhttps.proxyPort=9898, -DhttpnonProxyHosts=*.eclipse.org, -Dorg.eclipse.mylyn.gerrit.tests.alternate.push=true, -Dosgi.clean=true, -jar, /jobs/genie.mylyn/mylyn-test-build/workspace/.maven/repo/p2/osgi/bundle/org.eclipse.equinox.launcher/1.3.100.v20150511-1540/org.eclipse.equinox.launcher-1.3.100.v20150511-1540.jar, -data, /jobs/genie.mylyn/mylyn-test-build/workspace/org.eclipse.mylyn.reviews/org.eclipse.mylyn.reviews.ui.tests/target/work/data, -install, /jobs/genie.mylyn/mylyn-test-build/workspace/org.eclipse.mylyn.reviews/org.eclipse.mylyn.reviews.ui.tests/target/work, -configuration, /jobs/genie.mylyn/mylyn-test-build/workspace/org.eclipse.mylyn.reviews/org.eclipse.mylyn.reviews.ui.tests/target/work/configuration, -application, org.eclipse.tycho.surefire.osgibooter.uitest, -testproperties, /jobs/genie.mylyn/mylyn-test-build/workspace/org.eclipse.mylyn.reviews/org.eclipse.mylyn.reviews.ui.tests/target/surefire.properties, -testApplication, org.eclipse.ui.ide.workbench, -product, org.eclipse.sdk.ide, -eclipse.keyring, /jobs/genie.mylyn/mylyn-test-build/workspace/org.eclipse.mylyn.reviews/org.eclipse.mylyn.reviews.ui.tests/target/.eclipse.keyring, -eclipse.password, /jobs/genie.mylyn/mylyn-test-build/workspace/org.eclipse.mylyn.reviews/org.eclipse.mylyn.reviews.ui.tests/target/../../.gitignore]
Java HotSpot(TM) 64-Bit Server VM warning: ignoring option MaxPermSize=256m; support was removed in 8.0

-------------------------------------------------------
 T E S T S
-------------------------------------------------------
Running org.eclipse.mylyn.reviews.ui.tests.AllReviewsUiTests
Tests run: 23, Failures: 0, Errors: 0, Skipped: 0, Time elapsed: 4.431 sec

Results :

Tests run: 23, Failures: 0, Errors: 0, Skipped: 0

[INFO] All tests passed!
[INFO]                                                                         
[INFO] ------------------------------------------------------------------------
[INFO] Building org.eclipse.mylyn.all 3.20.0-SNAPSHOT
[INFO] ------------------------------------------------------------------------
[INFO] 
[INFO] --- maven-clean-plugin:2.4.1:clean (default-clean) @ org.eclipse.mylyn.all ---
[INFO] 
[INFO] --- jacoco-maven-plugin:0.5.6.201201232323:prepare-agent (default) @ org.eclipse.mylyn.all ---
[INFO] Skipping JaCoCo for project with packaging type 'pom'
[INFO] ------------------------------------------------------------------------
[INFO] Reactor Summary:
[INFO] 
[INFO] org.eclipse.mylyn-parent .......................... SUCCESS [16.049s]
[INFO] Mylyn Releng ...................................... SUCCESS [0.011s]
[INFO] org.eclipse.mylyn.discovery ....................... SUCCESS [12.350s]
[INFO] Mylyn Commons ..................................... SUCCESS [0.044s]
[INFO] org.eclipse.mylyn.commons.core .................... SUCCESS [26.674s]
[INFO] org.eclipse.mylyn.commons.screenshots ............. SUCCESS [0.979s]
[INFO] org.eclipse.mylyn.commons.ui ...................... SUCCESS [1.197s]
[INFO] org.eclipse.mylyn.commons.workbench ............... SUCCESS [1.039s]
[INFO] org.eclipse.mylyn.commons ......................... SUCCESS [0.189s]
[INFO] org.eclipse.mylyn.commons.identity.core ........... SUCCESS [0.408s]
[INFO] org.eclipse.mylyn.commons.identity ................ SUCCESS [0.153s]
[INFO] org.eclipse.mylyn.commons.net ..................... SUCCESS [0.583s]
[INFO] org.eclipse.mylyn.commons.notifications.core ...... SUCCESS [0.228s]
[INFO] org.eclipse.mylyn.commons.notifications.feed ...... SUCCESS [0.412s]
[INFO] org.eclipse.mylyn.commons.notifications.ui ........ SUCCESS [0.630s]
[INFO] org.eclipse.mylyn.commons.notifications ........... SUCCESS [0.173s]
[INFO] org.eclipse.mylyn.commons.repositories.core ....... SUCCESS [0.329s]
[INFO] org.eclipse.mylyn.commons.repositories.ui ......... SUCCESS [0.493s]
[INFO] org.eclipse.mylyn.commons.repositories ............ SUCCESS [0.147s]
[INFO] org.eclipse.mylyn.monitor.core .................... SUCCESS [0.367s]
[INFO] Mylyn Context ..................................... SUCCESS [0.042s]
[INFO] org.eclipse.mylyn.context.core .................... SUCCESS [0.509s]
[INFO] org.eclipse.mylyn.monitor.ui ...................... SUCCESS [0.349s]
[INFO] org.eclipse.mylyn.context.ui ...................... SUCCESS [0.639s]
[INFO] Mylyn Tasks ....................................... SUCCESS [0.044s]
[INFO] org.eclipse.mylyn.tasks.core ...................... SUCCESS [2.437s]
[INFO] org.eclipse.mylyn.discovery.core .................. SUCCESS [0.499s]
[INFO] org.eclipse.mylyn.discovery.ui .................... SUCCESS [0.553s]
[INFO] org.eclipse.mylyn.tasks.ui ........................ SUCCESS [3.324s]
[INFO] org.eclipse.mylyn.context.tasks.ui ................ SUCCESS [0.595s]
[INFO] org.eclipse.mylyn.discovery ....................... SUCCESS [0.135s]
[INFO] org.eclipse.mylyn.monitor ......................... SUCCESS [0.166s]
[INFO] org.eclipse.mylyn.tasks.index.core ................ SUCCESS [0.383s]
[INFO] org.eclipse.mylyn.tasks.index.ui .................. SUCCESS [0.498s]
[INFO] org.eclipse.mylyn.tasks.search .................... SUCCESS [0.506s]
[INFO] org.eclipse.mylyn_feature ......................... SUCCESS [0.422s]
[INFO] org.eclipse.mylyn.resources.ui .................... SUCCESS [0.424s]
[INFO] org.eclipse.mylyn.context_feature ................. SUCCESS [0.144s]
[INFO] org.eclipse.cdt.mylyn.ui .......................... SUCCESS [0.610s]
[INFO] org.eclipse.cdt.mylyn ............................. SUCCESS [0.168s]
[INFO] Mylyn Docs ........................................ SUCCESS [0.041s]
[INFO] org.eclipse.mylyn.wikitext.core ................... SUCCESS [0.735s]
[INFO] org.eclipse.mylyn.wikitext.asciidoc.core .......... SUCCESS [0.292s]
[INFO] org.eclipse.mylyn.wikitext.core.osgi .............. SUCCESS [0.237s]
[INFO] org.eclipse.mylyn.wikitext.ui ..................... SUCCESS [1.059s]
[INFO] org.eclipse.mylyn.wikitext.asciidoc.ui ............ SUCCESS [0.165s]
[INFO] org.eclipse.mylyn.wikitext.confluence.core ........ SUCCESS [0.242s]
[INFO] org.eclipse.mylyn.wikitext.confluence.ui .......... SUCCESS [0.331s]
[INFO] org.eclipse.mylyn.wikitext.context.ui ............. SUCCESS [0.293s]
[INFO] org.eclipse.mylyn.wikitext.core.ant ............... SUCCESS [0.257s]
[INFO] org.eclipse.mylyn.wikitext.textile.core ........... SUCCESS [0.333s]
[INFO] org.eclipse.mylyn.wikitext.help.ui ................ SUCCESS [3.555s]
[INFO] org.eclipse.mylyn.wikitext.html.core .............. SUCCESS [0.403s]
[INFO] org.eclipse.mylyn.wikitext.markdown.core .......... SUCCESS [0.208s]
[INFO] org.eclipse.mylyn.wikitext.markdown.ui ............ SUCCESS [0.192s]
[INFO] org.eclipse.mylyn.wikitext.mediawiki.core ......... SUCCESS [0.225s]
[INFO] org.eclipse.mylyn.wikitext.mediawiki.core.ant ..... SUCCESS [0.329s]
[INFO] org.eclipse.mylyn.wikitext.mediawiki.ui ........... SUCCESS [0.327s]
[INFO] org.eclipse.mylyn.wikitext.textile.ui ............. SUCCESS [0.215s]
[INFO] org.eclipse.mylyn.wikitext.tracwiki.core .......... SUCCESS [0.265s]
[INFO] org.eclipse.mylyn.wikitext.tracwiki.ui ............ SUCCESS [0.236s]
[INFO] org.eclipse.mylyn.wikitext.twiki.core ............. SUCCESS [0.272s]
[INFO] org.eclipse.mylyn.wikitext.twiki.ui ............... SUCCESS [0.278s]
[INFO] org.eclipse.mylyn.wikitext.tasks.ui ............... SUCCESS [5.599s]
[INFO] org.eclipse.mylyn.wikitext_feature ................ SUCCESS [0.218s]
[INFO] org.eclipse.mylyn.docs.epub.core .................. SUCCESS [0.839s]
[INFO] org.eclipse.mylyn.docs.epub.help .................. SUCCESS [0.290s]
[INFO] org.eclipse.mylyn.docs.epub.ui .................... SUCCESS [0.271s]
[INFO] org.eclipse.mylyn.docs.epub ....................... SUCCESS [0.184s]
[INFO] org.eclipse.mylyn.commons.xmlrpc .................. SUCCESS [0.207s]
[INFO] org.eclipse.mylyn.bugzilla.core ................... SUCCESS [1.530s]
[INFO] org.eclipse.mylyn.bugzilla.ui ..................... SUCCESS [0.709s]
[INFO] org.eclipse.mylyn.bugzilla_feature ................ SUCCESS [0.277s]
[INFO] Mylyn Versions .................................... SUCCESS [0.041s]
[INFO] org.eclipse.mylyn.versions.core ................... SUCCESS [0.213s]
[INFO] org.eclipse.mylyn.cvs.core ........................ SUCCESS [0.188s]
[INFO] org.eclipse.mylyn.versions.ui ..................... SUCCESS [0.235s]
[INFO] org.eclipse.mylyn.versions ........................ SUCCESS [0.107s]
[INFO] org.eclipse.mylyn.cvs ............................. SUCCESS [0.078s]
[INFO] Mylyn Reviews ..................................... SUCCESS [0.045s]
[INFO] org.eclipse.mylyn.reviews.core .................... SUCCESS [0.393s]
[INFO] org.eclipse.mylyn.reviews.edit .................... SUCCESS [0.621s]
[INFO] org.eclipse.mylyn.gerrit.core ..................... SUCCESS [0.529s]
[INFO] org.eclipse.mylyn.reviews.ui ...................... SUCCESS [0.733s]
[INFO] org.eclipse.mylyn.reviews.feature ................. SUCCESS [0.097s]
[INFO] org.eclipse.mylyn.gerrit.ui ....................... SUCCESS [1.062s]
[INFO] org.eclipse.mylyn.gerrit.feature .................. SUCCESS [0.111s]
[INFO] org.eclipse.mylyn.gerrit.dashboard.core ........... SUCCESS [0.230s]
[INFO] org.eclipse.mylyn.gerrit.dashboard.ui ............. SUCCESS [0.495s]
[INFO] org.eclipse.mylyn.gerrit.dashboard.feature ........ SUCCESS [0.120s]
[INFO] org.eclipse.mylyn.git.core ........................ SUCCESS [0.194s]
[INFO] org.eclipse.mylyn.git.ui .......................... SUCCESS [0.289s]
[INFO] org.eclipse.mylyn.git ............................. SUCCESS [0.075s]
[INFO] Mylyn Builds ...................................... SUCCESS [0.044s]
[INFO] org.eclipse.mylyn.builds.core ..................... SUCCESS [0.562s]
[INFO] org.eclipse.mylyn.team.ui ......................... SUCCESS [0.476s]
[INFO] org.eclipse.mylyn.team_feature .................... SUCCESS [0.156s]
[INFO] org.eclipse.mylyn.builds.ui ....................... SUCCESS [1.187s]
[INFO] org.eclipse.mylyn.builds .......................... SUCCESS [0.092s]
[INFO] org.eclipse.mylyn.commons.repositories.http.core .. SUCCESS [0.229s]
[INFO] org.eclipse.mylyn.commons.repositories.http ....... SUCCESS [0.114s]
[INFO] org.eclipse.mylyn.hudson.core ..................... SUCCESS [0.299s]
[INFO] org.eclipse.mylyn.hudson.ui ....................... SUCCESS [0.367s]
[INFO] org.eclipse.mylyn.hudson .......................... SUCCESS [0.107s]
[INFO] org.eclipse.mylyn.bugzilla.ide .................... SUCCESS [0.144s]
[INFO] org.eclipse.mylyn.help.ui ......................... SUCCESS [0.404s]
[INFO] org.eclipse.mylyn.ide.ui .......................... SUCCESS [0.379s]
[INFO] org.eclipse.mylyn.tasks.bugs ...................... SUCCESS [0.514s]
[INFO] org.eclipse.mylyn.tasks.ide ....................... SUCCESS [0.195s]
[INFO] org.eclipse.mylyn.ide_feature ..................... SUCCESS [0.204s]
[INFO] org.eclipse.mylyn.debug.ui ........................ SUCCESS [0.328s]
[INFO] org.eclipse.mylyn.ide.ant ......................... SUCCESS [0.409s]
[INFO] org.eclipse.mylyn.java.tasks ...................... SUCCESS [0.412s]
[INFO] org.eclipse.mylyn.java.ui ......................... SUCCESS [0.566s]
[INFO] org.eclipse.mylyn.java_feature .................... SUCCESS [0.208s]
[INFO] org.eclipse.mylyn.pde.ui .......................... SUCCESS [0.527s]
[INFO] org.eclipse.mylyn.pde_feature ..................... SUCCESS [0.173s]
[INFO] org.eclipse.mylyn.team.cvs ........................ SUCCESS [0.373s]
[INFO] org.eclipse.mylyn.team.cvs ........................ SUCCESS [0.599s]
[INFO] org.eclipse.mylyn.subclipse.core .................. SUCCESS [0.143s]
[INFO] org.eclipse.mylyn.subclipse.ui .................... SUCCESS [0.258s]
[INFO] org.eclipse.mylyn.subclipse ....................... SUCCESS [0.077s]
[INFO] org.eclipse.mylyn.trac.core ....................... SUCCESS [4.830s]
[INFO] org.eclipse.mylyn.trac.ui ......................... SUCCESS [0.671s]
[INFO] org.eclipse.mylyn.trac_feature .................... SUCCESS [0.299s]
[INFO] org.eclipse.mylyn.builds.sdk ...................... SUCCESS [0.094s]
[INFO] org.eclipse.mylyn.commons.sdk.util ................ SUCCESS [0.400s]
[INFO] org.eclipse.mylyn.commons.sdk ..................... SUCCESS [0.169s]
[INFO] org.eclipse.mylyn.context.sdk.util ................ SUCCESS [0.452s]
[INFO] org.eclipse.mylyn.context.sdk.java ................ SUCCESS [0.575s]
[INFO] org.eclipse.mylyn.context.sdk ..................... SUCCESS [0.427s]
[INFO] org.eclipse.mylyn.docs.epub.sdk ................... SUCCESS [0.168s]
[INFO] org.eclipse.mylyn.wikitext.help.sdk ............... SUCCESS [0.133s]
[INFO] org.eclipse.mylyn.wikitext.tests .................. SUCCESS [24.003s]
[INFO] org.eclipse.mylyn.wikitext.html.tests ............. SUCCESS [2.409s]
[INFO] org.eclipse.mylyn.wikitext.core.tests ............. SUCCESS [2.637s]
[INFO] org.eclipse.mylyn.wikitext.core.osgi.tests ........ SUCCESS [2.332s]
[INFO] org.eclipse.mylyn.wikitext.sdk .................... SUCCESS [0.279s]
[INFO] org.eclipse.mylyn.htmltext.ui ..................... SUCCESS [0.420s]
[INFO] org.eclipse.mylyn.htmltext ........................ SUCCESS [0.126s]
[INFO] org.eclipse.mylyn.docs.sdk ........................ SUCCESS [0.216s]
[INFO] org.eclipse.mylyn.reviews.sdk.feature ............. SUCCESS [0.131s]
[INFO] org.eclipse.mylyn.tests.util ...................... SUCCESS [0.374s]
[INFO] org.eclipse.mylyn.sdk_feature ..................... SUCCESS [0.595s]
[INFO] org.eclipse.mylyn.bugzilla.tests .................. SUCCESS [11:12.285s]
[INFO] org.eclipse.mylyn.tasks.core.tests ................ SUCCESS [7.724s]
[INFO] org.eclipse.mylyn.tasks.tests ..................... SUCCESS [1:08.679s]
[INFO] org.eclipse.mylyn.tasks.index.tests ............... SUCCESS [21.894s]
[INFO] org.eclipse.mylyn.tasks.ui.tests .................. SUCCESS [49.490s]
[INFO] org.eclipse.mylyn.trac.tests ...................... SUCCESS [9.954s]
[INFO] org.eclipse.mylyn.trac.core.tests ................. SUCCESS [6.061s]
[INFO] org.eclipse.mylyn.trac.ui.tests ................... SUCCESS [7.189s]
[INFO] org.eclipse.mylyn.test_feature .................... SUCCESS [0.379s]
[INFO] org.eclipse.mylyn.versions.sdk .................... SUCCESS [0.108s]
[INFO] Mylyn for Eclipse 4.x ............................. SUCCESS [18.323s]
[INFO] org.eclipse.mylyn-target .......................... SUCCESS [4.375s]
[INFO] org.eclipse.mylyn.commons.tck ..................... SUCCESS [0.127s]
[INFO] Mylyn Commons ..................................... SUCCESS [3.151s]
[INFO] org.eclipse.mylyn.commons-target .................. SUCCESS [0.043s]
[INFO] org.eclipse.mylyn.commons.tests ................... SUCCESS [22.826s]
[INFO] org.eclipse.mylyn.commons.ui.tests ................ SUCCESS [6.741s]
[INFO] org.eclipse.mylyn.commons.activity.ui ............. SUCCESS [0.308s]
[INFO] org.eclipse.mylyn.commons.activity ................ SUCCESS [0.118s]
[INFO] org.eclipse.mylyn.commons.activity.tests .......... SUCCESS [5.931s]
[INFO] org.eclipse.mylyn.monitor.tests ................... SUCCESS [11.472s]
[INFO] org.eclipse.mylyn.commons.notifications.tests ..... SUCCESS [4:20.738s]
[INFO] org.eclipse.mylyn.commons.repositories.http.tests . SUCCESS [9.710s]
[INFO] org.eclipse.mylyn.commons.repositories.tests ...... SUCCESS [10.790s]
[INFO] org.eclipse.mylyn.discovery.tests ................. SUCCESS [1:11.134s]
[INFO] org.eclipse.mylyn.commons.development ............. SUCCESS [0.186s]
[INFO] org.eclipse.mylyn.commons.identity.ui ............. SUCCESS [0.329s]
[INFO] Mylyn Versions .................................... SUCCESS [2.937s]
[INFO] org.eclipse.mylyn.versions.tests .................. SUCCESS [6.608s]
[INFO] org.eclipse.mylyn.versions.development ............ SUCCESS [0.073s]
[INFO] org.eclipse.mylyn.help.sdk ........................ SUCCESS [0.245s]
[INFO] org.eclipse.mylyn.tasks.index ..................... SUCCESS [0.273s]
[INFO] Mylyn Tasks ....................................... SUCCESS [2.953s]
[INFO] org.eclipse.mylyn.tasks-target .................... SUCCESS [0.044s]
[INFO] org.eclipse.mylyn.tasks.activity.core ............. SUCCESS [0.441s]
[INFO] org.eclipse.mylyn.tasks.activity.ui ............... SUCCESS [0.580s]
[INFO] org.eclipse.mylyn.tasks.activity.tests ............ SUCCESS [15.124s]
[INFO] org.eclipse.mylyn.tasks.connector-bugzilla-rest ... SUCCESS [0.044s]
[INFO] org.eclipse.mylyn.bugzilla.rest.core .............. SUCCESS [0.493s]
[INFO] org.eclipse.mylyn.bugzilla.rest.ui ................ SUCCESS [0.537s]
[INFO] org.eclipse.mylyn.bugzilla.rest ................... SUCCESS [0.253s]
[INFO] org.eclipse.mylyn.bugzilla.rest.core.tests ........ SUCCESS [6:28.790s]
[INFO] org.eclipse.mylyn.bugzilla.rest.tests ............. SUCCESS [6:31.296s]
[INFO] org.eclipse.mylyn.bugzilla.rest.ui.tests .......... SUCCESS [5.010s]
[INFO] org.eclipse.mylyn.cdt.tests ....................... SUCCESS [9.534s]
[INFO] Mylyn Context ..................................... SUCCESS [2.864s]
[INFO] org.eclipse.mylyn.context-target .................. SUCCESS [0.047s]
[INFO] org.eclipse.mylyn.context.tasks.tests ............. SUCCESS [12.488s]
[INFO] org.eclipse.mylyn.context.tests ................... SUCCESS [9.752s]
[INFO] org.eclipse.mylyn.debug.tests ..................... SUCCESS [8.794s]
[INFO] org.eclipse.mylyn.ide.tests ....................... SUCCESS [8.035s]
[INFO] org.eclipse.mylyn.java.tests ...................... SUCCESS [1:01.438s]
[INFO] org.eclipse.mylyn.resources.tests ................. SUCCESS [7.237s]
[INFO] org.eclipse.mylyn.team.tests ...................... SUCCESS [7.285s]
[INFO] org.eclipse.mylyn.context.development ............. SUCCESS [0.221s]
[INFO] org.eclipse.mylyn.context.tasks.ui.tests .......... SUCCESS [15.526s]
[INFO] Mylyn Builds ...................................... SUCCESS [2.595s]
[INFO] org.eclipse.mylyn.builds.tests .................... SUCCESS [8.904s]
[INFO] org.eclipse.mylyn.hudson.tests .................... SUCCESS [4:20.674s]
[INFO] org.eclipse.mylyn.builds.development .............. SUCCESS [0.173s]
[INFO] org.eclipse.mylyn.docs.epub.tests ................. SUCCESS [2.987s]
[INFO] org.eclipse.mylyn.wikitext.creole.core ............ SUCCESS [0.337s]
[INFO] org.eclipse.mylyn.wikitext.creole.tests ........... SUCCESS [3.016s]
[INFO] org.eclipse.mylyn.wikitext.markdown.tests ......... SUCCESS [3.249s]
[INFO] org.eclipse.mylyn.docs.development ................ SUCCESS [0.202s]
[INFO] org.eclipse.mylyn.wikitext.core.maven ............. SUCCESS [40.264s]
[INFO] org.eclipse.mylyn.wikitext.creole.ui .............. SUCCESS [0.259s]
[INFO] org.eclipse.mylyn.wikitext.commonmark ............. SUCCESS [0.350s]
[INFO] org.eclipse.mylyn.wikitext.commonmark.ui .......... SUCCESS [0.352s]
[INFO] org.eclipse.mylyn.wikitext.extras ................. SUCCESS [0.212s]
[INFO] org.eclipse.mylyn.wikitext.asciidoc.tests ......... SUCCESS [3.374s]
[INFO] org.eclipse.mylyn.wikitext.commonmark.tests ....... SUCCESS [4.494s]
[INFO] org.eclipse.mylyn.wikitext-standalone ............. SUCCESS [2:14.888s]
[INFO] org.eclipse.mylyn.docs.epub.ant.core .............. SUCCESS [0.336s]
[INFO] Mylyn Docs ........................................ SUCCESS [2.560s]
[INFO] org.eclipse.mylyn.gerrit.core.tests ............... SUCCESS [5.116s]
[INFO] org.eclipse.mylyn.gerrit.target ................... SUCCESS [0.050s]
[INFO] org.eclipse.mylyn.gerrit.tests .................... SUCCESS [10:34.639s]
[INFO] org.eclipse.mylyn.gerrit.ui.tests ................. SUCCESS [6.886s]
[INFO] org.eclipse.mylyn.reviews.core.tests .............. SUCCESS [9.537s]
[INFO] org.eclipse.mylyn.reviews.tests ................... SUCCESS [7.233s]
[INFO] org.eclipse.mylyn.reviews.development.feature ..... SUCCESS [0.191s]
[INFO] org.eclipse.mylyn.reviews.ui.tests ................ SUCCESS [10.420s]
[INFO] org.eclipse.mylyn.all ............................. SUCCESS [0.045s]
[INFO] ------------------------------------------------------------------------
[INFO] BUILD SUCCESS
[INFO] ------------------------------------------------------------------------
[INFO] Total time: 1:03:25.150s
[INFO] Finished at: Wed Jun 01 16:54:33 EDT 2016
[INFO] Final Memory: 494M/6041M
[INFO] ------------------------------------------------------------------------
[DEBUG] Closing connection to remote
[DEBUG] Waiting for process to finish
[DEBUG] Result: 0
Terminating xvnc.
Recording fingerprints
Archiving artifacts
Recording test results
Finished: UNSTABLE