UnstableConsole Output

Skipping 1,614 KB.. Full Log
 not found
  [javadoc] 	 * @see #getInternalPageHrefPrefix()
  [javadoc] 	        ^
  [javadoc] /jobs/genie.mylyn/mylyn-test-build/workspace/org.eclipse.mylyn.docs/org.eclipse.mylyn.wikitext.core/src/org/eclipse/mylyn/wikitext/core/util/ServiceLocator.java:270: error: @param name not found
  [javadoc] 	 * @param resourceUrl
  [javadoc] 	          ^
  [javadoc] /jobs/genie.mylyn/mylyn-test-build/workspace/org.eclipse.mylyn.docs/org.eclipse.mylyn.wikitext.core/src/org/eclipse/mylyn/wikitext/core/util/ServiceLocator.java:55: error: unexpected end tag: </p>
  [javadoc]  * </p>
  [javadoc]    ^
  [javadoc] /jobs/genie.mylyn/mylyn-test-build/workspace/org.eclipse.mylyn.docs/org.eclipse.mylyn.wikitext.core.osgi/src/org/eclipse/mylyn/wikitext/core/osgi/OsgiServiceLocator.java:36: error: reference not found
  [javadoc]  * A {@link ServiceLocator} for use in an OSGi runtime environment. Uses OSGI {@link Bundle bundles} to load markup
  [javadoc]                                                                                      ^
  [javadoc] /jobs/genie.mylyn/mylyn-test-build/workspace/org.eclipse.mylyn.docs/org.eclipse.mylyn.wikitext.creole.core/src/org/eclipse/mylyn/wikitext/creole/core/CreoleLanguage.java:57: error: reference not found
  [javadoc] 	 * @see WikiWordReplacementToken
  [javadoc] 	        ^
  [javadoc] /jobs/genie.mylyn/mylyn-test-build/workspace/org.eclipse.mylyn.docs/org.eclipse.mylyn.wikitext.creole.core/src/org/eclipse/mylyn/wikitext/creole/core/CreoleLanguage.java:69: error: reference not found
  [javadoc] 	 * @see #getInternalPageHrefPrefix()
  [javadoc] 	        ^
  [javadoc] /jobs/genie.mylyn/mylyn-test-build/workspace/org.eclipse.mylyn.docs/org.eclipse.mylyn.wikitext.core/src/org/eclipse/mylyn/wikitext/core/parser/util/MarkupToEclipseToc.java:186: error: bad use of '>'
  [javadoc] 	 *            a number >= 0 and <= 6
  [javadoc] 	                       ^
  [javadoc] /jobs/genie.mylyn/mylyn-test-build/workspace/org.eclipse.mylyn.docs/org.eclipse.mylyn.wikitext.core/src/org/eclipse/mylyn/wikitext/core/parser/util/MarkupToEclipseToc.java:186: error: malformed HTML
  [javadoc] 	 *            a number >= 0 and <= 6
  [javadoc] 	                                ^
  [javadoc] /jobs/genie.mylyn/mylyn-test-build/workspace/org.eclipse.mylyn.docs/org.eclipse.mylyn.wikitext.tracwiki.core/src/org/eclipse/mylyn/wikitext/tracwiki/core/TracWikiLanguage.java:67: error: reference not found
  [javadoc] 	 * @see MarkupLanguage#getInternalLinkPattern()
  [javadoc] 	        ^
  [javadoc] /jobs/genie.mylyn/mylyn-test-build/workspace/org.eclipse.mylyn.docs/org.eclipse.mylyn.wikitext.core/src/org/eclipse/mylyn/wikitext/core/parser/builder/AbstractMarkupDocumentBuilder.java:303: error: reference not found
  [javadoc] 	 * Indicate that the next content to be emitted requires adjacent {@link #isSeparator(char) separator}. When
  [javadoc] 	                                                                         ^
  [javadoc] /jobs/genie.mylyn/mylyn-test-build/workspace/org.eclipse.mylyn.docs/org.eclipse.mylyn.wikitext.core/src/org/eclipse/mylyn/wikitext/core/parser/builder/AbstractXmlDocumentBuilder.java:50: error: unknown tag: noreference
  [javadoc] 	 * @noreference This method is not intended to be referenced by clients.
  [javadoc] 	   ^
  [javadoc] /jobs/genie.mylyn/mylyn-test-build/workspace/org.eclipse.mylyn.docs/org.eclipse.mylyn.wikitext.core/src/org/eclipse/mylyn/wikitext/core/parser/builder/AbstractXmlDocumentBuilder.java:126: error: reference not found
  [javadoc] 	 * value is false. Ignored unless {@link #isEmitAsDocument()}
  [javadoc] 	                                         ^
  [javadoc] /jobs/genie.mylyn/mylyn-test-build/workspace/org.eclipse.mylyn.docs/org.eclipse.mylyn.wikitext.core/src/org/eclipse/mylyn/wikitext/core/parser/builder/AbstractXmlDocumentBuilder.java:134: error: reference not found
  [javadoc] 	 * value is false. Ignored unless {@link #isEmitAsDocument()}
  [javadoc] 	                                         ^
  [javadoc] /jobs/genie.mylyn/mylyn-test-build/workspace/org.eclipse.mylyn.docs/org.eclipse.mylyn.wikitext.core/src/org/eclipse/mylyn/wikitext/core/parser/builder/DitaBookMapDocumentBuilder.java:37: error: reference not found
  [javadoc]  * @see MarkupToDitaTask
  [javadoc]         ^
  [javadoc] /jobs/genie.mylyn/mylyn-test-build/workspace/org.eclipse.mylyn.docs/org.eclipse.mylyn.wikitext.core/src/org/eclipse/mylyn/wikitext/core/parser/builder/DocBookDocumentBuilder.java:37: error: bad use of '>'
  [javadoc]  * @author Peter Friese bug 273355 Support image scaling for Textile -> DocBook
  [javadoc]                                                                       ^
  [javadoc] /jobs/genie.mylyn/mylyn-test-build/workspace/org.eclipse.mylyn.docs/org.eclipse.mylyn.wikitext.core/src/org/eclipse/mylyn/wikitext/core/parser/builder/DocBookDocumentBuilder.java:39: error: reference not found
  [javadoc]  * @see MarkupToDocbookTask
  [javadoc]         ^
  [javadoc] /jobs/genie.mylyn/mylyn-test-build/workspace/org.eclipse.mylyn.docs/org.eclipse.mylyn.wikitext.core/src/org/eclipse/mylyn/wikitext/core/parser/builder/HtmlDocumentBuilder.java:396: error: bad use of '>'
  [javadoc] 	 *   &lt;link type="text/css" rel="stylesheet" href="url"/>
  [javadoc] 	                                                          ^
  [javadoc] /jobs/genie.mylyn/mylyn-test-build/workspace/org.eclipse.mylyn.docs/org.eclipse.mylyn.wikitext.core/src/org/eclipse/mylyn/wikitext/core/parser/builder/HtmlDocumentBuilder.java:401: error: invalid use of @return
  [javadoc] 	 * @return the stylesheet, whose attributes may be modified
  [javadoc] 	   ^
  [javadoc] /jobs/genie.mylyn/mylyn-test-build/workspace/org.eclipse.mylyn.docs/org.eclipse.mylyn.wikitext.core/src/org/eclipse/mylyn/wikitext/core/parser/builder/HtmlDocumentBuilder.java:425: error: invalid use of @return
  [javadoc] 	 * @return the stylesheet, whose attributes may be modified
  [javadoc] 	   ^
  [javadoc] /jobs/genie.mylyn/mylyn-test-build/workspace/org.eclipse.mylyn.docs/org.eclipse.mylyn.wikitext.core/src/org/eclipse/mylyn/wikitext/core/parser/builder/HtmlDocumentHandler.java:28: error: unknown tag: Override
  [javadoc]  * 	@Override
  [javadoc]    	^
  [javadoc] /jobs/genie.mylyn/mylyn-test-build/workspace/org.eclipse.mylyn.docs/org.eclipse.mylyn.wikitext.core/src/org/eclipse/mylyn/wikitext/core/parser/builder/HtmlDocumentHandler.java:36: error: unknown tag: Override
  [javadoc]  * 	@Override
  [javadoc]    	^
  [javadoc] /jobs/genie.mylyn/mylyn-test-build/workspace/org.eclipse.mylyn.docs/org.eclipse.mylyn.wikitext.core/src/org/eclipse/mylyn/wikitext/core/parser/builder/XslfoDocumentBuilder.java:1612: error: @param name not found
  [javadoc] 		 * @param boduMargins
  [javadoc] 		          ^
  [javadoc] /jobs/genie.mylyn/mylyn-test-build/workspace/org.eclipse.mylyn.docs/org.eclipse.mylyn.wikitext.html.core/src/org/eclipse/mylyn/wikitext/html/core/HtmlLanguage.java:37: error: bad use of '>'
  [javadoc]  * <li>{@link BlockType#CODE} maps to HTML tags <code>&lt;pre>&lt;code></code></li>
  [javadoc]                                                              ^
  [javadoc] /jobs/genie.mylyn/mylyn-test-build/workspace/org.eclipse.mylyn.docs/org.eclipse.mylyn.wikitext.html.core/src/org/eclipse/mylyn/wikitext/html/core/HtmlLanguage.java:37: error: bad use of '>'
  [javadoc]  * <li>{@link BlockType#CODE} maps to HTML tags <code>&lt;pre>&lt;code></code></li>
  [javadoc]                                                                       ^
  [javadoc] Building index for all the packages and classes...
  [javadoc] Building index for all classes...
  [javadoc] Generating /jobs/genie.mylyn/mylyn-test-build/workspace/org.eclipse.mylyn.docs/org.eclipse.mylyn.wikitext-standalone/target/wikitext-apidoc/help-doc.html...
  [javadoc] 49 errors
  [javadoc] 100 warnings
      [zip] Building zip: /jobs/genie.mylyn/mylyn-test-build/workspace/org.eclipse.mylyn.docs/org.eclipse.mylyn.wikitext-standalone/target/wikitext-standalone-latest.zip
[INFO] Executed tasks
[INFO]                                                                         
[INFO] ------------------------------------------------------------------------
[INFO] Building org.eclipse.mylyn.docs.epub.ant.core 2.2.0-SNAPSHOT
[INFO] ------------------------------------------------------------------------
[INFO] 
[INFO] --- maven-clean-plugin:2.4.1:clean (default-clean) @ org.eclipse.mylyn.docs.epub.ant.core ---
[INFO] 
[INFO] --- tycho-packaging-plugin:0.21.0:build-qualifier (default-build-qualifier) @ org.eclipse.mylyn.docs.epub.ant.core ---
[INFO] The project's OSGi version is 2.2.0.x20160429-2231
[INFO] 
[INFO] --- tycho-packaging-plugin:0.21.0:validate-id (default-validate-id) @ org.eclipse.mylyn.docs.epub.ant.core ---
[INFO] 
[INFO] --- tycho-packaging-plugin:0.21.0:validate-version (default-validate-version) @ org.eclipse.mylyn.docs.epub.ant.core ---
[INFO] 
[INFO] --- jacoco-maven-plugin:0.5.6.201201232323:prepare-agent (default) @ org.eclipse.mylyn.docs.epub.ant.core ---
[INFO] Skipping JaCoCo execution
[INFO] 
[INFO] --- maven-resources-plugin:2.4.1:resources (default-resources) @ org.eclipse.mylyn.docs.epub.ant.core ---
[INFO] Using 'ISO-8859-1' encoding to copy filtered resources.
[INFO] skip non existing resourceDirectory /jobs/genie.mylyn/mylyn-test-build/workspace/org.eclipse.mylyn.docs/org.eclipse.mylyn.docs.epub.ant.core/src/main/resources
[INFO] 
[INFO] --- tycho-compiler-plugin:0.21.0:compile (default-compile) @ org.eclipse.mylyn.docs.epub.ant.core ---
[INFO] Compiling 23 source files to /jobs/genie.mylyn/mylyn-test-build/workspace/org.eclipse.mylyn.docs/org.eclipse.mylyn.docs.epub.ant.core/target/classes
[INFO] 
[INFO] --- tycho-source-plugin:0.21.0:plugin-source (attach-source) @ org.eclipse.mylyn.docs.epub.ant.core ---
[INFO] Building jar: /jobs/genie.mylyn/mylyn-test-build/workspace/org.eclipse.mylyn.docs/org.eclipse.mylyn.docs.epub.ant.core/target/org.eclipse.mylyn.docs.epub.ant.core-2.2.0-SNAPSHOT-sources.jar
[INFO] 
[INFO] --- maven-resources-plugin:2.4.1:testResources (default-testResources) @ org.eclipse.mylyn.docs.epub.ant.core ---
[INFO] Using 'ISO-8859-1' encoding to copy filtered resources.
[INFO] skip non existing resourceDirectory /jobs/genie.mylyn/mylyn-test-build/workspace/org.eclipse.mylyn.docs/org.eclipse.mylyn.docs.epub.ant.core/src/test/resources
[INFO] 
[INFO] --- target-platform-configuration:0.21.0:target-platform (default-target-platform) @ org.eclipse.mylyn.docs.epub.ant.core ---
[INFO] 
[INFO] --- tycho-packaging-plugin:0.21.0:package-plugin (default-package-plugin) @ org.eclipse.mylyn.docs.epub.ant.core ---
[INFO] Building jar: /jobs/genie.mylyn/mylyn-test-build/workspace/org.eclipse.mylyn.docs/org.eclipse.mylyn.docs.epub.ant.core/target/org.eclipse.mylyn.docs.epub.ant.core-2.2.0-SNAPSHOT.jar
[INFO] 
[INFO] --- tycho-p2-plugin:0.21.0:p2-metadata-default (default-p2-metadata-default) @ org.eclipse.mylyn.docs.epub.ant.core ---
[INFO] 
[INFO] >>> findbugs-maven-plugin:2.3.2:check (default) @ org.eclipse.mylyn.docs.epub.ant.core >>>
[INFO] 
[INFO] --- findbugs-maven-plugin:2.3.2:findbugs (findbugs) @ org.eclipse.mylyn.docs.epub.ant.core ---
[INFO] ****** FindBugsMojo execute *******
[INFO] canGenerate is false
[INFO] 
[INFO] <<< findbugs-maven-plugin:2.3.2:check (default) @ org.eclipse.mylyn.docs.epub.ant.core <<<
[INFO] 
[INFO] --- findbugs-maven-plugin:2.3.2:check (default) @ org.eclipse.mylyn.docs.epub.ant.core ---
[INFO] 
[INFO] >>> maven-pmd-plugin:2.5:cpd-check (default) @ org.eclipse.mylyn.docs.epub.ant.core >>>
[INFO] 
[INFO] --- maven-pmd-plugin:2.5:cpd (cpd) @ org.eclipse.mylyn.docs.epub.ant.core ---
[INFO] 
[INFO] <<< maven-pmd-plugin:2.5:cpd-check (default) @ org.eclipse.mylyn.docs.epub.ant.core <<<
[INFO] 
[INFO] --- maven-pmd-plugin:2.5:cpd-check (default) @ org.eclipse.mylyn.docs.epub.ant.core ---
[INFO]                                                                         
[INFO] ------------------------------------------------------------------------
[INFO] Building Mylyn Docs 2.9.0-SNAPSHOT
[INFO] ------------------------------------------------------------------------
[INFO] 
[INFO] --- maven-clean-plugin:2.4.1:clean (default-clean) @ org.eclipse.mylyn.docs-site ---
[INFO] 
[INFO] --- tycho-packaging-plugin:0.21.0:build-qualifier (default-build-qualifier) @ org.eclipse.mylyn.docs-site ---
[INFO] The project's OSGi version is 2.9.0.x20160420-2216
[INFO] 
[INFO] --- jacoco-maven-plugin:0.5.6.201201232323:prepare-agent (default) @ org.eclipse.mylyn.docs-site ---
[INFO] Skipping JaCoCo execution
[INFO] 
[INFO] --- tycho-packaging-plugin:0.21.0:update-site (default-update-site) @ org.eclipse.mylyn.docs-site ---
[INFO] 
[INFO] --- tycho-p2-plugin:0.21.0:update-site-p2-metadata (default-update-site-p2-metadata) @ org.eclipse.mylyn.docs-site ---
[INFO] Command line:
	[/opt/public/common/jdk1.8.0_51.x64/jre/bin/java, -jar, /jobs/genie.mylyn/mylyn-test-build/workspace/.maven/repo/org/eclipse/tycho/tycho-bundles-external/0.21.0/eclipse/plugins/org.eclipse.equinox.launcher_1.3.0.v20140415-2008.jar, -configuration, /tmp/tycho-p2-runtime8142598462877894472.tmp/configuration, -nosplash, -application, org.eclipse.equinox.p2.publisher.UpdateSitePublisher, -source, /jobs/genie.mylyn/mylyn-test-build/workspace/org.eclipse.mylyn.docs/org.eclipse.mylyn.docs-site/target/site, -metadataRepository, file:/jobs/genie.mylyn/mylyn-test-build/workspace/org.eclipse.mylyn.docs/org.eclipse.mylyn.docs-site/target/site/, -metadataRepositoryName, Mylyn Docs, -artifactRepository, file:/jobs/genie.mylyn/mylyn-test-build/workspace/org.eclipse.mylyn.docs/org.eclipse.mylyn.docs-site/target/site/, -artifactRepositoryName, Mylyn Docs Artifacts, -noDefaultIUs, -compress]
Generating metadata for ..
Generation completed with success [0 seconds].
[INFO] 
[INFO] --- tycho-packaging-plugin:0.21.0:update-site-packaging (default-update-site-packaging) @ org.eclipse.mylyn.docs-site ---
[INFO] Building zip: /jobs/genie.mylyn/mylyn-test-build/workspace/org.eclipse.mylyn.docs/org.eclipse.mylyn.docs-site/target/site.zip
[INFO]                                                                         
[INFO] ------------------------------------------------------------------------
[INFO] Building org.eclipse.mylyn.gerrit.core.tests 2.11.0-SNAPSHOT
[INFO] ------------------------------------------------------------------------
[INFO] 
[INFO] --- maven-clean-plugin:2.4.1:clean (default-clean) @ org.eclipse.mylyn.gerrit.core.tests ---
[INFO] 
[INFO] --- tycho-packaging-plugin:0.21.0:build-qualifier (default-build-qualifier) @ org.eclipse.mylyn.gerrit.core.tests ---
[INFO] The project's OSGi version is 2.11.0.x20160421-1821
[INFO] 
[INFO] --- tycho-packaging-plugin:0.21.0:validate-id (default-validate-id) @ org.eclipse.mylyn.gerrit.core.tests ---
[INFO] 
[INFO] --- tycho-packaging-plugin:0.21.0:validate-version (default-validate-version) @ org.eclipse.mylyn.gerrit.core.tests ---
[INFO] 
[INFO] --- jacoco-maven-plugin:0.5.6.201201232323:prepare-agent (default) @ org.eclipse.mylyn.gerrit.core.tests ---
[INFO] Skipping JaCoCo execution
[INFO] 
[INFO] --- maven-resources-plugin:2.4.1:resources (default-resources) @ org.eclipse.mylyn.gerrit.core.tests ---
[INFO] Using 'ISO-8859-1' encoding to copy filtered resources.
[INFO] skip non existing resourceDirectory /jobs/genie.mylyn/mylyn-test-build/workspace/org.eclipse.mylyn.reviews/org.eclipse.mylyn.gerrit.core.tests/src/main/resources
[INFO] 
[INFO] --- tycho-compiler-plugin:0.21.0:compile (default-compile) @ org.eclipse.mylyn.gerrit.core.tests ---
[INFO] Compiling 10 source files to /jobs/genie.mylyn/mylyn-test-build/workspace/org.eclipse.mylyn.reviews/org.eclipse.mylyn.gerrit.core.tests/target/classes
[INFO] 
[INFO] --- tycho-source-plugin:0.21.0:plugin-source (attach-source) @ org.eclipse.mylyn.gerrit.core.tests ---
[WARNING] bundle localization file /jobs/genie.mylyn/mylyn-test-build/workspace/org.eclipse.mylyn.reviews/org.eclipse.mylyn.gerrit.core.tests/plugin.properties not found
[INFO] Building jar: /jobs/genie.mylyn/mylyn-test-build/workspace/org.eclipse.mylyn.reviews/org.eclipse.mylyn.gerrit.core.tests/target/org.eclipse.mylyn.gerrit.core.tests-2.11.0-SNAPSHOT-sources.jar
[INFO] 
[INFO] --- maven-resources-plugin:2.4.1:testResources (default-testResources) @ org.eclipse.mylyn.gerrit.core.tests ---
[INFO] Using 'ISO-8859-1' encoding to copy filtered resources.
[INFO] skip non existing resourceDirectory /jobs/genie.mylyn/mylyn-test-build/workspace/org.eclipse.mylyn.reviews/org.eclipse.mylyn.gerrit.core.tests/src/test/resources
[INFO] 
[INFO] --- target-platform-configuration:0.21.0:target-platform (default-target-platform) @ org.eclipse.mylyn.gerrit.core.tests ---
[INFO] 
[INFO] --- tycho-packaging-plugin:0.21.0:package-plugin (default-package-plugin) @ org.eclipse.mylyn.gerrit.core.tests ---
[INFO] Building jar: /jobs/genie.mylyn/mylyn-test-build/workspace/org.eclipse.mylyn.reviews/org.eclipse.mylyn.gerrit.core.tests/target/org.eclipse.mylyn.gerrit.core.tests-2.11.0-SNAPSHOT.jar
[INFO] 
[INFO] --- tycho-p2-plugin:0.21.0:p2-metadata-default (default-p2-metadata-default) @ org.eclipse.mylyn.gerrit.core.tests ---
[INFO] 
[INFO] --- tycho-surefire-plugin:0.21.0:test (default-test) @ org.eclipse.mylyn.gerrit.core.tests ---
[INFO] Expected eclipse log file: /jobs/genie.mylyn/mylyn-test-build/workspace/org.eclipse.mylyn.reviews/org.eclipse.mylyn.gerrit.core.tests/target/work/data/.metadata/.log
[INFO] Command line:
	[/opt/public/common/jdk1.8.0_51.x64/jre/bin/java, -Dosgi.noShutdown=false, -Dosgi.os=linux, -Dosgi.ws=gtk, -Dosgi.arch=x86_64, -Xmx512m, -XX:MaxPermSize=256m, -Djava.io.tmpdir=/jobs/genie.mylyn/mylyn-test-build/workspace/org.eclipse.mylyn.reviews/org.eclipse.mylyn.gerrit.core.tests/target, -ea, -Dmylyn.credentials=/shared/mylyn/.credentials.properties, -Dorg.eclipse.mylyn.wikitext.tests.disableOutput=true, -Dhttp.proxyHost=proxy.eclipse.org, -Dhttp.proxyPort=9898, -Dhttps.proxyHost=proxy.eclipse.org, -Dhttps.proxyPort=9898, -DhttpnonProxyHosts=*.eclipse.org, -Dorg.eclipse.mylyn.gerrit.tests.alternate.push=true, -Dosgi.clean=true, -jar, /jobs/genie.mylyn/mylyn-test-build/workspace/.maven/repo/p2/osgi/bundle/org.eclipse.equinox.launcher/1.3.100.v20150511-1540/org.eclipse.equinox.launcher-1.3.100.v20150511-1540.jar, -data, /jobs/genie.mylyn/mylyn-test-build/workspace/org.eclipse.mylyn.reviews/org.eclipse.mylyn.gerrit.core.tests/target/work/data, -install, /jobs/genie.mylyn/mylyn-test-build/workspace/org.eclipse.mylyn.reviews/org.eclipse.mylyn.gerrit.core.tests/target/work, -configuration, /jobs/genie.mylyn/mylyn-test-build/workspace/org.eclipse.mylyn.reviews/org.eclipse.mylyn.gerrit.core.tests/target/work/configuration, -application, org.eclipse.tycho.surefire.osgibooter.uitest, -testproperties, /jobs/genie.mylyn/mylyn-test-build/workspace/org.eclipse.mylyn.reviews/org.eclipse.mylyn.gerrit.core.tests/target/surefire.properties, -testApplication, org.eclipse.ui.ide.workbench, -product, org.eclipse.sdk.ide, -eclipse.keyring, /jobs/genie.mylyn/mylyn-test-build/workspace/org.eclipse.mylyn.reviews/org.eclipse.mylyn.gerrit.core.tests/target/.eclipse.keyring, -eclipse.password, /jobs/genie.mylyn/mylyn-test-build/workspace/org.eclipse.mylyn.reviews/org.eclipse.mylyn.gerrit.core.tests/target/../../.gitignore]
Java HotSpot(TM) 64-Bit Server VM warning: ignoring option MaxPermSize=256m; support was removed in 8.0

-------------------------------------------------------
 T E S T S
-------------------------------------------------------
Running org.eclipse.mylyn.internal.gerrit.core.client.GerritHttpClientTest
Tests run: 5, Failures: 0, Errors: 0, Skipped: 0, Time elapsed: 0.686 sec
Running org.eclipse.mylyn.internal.gerrit.core.client.ProjectByNameComparatorTest
Tests run: 1, Failures: 0, Errors: 0, Skipped: 0, Time elapsed: 0.002 sec
Running org.eclipse.mylyn.internal.gerrit.core.client.GerritHtmlProcessorTest
Tests run: 2, Failures: 0, Errors: 0, Skipped: 0, Time elapsed: 0.041 sec
Running org.eclipse.mylyn.internal.gerrit.core.client.JSonSupportTest
Tests run: 3, Failures: 0, Errors: 0, Skipped: 0, Time elapsed: 0.003 sec
Running org.eclipse.mylyn.internal.gerrit.core.GerritAttributeTest
Tests run: 1, Failures: 0, Errors: 0, Skipped: 0, Time elapsed: 0.006 sec
Running org.eclipse.mylyn.internal.gerrit.core.GerritTaskDataHandlerTest
Tests run: 4, Failures: 0, Errors: 0, Skipped: 0, Time elapsed: 0.164 sec
Running org.eclipse.mylyn.internal.gerrit.core.egit.GerritToGitMappingTest
SLF4J: Failed to load class "org.slf4j.impl.StaticLoggerBinder".
SLF4J: Defaulting to no-operation (NOP) logger implementation
SLF4J: See http://www.slf4j.org/codes.html#StaticLoggerBinder for further details.
Tests run: 15, Failures: 0, Errors: 0, Skipped: 0, Time elapsed: 0.106 sec
Running org.eclipse.mylyn.internal.gerrit.core.HudsonCommentParserTest
Tests run: 14, Failures: 0, Errors: 0, Skipped: 0, Time elapsed: 0.006 sec
Running org.eclipse.mylyn.internal.gerrit.core.GerritConnectorTest
Tests run: 20, Failures: 0, Errors: 0, Skipped: 0, Time elapsed: 0.236 sec
Running org.eclipse.mylyn.internal.gerrit.core.GerritUtilTest
Tests run: 1, Failures: 0, Errors: 0, Skipped: 0, Time elapsed: 0 sec

Results :

Tests run: 66, Failures: 0, Errors: 0, Skipped: 0

[INFO] All tests passed!
[INFO]                                                                         
[INFO] ------------------------------------------------------------------------
[INFO] Building org.eclipse.mylyn.gerrit.target 2.11.0-SNAPSHOT
[INFO] ------------------------------------------------------------------------
[INFO] 
[INFO] --- maven-clean-plugin:2.4.1:clean (default-clean) @ org.eclipse.mylyn.gerrit.target ---
[INFO] 
[INFO] --- jacoco-maven-plugin:0.5.6.201201232323:prepare-agent (default) @ org.eclipse.mylyn.gerrit.target ---
[INFO] Skipping JaCoCo for project with packaging type 'pom'
[INFO]                                                                         
[INFO] ------------------------------------------------------------------------
[INFO] Building org.eclipse.mylyn.gerrit.tests 2.11.0-SNAPSHOT
[INFO] ------------------------------------------------------------------------
[INFO] 
[INFO] --- maven-clean-plugin:2.4.1:clean (default-clean) @ org.eclipse.mylyn.gerrit.tests ---
[INFO] 
[INFO] --- tycho-packaging-plugin:0.21.0:build-qualifier (default-build-qualifier) @ org.eclipse.mylyn.gerrit.tests ---
[INFO] The project's OSGi version is 2.11.0.x20160421-1821
[INFO] 
[INFO] --- tycho-packaging-plugin:0.21.0:validate-id (default-validate-id) @ org.eclipse.mylyn.gerrit.tests ---
[INFO] 
[INFO] --- tycho-packaging-plugin:0.21.0:validate-version (default-validate-version) @ org.eclipse.mylyn.gerrit.tests ---
[INFO] 
[INFO] --- jacoco-maven-plugin:0.5.6.201201232323:prepare-agent (default) @ org.eclipse.mylyn.gerrit.tests ---
[INFO] Skipping JaCoCo execution
[INFO] 
[INFO] --- maven-resources-plugin:2.4.1:resources (default-resources) @ org.eclipse.mylyn.gerrit.tests ---
[INFO] Using 'ISO-8859-1' encoding to copy filtered resources.
[INFO] skip non existing resourceDirectory /jobs/genie.mylyn/mylyn-test-build/workspace/org.eclipse.mylyn.reviews/org.eclipse.mylyn.gerrit.tests/src/main/resources
[INFO] 
[INFO] --- tycho-compiler-plugin:0.21.0:compile (default-compile) @ org.eclipse.mylyn.gerrit.tests ---
[INFO] Compiling 39 source files to /jobs/genie.mylyn/mylyn-test-build/workspace/org.eclipse.mylyn.reviews/org.eclipse.mylyn.gerrit.tests/target/classes
[INFO] 
[INFO] --- tycho-source-plugin:0.21.0:plugin-source (attach-source) @ org.eclipse.mylyn.gerrit.tests ---
[WARNING] bundle localization file /jobs/genie.mylyn/mylyn-test-build/workspace/org.eclipse.mylyn.reviews/org.eclipse.mylyn.gerrit.tests/plugin.properties not found
[INFO] Building jar: /jobs/genie.mylyn/mylyn-test-build/workspace/org.eclipse.mylyn.reviews/org.eclipse.mylyn.gerrit.tests/target/org.eclipse.mylyn.gerrit.tests-2.11.0-SNAPSHOT-sources.jar
[INFO] 
[INFO] --- maven-resources-plugin:2.4.1:testResources (default-testResources) @ org.eclipse.mylyn.gerrit.tests ---
[INFO] Using 'ISO-8859-1' encoding to copy filtered resources.
[INFO] skip non existing resourceDirectory /jobs/genie.mylyn/mylyn-test-build/workspace/org.eclipse.mylyn.reviews/org.eclipse.mylyn.gerrit.tests/src/test/resources
[INFO] 
[INFO] --- target-platform-configuration:0.21.0:target-platform (default-target-platform) @ org.eclipse.mylyn.gerrit.tests ---
[INFO] 
[INFO] --- tycho-packaging-plugin:0.21.0:package-plugin (default-package-plugin) @ org.eclipse.mylyn.gerrit.tests ---
[INFO] Building jar: /jobs/genie.mylyn/mylyn-test-build/workspace/org.eclipse.mylyn.reviews/org.eclipse.mylyn.gerrit.tests/target/org.eclipse.mylyn.gerrit.tests-2.11.0-SNAPSHOT.jar
[INFO] 
[INFO] --- tycho-p2-plugin:0.21.0:p2-metadata-default (default-p2-metadata-default) @ org.eclipse.mylyn.gerrit.tests ---
[INFO] 
[INFO] --- tycho-surefire-plugin:0.21.0:test (default-test) @ org.eclipse.mylyn.gerrit.tests ---
[INFO] Expected eclipse log file: /jobs/genie.mylyn/mylyn-test-build/workspace/org.eclipse.mylyn.reviews/org.eclipse.mylyn.gerrit.tests/target/work/data/.metadata/.log
[INFO] Command line:
	[/opt/public/common/jdk1.8.0_51.x64/jre/bin/java, -Dosgi.noShutdown=false, -Dosgi.os=linux, -Dosgi.ws=gtk, -Dosgi.arch=x86_64, -Xmx512m, -XX:MaxPermSize=256m, -Djava.io.tmpdir=/jobs/genie.mylyn/mylyn-test-build/workspace/org.eclipse.mylyn.reviews/org.eclipse.mylyn.gerrit.tests/target, -ea, -Dmylyn.credentials=/shared/mylyn/.credentials.properties, -Dorg.eclipse.mylyn.wikitext.tests.disableOutput=true, -Dhttp.proxyHost=proxy.eclipse.org, -Dhttp.proxyPort=9898, -Dhttps.proxyHost=proxy.eclipse.org, -Dhttps.proxyPort=9898, -DhttpnonProxyHosts=*.eclipse.org, -Dorg.eclipse.mylyn.gerrit.tests.alternate.push=true, -Dosgi.clean=true, -jar, /jobs/genie.mylyn/mylyn-test-build/workspace/.maven/repo/p2/osgi/bundle/org.eclipse.equinox.launcher/1.3.100.v20150511-1540/org.eclipse.equinox.launcher-1.3.100.v20150511-1540.jar, -data, /jobs/genie.mylyn/mylyn-test-build/workspace/org.eclipse.mylyn.reviews/org.eclipse.mylyn.gerrit.tests/target/work/data, -install, /jobs/genie.mylyn/mylyn-test-build/workspace/org.eclipse.mylyn.reviews/org.eclipse.mylyn.gerrit.tests/target/work, -configuration, /jobs/genie.mylyn/mylyn-test-build/workspace/org.eclipse.mylyn.reviews/org.eclipse.mylyn.gerrit.tests/target/work/configuration, -application, org.eclipse.tycho.surefire.osgibooter.uitest, -testproperties, /jobs/genie.mylyn/mylyn-test-build/workspace/org.eclipse.mylyn.reviews/org.eclipse.mylyn.gerrit.tests/target/surefire.properties, -testApplication, org.eclipse.ui.ide.workbench, -product, org.eclipse.sdk.ide, -eclipse.keyring, /jobs/genie.mylyn/mylyn-test-build/workspace/org.eclipse.mylyn.reviews/org.eclipse.mylyn.gerrit.tests/target/.eclipse.keyring, -eclipse.password, /jobs/genie.mylyn/mylyn-test-build/workspace/org.eclipse.mylyn.reviews/org.eclipse.mylyn.gerrit.tests/target/../../.gitignore]
Java HotSpot(TM) 64-Bit Server VM warning: ignoring option MaxPermSize=256m; support was removed in 8.0
[2016-05-30T7-54-49] Status WARNING: org.eclipse.mylyn.tasks.ui code=0 No search provider was registered. Tasks search is not available. null, 

-------------------------------------------------------
 T E S T S
-------------------------------------------------------
Running org.eclipse.mylyn.gerrit.tests.AllGerritTests
System: Linux 3.12.51-52.39-default (amd64) / linux-x86_64-gtk / Oracle Corporation Java HotSpot(TM) 64-Bit Server VM 1.8.0_51
HTTP Proxy : HTTP @ proxy.eclipse.org/172.30.206.220:9898 (Platform) / [HTTP @ proxy.eclipse.org:9898] (Java)
HTTPS Proxy : null (Platform) / [DIRECT] (Java)

Running testParseShortId(org.eclipse.mylyn.internal.gerrit.core.remote.ReviewHarnessTest)
Running testParse_27xxx31(org.eclipse.mylyn.gerrit.tests.core.client.GerritVersionTest)
Running testParse_123q(org.eclipse.mylyn.gerrit.tests.core.client.GerritVersionTest)
Running testParse_2861(org.eclipse.mylyn.gerrit.tests.core.client.GerritVersionTest)
Running testParse_null(org.eclipse.mylyn.gerrit.tests.core.client.GerritVersionTest)
Running testIsVersion2112OrLater(org.eclipse.mylyn.gerrit.tests.core.client.GerritVersionTest)
Running testParse_254(org.eclipse.mylyn.gerrit.tests.core.client.GerritVersionTest)
Running testParse_26rc3(org.eclipse.mylyn.gerrit.tests.core.client.GerritVersionTest)
Running testParse_empty(org.eclipse.mylyn.gerrit.tests.core.client.GerritVersionTest)
Running testParse_27rc2637g76c7890(org.eclipse.mylyn.gerrit.tests.core.client.GerritVersionTest)
Running testParse_invalid(org.eclipse.mylyn.gerrit.tests.core.client.GerritVersionTest)
Running testParse_21(org.eclipse.mylyn.gerrit.tests.core.client.GerritVersionTest)
Running testParse_V221NQT012(org.eclipse.mylyn.gerrit.tests.core.client.GerritVersionTest)
Running testFromNull(org.eclipse.mylyn.gerrit.tests.core.client.rest.AbandonInputTest)
Running testFromEmpty(org.eclipse.mylyn.gerrit.tests.core.client.rest.AbandonInputTest)
Running testFromValid(org.eclipse.mylyn.gerrit.tests.core.client.rest.AbandonInputTest)
Running testFromEmptyJson(org.eclipse.mylyn.gerrit.tests.core.client.rest.AccountInfoTest)
Running testFromValid(org.eclipse.mylyn.gerrit.tests.core.client.rest.AccountInfoTest)
Running testFromInvalid(org.eclipse.mylyn.gerrit.tests.core.client.rest.AccountInfoTest)
Running testFromEmptyJson(org.eclipse.mylyn.gerrit.tests.core.client.rest.AddReviewerResultTest)
Running testFromValid(org.eclipse.mylyn.gerrit.tests.core.client.rest.AddReviewerResultTest)
Running testFromInvalid(org.eclipse.mylyn.gerrit.tests.core.client.rest.AddReviewerResultTest)
Running testNoReviews(org.eclipse.mylyn.gerrit.tests.core.client.rest.ChangeInfoTest)
Running testFromEmptyJson(org.eclipse.mylyn.gerrit.tests.core.client.rest.ChangeInfoTest)
Running testFromAbandoned(org.eclipse.mylyn.gerrit.tests.core.client.rest.ChangeInfoTest)
Running testCustomApprovalType(org.eclipse.mylyn.gerrit.tests.core.client.rest.ChangeInfoTest)
Running testNewChangeInfo(org.eclipse.mylyn.gerrit.tests.core.client.rest.ChangeInfoTest)
Running testCodeReviewMinusOne(org.eclipse.mylyn.gerrit.tests.core.client.rest.ChangeInfoTest)
Running testThreeApprovalTypes(org.eclipse.mylyn.gerrit.tests.core.client.rest.ChangeInfoTest)
Running testFromInvalid(org.eclipse.mylyn.gerrit.tests.core.client.rest.ChangeInfoTest)
Running testTwoRevisions(org.eclipse.mylyn.gerrit.tests.core.client.rest.ChangeInfoTest)
Running testFromEmptyJson(org.eclipse.mylyn.gerrit.tests.core.client.rest.ProjectInfoTest)
Running testFromSingleProject(org.eclipse.mylyn.gerrit.tests.core.client.rest.ProjectInfoTest)
Running testFromInvalid(org.eclipse.mylyn.gerrit.tests.core.client.rest.ProjectInfoTest)
Running testFromProjects(org.eclipse.mylyn.gerrit.tests.core.client.rest.ProjectInfoTest)
Running testFromNull(org.eclipse.mylyn.gerrit.tests.core.client.rest.RestoreInputTest)
Running testFromEmpty(org.eclipse.mylyn.gerrit.tests.core.client.rest.RestoreInputTest)
Running testFromValid(org.eclipse.mylyn.gerrit.tests.core.client.rest.RestoreInputTest)
Running testFromEmptyJson(org.eclipse.mylyn.gerrit.tests.core.client.rest.ReviewerInfoTest)
Running testFromValid(org.eclipse.mylyn.gerrit.tests.core.client.rest.ReviewerInfoTest)
Running testFromInvalid(org.eclipse.mylyn.gerrit.tests.core.client.rest.ReviewerInfoTest)
Running testFromNull(org.eclipse.mylyn.gerrit.tests.core.client.rest.ReviewerInputTest)
Running testFromEmpty(org.eclipse.mylyn.gerrit.tests.core.client.rest.ReviewerInputTest)
Running testFromValid(org.eclipse.mylyn.gerrit.tests.core.client.rest.ReviewerInputTest)
Running testFromEmptyJson(org.eclipse.mylyn.gerrit.tests.core.client.rest.ReviewInfoTest)
Running testFromVerifyZero(org.eclipse.mylyn.gerrit.tests.core.client.rest.ReviewInfoTest)
Running testFromCodeReviewMinusOne(org.eclipse.mylyn.gerrit.tests.core.client.rest.ReviewInfoTest)
Running testFromInvalid(org.eclipse.mylyn.gerrit.tests.core.client.rest.ReviewInfoTest)
Running testFromNull(org.eclipse.mylyn.gerrit.tests.core.client.rest.ReviewInputTest)
Running testSetNullApprovals(org.eclipse.mylyn.gerrit.tests.core.client.rest.ReviewInputTest)
Running testSetApprovals(org.eclipse.mylyn.gerrit.tests.core.client.rest.ReviewInputTest)
Running testSetEmptyApprovals(org.eclipse.mylyn.gerrit.tests.core.client.rest.ReviewInputTest)
Running testFromEmpty(org.eclipse.mylyn.gerrit.tests.core.client.rest.ReviewInputTest)
Running testFromValid(org.eclipse.mylyn.gerrit.tests.core.client.rest.ReviewInputTest)
Running testFromValid(org.eclipse.mylyn.gerrit.tests.core.client.rest.SubmitInfoTest)
Running testFromValid(org.eclipse.mylyn.gerrit.tests.core.client.rest.SubmitInputTest)
Running testAbandoned(org.eclipse.mylyn.gerrit.tests.core.client.compat.ChangeDetailXTest)
Running testConvertWhenApprovalTypesNotNull(org.eclipse.mylyn.gerrit.tests.core.client.compat.ChangeDetailXTest)
Running testContinousIntegrationCommentsAreRemoved(org.eclipse.mylyn.gerrit.tests.core.client.compat.ChangeDetailXTest)
Running testCustomLabel(org.eclipse.mylyn.gerrit.tests.core.client.compat.ChangeDetailXTest)
Running testPatchScriptIsNotBinary(org.eclipse.mylyn.gerrit.tests.core.client.compat.PatchScriptXTest)
Running testPatchScriptIsBinary(org.eclipse.mylyn.gerrit.tests.core.client.compat.PatchScriptXTest)
Running testExecuteOpenIdProviderNullCredentials(org.eclipse.mylyn.gerrit.tests.core.client.OpenIdAuthenticationTest)
 Authentication failed: [ |  | ]
Running testExecuteNullOpenIdProviderNullCredentials(org.eclipse.mylyn.gerrit.tests.core.client.OpenIdAuthenticationTest)
Running repository: http://mylyn.org/gerrit-2.10/ [@2.10](org.eclipse.mylyn.tests.util.TestFixture$Activation)
Running testExecuteQueryWithEmptyOption(org.eclipse.mylyn.gerrit.tests.core.client.GerritClientTest)
Running testExecuteQueryDraftsCommentsReviews(org.eclipse.mylyn.gerrit.tests.core.client.GerritClientTest)
Running testToReviewIdWithChangeId(org.eclipse.mylyn.gerrit.tests.core.client.GerritClientTest)
SLF4J: Failed to load class "org.slf4j.impl.StaticLoggerBinder".
SLF4J: Defaulting to no-operation (NOP) logger implementation
SLF4J: See http://www.slf4j.org/codes.html#StaticLoggerBinder for further details.
Response message:
remote: 
remote: Processing changes: new: 1, refs: 1        
remote: Processing changes: new: 1, refs: 1, done            
remote: 
remote: New Changes:        
remote:   http://lvps92-51-163-75.dedicated.hosteurope.de/gerrit-2.10/337 ZYKLZO        
remote: 
To http:\\tests:mylyntest@mylyn.org\gerrit-2.10\org.eclipse.mylyn.test\
 * [new branch]      HEAD -> refs\for\master

######
Running testToReviewId(org.eclipse.mylyn.gerrit.tests.core.client.GerritClientTest)
Running testExecuteQueryWithOption(org.eclipse.mylyn.gerrit.tests.core.client.GerritClientTest)
Running testGetAccount(org.eclipse.mylyn.gerrit.tests.core.client.GerritClientTest)
Running testExecuteQueryAllMerged(org.eclipse.mylyn.gerrit.tests.core.client.GerritClientTest)
Running testGetInfo(org.eclipse.mylyn.gerrit.tests.core.client.GerritClientTest)
Running testRefreshConfig(org.eclipse.mylyn.gerrit.tests.core.client.GerritClientTest)
Running testFetchLeftBinaryContent(org.eclipse.mylyn.gerrit.tests.core.client.GerritClientTest)
Running testExecuteQueryisStarred(org.eclipse.mylyn.gerrit.tests.core.client.GerritClientTest)
Running testExecuteQueryWithMultipleOptions(org.eclipse.mylyn.gerrit.tests.core.client.GerritClientTest)
Running testIsZippedContent(org.eclipse.mylyn.gerrit.tests.core.client.GerritClientTest)
Running testExecuteQueryWithNullOption(org.eclipse.mylyn.gerrit.tests.core.client.GerritClientTest)
Running testFetchRightBinaryContent(org.eclipse.mylyn.gerrit.tests.core.client.GerritClientTest)
Running testGetUrlForPatchSet(org.eclipse.mylyn.gerrit.tests.core.client.GerritClientTest)
Running testExecuteQueryDraftsReviews(org.eclipse.mylyn.gerrit.tests.core.client.GerritClientTest)
Running testExecuteQueryHasComments(org.eclipse.mylyn.gerrit.tests.core.client.GerritClientTest)
Running testExecuteQueryWithEmptyList(org.eclipse.mylyn.gerrit.tests.core.client.GerritClientTest)
Running testExecuteQueryAllAbandoned(org.eclipse.mylyn.gerrit.tests.core.client.GerritClientTest)
Running testGetVersion(org.eclipse.mylyn.gerrit.tests.core.client.GerritClientTest)
Running testToReviewIdWithInvalidId(org.eclipse.mylyn.gerrit.tests.core.client.GerritClientTest)
Running testInvalidXrsfKey(org.eclipse.mylyn.gerrit.tests.core.client.GerritClientTest)
Running testExecuteQueryWithoutOption(org.eclipse.mylyn.gerrit.tests.core.client.GerritClientTest)
Running testGetAccountAnonymous(org.eclipse.mylyn.gerrit.tests.core.client.GerritClientTest)
Running testPerformQueryAnonymous(org.eclipse.mylyn.gerrit.tests.core.GerritConnectorTest)
Response message:
remote: 
remote: Processing changes: new: 1, refs: 1        
remote: Processing changes: new: 1, refs: 1, done            
remote: 
remote: New Changes:        
remote:   http://lvps92-51-163-75.dedicated.hosteurope.de/gerrit-2.10/338 amNgcq        
remote: 
To http:\\tests:mylyntest@mylyn.org\gerrit-2.10\org.eclipse.mylyn.test\
 * [new branch]      HEAD -> refs\for\master

######
Running testSynchronizeTaskUpdated(org.eclipse.mylyn.gerrit.tests.core.GerritSynchronizationTest)
Response message:
remote: 
remote: Processing changes: new: 1, refs: 1        
remote: Processing changes: new: 1, refs: 1, done            
remote: 
remote: New Changes:        
remote:   http://lvps92-51-163-75.dedicated.hosteurope.de/gerrit-2.10/339 jVUUFg        
remote: 
To http:\\tests:mylyntest@mylyn.org\gerrit-2.10\org.eclipse.mylyn.test\
 * [new branch]      HEAD -> refs\for\master

######
Running testSynchronizeBackgroundTaskUpdated(org.eclipse.mylyn.gerrit.tests.core.GerritSynchronizationTest)
Response message:
remote: 
remote: Processing changes: new: 1, refs: 1        
remote: Processing changes: new: 1, refs: 1, done            
remote: 
remote: New Changes:        
remote:   http://lvps92-51-163-75.dedicated.hosteurope.de/gerrit-2.10/340 LXAWFO        
remote: 
To http:\\tests:mylyntest@mylyn.org\gerrit-2.10\org.eclipse.mylyn.test\
 * [new branch]      HEAD -> refs\for\master

######
Running testGetFromChangeId(org.eclipse.mylyn.gerrit.tests.core.GerritSynchronizationTest)
Response message:
remote: 
remote: Processing changes: new: 1, refs: 1        
remote: Processing changes: new: 1, refs: 1        
remote: Processing changes: new: 1, refs: 1, done            
remote: 
remote: New Changes:        
remote:   http://lvps92-51-163-75.dedicated.hosteurope.de/gerrit-2.10/341 nexpsd        
remote: 
To http:\\tests:mylyntest@mylyn.org\gerrit-2.10\org.eclipse.mylyn.test\
 * [new branch]      HEAD -> refs\for\master

######
Running testSynchronizeQueryTaskUpdated(org.eclipse.mylyn.gerrit.tests.core.GerritSynchronizationTest)
Response message:
remote: 
remote: Processing changes: new: 1, refs: 1        
remote: Processing changes: new: 1, refs: 1        
remote: Processing changes: new: 1, refs: 1        
remote: Processing changes: new: 1, refs: 1, done            
remote: 
remote: New Changes:        
remote:   http://lvps92-51-163-75.dedicated.hosteurope.de/gerrit-2.10/342 ycfnvj        
remote: 
To http:\\tests:mylyntest@mylyn.org\gerrit-2.10\org.eclipse.mylyn.test\
 * [new branch]      HEAD -> refs\for\master

######
Running testSynchronizeQueryNewTask(org.eclipse.mylyn.gerrit.tests.core.GerritSynchronizationTest)
Response message:
remote: 
remote: Processing changes: new: 1, refs: 1        
remote: Processing changes: new: 1, refs: 1, done            
remote: 
remote: New Changes:        
remote:   http://lvps92-51-163-75.dedicated.hosteurope.de/gerrit-2.10/343 SwYhKi        
remote: 
To http:\\tests:mylyntest@mylyn.org\gerrit-2.10\org.eclipse.mylyn.test\
 * [new branch]      HEAD -> refs\for\master

######
Running testSynchronizeBackgroundQueryTaskUpdated(org.eclipse.mylyn.gerrit.tests.core.GerritSynchronizationTest)
Response message:
remote: 
remote: Processing changes: new: 1, refs: 1        
remote: Processing changes: new: 1, refs: 1        
remote: Processing changes: new: 1, refs: 1        
remote: Processing changes: new: 1, refs: 1, done            
remote: 
remote: New Changes:        
remote:   http://lvps92-51-163-75.dedicated.hosteurope.de/gerrit-2.10/344 PYlbNO        
remote: 
To http:\\tests:mylyntest@mylyn.org\gerrit-2.10\org.eclipse.mylyn.test\
 * [new branch]      HEAD -> refs\for\master

######
Running testCreateChild(org.eclipse.mylyn.internal.gerrit.core.remote.GerritDataLocatorTest)
Running testCreateRoot(org.eclipse.mylyn.internal.gerrit.core.remote.GerritDataLocatorTest)
Running testMigrate(org.eclipse.mylyn.internal.gerrit.core.remote.GerritDataLocatorTest)
Running testGlobalComments(org.eclipse.mylyn.internal.gerrit.core.remote.GerritReviewRemoteFactoryTest)
Response message:
remote: 
remote: Processing changes: new: 1, refs: 1        
remote: Processing changes: new: 1, refs: 1, done            
remote: 
remote: New Changes:        
remote:   http://lvps92-51-163-75.dedicated.hosteurope.de/gerrit-2.10/345 Test Change I699a27f93b14bd7a8596fe1fe8d861f0aa7dde4c        
remote: 
To http:\\tests:mylyntest@mylyn.org\gerrit-2.10\org.eclipse.mylyn.test\
 * [new branch]      HEAD -> refs\for\master

######
Running testAddEmptyReviewers(org.eclipse.mylyn.internal.gerrit.core.remote.GerritReviewRemoteFactoryTest)
Response message:
remote: 
remote: Processing changes: new: 1, refs: 1        
remote: Processing changes: new: 1, refs: 1        
remote: Processing changes: new: 1, refs: 1, done            
remote: 
remote: New Changes:        
remote:   http://lvps92-51-163-75.dedicated.hosteurope.de/gerrit-2.10/346 Test Change I27360d3ccea82f2c05d2eefdc42a7e08ba9eeef8        
remote: 
To http:\\tests:mylyntest@mylyn.org\gerrit-2.10\org.eclipse.mylyn.test\
 * [new branch]      HEAD -> refs\for\master

######
Running testAddInvalidReviewers(org.eclipse.mylyn.internal.gerrit.core.remote.GerritReviewRemoteFactoryTest)
Response message:
remote: 
remote: Processing changes: new: 1, refs: 1        
remote: Processing changes: new: 1, refs: 1, done            
remote: 
remote: New Changes:        
remote:   http://lvps92-51-163-75.dedicated.hosteurope.de/gerrit-2.10/347 Test Change I6cb45fbf275089d579c5000556315f0d1a4d9ddf        
remote: 
To http:\\tests:mylyntest@mylyn.org\gerrit-2.10\org.eclipse.mylyn.test\
 * [new branch]      HEAD -> refs\for\master

######
Running testAccount(org.eclipse.mylyn.internal.gerrit.core.remote.GerritReviewRemoteFactoryTest)
Response message:
remote: 
remote: Processing changes: new: 1, refs: 1        
remote: Processing changes: new: 1, refs: 1        
remote: Processing changes: new: 1, refs: 1        
remote: Processing changes: new: 1, refs: 1, done            
remote: 
remote: New Changes:        
remote:   http://lvps92-51-163-75.dedicated.hosteurope.de/gerrit-2.10/348 Test Change I18f577183760d5f6ca335213a36d97cde3a61a86        
remote: 
To http:\\tests:mylyntest@mylyn.org\gerrit-2.10\org.eclipse.mylyn.test\
 * [new branch]      HEAD -> refs\for\master

######
Running testApprovals(org.eclipse.mylyn.internal.gerrit.core.remote.GerritReviewRemoteFactoryTest)
Response message:
remote: 
remote: Processing changes: new: 1, refs: 1        
remote: Processing changes: new: 1, refs: 1, done            
remote: 
remote: New Changes:        
remote:   http://lvps92-51-163-75.dedicated.hosteurope.de/gerrit-2.10/349 Test Change I3cff40289ba297e6d3572354db5b2fe9e91ee38f        
remote: 
To http:\\tests:mylyntest@mylyn.org\gerrit-2.10\org.eclipse.mylyn.test\
 * [new branch]      HEAD -> refs\for\master

######
Running testGetPatchSetPublishDetail(org.eclipse.mylyn.internal.gerrit.core.remote.GerritReviewRemoteFactoryTest)
Response message:
remote: 
remote: Processing changes: new: 1, refs: 1        
remote: Processing changes: new: 1, refs: 1, done            
remote: 
remote: New Changes:        
remote:   http://lvps92-51-163-75.dedicated.hosteurope.de/gerrit-2.10/350 Test Change I723c527b5c2faad8015bdc61f66100957f396bfd        
remote: 
To http:\\tests:mylyntest@mylyn.org\gerrit-2.10\org.eclipse.mylyn.test\
 * [new branch]      HEAD -> refs\for\master

######
Running testCannotRebaseChangeAlreadyUpToDate(org.eclipse.mylyn.internal.gerrit.core.remote.GerritReviewRemoteFactoryTest)
Response message:
remote: 
remote: Processing changes: new: 1, refs: 1        
remote: Processing changes: new: 1, refs: 1, done            
remote: 
remote: New Changes:        
remote:   http://lvps92-51-163-75.dedicated.hosteurope.de/gerrit-2.10/351 Test Change I8b8fcfd4689de784d030a3ef65ec9561b34a4cbb        
remote: 
To http:\\tests:mylyntest@mylyn.org\gerrit-2.10\org.eclipse.mylyn.test\
 * [new branch]      HEAD -> refs\for\master

######
Running testCherryPick(org.eclipse.mylyn.internal.gerrit.core.remote.GerritReviewRemoteFactoryTest)
Response message:
remote: 
remote: Processing changes: new: 1, refs: 1        
remote: Processing changes: new: 1, refs: 1, done            
remote: 
remote: New Changes:        
remote:   http://lvps92-51-163-75.dedicated.hosteurope.de/gerrit-2.10/352 Test Change I17774cc3e3bb83fc649fa5c4bcea02b378b8c31e        
remote: 
To http:\\tests:mylyntest@mylyn.org\gerrit-2.10\org.eclipse.mylyn.test\
 * [new branch]      HEAD -> refs\for\master

######
Running testCannotCherryPick(org.eclipse.mylyn.internal.gerrit.core.remote.GerritReviewRemoteFactoryTest)
Response message:
remote: 
remote: Processing changes: new: 1, refs: 1        
remote: Processing changes: new: 1, refs: 1, done            
remote: 
remote: New Changes:        
remote:   http://lvps92-51-163-75.dedicated.hosteurope.de/gerrit-2.10/354 Test Change I766b4083bded4ca48e9c7078fc7c918f1aaaf147        
remote: 
To http:\\tests:mylyntest@mylyn.org\gerrit-2.10\org.eclipse.mylyn.test\
 * [new branch]      HEAD -> refs\for\master

######
Running testGetChangeInfo(org.eclipse.mylyn.internal.gerrit.core.remote.GerritReviewRemoteFactoryTest)
Response message:
remote: 
remote: Processing changes: new: 1, refs: 1        
remote: Processing changes: new: 1, refs: 1, done            
remote: 
remote: New Changes:        
remote:   http://lvps92-51-163-75.dedicated.hosteurope.de/gerrit-2.10/355 Test Change I6f733d0abde79f05e210b904b2fc9d2e0bb2da8a        
remote: 
To http:\\tests:mylyntest@mylyn.org\gerrit-2.10\org.eclipse.mylyn.test\
 * [new branch]      HEAD -> refs\for\master

######
Running testGetCachedBranches(org.eclipse.mylyn.internal.gerrit.core.remote.GerritReviewRemoteFactoryTest)
Response message:
remote: 
remote: Processing changes: new: 1, refs: 1        
remote: Processing changes: new: 1, refs: 1, done            
remote: 
remote: New Changes:        
remote:   http://lvps92-51-163-75.dedicated.hosteurope.de/gerrit-2.10/356 Test Change I37cca07dbeca84deaf1af2555af2b52931419fc4        
remote: 
To http:\\tests:mylyntest@mylyn.org\gerrit-2.10\org.eclipse.mylyn.test\
 * [new branch]      HEAD -> refs\for\master

######
Running testUnpermittedApproval(org.eclipse.mylyn.internal.gerrit.core.remote.GerritReviewRemoteFactoryTest)
Response message:
remote: 
remote: Processing changes: new: 1, refs: 1        
remote: Processing changes: new: 1, refs: 1, done            
remote: 
remote: New Changes:        
remote:   http://lvps92-51-163-75.dedicated.hosteurope.de/gerrit-2.10/357 Test Change I1db2ae0caedd5a96611066cf3565bdb3cdf30cde        
remote: 
To http:\\tests:mylyntest@mylyn.org\gerrit-2.10\org.eclipse.mylyn.test\
 * [new branch]      HEAD -> refs\for\master

######
Running testNewChange(org.eclipse.mylyn.internal.gerrit.core.remote.GerritReviewRemoteFactoryTest)
Response message:
remote: 
remote: Processing changes: new: 1, refs: 1        
remote: Processing changes: new: 1, refs: 1, done            
remote: 
remote: New Changes:        
remote:   http://lvps92-51-163-75.dedicated.hosteurope.de/gerrit-2.10/358 Test Change I102787a9b5b8fef1ea103685a9b3610b90ac166c        
remote: 
To http:\\tests:mylyntest@mylyn.org\gerrit-2.10\org.eclipse.mylyn.test\
 * [new branch]      HEAD -> refs\for\master

######
Response message:
remote: 
remote: Processing changes: updated: 1, refs: 1        
remote: Processing changes: updated: 1, refs: 1, done            
remote: 
remote: Updated Changes:        
remote:   http://lvps92-51-163-75.dedicated.hosteurope.de/gerrit-2.10/358 Test Change I102787a9b5b8fef1ea103685a9b3610b90ac166c        
remote: 
To http:\\tests:mylyntest@mylyn.org\gerrit-2.10\org.eclipse.mylyn.test\
 * [new branch]      HEAD -> refs\for\master

######
Running testCannotSubmitChange(org.eclipse.mylyn.internal.gerrit.core.remote.GerritReviewRemoteFactoryTest)
Response message:
remote: 
remote: Processing changes: new: 1, refs: 1        
remote: Processing changes: new: 1, refs: 1        
remote: Processing changes: new: 1, refs: 1        
remote: Processing changes: new: 1, refs: 1, done            
remote: 
remote: New Changes:        
remote:   http://lvps92-51-163-75.dedicated.hosteurope.de/gerrit-2.10/359 Test Change Ic89523f4ed48e49377055ccc50aca18e9cf76b3f        
remote: 
To http:\\tests:mylyntest@mylyn.org\gerrit-2.10\org.eclipse.mylyn.test\
 * [new branch]      HEAD -> refs\for\master

######
Running testReviewStatus(org.eclipse.mylyn.internal.gerrit.core.remote.GerritReviewRemoteFactoryTest)
Response message:
remote: 
remote: Processing changes: new: 1, refs: 1        
remote: Processing changes: new: 1, refs: 1, done            
remote: 
remote: New Changes:        
remote:   http://lvps92-51-163-75.dedicated.hosteurope.de/gerrit-2.10/360 Test Change I72eea1ec6b565fd2ebfdb614a301b3d891203814        
remote: 
To http:\\tests:mylyntest@mylyn.org\gerrit-2.10\org.eclipse.mylyn.test\
 * [new branch]      HEAD -> refs\for\master

######
Running testGetChangeDetailWithNoApprovals(org.eclipse.mylyn.internal.gerrit.core.remote.GerritReviewRemoteFactoryTest)
Response message:
remote: 
remote: Processing changes: new: 1, refs: 1        
remote: Processing changes: new: 1, refs: 1        
remote: Processing changes: new: 1, refs: 1, done            
remote: 
remote: New Changes:        
remote:   http://lvps92-51-163-75.dedicated.hosteurope.de/gerrit-2.10/361 Test Change I878a8846eef2a3c3f38ca0632026c0a8f616cc3a        
remote: 
To http:\\tests:mylyntest@mylyn.org\gerrit-2.10\org.eclipse.mylyn.test\
 * [new branch]      HEAD -> refs\for\master

######
Running testSetStarred(org.eclipse.mylyn.internal.gerrit.core.remote.GerritReviewRemoteFactoryTest)
Response message:
remote: 
remote: Processing changes: new: 1, refs: 1        
remote: Processing changes: new: 1, refs: 1        
remote: Processing changes: new: 1, refs: 1, done            
remote: 
remote: New Changes:        
remote:   http://lvps92-51-163-75.dedicated.hosteurope.de/gerrit-2.10/362 Test Change I30a7b3b82ecb43cf32b810a200bff6b097b211a8        
remote: 
To http:\\tests:mylyntest@mylyn.org\gerrit-2.10\org.eclipse.mylyn.test\
 * [new branch]      HEAD -> refs\for\master

######
Running testAddSomeInvalidReviewers(org.eclipse.mylyn.internal.gerrit.core.remote.GerritReviewRemoteFactoryTest)
Response message:
remote: 
remote: Processing changes: new: 1, refs: 1        
remote: Processing changes: new: 1, refs: 1, done            
remote: 
remote: New Changes:        
remote:   http://lvps92-51-163-75.dedicated.hosteurope.de/gerrit-2.10/363 Test Change I4bbefd6a798205206c01e293251829e95df38e3e        
remote: 
To http:\\tests:mylyntest@mylyn.org\gerrit-2.10\org.eclipse.mylyn.test\
 * [new branch]      HEAD -> refs\for\master

######
Running testRestoreChange(org.eclipse.mylyn.internal.gerrit.core.remote.GerritReviewRemoteFactoryTest)
Response message:
remote: 
remote: Processing changes: new: 1, refs: 1        
remote: Processing changes: new: 1, refs: 1, done            
remote: 
remote: New Changes:        
remote:   http://lvps92-51-163-75.dedicated.hosteurope.de/gerrit-2.10/364 Test Change I4c7cf3bab5dbce9170ab6c89c91da1f7a8795072        
remote: 
To http:\\tests:mylyntest@mylyn.org\gerrit-2.10\org.eclipse.mylyn.test\
 * [new branch]      HEAD -> refs\for\master

######
Running testReviewsWithSameChangeId(org.eclipse.mylyn.internal.gerrit.core.remote.GerritReviewRemoteFactoryTest)
Response message:
remote: 
remote: Processing changes: new: 1, refs: 1        
remote: Processing changes: new: 1, refs: 1        
remote: Processing changes: new: 1, refs: 1        
remote: Processing changes: new: 1, refs: 1, done            
remote: 
remote: New Changes:        
remote:   http://lvps92-51-163-75.dedicated.hosteurope.de/gerrit-2.10/365 Test Change I4adcf5f6cce07d550c61ec3a5ae7c017969fd694        
remote: 
To http:\\tests:mylyntest@mylyn.org\gerrit-2.10\org.eclipse.mylyn.test\
 * [new branch]      HEAD -> refs\for\master

######
Response message:
remote: 
remote: Processing changes: new: 1, refs: 1        
remote: Processing changes: new: 1, refs: 1, done            
remote: 
remote: New Changes:        
remote:   http://lvps92-51-163-75.dedicated.hosteurope.de/gerrit-2.10/366 Test Change I4adcf5f6cce07d550c61ec3a5ae7c017969fd694        
remote: 
To http:\\tests:mylyntest@mylyn.org\gerrit-2.10\org.eclipse.mylyn.test\
 * [new branch]      HEAD -> refs\for\test_side_branch

######
Running testAddNullReviewers(org.eclipse.mylyn.internal.gerrit.core.remote.GerritReviewRemoteFactoryTest)
Response message:
remote: 
remote: Processing changes: new: 1, refs: 1        
remote: Processing changes: new: 1, refs: 1, done            
remote: 
remote: New Changes:        
remote:   http://lvps92-51-163-75.dedicated.hosteurope.de/gerrit-2.10/367 Test Change I11b08dc9b8085c7484052bdf2e9fc5dbc675d32e        
remote: 
To http:\\tests:mylyntest@mylyn.org\gerrit-2.10\org.eclipse.mylyn.test\
 * [new branch]      HEAD -> refs\for\master

######
Running testAddReviewersByEmail(org.eclipse.mylyn.internal.gerrit.core.remote.GerritReviewRemoteFactoryTest)
Response message:
remote: 
remote: Processing changes: new: 1, refs: 1        
remote: Processing changes: new: 1, refs: 1, done            
remote: 
remote: New Changes:        
remote:   http://lvps92-51-163-75.dedicated.hosteurope.de/gerrit-2.10/368 Test Change I2bd62b26407ea605519115159ad5116d85d02a13        
remote: 
To http:\\tests:mylyntest@mylyn.org\gerrit-2.10\org.eclipse.mylyn.test\
 * [new branch]      HEAD -> refs\for\master

######
Running testNoLabels(org.eclipse.mylyn.internal.gerrit.core.remote.GerritReviewRemoteFactoryTest)
Response message:
remote: 
remote: Processing changes: new: 1, refs: 1        
remote: Processing changes: new: 1, refs: 1, done            
remote: 
remote: New Changes:        
remote:   http://lvps92-51-163-75.dedicated.hosteurope.de/gerrit-2.10/369 Test Change I233f8333eecc8d6ff4a3751b0de9fa6c1c526e5f        
remote: 
To http:\\tests:mylyntest@mylyn.org\gerrit-2.10\org.eclipse.mylyn.test\
 * [new branch]      HEAD -> refs\for\master

######
Running testAbandonChange(org.eclipse.mylyn.internal.gerrit.core.remote.GerritReviewRemoteFactoryTest)
Response message:
remote: 
remote: Processing changes: new: 1, refs: 1        
remote: Processing changes: new: 1, refs: 1        
remote: Processing changes: new: 1, refs: 1, done            
remote: 
remote: New Changes:        
remote:   http://lvps92-51-163-75.dedicated.hosteurope.de/gerrit-2.10/370 Test Change I5b1ff0da670dfe18d17642c221589d97fd031eac        
remote: 
To http:\\tests:mylyntest@mylyn.org\gerrit-2.10\org.eclipse.mylyn.test\
 * [new branch]      HEAD -> refs\for\master

######
Running testAddReviewers(org.eclipse.mylyn.internal.gerrit.core.remote.GerritReviewRemoteFactoryTest)
Response message:
remote: 
remote: Processing changes: new: 1, refs: 1        
remote: Processing changes: new: 1, refs: 1        
remote: Processing changes: new: 1, refs: 1        
remote: Processing changes: new: 1, refs: 1, done            
remote: 
remote: New Changes:        
remote:   http://lvps92-51-163-75.dedicated.hosteurope.de/gerrit-2.10/371 Test Change I51270921e49527fba85e45304100433154503fea        
remote: 
To http:\\tests:mylyntest@mylyn.org\gerrit-2.10\org.eclipse.mylyn.test\
 * [new branch]      HEAD -> refs\for\master

######
Running testDependencies(org.eclipse.mylyn.internal.gerrit.core.remote.GerritReviewRemoteFactoryTest)
Response message:
remote: 
remote: Processing changes: new: 1, refs: 1        
remote: Processing changes: new: 1, refs: 1, done            
remote: 
remote: New Changes:        
remote:   http://lvps92-51-163-75.dedicated.hosteurope.de/gerrit-2.10/372 Test Change I47cdd833a4987ae7d3219285b89c0bd0f4d00374        
remote: 
To http:\\tests:mylyntest@mylyn.org\gerrit-2.10\org.eclipse.mylyn.test\
 * [new branch]      HEAD -> refs\for\master

######
Response message:
remote: 
remote: Processing changes: new: 1, refs: 1        
remote: Processing changes: new: 1, refs: 1, done            
remote: 
remote: New Changes:        
remote:   http://lvps92-51-163-75.dedicated.hosteurope.de/gerrit-2.10/373 Test Change I1464652880210aaaaaaaaaaaaaaaaaaaaaaaaaaa        
remote: 
To http:\\tests:mylyntest@mylyn.org\gerrit-2.10\org.eclipse.mylyn.test\
 * [new branch]      HEAD -> refs\for\master

######
Running testParentCommit(org.eclipse.mylyn.internal.gerrit.core.remote.GerritReviewRemoteFactoryTest)
Response message:
remote: 
remote: Processing changes: new: 1, refs: 1        
remote: Processing changes: new: 1, refs: 1, done            
remote: 
remote: New Changes:        
remote:   http://lvps92-51-163-75.dedicated.hosteurope.de/gerrit-2.10/374 Test Change I43e703e3fc07ca82f5bdf0c6d7af0600562a1795        
remote: 
To http:\\tests:mylyntest@mylyn.org\gerrit-2.10\org.eclipse.mylyn.test\
 * [new branch]      HEAD -> refs\for\master

######
Response message:
remote: 
remote: Processing changes: new: 1, refs: 1        
remote: Processing changes: new: 1, refs: 1, done            
remote: 
remote: New Changes:        
remote:   http://lvps92-51-163-75.dedicated.hosteurope.de/gerrit-2.10/375 Test Change I6d0eac76bce8a51b6ef78b5072bf9fd385cf6914        
remote: 
To http:\\tests:mylyntest@mylyn.org\gerrit-2.10\org.eclipse.mylyn.test\
 * [new branch]      HEAD -> refs\for\master

######
Running testGlobalCommentByGerrit(org.eclipse.mylyn.internal.gerrit.core.remote.GerritReviewRemoteFactoryTest)
Response message:
remote: 
remote: Processing changes: new: 1, refs: 1        
remote: Processing changes: new: 1, refs: 1, done            
remote: 
remote: New Changes:        
remote:   http://lvps92-51-163-75.dedicated.hosteurope.de/gerrit-2.10/376 Test Change I67eb54adb84cddf22b8f91243e89b0c04d468e85        
remote: 
To http:\\tests:mylyntest@mylyn.org\gerrit-2.10\org.eclipse.mylyn.test\
 * [new branch]      HEAD -> refs\for\master

######
Response message:
remote: 
remote: Processing changes: new: 1, refs: 1        
remote: Processing changes: new: 1, refs: 1, done            
remote: 
remote: New Changes:        
remote:   http://lvps92-51-163-75.dedicated.hosteurope.de/gerrit-2.10/377 Test Change I2be47075d67c88671cf4939152b21a7b97d14a4a        
remote: 
To http:\\tests:mylyntest@mylyn.org\gerrit-2.10\org.eclipse.mylyn.test\
 * [new branch]      HEAD -> refs\for\master

######
Response message:
remote: Resolving deltas: 100% (1/1)           
remote: Resolving deltas: 100% (1/1)        
remote: 
remote: Processing changes: updated: 1, refs: 1        
remote: Processing changes: updated: 1, refs: 1        
remote: Processing changes: updated: 1, refs: 1, done            
remote: 
remote: Updated Changes:        
remote:   http://lvps92-51-163-75.dedicated.hosteurope.de/gerrit-2.10/376 Test Change I67eb54adb84cddf22b8f91243e89b0c04d468e85        
remote: 
To http:\\tests:mylyntest@mylyn.org\gerrit-2.10\org.eclipse.mylyn.test\
 * [new branch]      HEAD -> refs\for\master

######
Running testRestoreNewChange(org.eclipse.mylyn.internal.gerrit.core.remote.GerritReviewRemoteFactoryTest)
Response message:
remote: 
remote: Processing changes: new: 1, refs: 1        
remote: Processing changes: new: 1, refs: 1, done            
remote: 
remote: New Changes:        
remote:   http://lvps92-51-163-75.dedicated.hosteurope.de/gerrit-2.10/378 Test Change I48a1a77310654fa42ebf40577982c37c5a653d31        
remote: 
To http:\\tests:mylyntest@mylyn.org\gerrit-2.10\org.eclipse.mylyn.test\
 * [new branch]      HEAD -> refs\for\master

######
Running testBaseAndPatchSetComments(org.eclipse.mylyn.internal.gerrit.core.remote.PatchSetRemoteFactoryTest)
Response message:
remote: 
remote: Processing changes: new: 1, refs: 1        
remote: Processing changes: new: 1, refs: 1, done            
remote: 
remote: New Changes:        
remote:   http://lvps92-51-163-75.dedicated.hosteurope.de/gerrit-2.10/379 Test Change I5bd7899b006df103217a2f22acbd3fb9b24708fe        
remote: 
To http:\\tests:mylyntest@mylyn.org\gerrit-2.10\org.eclipse.mylyn.test\
 * [new branch]      HEAD -> refs\for\master

######
Response message:
remote: 
remote: Processing changes: updated: 1, refs: 1        
remote: Processing changes: updated: 1, refs: 1        
remote: Processing changes: updated: 1, refs: 1, done            
remote: 
remote: Updated Changes:        
remote:   http://lvps92-51-163-75.dedicated.hosteurope.de/gerrit-2.10/379 Test Change I5bd7899b006df103217a2f22acbd3fb9b24708fe        
remote: 
To http:\\tests:mylyntest@mylyn.org\gerrit-2.10\org.eclipse.mylyn.test\
 * [new branch]      HEAD -> refs\for\master

######
Running testBaseComment(org.eclipse.mylyn.internal.gerrit.core.remote.PatchSetRemoteFactoryTest)
Response message:
remote: 
remote: Processing changes: new: 1, refs: 1        
remote: Processing changes: new: 1, refs: 1        
remote: Processing changes: new: 1, refs: 1, done            
remote: 
remote: New Changes:        
remote:   http://lvps92-51-163-75.dedicated.hosteurope.de/gerrit-2.10/380 Test Change I261b4f737bdd4552f6148e209334a99f940b2642        
remote: 
To http:\\tests:mylyntest@mylyn.org\gerrit-2.10\org.eclipse.mylyn.test\
 * [new branch]      HEAD -> refs\for\master

######
Response message:
remote: 
remote: Processing changes: updated: 1, refs: 1        
remote: Processing changes: updated: 1, refs: 1        
remote: Processing changes: updated: 1, refs: 1, done            
remote: 
remote: Updated Changes:        
remote:   http://lvps92-51-163-75.dedicated.hosteurope.de/gerrit-2.10/380 Test Change I261b4f737bdd4552f6148e209334a99f940b2642        
remote: 
To http:\\tests:mylyntest@mylyn.org\gerrit-2.10\org.eclipse.mylyn.test\
 * [new branch]      HEAD -> refs\for\master

######
Running testLoadPatchSet(org.eclipse.mylyn.internal.gerrit.core.remote.PatchSetRemoteFactoryTest)
Response message:
remote: 
remote: Processing changes: new: 1, refs: 1        
remote: Processing changes: new: 1, refs: 1, done            
remote: 
remote: New Changes:        
remote:   http://lvps92-51-163-75.dedicated.hosteurope.de/gerrit-2.10/381 Test Change I1b900a2a8255074867627a670f4a3d16adb97d97        
remote: 
To http:\\tests:mylyntest@mylyn.org\gerrit-2.10\org.eclipse.mylyn.test\
 * [new branch]      HEAD -> refs\for\master

######
Running testCompareBinaryContent(org.eclipse.mylyn.internal.gerrit.core.remote.PatchSetRemoteFactoryTest)
Response message:
remote: 
remote: Processing changes: new: 1, refs: 1        
remote: Processing changes: new: 1, refs: 1, done            
remote: 
remote: New Changes:        
remote:   http://lvps92-51-163-75.dedicated.hosteurope.de/gerrit-2.10/382 Test Change I513b27dc58aa29d921a47745353d0782f1ad4b88        
remote: 
To http:\\tests:mylyntest@mylyn.org\gerrit-2.10\org.eclipse.mylyn.test\
 * [new branch]      HEAD -> refs\for\master

######
Response message:
remote: 
remote: Processing changes: updated: 1, refs: 1        
remote: Processing changes: updated: 1, refs: 1, done            
remote: 
remote: Updated Changes:        
remote:   http://lvps92-51-163-75.dedicated.hosteurope.de/gerrit-2.10/382 Test Change I513b27dc58aa29d921a47745353d0782f1ad4b88        
remote: 
To http:\\tests:mylyntest@mylyn.org\gerrit-2.10\org.eclipse.mylyn.test\
 * [new branch]      HEAD -> refs\for\master

######
Response message:
remote: 
remote: Processing changes: updated: 1, refs: 1        
remote: Processing changes: updated: 1, refs: 1, done            
remote: 
remote: Updated Changes:        
remote:   http://lvps92-51-163-75.dedicated.hosteurope.de/gerrit-2.10/382 Test Change I513b27dc58aa29d921a47745353d0782f1ad4b88        
remote: 
To http:\\tests:mylyntest@mylyn.org\gerrit-2.10\org.eclipse.mylyn.test\
 * [new branch]      HEAD -> refs\for\master

######
Response message:
remote: 
remote: Processing changes: updated: 1, refs: 1        
remote: Processing changes: updated: 1, refs: 1, done            
remote: 
remote: Updated Changes:        
remote:   http://lvps92-51-163-75.dedicated.hosteurope.de/gerrit-2.10/382 Test Change I513b27dc58aa29d921a47745353d0782f1ad4b88        
remote: 
To http:\\tests:mylyntest@mylyn.org\gerrit-2.10\org.eclipse.mylyn.test\
 * [new branch]      HEAD -> refs\for\master

######
Running testPatchSetComments(org.eclipse.mylyn.internal.gerrit.core.remote.PatchSetRemoteFactoryTest)
Response message:
remote: 
remote: Processing changes: new: 1, refs: 1        
remote: Processing changes: new: 1, refs: 1, done            
remote: 
remote: New Changes:        
remote:   http://lvps92-51-163-75.dedicated.hosteurope.de/gerrit-2.10/383 Test Change I5a8cf953f94b1963b308905483ab9a44ba8a84ae        
remote: 
To http:\\tests:mylyntest@mylyn.org\gerrit-2.10\org.eclipse.mylyn.test\
 * [new branch]      HEAD -> refs\for\master

######
Response message:
remote: 
remote: Processing changes: updated: 1, refs: 1        
remote: Processing changes: updated: 1, refs: 1        
remote: Processing changes: updated: 1, refs: 1, done            
remote: 
remote: Updated Changes:        
remote:   http://lvps92-51-163-75.dedicated.hosteurope.de/gerrit-2.10/383 Test Change I5a8cf953f94b1963b308905483ab9a44ba8a84ae        
remote: 
To http:\\tests:mylyntest@mylyn.org\gerrit-2.10\org.eclipse.mylyn.test\
 * [new branch]      HEAD -> refs\for\master

######
Running testFetchZippedBinaryContent(org.eclipse.mylyn.internal.gerrit.core.remote.PatchSetRemoteFactoryTest)
Response message:
remote: 
remote: Processing changes: new: 1, refs: 1        
remote: Processing changes: new: 1, refs: 1        
remote: Processing changes: new: 1, refs: 1        
remote: Processing changes: new: 1, refs: 1, done            
remote: 
remote: New Changes:        
remote:   http://lvps92-51-163-75.dedicated.hosteurope.de/gerrit-2.10/384 Test Change I568995087be3310ca35c8ee9535cbe5372230ac1        
remote: 
To http:\\tests:mylyntest@mylyn.org\gerrit-2.10\org.eclipse.mylyn.test\
 * [new branch]      HEAD -> refs\for\master

######
Response message:
remote: 
remote: Processing changes: updated: 1, refs: 1        
remote: Processing changes: updated: 1, refs: 1        
remote: Processing changes: updated: 1, refs: 1, done            
remote: 
remote: Updated Changes:        
remote:   http://lvps92-51-163-75.dedicated.hosteurope.de/gerrit-2.10/384 Test Change I568995087be3310ca35c8ee9535cbe5372230ac1        
remote: 
To http:\\tests:mylyntest@mylyn.org\gerrit-2.10\org.eclipse.mylyn.test\
 * [new branch]      HEAD -> refs\for\master

######
Running testUnzipBinaryContent(org.eclipse.mylyn.internal.gerrit.core.remote.PatchSetRemoteFactoryTest)
Response message:
remote: 
remote: Processing changes: new: 1, refs: 1        
remote: Processing changes: new: 1, refs: 1, done            
remote: 
remote: New Changes:        
remote:   http://lvps92-51-163-75.dedicated.hosteurope.de/gerrit-2.10/385 Test Change I5663a19f9222b5f46dbacf794bb00f24968e5ac9        
remote: 
To http:\\tests:mylyntest@mylyn.org\gerrit-2.10\org.eclipse.mylyn.test\
 * [new branch]      HEAD -> refs\for\master

######
Running testPatchSetFiles(org.eclipse.mylyn.internal.gerrit.core.remote.PatchSetRemoteFactoryTest)
Response message:
remote: 
remote: Processing changes: new: 1, refs: 1        
remote: Processing changes: new: 1, refs: 1, done            
remote: 
remote: New Changes:        
remote:   http://lvps92-51-163-75.dedicated.hosteurope.de/gerrit-2.10/386 Test Change I7daff0b4bdfd100978006dbf93b2658549723dba        
remote: 
To http:\\tests:mylyntest@mylyn.org\gerrit-2.10\org.eclipse.mylyn.test\
 * [new branch]      HEAD -> refs\for\master

######
Response message:
remote: 
remote: Processing changes: updated: 1, refs: 1        
remote: Processing changes: updated: 1, refs: 1, done            
remote: 
remote: Updated Changes:        
remote:   http://lvps92-51-163-75.dedicated.hosteurope.de/gerrit-2.10/386 Test Change I7daff0b4bdfd100978006dbf93b2658549723dba        
remote: 
To http:\\tests:mylyntest@mylyn.org\gerrit-2.10\org.eclipse.mylyn.test\
 * [new branch]      HEAD -> refs\for\master

######
Response message:
remote: 
remote: Processing changes: updated: 1, refs: 1        
remote: Processing changes: updated: 1, refs: 1        
remote: Processing changes: updated: 1, refs: 1, done            
remote: 
remote: Updated Changes:        
remote:   http://lvps92-51-163-75.dedicated.hosteurope.de/gerrit-2.10/386 Test Change I7daff0b4bdfd100978006dbf93b2658549723dba        
remote: 
To http:\\tests:mylyntest@mylyn.org\gerrit-2.10\org.eclipse.mylyn.test\
 * [new branch]      HEAD -> refs\for\master

######
Running testCompareRenamedImage(org.eclipse.mylyn.internal.gerrit.core.remote.PatchSetRemoteFactoryTest)
Response message:
remote: 
remote: Processing changes: new: 1, refs: 1        
remote: Processing changes: new: 1, refs: 1, done            
remote: 
remote: New Changes:        
remote:   http://lvps92-51-163-75.dedicated.hosteurope.de/gerrit-2.10/387 Test Change Iac933c0348b383c3e1eda984ee46ad67df47c826        
remote: 
To http:\\tests:mylyntest@mylyn.org\gerrit-2.10\org.eclipse.mylyn.test\
 * [new branch]      HEAD -> refs\for\master

######
Response message:
remote: 
remote: Processing changes: updated: 1, refs: 1        
remote: Processing changes: updated: 1, refs: 1, done            
remote: 
remote: Updated Changes:        
remote:   http://lvps92-51-163-75.dedicated.hosteurope.de/gerrit-2.10/387 Test Change Iac933c0348b383c3e1eda984ee46ad67df47c826        
remote: 
To http:\\tests:mylyntest@mylyn.org\gerrit-2.10\org.eclipse.mylyn.test\
 * [new branch]      HEAD -> refs\for\master

######
Response message:
remote: 
remote: Processing changes: updated: 1, refs: 1        
remote: Processing changes: updated: 1, refs: 1, done            
remote: 
remote: Updated Changes:        
remote:   http://lvps92-51-163-75.dedicated.hosteurope.de/gerrit-2.10/387 Test Change Iac933c0348b383c3e1eda984ee46ad67df47c826        
remote: 
To http:\\tests:mylyntest@mylyn.org\gerrit-2.10\org.eclipse.mylyn.test\
 * [new branch]      HEAD -> refs\for\master

######
Running testFetchBinaryContent(org.eclipse.mylyn.internal.gerrit.core.remote.PatchSetRemoteFactoryTest)
Response message:
remote: 
remote: Processing changes: new: 1, refs: 1        
remote: Processing changes: new: 1, refs: 1, done            
remote: 
remote: New Changes:        
remote:   http://lvps92-51-163-75.dedicated.hosteurope.de/gerrit-2.10/388 Test Change I25a105551f5c105cc34443f6bf51b3ccc23b1ee9        
remote: 
To http:\\tests:mylyntest@mylyn.org\gerrit-2.10\org.eclipse.mylyn.test\
 * [new branch]      HEAD -> refs\for\master

######
Response message:
remote: 
remote: Processing changes: updated: 1, refs: 1        
remote: Processing changes: updated: 1, refs: 1, done            
remote: 
remote: Updated Changes:        
remote:   http://lvps92-51-163-75.dedicated.hosteurope.de/gerrit-2.10/388 Test Change I25a105551f5c105cc34443f6bf51b3ccc23b1ee9        
remote: 
To http:\\tests:mylyntest@mylyn.org\gerrit-2.10\org.eclipse.mylyn.test\
 * [new branch]      HEAD -> refs\for\master

######
Running testGetPatchSetPublishDetailOfDraftIffAdmin(org.eclipse.mylyn.internal.gerrit.core.remote.PatchSetDetailRemoteFactoryTest)
Response message:
remote: 
remote: Processing changes: new: 1, refs: 1        
remote: Processing changes: new: 1, refs: 1, done            
remote: 
remote: New Changes:        
remote:   http://lvps92-51-163-75.dedicated.hosteurope.de/gerrit-2.10/389 Test Change I292e83688522671a905386344cf788f4b38db867 [DRAFT]        
remote: 
To http:\\admin:mylyntest@mylyn.org\gerrit-2.10\org.eclipse.mylyn.test\
 * [new branch]      HEAD -> refs\drafts\master

######
Running testUserHasNoAccessToAdminDraft(org.eclipse.mylyn.internal.gerrit.core.remote.PatchSetDetailRemoteFactoryTest)
Response message:
remote: 
remote: Processing changes: new: 1, refs: 1        
remote: Processing changes: new: 1, refs: 1        
remote: Processing changes: new: 1, refs: 1        
remote: Processing changes: new: 1, refs: 1, done            
remote: 
remote: New Changes:        
remote:   http://lvps92-51-163-75.dedicated.hosteurope.de/gerrit-2.10/390 Test Change I60d5b5fde15b043622a6af07632eb5d1189ac5cb [DRAFT]        
remote: 
To http:\\admin:mylyntest@mylyn.org\gerrit-2.10\org.eclipse.mylyn.test\
 * [new branch]      HEAD -> refs\drafts\master

######
Response message:
remote: 
remote: Processing changes: updated: 1, refs: 1        
remote: Processing changes: updated: 1, refs: 1        
remote: Processing changes: updated: 1, refs: 1, done            
remote: 
remote: Updated Changes:        
remote:   http://lvps92-51-163-75.dedicated.hosteurope.de/gerrit-2.10/390 Test Change I60d5b5fde15b043622a6af07632eb5d1189ac5cb        
remote: 
To http:\\admin:mylyntest@mylyn.org\gerrit-2.10\org.eclipse.mylyn.test\
 * [new branch]      HEAD -> refs\for\master

######
Running testGetChangeDetailOfDraftIffAdmin(org.eclipse.mylyn.internal.gerrit.core.remote.PatchSetDetailRemoteFactoryTest)
Response message:
remote: 
remote: Processing changes: new: 1, refs: 1        
remote: Processing changes: new: 1, refs: 1, done            
remote: 
remote: New Changes:        
remote:   http://lvps92-51-163-75.dedicated.hosteurope.de/gerrit-2.10/391 Test Change I4d74ee21bcf9358b7cd79780402183037646dc06 [DRAFT]        
remote: 
To http:\\admin:mylyntest@mylyn.org\gerrit-2.10\org.eclipse.mylyn.test\
 * [new branch]      HEAD -> refs\drafts\master

######
Running testUserHasAccessToAdminDraft(org.eclipse.mylyn.internal.gerrit.core.remote.PatchSetDetailRemoteFactoryTest)
Response message:
remote: 
remote: Processing changes: new: 1, refs: 1        
remote: Processing changes: new: 1, refs: 1        
remote: Processing changes: new: 1, refs: 1, done            
remote: 
remote: New Changes:        
remote:   http://lvps92-51-163-75.dedicated.hosteurope.de/gerrit-2.10/392 Test Change Ie8b85a6d44625e57302d15bdd856131afecab6ad [DRAFT]        
remote: 
To http:\\admin:mylyntest@mylyn.org\gerrit-2.10\org.eclipse.mylyn.test\
 * [new branch]      HEAD -> refs\drafts\master

######
Response message:
remote: 
remote: Processing changes: updated: 1, refs: 1        
remote: Processing changes: updated: 1, refs: 1, done            
remote: 
remote: Updated Changes:        
remote:   http://lvps92-51-163-75.dedicated.hosteurope.de/gerrit-2.10/392 Test Change Ie8b85a6d44625e57302d15bdd856131afecab6ad        
remote: 
To http:\\admin:mylyntest@mylyn.org\gerrit-2.10\org.eclipse.mylyn.test\
 * [new branch]      HEAD -> refs\for\master

######
Running testOpenUrl(org.eclipse.mylyn.gerrit.tests.ui.GerritUrlHandlerTest)
Skipping GerritUrlHandlerTest.testOpenUrl() due to lack of anonymous access
Running testOpenUrlInvalid(org.eclipse.mylyn.gerrit.tests.ui.GerritUrlHandlerTest)
Skipping GerritUrlHandlerTest.testOpenUrlInvalid() due to lack of browser support
Running testIsSupported(org.eclipse.mylyn.gerrit.tests.core.client.GerritCapabilitiesTest)
Running done(org.eclipse.mylyn.tests.util.TestFixture$Activation)

0 out of 147 tests failed
Tests run: 147, Failures: 0, Errors: 0, Skipped: 0, Time elapsed: 626.039 sec

Results :

Tests run: 147, Failures: 0, Errors: 0, Skipped: 0

[INFO] All tests passed!
[INFO]                                                                         
[INFO] ------------------------------------------------------------------------
[INFO] Building org.eclipse.mylyn.gerrit.ui.tests 2.11.0-SNAPSHOT
[INFO] ------------------------------------------------------------------------
[INFO] 
[INFO] --- maven-clean-plugin:2.4.1:clean (default-clean) @ org.eclipse.mylyn.gerrit.ui.tests ---
[INFO] 
[INFO] --- tycho-packaging-plugin:0.21.0:build-qualifier (default-build-qualifier) @ org.eclipse.mylyn.gerrit.ui.tests ---
[INFO] The project's OSGi version is 2.11.0.x20160421-1821
[INFO] 
[INFO] --- tycho-packaging-plugin:0.21.0:validate-id (default-validate-id) @ org.eclipse.mylyn.gerrit.ui.tests ---
[INFO] 
[INFO] --- tycho-packaging-plugin:0.21.0:validate-version (default-validate-version) @ org.eclipse.mylyn.gerrit.ui.tests ---
[INFO] 
[INFO] --- jacoco-maven-plugin:0.5.6.201201232323:prepare-agent (default) @ org.eclipse.mylyn.gerrit.ui.tests ---
[INFO] Skipping JaCoCo execution
[INFO] 
[INFO] --- maven-resources-plugin:2.4.1:resources (default-resources) @ org.eclipse.mylyn.gerrit.ui.tests ---
[INFO] Using 'ISO-8859-1' encoding to copy filtered resources.
[INFO] skip non existing resourceDirectory /jobs/genie.mylyn/mylyn-test-build/workspace/org.eclipse.mylyn.reviews/org.eclipse.mylyn.gerrit.ui.tests/src/main/resources
[INFO] 
[INFO] --- tycho-compiler-plugin:0.21.0:compile (default-compile) @ org.eclipse.mylyn.gerrit.ui.tests ---
[INFO] Compiling 9 source files to /jobs/genie.mylyn/mylyn-test-build/workspace/org.eclipse.mylyn.reviews/org.eclipse.mylyn.gerrit.ui.tests/target/classes
[INFO] 
[INFO] --- tycho-source-plugin:0.21.0:plugin-source (attach-source) @ org.eclipse.mylyn.gerrit.ui.tests ---
[WARNING] bundle localization file /jobs/genie.mylyn/mylyn-test-build/workspace/org.eclipse.mylyn.reviews/org.eclipse.mylyn.gerrit.ui.tests/plugin.properties not found
[INFO] Building jar: /jobs/genie.mylyn/mylyn-test-build/workspace/org.eclipse.mylyn.reviews/org.eclipse.mylyn.gerrit.ui.tests/target/org.eclipse.mylyn.gerrit.ui.tests-2.11.0-SNAPSHOT-sources.jar
[INFO] 
[INFO] --- maven-resources-plugin:2.4.1:testResources (default-testResources) @ org.eclipse.mylyn.gerrit.ui.tests ---
[INFO] Using 'ISO-8859-1' encoding to copy filtered resources.
[INFO] skip non existing resourceDirectory /jobs/genie.mylyn/mylyn-test-build/workspace/org.eclipse.mylyn.reviews/org.eclipse.mylyn.gerrit.ui.tests/src/test/resources
[INFO] 
[INFO] --- target-platform-configuration:0.21.0:target-platform (default-target-platform) @ org.eclipse.mylyn.gerrit.ui.tests ---
[INFO] 
[INFO] --- tycho-packaging-plugin:0.21.0:package-plugin (default-package-plugin) @ org.eclipse.mylyn.gerrit.ui.tests ---
[INFO] Building jar: /jobs/genie.mylyn/mylyn-test-build/workspace/org.eclipse.mylyn.reviews/org.eclipse.mylyn.gerrit.ui.tests/target/org.eclipse.mylyn.gerrit.ui.tests-2.11.0-SNAPSHOT.jar
[INFO] 
[INFO] --- tycho-p2-plugin:0.21.0:p2-metadata-default (default-p2-metadata-default) @ org.eclipse.mylyn.gerrit.ui.tests ---
[INFO] 
[INFO] --- tycho-surefire-plugin:0.21.0:test (default-test) @ org.eclipse.mylyn.gerrit.ui.tests ---
[INFO] Expected eclipse log file: /jobs/genie.mylyn/mylyn-test-build/workspace/org.eclipse.mylyn.reviews/org.eclipse.mylyn.gerrit.ui.tests/target/work/data/.metadata/.log
[INFO] Command line:
	[/opt/public/common/jdk1.8.0_51.x64/jre/bin/java, -Dosgi.noShutdown=false, -Dosgi.os=linux, -Dosgi.ws=gtk, -Dosgi.arch=x86_64, -Xmx512m, -XX:MaxPermSize=256m, -Djava.io.tmpdir=/jobs/genie.mylyn/mylyn-test-build/workspace/org.eclipse.mylyn.reviews/org.eclipse.mylyn.gerrit.ui.tests/target, -ea, -Dmylyn.credentials=/shared/mylyn/.credentials.properties, -Dorg.eclipse.mylyn.wikitext.tests.disableOutput=true, -Dhttp.proxyHost=proxy.eclipse.org, -Dhttp.proxyPort=9898, -Dhttps.proxyHost=proxy.eclipse.org, -Dhttps.proxyPort=9898, -DhttpnonProxyHosts=*.eclipse.org, -Dorg.eclipse.mylyn.gerrit.tests.alternate.push=true, -Dosgi.clean=true, -jar, /jobs/genie.mylyn/mylyn-test-build/workspace/.maven/repo/p2/osgi/bundle/org.eclipse.equinox.launcher/1.3.100.v20150511-1540/org.eclipse.equinox.launcher-1.3.100.v20150511-1540.jar, -data, /jobs/genie.mylyn/mylyn-test-build/workspace/org.eclipse.mylyn.reviews/org.eclipse.mylyn.gerrit.ui.tests/target/work/data, -install, /jobs/genie.mylyn/mylyn-test-build/workspace/org.eclipse.mylyn.reviews/org.eclipse.mylyn.gerrit.ui.tests/target/work, -configuration, /jobs/genie.mylyn/mylyn-test-build/workspace/org.eclipse.mylyn.reviews/org.eclipse.mylyn.gerrit.ui.tests/target/work/configuration, -application, org.eclipse.tycho.surefire.osgibooter.uitest, -testproperties, /jobs/genie.mylyn/mylyn-test-build/workspace/org.eclipse.mylyn.reviews/org.eclipse.mylyn.gerrit.ui.tests/target/surefire.properties, -testApplication, org.eclipse.ui.ide.workbench, -product, org.eclipse.sdk.ide, -eclipse.keyring, /jobs/genie.mylyn/mylyn-test-build/workspace/org.eclipse.mylyn.reviews/org.eclipse.mylyn.gerrit.ui.tests/target/.eclipse.keyring, -eclipse.password, /jobs/genie.mylyn/mylyn-test-build/workspace/org.eclipse.mylyn.reviews/org.eclipse.mylyn.gerrit.ui.tests/target/../../.gitignore]
Java HotSpot(TM) 64-Bit Server VM warning: ignoring option MaxPermSize=256m; support was removed in 8.0
[2016-05-30T8-5-26] Status WARNING: org.eclipse.mylyn.tasks.ui code=0 No search provider was registered. Tasks search is not available. null, 

-------------------------------------------------------
 T E S T S
-------------------------------------------------------
Running org.eclipse.mylyn.internal.gerrit.ui.operations.BranchProposalProviderTest
Tests run: 7, Failures: 0, Errors: 0, Skipped: 0, Time elapsed: 0.028 sec
Running org.eclipse.mylyn.internal.gerrit.ui.operations.AddReviewersDialogTest
Tests run: 7, Failures: 0, Errors: 0, Skipped: 0, Time elapsed: 0.201 sec
Running org.eclipse.mylyn.internal.gerrit.ui.ChangeIdHyperlinkTest
Tests run: 9, Failures: 0, Errors: 0, Skipped: 0, Time elapsed: 0.006 sec
Running org.eclipse.mylyn.internal.gerrit.ui.GerritUrlHandlerTest
Tests run: 28, Failures: 0, Errors: 0, Skipped: 0, Time elapsed: 0.207 sec
Running org.eclipse.mylyn.internal.gerrit.ui.editor.GerritTaskEditorTest
[2016-05-30T8-5-28] Status ERROR: org.eclipse.mylyn.tasks.ui code=0 Error opening task org.eclipse.core.runtime.CoreException: Task data at "/jobs/genie.mylyn/mylyn-test-build/workspace/org.eclipse.mylyn.reviews/org.eclipse.mylyn.gerrit.ui.tests/target/work/data/.metadata/.mylyn/tasks/org.eclipse.mylyn.gerrit-url/offline/1.zip" not found, Exception:
org.eclipse.core.runtime.CoreException: Task data at "/jobs/genie.mylyn/mylyn-test-build/workspace/org.eclipse.mylyn.reviews/org.eclipse.mylyn.gerrit.ui.tests/target/work/data/.metadata/.mylyn/tasks/org.eclipse.mylyn.gerrit-url/offline/1.zip" not found
	at org.eclipse.mylyn.internal.tasks.core.data.TaskDataManager$1.execute(TaskDataManager.java:124)
	at org.eclipse.mylyn.internal.tasks.core.TaskList.run(TaskList.java:679)
	at org.eclipse.mylyn.internal.tasks.core.data.TaskDataManager.getWorkingCopy(TaskDataManager.java:119)
	at org.eclipse.mylyn.internal.tasks.core.data.TaskDataManager.getWorkingCopy(TaskDataManager.java:110)
	at org.eclipse.mylyn.tasks.ui.editors.AbstractTaskEditorPage.createModel(AbstractTaskEditorPage.java:745)
	at org.eclipse.mylyn.tasks.ui.editors.AbstractTaskEditorPage.initModel(AbstractTaskEditorPage.java:1302)
	at org.eclipse.mylyn.tasks.ui.editors.AbstractTaskEditorPage.init(AbstractTaskEditorPage.java:1294)
	at org.eclipse.mylyn.reviews.ui.spi.editor.AbstractReviewTaskEditorPage.access$1(AbstractReviewTaskEditorPage.java:1)
	at org.eclipse.mylyn.reviews.ui.spi.editor.AbstractReviewTaskEditorPage.init(AbstractReviewTaskEditorPage.java:71)
	at org.eclipse.ui.forms.editor.FormEditor.registerPage(FormEditor.java:657)
	at org.eclipse.ui.forms.editor.FormEditor.configurePage(FormEditor.java:348)
	at org.eclipse.ui.forms.editor.FormEditor.addPage(FormEditor.java:190)
	at org.eclipse.mylyn.tasks.ui.editors.TaskEditor.addPages(TaskEditor.java:415)
	at org.eclipse.ui.forms.editor.FormEditor.createPages(FormEditor.java:138)
	at org.eclipse.ui.forms.editor.SharedHeaderFormEditor.createPages(SharedHeaderFormEditor.java:98)
	at org.eclipse.mylyn.tasks.ui.editors.TaskEditor.createPages(TaskEditor.java:200)
	at org.eclipse.ui.part.MultiPageEditorPart.createPartControl(MultiPageEditorPart.java:363)
	at org.eclipse.ui.internal.e4.compatibility.CompatibilityPart.createPartControl(CompatibilityPart.java:151)
	at org.eclipse.ui.internal.e4.compatibility.CompatibilityEditor.createPartControl(CompatibilityEditor.java:99)
	at org.eclipse.ui.internal.e4.compatibility.CompatibilityPart.create(CompatibilityPart.java:341)
	at sun.reflect.NativeMethodAccessorImpl.invoke0(Native Method)
	at sun.reflect.NativeMethodAccessorImpl.invoke(NativeMethodAccessorImpl.java:62)
	at sun.reflect.DelegatingMethodAccessorImpl.invoke(DelegatingMethodAccessorImpl.java:43)
	at java.lang.reflect.Method.invoke(Method.java:497)
	at org.eclipse.e4.core.internal.di.MethodRequestor.execute(MethodRequestor.java:56)
	at org.eclipse.e4.core.internal.di.InjectorImpl.processAnnotated(InjectorImpl.java:898)
	at org.eclipse.e4.core.internal.di.InjectorImpl.processAnnotated(InjectorImpl.java:879)
	at org.eclipse.e4.core.internal.di.InjectorImpl.inject(InjectorImpl.java:121)
	at org.eclipse.e4.core.internal.di.InjectorImpl.internalMake(InjectorImpl.java:345)
	at org.eclipse.e4.core.internal.di.InjectorImpl.make(InjectorImpl.java:264)
	at org.eclipse.e4.core.contexts.ContextInjectionFactory.make(ContextInjectionFactory.java:162)
	at org.eclipse.e4.ui.internal.workbench.ReflectionContributionFactory.createFromBundle(ReflectionContributionFactory.java:104)
	at org.eclipse.e4.ui.internal.workbench.ReflectionContributionFactory.doCreate(ReflectionContributionFactory.java:73)
	at org.eclipse.e4.ui.internal.workbench.ReflectionContributionFactory.create(ReflectionContributionFactory.java:55)
	at org.eclipse.e4.ui.workbench.renderers.swt.ContributedPartRenderer.createWidget(ContributedPartRenderer.java:129)
	at org.eclipse.e4.ui.internal.workbench.swt.PartRenderingEngine.createWidget(PartRenderingEngine.java:971)
	at org.eclipse.e4.ui.internal.workbench.swt.PartRenderingEngine.safeCreateGui(PartRenderingEngine.java:640)
	at org.eclipse.e4.ui.internal.workbench.swt.PartRenderingEngine.safeCreateGui(PartRenderingEngine.java:746)
	at org.eclipse.e4.ui.internal.workbench.swt.PartRenderingEngine.access$0(PartRenderingEngine.java:717)
	at org.eclipse.e4.ui.internal.workbench.swt.PartRenderingEngine$2.run(PartRenderingEngine.java:711)
	at org.eclipse.core.runtime.SafeRunner.run(SafeRunner.java:42)
	at org.eclipse.e4.ui.internal.workbench.swt.PartRenderingEngine.createGui(PartRenderingEngine.java:695)
	at org.eclipse.e4.ui.internal.workbench.PartServiceImpl$1.handleEvent(PartServiceImpl.java:99)
	at org.eclipse.e4.ui.services.internal.events.UIEventHandler$1.run(UIEventHandler.java:40)
	at org.eclipse.swt.widgets.Synchronizer.syncExec(Synchronizer.java:186)
	at org.eclipse.ui.internal.UISynchronizer.syncExec(UISynchronizer.java:145)
	at org.eclipse.swt.widgets.Display.syncExec(Display.java:4633)
	at org.eclipse.e4.ui.internal.workbench.swt.E4Application$1.syncExec(E4Application.java:211)
	at org.eclipse.e4.ui.services.internal.events.UIEventHandler.handleEvent(UIEventHandler.java:36)
	at org.eclipse.equinox.internal.event.EventHandlerWrapper.handleEvent(EventHandlerWrapper.java:197)
	at org.eclipse.equinox.internal.event.EventHandlerTracker.dispatchEvent(EventHandlerTracker.java:197)
	at org.eclipse.equinox.internal.event.EventHandlerTracker.dispatchEvent(EventHandlerTracker.java:1)
	at org.eclipse.osgi.framework.eventmgr.EventManager.dispatchEvent(EventManager.java:230)
	at org.eclipse.osgi.framework.eventmgr.ListenerQueue.dispatchEventSynchronous(ListenerQueue.java:148)
	at org.eclipse.equinox.internal.event.EventAdminImpl.dispatchEvent(EventAdminImpl.java:135)
	at org.eclipse.equinox.internal.event.EventAdminImpl.sendEvent(EventAdminImpl.java:78)
	at org.eclipse.equinox.internal.event.EventComponent.sendEvent(EventComponent.java:39)
	at org.eclipse.e4.ui.services.internal.events.EventBroker.send(EventBroker.java:85)
	at org.eclipse.e4.ui.internal.workbench.UIEventPublisher.notifyChanged(UIEventPublisher.java:59)
	at org.eclipse.emf.common.notify.impl.BasicNotifierImpl.eNotify(BasicNotifierImpl.java:374)
	at org.eclipse.e4.ui.model.application.ui.impl.ElementContainerImpl.setSelectedElement(ElementContainerImpl.java:171)
	at org.eclipse.e4.ui.internal.workbench.ModelServiceImpl.showElementInWindow(ModelServiceImpl.java:572)
	at org.eclipse.e4.ui.internal.workbench.ModelServiceImpl.bringToTop(ModelServiceImpl.java:536)
	at org.eclipse.e4.ui.internal.workbench.PartServiceImpl.delegateBringToTop(PartServiceImpl.java:724)
	at org.eclipse.e4.ui.internal.workbench.PartServiceImpl.bringToTop(PartServiceImpl.java:396)
	at org.eclipse.e4.ui.internal.workbench.PartServiceImpl.showPart(PartServiceImpl.java:1166)
	at org.eclipse.ui.internal.WorkbenchPage.busyOpenEditor(WorkbenchPage.java:3252)
	at org.eclipse.ui.internal.WorkbenchPage.access$25(WorkbenchPage.java:3167)
	at org.eclipse.ui.internal.WorkbenchPage$10.run(WorkbenchPage.java:3149)
	at org.eclipse.swt.custom.BusyIndicator.showWhile(BusyIndicator.java:70)
	at org.eclipse.ui.internal.WorkbenchPage.openEditor(WorkbenchPage.java:3144)
	at org.eclipse.ui.internal.WorkbenchPage.openEditor(WorkbenchPage.java:3108)
	at org.eclipse.ui.internal.WorkbenchPage.openEditor(WorkbenchPage.java:3089)
	at org.eclipse.mylyn.tasks.ui.TasksUiUtil.openEditor(TasksUiUtil.java:182)
	at org.eclipse.mylyn.internal.tasks.ui.util.TasksUiInternal.openTask(TasksUiInternal.java:964)
	at org.eclipse.mylyn.tasks.ui.TasksUiUtil.openTask(TasksUiUtil.java:283)
	at org.eclipse.mylyn.internal.gerrit.ui.editor.GerritTaskEditorTest.testOpenEditor(GerritTaskEditorTest.java:59)
	at sun.reflect.NativeMethodAccessorImpl.invoke0(Native Method)
	at sun.reflect.NativeMethodAccessorImpl.invoke(NativeMethodAccessorImpl.java:62)
	at sun.reflect.DelegatingMethodAccessorImpl.invoke(DelegatingMethodAccessorImpl.java:43)
	at java.lang.reflect.Method.invoke(Method.java:497)
	at org.junit.runners.model.FrameworkMethod$1.runReflectiveCall(FrameworkMethod.java:50)
	at org.junit.internal.runners.model.ReflectiveCallable.run(ReflectiveCallable.java:12)
	at org.junit.runners.model.FrameworkMethod.invokeExplosively(FrameworkMethod.java:47)
	at org.junit.internal.runners.statements.InvokeMethod.evaluate(InvokeMethod.java:17)
	at org.junit.internal.runners.statements.RunBefores.evaluate(RunBefores.java:26)
	at org.junit.internal.runners.statements.RunAfters.evaluate(RunAfters.java:27)
	at org.junit.runners.ParentRunner.runLeaf(ParentRunner.java:325)
	at org.junit.runners.BlockJUnit4ClassRunner.runChild(BlockJUnit4ClassRunner.java:78)
	at org.junit.runners.BlockJUnit4ClassRunner.runChild(BlockJUnit4ClassRunner.java:57)
	at org.junit.runners.ParentRunner$3.run(ParentRunner.java:290)
	at org.junit.runners.ParentRunner$1.schedule(ParentRunner.java:71)
	at org.junit.runners.ParentRunner.runChildren(ParentRunner.java:288)
	at org.junit.runners.ParentRunner.access$000(ParentRunner.java:58)
	at org.junit.runners.ParentRunner$2.evaluate(ParentRunner.java:268)
	at org.junit.runners.ParentRunner.run(ParentRunner.java:363)
	at org.apache.maven.surefire.junit4.JUnit4TestSet.execute(JUnit4TestSet.java:53)
	at org.apache.maven.surefire.junit4.JUnit4Provider.executeTestSet(JUnit4Provider.java:123)
	at org.apache.maven.surefire.junit4.JUnit4Provider.invoke(JUnit4Provider.java:104)
	at sun.reflect.NativeMethodAccessorImpl.invoke0(Native Method)
	at sun.reflect.NativeMethodAccessorImpl.invoke(NativeMethodAccessorImpl.java:62)
	at sun.reflect.DelegatingMethodAccessorImpl.invoke(DelegatingMethodAccessorImpl.java:43)
	at java.lang.reflect.Method.invoke(Method.java:497)
	at org.apache.maven.surefire.util.ReflectionUtils.invokeMethodWithArray(ReflectionUtils.java:164)
	at org.apache.maven.surefire.booter.ProviderFactory$ProviderProxy.invoke(ProviderFactory.java:110)
	at org.apache.maven.surefire.booter.SurefireStarter.invokeProvider(SurefireStarter.java:175)
	at org.apache.maven.surefire.booter.SurefireStarter.runSuitesInProcess(SurefireStarter.java:123)
	at org.eclipse.tycho.surefire.osgibooter.OsgiSurefireBooter.run(OsgiSurefireBooter.java:87)
	at org.eclipse.tycho.surefire.osgibooter.AbstractUITestApplication$1.run(AbstractUITestApplication.java:35)
	at org.eclipse.swt.widgets.RunnableLock.run(RunnableLock.java:35)
	at org.eclipse.swt.widgets.Synchronizer.runAsyncMessages(Synchronizer.java:135)
	at org.eclipse.swt.widgets.Display.runAsyncMessages(Display.java:3794)
	at org.eclipse.swt.widgets.Display.readAndDispatch(Display.java:3433)
	at org.eclipse.e4.ui.internal.workbench.swt.PartRenderingEngine$4.run(PartRenderingEngine.java:1127)
	at org.eclipse.core.databinding.observable.Realm.runWithDefault(Realm.java:337)
	at org.eclipse.e4.ui.internal.workbench.swt.PartRenderingEngine.run(PartRenderingEngine.java:1018)
	at org.eclipse.e4.ui.internal.workbench.E4Workbench.createAndRunUI(E4Workbench.java:156)
	at org.eclipse.ui.internal.Workbench$5.run(Workbench.java:694)
	at org.eclipse.core.databinding.observable.Realm.runWithDefault(Realm.java:337)
	at org.eclipse.ui.internal.Workbench.createAndRunWorkbench(Workbench.java:606)
	at org.eclipse.ui.PlatformUI.createAndRunWorkbench(PlatformUI.java:150)
	at org.eclipse.ui.internal.ide.application.IDEApplication.start(IDEApplication.java:139)
	at org.eclipse.tycho.surefire.osgibooter.UITestApplication.runApplication(UITestApplication.java:31)
	at org.eclipse.tycho.surefire.osgibooter.AbstractUITestApplication.run(AbstractUITestApplication.java:115)
	at org.eclipse.tycho.surefire.osgibooter.UITestApplication.start(UITestApplication.java:37)
	at org.eclipse.equinox.internal.app.EclipseAppHandle.run(EclipseAppHandle.java:196)
	at org.eclipse.core.runtime.internal.adaptor.EclipseAppLauncher.runApplication(EclipseAppLauncher.java:134)
	at org.eclipse.core.runtime.internal.adaptor.EclipseAppLauncher.start(EclipseAppLauncher.java:104)
	at org.eclipse.core.runtime.adaptor.EclipseStarter.run(EclipseStarter.java:380)
	at org.eclipse.core.runtime.adaptor.EclipseStarter.run(EclipseStarter.java:235)
	at sun.reflect.NativeMethodAccessorImpl.invoke0(Native Method)
	at sun.reflect.NativeMethodAccessorImpl.invoke(NativeMethodAccessorImpl.java:62)
	at sun.reflect.DelegatingMethodAccessorImpl.invoke(DelegatingMethodAccessorImpl.java:43)
	at java.lang.reflect.Method.invoke(Method.java:497)
	at org.eclipse.equinox.launcher.Main.invokeFramework(Main.java:669)
	at org.eclipse.equinox.launcher.Main.basicRun(Main.java:608)
	at org.eclipse.equinox.launcher.Main.run(Main.java:1515)
	at org.eclipse.equinox.launcher.Main.main(Main.java:1488)

Tests run: 1, Failures: 0, Errors: 0, Skipped: 0, Time elapsed: 0.358 sec
Running org.eclipse.mylyn.internal.gerrit.ui.editor.GerritTaskEditorPageTest
Tests run: 4, Failures: 0, Errors: 0, Skipped: 0, Time elapsed: 0.382 sec
Running org.eclipse.mylyn.internal.gerrit.ui.GerritCompareUiTest
Tests run: 5, Failures: 0, Errors: 0, Skipped: 0, Time elapsed: 0.076 sec
Running org.eclipse.mylyn.internal.gerrit.ui.GerritRepositorySettingsPageTest
Tests run: 2, Failures: 0, Errors: 0, Skipped: 0, Time elapsed: 0.386 sec
Running org.eclipse.mylyn.internal.gerrit.ui.GerritCommentLinkDetectorTest
Tests run: 8, Failures: 0, Errors: 0, Skipped: 0, Time elapsed: 0.007 sec

Results :

Tests run: 71, Failures: 0, Errors: 0, Skipped: 0

[2016-05-30T8-5-30] Status ERROR: org.eclipse.mylyn.gerrit.core code=1 Problem while retrieving Gerrit review.: Bad Gateway null, 
[2016-05-30T8-5-30] Status ERROR: org.eclipse.mylyn.gerrit.core code=1 Problem while retrieving Gerrit review.: Bad Gateway null, 
[2016-05-30T8-5-30] Status ERROR: org.eclipse.mylyn.gerrit.core code=1 Problem while retrieving Gerrit review.: Bad Gateway null, 
[INFO] All tests passed!
[INFO]                                                                         
[INFO] ------------------------------------------------------------------------
[INFO] Building org.eclipse.mylyn.reviews.core.tests 2.11.0-SNAPSHOT
[INFO] ------------------------------------------------------------------------
[INFO] 
[INFO] --- maven-clean-plugin:2.4.1:clean (default-clean) @ org.eclipse.mylyn.reviews.core.tests ---
[INFO] 
[INFO] --- tycho-packaging-plugin:0.21.0:build-qualifier (default-build-qualifier) @ org.eclipse.mylyn.reviews.core.tests ---
[INFO] The project's OSGi version is 2.11.0.x20160421-1821
[INFO] 
[INFO] --- tycho-packaging-plugin:0.21.0:validate-id (default-validate-id) @ org.eclipse.mylyn.reviews.core.tests ---
[INFO] 
[INFO] --- tycho-packaging-plugin:0.21.0:validate-version (default-validate-version) @ org.eclipse.mylyn.reviews.core.tests ---
[INFO] 
[INFO] --- jacoco-maven-plugin:0.5.6.201201232323:prepare-agent (default) @ org.eclipse.mylyn.reviews.core.tests ---
[INFO] Skipping JaCoCo execution
[INFO] 
[INFO] --- maven-resources-plugin:2.4.1:resources (default-resources) @ org.eclipse.mylyn.reviews.core.tests ---
[INFO] Using 'ISO-8859-1' encoding to copy filtered resources.
[INFO] skip non existing resourceDirectory /jobs/genie.mylyn/mylyn-test-build/workspace/org.eclipse.mylyn.reviews/org.eclipse.mylyn.reviews.core.tests/src/main/resources
[INFO] 
[INFO] --- tycho-compiler-plugin:0.21.0:compile (default-compile) @ org.eclipse.mylyn.reviews.core.tests ---
[INFO] Compiling 16 source files to /jobs/genie.mylyn/mylyn-test-build/workspace/org.eclipse.mylyn.reviews/org.eclipse.mylyn.reviews.core.tests/target/classes
[INFO] 
[INFO] --- tycho-source-plugin:0.21.0:plugin-source (attach-source) @ org.eclipse.mylyn.reviews.core.tests ---
[WARNING] bundle localization file /jobs/genie.mylyn/mylyn-test-build/workspace/org.eclipse.mylyn.reviews/org.eclipse.mylyn.reviews.core.tests/plugin.properties not found
[INFO] Building jar: /jobs/genie.mylyn/mylyn-test-build/workspace/org.eclipse.mylyn.reviews/org.eclipse.mylyn.reviews.core.tests/target/org.eclipse.mylyn.reviews.core.tests-2.11.0-SNAPSHOT-sources.jar
[INFO] 
[INFO] --- maven-resources-plugin:2.4.1:testResources (default-testResources) @ org.eclipse.mylyn.reviews.core.tests ---
[INFO] Using 'ISO-8859-1' encoding to copy filtered resources.
[INFO] skip non existing resourceDirectory /jobs/genie.mylyn/mylyn-test-build/workspace/org.eclipse.mylyn.reviews/org.eclipse.mylyn.reviews.core.tests/src/test/resources
[INFO] 
[INFO] --- target-platform-configuration:0.21.0:target-platform (default-target-platform) @ org.eclipse.mylyn.reviews.core.tests ---
[INFO] 
[INFO] --- tycho-packaging-plugin:0.21.0:package-plugin (default-package-plugin) @ org.eclipse.mylyn.reviews.core.tests ---
[INFO] Building jar: /jobs/genie.mylyn/mylyn-test-build/workspace/org.eclipse.mylyn.reviews/org.eclipse.mylyn.reviews.core.tests/target/org.eclipse.mylyn.reviews.core.tests-2.11.0-SNAPSHOT.jar
[INFO] 
[INFO] --- tycho-p2-plugin:0.21.0:p2-metadata-default (default-p2-metadata-default) @ org.eclipse.mylyn.reviews.core.tests ---
[INFO] 
[INFO] --- tycho-surefire-plugin:0.21.0:test (default-test) @ org.eclipse.mylyn.reviews.core.tests ---
[INFO] Expected eclipse log file: /jobs/genie.mylyn/mylyn-test-build/workspace/org.eclipse.mylyn.reviews/org.eclipse.mylyn.reviews.core.tests/target/work/data/.metadata/.log
[INFO] Command line:
	[/opt/public/common/jdk1.8.0_51.x64/jre/bin/java, -Dosgi.noShutdown=false, -Dosgi.os=linux, -Dosgi.ws=gtk, -Dosgi.arch=x86_64, -Xmx512m, -XX:MaxPermSize=256m, -Djava.io.tmpdir=/jobs/genie.mylyn/mylyn-test-build/workspace/org.eclipse.mylyn.reviews/org.eclipse.mylyn.reviews.core.tests/target, -ea, -Dmylyn.credentials=/shared/mylyn/.credentials.properties, -Dorg.eclipse.mylyn.wikitext.tests.disableOutput=true, -Dhttp.proxyHost=proxy.eclipse.org, -Dhttp.proxyPort=9898, -Dhttps.proxyHost=proxy.eclipse.org, -Dhttps.proxyPort=9898, -DhttpnonProxyHosts=*.eclipse.org, -Dorg.eclipse.mylyn.gerrit.tests.alternate.push=true, -Dosgi.clean=true, -jar, /jobs/genie.mylyn/mylyn-test-build/workspace/.maven/repo/p2/osgi/bundle/org.eclipse.equinox.launcher/1.3.100.v20150511-1540/org.eclipse.equinox.launcher-1.3.100.v20150511-1540.jar, -data, /jobs/genie.mylyn/mylyn-test-build/workspace/org.eclipse.mylyn.reviews/org.eclipse.mylyn.reviews.core.tests/target/work/data, -install, /jobs/genie.mylyn/mylyn-test-build/workspace/org.eclipse.mylyn.reviews/org.eclipse.mylyn.reviews.core.tests/target/work, -configuration, /jobs/genie.mylyn/mylyn-test-build/workspace/org.eclipse.mylyn.reviews/org.eclipse.mylyn.reviews.core.tests/target/work/configuration, -application, org.eclipse.tycho.surefire.osgibooter.uitest, -testproperties, /jobs/genie.mylyn/mylyn-test-build/workspace/org.eclipse.mylyn.reviews/org.eclipse.mylyn.reviews.core.tests/target/surefire.properties, -testApplication, org.eclipse.ui.ide.workbench, -product, org.eclipse.sdk.ide, -eclipse.keyring, /jobs/genie.mylyn/mylyn-test-build/workspace/org.eclipse.mylyn.reviews/org.eclipse.mylyn.reviews.core.tests/target/.eclipse.keyring, -eclipse.password, /jobs/genie.mylyn/mylyn-test-build/workspace/org.eclipse.mylyn.reviews/org.eclipse.mylyn.reviews.core.tests/target/../../.gitignore]
Java HotSpot(TM) 64-Bit Server VM warning: ignoring option MaxPermSize=256m; support was removed in 8.0

-------------------------------------------------------
 T E S T S
-------------------------------------------------------
Running org.eclipse.mylyn.reviews.core.spi.remote.emf.RemoteServiceTest
Tests run: 6, Failures: 0, Errors: 0, Skipped: 0, Time elapsed: 0.074 sec
Running org.eclipse.mylyn.reviews.core.spi.remote.emf.RemoteEmfFactoryTest
Tests run: 19, Failures: 0, Errors: 0, Skipped: 0, Time elapsed: 3.107 sec
Running org.eclipse.mylyn.reviews.core.spi.remote.emf.RemoteEmfObserverTest
Tests run: 6, Failures: 0, Errors: 0, Skipped: 0, Time elapsed: 1.336 sec
Running org.eclipse.mylyn.reviews.core.spi.remote.AbstractDataLocatorTest
Tests run: 9, Failures: 0, Errors: 0, Skipped: 0, Time elapsed: 0.02 sec
Running org.eclipse.mylyn.reviews.core.spi.remote.ReviewsDataLocatorTest
Tests run: 2, Failures: 0, Errors: 0, Skipped: 0, Time elapsed: 0.015 sec
Running org.eclipse.mylyn.reviews.core.model.IndexedTest
Tests run: 2, Failures: 0, Errors: 0, Skipped: 0, Time elapsed: 0.009 sec
Running org.eclipse.mylyn.reviews.core.model.CommentContainerTest
Tests run: 17, Failures: 0, Errors: 0, Skipped: 0, Time elapsed: 0.027 sec
Running org.eclipse.mylyn.reviews.internal.core.TaskReviewMappingStoreTest
Tests run: 9, Failures: 0, Errors: 0, Skipped: 0, Time elapsed: 0.616 sec
Running org.eclipse.mylyn.reviews.internal.core.ReviewFileCommentsMapperTest
Tests run: 3, Failures: 0, Errors: 0, Skipped: 0, Time elapsed: 0.051 sec
Running org.eclipse.mylyn.reviews.internal.core.TaskBuildStatusMapperTest
Tests run: 4, Failures: 0, Errors: 0, Skipped: 0, Time elapsed: 0.012 sec

Results :

Tests run: 77, Failures: 0, Errors: 0, Skipped: 0

[INFO] All tests passed!
[INFO]                                                                         
[INFO] ------------------------------------------------------------------------
[INFO] Building org.eclipse.mylyn.reviews.tests 2.11.0-SNAPSHOT
[INFO] ------------------------------------------------------------------------
[INFO] 
[INFO] --- maven-clean-plugin:2.4.1:clean (default-clean) @ org.eclipse.mylyn.reviews.tests ---
[INFO] 
[INFO] --- tycho-packaging-plugin:0.21.0:build-qualifier (default-build-qualifier) @ org.eclipse.mylyn.reviews.tests ---
[INFO] The project's OSGi version is 2.11.0.x20160421-1821
[INFO] 
[INFO] --- tycho-packaging-plugin:0.21.0:validate-id (default-validate-id) @ org.eclipse.mylyn.reviews.tests ---
[INFO] 
[INFO] --- tycho-packaging-plugin:0.21.0:validate-version (default-validate-version) @ org.eclipse.mylyn.reviews.tests ---
[INFO] 
[INFO] --- jacoco-maven-plugin:0.5.6.201201232323:prepare-agent (default) @ org.eclipse.mylyn.reviews.tests ---
[INFO] Skipping JaCoCo execution
[INFO] 
[INFO] --- maven-resources-plugin:2.4.1:resources (default-resources) @ org.eclipse.mylyn.reviews.tests ---
[INFO] Using 'ISO-8859-1' encoding to copy filtered resources.
[INFO] skip non existing resourceDirectory /jobs/genie.mylyn/mylyn-test-build/workspace/org.eclipse.mylyn.reviews/org.eclipse.mylyn.reviews.tests/src/main/resources
[INFO] 
[INFO] --- tycho-compiler-plugin:0.21.0:compile (default-compile) @ org.eclipse.mylyn.reviews.tests ---
[INFO] Compiling 8 source files to /jobs/genie.mylyn/mylyn-test-build/workspace/org.eclipse.mylyn.reviews/org.eclipse.mylyn.reviews.tests/target/classes
[INFO] 
[INFO] --- tycho-source-plugin:0.21.0:plugin-source (attach-source) @ org.eclipse.mylyn.reviews.tests ---
[WARNING] bundle localization file /jobs/genie.mylyn/mylyn-test-build/workspace/org.eclipse.mylyn.reviews/org.eclipse.mylyn.reviews.tests/plugin.properties not found
[INFO] Building jar: /jobs/genie.mylyn/mylyn-test-build/workspace/org.eclipse.mylyn.reviews/org.eclipse.mylyn.reviews.tests/target/org.eclipse.mylyn.reviews.tests-2.11.0-SNAPSHOT-sources.jar
[INFO] 
[INFO] --- maven-resources-plugin:2.4.1:testResources (default-testResources) @ org.eclipse.mylyn.reviews.tests ---
[INFO] Using 'ISO-8859-1' encoding to copy filtered resources.
[INFO] skip non existing resourceDirectory /jobs/genie.mylyn/mylyn-test-build/workspace/org.eclipse.mylyn.reviews/org.eclipse.mylyn.reviews.tests/src/test/resources
[INFO] 
[INFO] --- target-platform-configuration:0.21.0:target-platform (default-target-platform) @ org.eclipse.mylyn.reviews.tests ---
[INFO] 
[INFO] --- tycho-packaging-plugin:0.21.0:package-plugin (default-package-plugin) @ org.eclipse.mylyn.reviews.tests ---
[INFO] Building jar: /jobs/genie.mylyn/mylyn-test-build/workspace/org.eclipse.mylyn.reviews/org.eclipse.mylyn.reviews.tests/target/org.eclipse.mylyn.reviews.tests-2.11.0-SNAPSHOT.jar
[INFO] 
[INFO] --- tycho-p2-plugin:0.21.0:p2-metadata-default (default-p2-metadata-default) @ org.eclipse.mylyn.reviews.tests ---
[INFO] 
[INFO] --- tycho-surefire-plugin:0.21.0:test (default-test) @ org.eclipse.mylyn.reviews.tests ---
[INFO] Expected eclipse log file: /jobs/genie.mylyn/mylyn-test-build/workspace/org.eclipse.mylyn.reviews/org.eclipse.mylyn.reviews.tests/target/work/data/.metadata/.log
[INFO] Command line:
	[/opt/public/common/jdk1.8.0_51.x64/jre/bin/java, -Dosgi.noShutdown=false, -Dosgi.os=linux, -Dosgi.ws=gtk, -Dosgi.arch=x86_64, -Xmx512m, -XX:MaxPermSize=256m, -Djava.io.tmpdir=/jobs/genie.mylyn/mylyn-test-build/workspace/org.eclipse.mylyn.reviews/org.eclipse.mylyn.reviews.tests/target, -ea, -Dmylyn.credentials=/shared/mylyn/.credentials.properties, -Dorg.eclipse.mylyn.wikitext.tests.disableOutput=true, -Dhttp.proxyHost=proxy.eclipse.org, -Dhttp.proxyPort=9898, -Dhttps.proxyHost=proxy.eclipse.org, -Dhttps.proxyPort=9898, -DhttpnonProxyHosts=*.eclipse.org, -Dorg.eclipse.mylyn.gerrit.tests.alternate.push=true, -Dosgi.clean=true, -jar, /jobs/genie.mylyn/mylyn-test-build/workspace/.maven/repo/p2/osgi/bundle/org.eclipse.equinox.launcher/1.3.100.v20150511-1540/org.eclipse.equinox.launcher-1.3.100.v20150511-1540.jar, -data, /jobs/genie.mylyn/mylyn-test-build/workspace/org.eclipse.mylyn.reviews/org.eclipse.mylyn.reviews.tests/target/work/data, -install, /jobs/genie.mylyn/mylyn-test-build/workspace/org.eclipse.mylyn.reviews/org.eclipse.mylyn.reviews.tests/target/work, -configuration, /jobs/genie.mylyn/mylyn-test-build/workspace/org.eclipse.mylyn.reviews/org.eclipse.mylyn.reviews.tests/target/work/configuration, -application, org.eclipse.tycho.surefire.osgibooter.uitest, -testproperties, /jobs/genie.mylyn/mylyn-test-build/workspace/org.eclipse.mylyn.reviews/org.eclipse.mylyn.reviews.tests/target/surefire.properties, -testApplication, org.eclipse.ui.ide.workbench, -product, org.eclipse.sdk.ide, -eclipse.keyring, /jobs/genie.mylyn/mylyn-test-build/workspace/org.eclipse.mylyn.reviews/org.eclipse.mylyn.reviews.tests/target/.eclipse.keyring, -eclipse.password, /jobs/genie.mylyn/mylyn-test-build/workspace/org.eclipse.mylyn.reviews/org.eclipse.mylyn.reviews.tests/target/../../.gitignore]
Java HotSpot(TM) 64-Bit Server VM warning: ignoring option MaxPermSize=256m; support was removed in 8.0
[2016-05-30T8-5-53] Status WARNING: org.eclipse.mylyn.tasks.ui code=0 No search provider was registered. Tasks search is not available. null, 

-------------------------------------------------------
 T E S T S
-------------------------------------------------------
Running org.eclipse.mylyn.reviews.tests.AllReviewsTests
[2016-05-30T8-5-56] Status ERROR: org.eclipse.mylyn.reviews.edit code=0 Problem with model file. Will be recreated at: file:/jobs/genie.mylyn/mylyn-test-build/workspace/org.eclipse.mylyn.reviews/org.eclipse.mylyn.reviews.tests/target/org.eclipse.mylyn.reviews.tests/RemoteEditFactoryTest/Container/EClass/123.ecore org.eclipse.emf.ecore.resource.impl.ResourceSetImpl$1DiagnosticWrappedException: org.xml.sax.SAXParseExceptionpublicId: file:/jobs/genie.mylyn/mylyn-test-build/workspace/org.eclipse.mylyn.reviews/org.eclipse.mylyn.reviews.tests/target/org.eclipse.mylyn.reviews.tests/RemoteEditFactoryTest/Container/EClass/123.ecore; systemId: file:/jobs/genie.mylyn/mylyn-test-build/workspace/org.eclipse.mylyn.reviews/org.eclipse.mylyn.reviews.tests/target/org.eclipse.mylyn.reviews.tests/RemoteEditFactoryTest/Container/EClass/123.ecore; lineNumber: 1; columnNumber: 1; Content is not allowed in prolog., Exception:
org.eclipse.emf.ecore.resource.impl.ResourceSetImpl$1DiagnosticWrappedException: org.xml.sax.SAXParseExceptionpublicId: file:/jobs/genie.mylyn/mylyn-test-build/workspace/org.eclipse.mylyn.reviews/org.eclipse.mylyn.reviews.tests/target/org.eclipse.mylyn.reviews.tests/RemoteEditFactoryTest/Container/EClass/123.ecore; systemId: file:/jobs/genie.mylyn/mylyn-test-build/workspace/org.eclipse.mylyn.reviews/org.eclipse.mylyn.reviews.tests/target/org.eclipse.mylyn.reviews.tests/RemoteEditFactoryTest/Container/EClass/123.ecore; lineNumber: 1; columnNumber: 1; Content is not allowed in prolog.
	at org.eclipse.emf.ecore.resource.impl.ResourceSetImpl.handleDemandLoadException(ResourceSetImpl.java:319)
	at org.eclipse.emf.ecore.resource.impl.ResourceSetImpl.demandLoadHelper(ResourceSetImpl.java:278)
	at org.eclipse.emf.ecore.resource.impl.ResourceSetImpl.getResource(ResourceSetImpl.java:406)
	at org.eclipse.mylyn.reviews.spi.edit.remote.AbstractRemoteEditFactoryProvider.getResourceImpl(AbstractRemoteEditFactoryProvider.java:135)
	at org.eclipse.mylyn.reviews.spi.edit.remote.AbstractRemoteEditFactoryProvider.open(AbstractRemoteEditFactoryProvider.java:189)
	at org.eclipse.mylyn.reviews.spi.edit.remote.AbstractRemoteEditFactoryProvider.open(AbstractRemoteEditFactoryProvider.java:107)
	at org.eclipse.mylyn.reviews.spi.edit.remote.AbstractRemoteEditFactoryProviderTest.testBadChild(AbstractRemoteEditFactoryProviderTest.java:206)
	at sun.reflect.NativeMethodAccessorImpl.invoke0(Native Method)
	at sun.reflect.NativeMethodAccessorImpl.invoke(NativeMethodAccessorImpl.java:62)
	at sun.reflect.DelegatingMethodAccessorImpl.invoke(DelegatingMethodAccessorImpl.java:43)
	at java.lang.reflect.Method.invoke(Method.java:497)
	at junit.framework.TestCase.runTest(TestCase.java:176)
	at junit.framework.TestCase.runBare(TestCase.java:141)
	at junit.framework.TestResult$1.protect(TestResult.java:122)
	at junit.framework.TestResult.runProtected(TestResult.java:142)
	at junit.framework.TestResult.run(TestResult.java:125)
	at junit.framework.TestCase.run(TestCase.java:129)
	at junit.framework.TestSuite.runTest(TestSuite.java:252)
	at junit.framework.TestSuite.run(TestSuite.java:247)
	at junit.framework.TestSuite.runTest(TestSuite.java:252)
	at junit.framework.TestSuite.run(TestSuite.java:247)
	at org.junit.internal.runners.JUnit38ClassRunner.run(JUnit38ClassRunner.java:86)
	at org.apache.maven.surefire.junit4.JUnit4TestSet.execute(JUnit4TestSet.java:53)
	at org.apache.maven.surefire.junit4.JUnit4Provider.executeTestSet(JUnit4Provider.java:123)
	at org.apache.maven.surefire.junit4.JUnit4Provider.invoke(JUnit4Provider.java:104)
	at sun.reflect.NativeMethodAccessorImpl.invoke0(Native Method)
	at sun.reflect.NativeMethodAccessorImpl.invoke(NativeMethodAccessorImpl.java:62)
	at sun.reflect.DelegatingMethodAccessorImpl.invoke(DelegatingMethodAccessorImpl.java:43)
	at java.lang.reflect.Method.invoke(Method.java:497)
	at org.apache.maven.surefire.util.ReflectionUtils.invokeMethodWithArray(ReflectionUtils.java:164)
	at org.apache.maven.surefire.booter.ProviderFactory$ProviderProxy.invoke(ProviderFactory.java:110)
	at org.apache.maven.surefire.booter.SurefireStarter.invokeProvider(SurefireStarter.java:175)
	at org.apache.maven.surefire.booter.SurefireStarter.runSuitesInProcess(SurefireStarter.java:123)
	at org.eclipse.tycho.surefire.osgibooter.OsgiSurefireBooter.run(OsgiSurefireBooter.java:87)
	at org.eclipse.tycho.surefire.osgibooter.AbstractUITestApplication$1.run(AbstractUITestApplication.java:35)
	at org.eclipse.swt.widgets.RunnableLock.run(RunnableLock.java:35)
	at org.eclipse.swt.widgets.Synchronizer.runAsyncMessages(Synchronizer.java:135)
	at org.eclipse.swt.widgets.Display.runAsyncMessages(Display.java:3794)
	at org.eclipse.swt.widgets.Display.readAndDispatch(Display.java:3433)
	at org.eclipse.e4.ui.internal.workbench.swt.PartRenderingEngine$4.run(PartRenderingEngine.java:1127)
	at org.eclipse.core.databinding.observable.Realm.runWithDefault(Realm.java:337)
	at org.eclipse.e4.ui.internal.workbench.swt.PartRenderingEngine.run(PartRenderingEngine.java:1018)
	at org.eclipse.e4.ui.internal.workbench.E4Workbench.createAndRunUI(E4Workbench.java:156)
	at org.eclipse.ui.internal.Workbench$5.run(Workbench.java:694)
	at org.eclipse.core.databinding.observable.Realm.runWithDefault(Realm.java:337)
	at org.eclipse.ui.internal.Workbench.createAndRunWorkbench(Workbench.java:606)
	at org.eclipse.ui.PlatformUI.createAndRunWorkbench(PlatformUI.java:150)
	at org.eclipse.ui.internal.ide.application.IDEApplication.start(IDEApplication.java:139)
	at org.eclipse.tycho.surefire.osgibooter.UITestApplication.runApplication(UITestApplication.java:31)
	at org.eclipse.tycho.surefire.osgibooter.AbstractUITestApplication.run(AbstractUITestApplication.java:115)
	at org.eclipse.tycho.surefire.osgibooter.UITestApplication.start(UITestApplication.java:37)
	at org.eclipse.equinox.internal.app.EclipseAppHandle.run(EclipseAppHandle.java:196)
	at org.eclipse.core.runtime.internal.adaptor.EclipseAppLauncher.runApplication(EclipseAppLauncher.java:134)
	at org.eclipse.core.runtime.internal.adaptor.EclipseAppLauncher.start(EclipseAppLauncher.java:104)
	at org.eclipse.core.runtime.adaptor.EclipseStarter.run(EclipseStarter.java:380)
	at org.eclipse.core.runtime.adaptor.EclipseStarter.run(EclipseStarter.java:235)
	at sun.reflect.NativeMethodAccessorImpl.invoke0(Native Method)
	at sun.reflect.NativeMethodAccessorImpl.invoke(NativeMethodAccessorImpl.java:62)
	at sun.reflect.DelegatingMethodAccessorImpl.invoke(DelegatingMethodAccessorImpl.java:43)
	at java.lang.reflect.Method.invoke(Method.java:497)
	at org.eclipse.equinox.launcher.Main.invokeFramework(Main.java:669)
	at org.eclipse.equinox.launcher.Main.basicRun(Main.java:608)
	at org.eclipse.equinox.launcher.Main.run(Main.java:1515)
	at org.eclipse.equinox.launcher.Main.main(Main.java:1488)
Caused by: org.xml.sax.SAXParseExceptionpublicId: file:/jobs/genie.mylyn/mylyn-test-build/workspace/org.eclipse.mylyn.reviews/org.eclipse.mylyn.reviews.tests/target/org.eclipse.mylyn.reviews.tests/RemoteEditFactoryTest/Container/EClass/123.ecore; systemId: file:/jobs/genie.mylyn/mylyn-test-build/workspace/org.eclipse.mylyn.reviews/org.eclipse.mylyn.reviews.tests/target/org.eclipse.mylyn.reviews.tests/RemoteEditFactoryTest/Container/EClass/123.ecore; lineNumber: 1; columnNumber: 1; Content is not allowed in prolog.
	at com.sun.org.apache.xerces.internal.util.ErrorHandlerWrapper.createSAXParseException(ErrorHandlerWrapper.java:203)
	at com.sun.org.apache.xerces.internal.util.ErrorHandlerWrapper.fatalError(ErrorHandlerWrapper.java:177)
	at com.sun.org.apache.xerces.internal.impl.XMLErrorReporter.reportError(XMLErrorReporter.java:441)
	at com.sun.org.apache.xerces.internal.impl.XMLErrorReporter.reportError(XMLErrorReporter.java:368)
	at com.sun.org.apache.xerces.internal.impl.XMLScanner.reportFatalError(XMLScanner.java:1437)
	at com.sun.org.apache.xerces.internal.impl.XMLDocumentScannerImpl$PrologDriver.next(XMLDocumentScannerImpl.java:999)
	at com.sun.org.apache.xerces.internal.impl.XMLDocumentScannerImpl.next(XMLDocumentScannerImpl.java:606)
	at com.sun.org.apache.xerces.internal.impl.XMLDocumentFragmentScannerImpl.scanDocument(XMLDocumentFragmentScannerImpl.java:510)
	at com.sun.org.apache.xerces.internal.parsers.XML11Configuration.parse(XML11Configuration.java:848)
	at com.sun.org.apache.xerces.internal.parsers.XML11Configuration.parse(XML11Configuration.java:777)
	at com.sun.org.apache.xerces.internal.parsers.XMLParser.parse(XMLParser.java:141)
	at com.sun.org.apache.xerces.internal.parsers.AbstractSAXParser.parse(AbstractSAXParser.java:1213)
	at com.sun.org.apache.xerces.internal.jaxp.SAXParserImpl$JAXPSAXParser.parse(SAXParserImpl.java:649)
	at com.sun.org.apache.xerces.internal.jaxp.SAXParserImpl.parse(SAXParserImpl.java:333)
	at org.eclipse.emf.ecore.xmi.impl.XMLLoadImpl.load(XMLLoadImpl.java:175)
	at org.eclipse.emf.ecore.xmi.impl.XMLResourceImpl.doLoad(XMLResourceImpl.java:261)
	at org.eclipse.emf.ecore.resource.impl.ResourceImpl.load(ResourceImpl.java:1518)
	at org.eclipse.emf.ecore.resource.impl.ResourceImpl.load(ResourceImpl.java:1297)
	at org.eclipse.emf.ecore.resource.impl.ResourceSetImpl.demandLoad(ResourceSetImpl.java:259)
	at org.eclipse.emf.ecore.resource.impl.ResourceSetImpl.demandLoadHelper(ResourceSetImpl.java:274)
	... 62 more

[2016-05-30T8-5-56] Status ERROR: org.eclipse.mylyn.reviews.edit code=0 Problem with model file. Will be recreated at: file:/jobs/genie.mylyn/mylyn-test-build/workspace/org.eclipse.mylyn.reviews/org.eclipse.mylyn.reviews.tests/target/org.eclipse.mylyn.reviews.tests/RemoteEditFactoryTest/Container/EPackage/EPackage.ecore org.eclipse.emf.ecore.resource.impl.ResourceSetImpl$1DiagnosticWrappedException: org.xml.sax.SAXParseExceptionpublicId: file:/jobs/genie.mylyn/mylyn-test-build/workspace/org.eclipse.mylyn.reviews/org.eclipse.mylyn.reviews.tests/target/org.eclipse.mylyn.reviews.tests/RemoteEditFactoryTest/Container/EPackage/EPackage.ecore; systemId: file:/jobs/genie.mylyn/mylyn-test-build/workspace/org.eclipse.mylyn.reviews/org.eclipse.mylyn.reviews.tests/target/org.eclipse.mylyn.reviews.tests/RemoteEditFactoryTest/Container/EPackage/EPackage.ecore; lineNumber: 1; columnNumber: 1; Content is not allowed in prolog., Exception:
org.eclipse.emf.ecore.resource.impl.ResourceSetImpl$1DiagnosticWrappedException: org.xml.sax.SAXParseExceptionpublicId: file:/jobs/genie.mylyn/mylyn-test-build/workspace/org.eclipse.mylyn.reviews/org.eclipse.mylyn.reviews.tests/target/org.eclipse.mylyn.reviews.tests/RemoteEditFactoryTest/Container/EPackage/EPackage.ecore; systemId: file:/jobs/genie.mylyn/mylyn-test-build/workspace/org.eclipse.mylyn.reviews/org.eclipse.mylyn.reviews.tests/target/org.eclipse.mylyn.reviews.tests/RemoteEditFactoryTest/Container/EPackage/EPackage.ecore; lineNumber: 1; columnNumber: 1; Content is not allowed in prolog.
	at org.eclipse.emf.ecore.resource.impl.ResourceSetImpl.handleDemandLoadException(ResourceSetImpl.java:319)
	at org.eclipse.emf.ecore.resource.impl.ResourceSetImpl.demandLoadHelper(ResourceSetImpl.java:278)
	at org.eclipse.emf.ecore.resource.impl.ResourceSetImpl.getResource(ResourceSetImpl.java:406)
	at org.eclipse.mylyn.reviews.spi.edit.remote.AbstractRemoteEditFactoryProvider.getResourceImpl(AbstractRemoteEditFactoryProvider.java:135)
	at org.eclipse.mylyn.reviews.spi.edit.remote.AbstractRemoteEditFactoryProvider.open(AbstractRemoteEditFactoryProvider.java:189)
	at org.eclipse.mylyn.reviews.spi.edit.remote.AbstractRemoteEditFactoryProvider.open(AbstractRemoteEditFactoryProvider.java:95)
	at org.eclipse.mylyn.reviews.spi.edit.remote.AbstractRemoteEditFactoryProviderTest.testBadFile(AbstractRemoteEditFactoryProviderTest.java:138)
	at sun.reflect.NativeMethodAccessorImpl.invoke0(Native Method)
	at sun.reflect.NativeMethodAccessorImpl.invoke(NativeMethodAccessorImpl.java:62)
	at sun.reflect.DelegatingMethodAccessorImpl.invoke(DelegatingMethodAccessorImpl.java:43)
	at java.lang.reflect.Method.invoke(Method.java:497)
	at junit.framework.TestCase.runTest(TestCase.java:176)
	at junit.framework.TestCase.runBare(TestCase.java:141)
	at junit.framework.TestResult$1.protect(TestResult.java:122)
	at junit.framework.TestResult.runProtected(TestResult.java:142)
	at junit.framework.TestResult.run(TestResult.java:125)
	at junit.framework.TestCase.run(TestCase.java:129)
	at junit.framework.TestSuite.runTest(TestSuite.java:252)
	at junit.framework.TestSuite.run(TestSuite.java:247)
	at junit.framework.TestSuite.runTest(TestSuite.java:252)
	at junit.framework.TestSuite.run(TestSuite.java:247)
	at org.junit.internal.runners.JUnit38ClassRunner.run(JUnit38ClassRunner.java:86)
	at org.apache.maven.surefire.junit4.JUnit4TestSet.execute(JUnit4TestSet.java:53)
	at org.apache.maven.surefire.junit4.JUnit4Provider.executeTestSet(JUnit4Provider.java:123)
	at org.apache.maven.surefire.junit4.JUnit4Provider.invoke(JUnit4Provider.java:104)
	at sun.reflect.NativeMethodAccessorImpl.invoke0(Native Method)
	at sun.reflect.NativeMethodAccessorImpl.invoke(NativeMethodAccessorImpl.java:62)
	at sun.reflect.DelegatingMethodAccessorImpl.invoke(DelegatingMethodAccessorImpl.java:43)
	at java.lang.reflect.Method.invoke(Method.java:497)
	at org.apache.maven.surefire.util.ReflectionUtils.invokeMethodWithArray(ReflectionUtils.java:164)
	at org.apache.maven.surefire.booter.ProviderFactory$ProviderProxy.invoke(ProviderFactory.java:110)
	at org.apache.maven.surefire.booter.SurefireStarter.invokeProvider(SurefireStarter.java:175)
	at org.apache.maven.surefire.booter.SurefireStarter.runSuitesInProcess(SurefireStarter.java:123)
	at org.eclipse.tycho.surefire.osgibooter.OsgiSurefireBooter.run(OsgiSurefireBooter.java:87)
	at org.eclipse.tycho.surefire.osgibooter.AbstractUITestApplication$1.run(AbstractUITestApplication.java:35)
	at org.eclipse.swt.widgets.RunnableLock.run(RunnableLock.java:35)
	at org.eclipse.swt.widgets.Synchronizer.runAsyncMessages(Synchronizer.java:135)
	at org.eclipse.swt.widgets.Display.runAsyncMessages(Display.java:3794)
	at org.eclipse.swt.widgets.Display.readAndDispatch(Display.java:3433)
	at org.eclipse.e4.ui.internal.workbench.swt.PartRenderingEngine$4.run(PartRenderingEngine.java:1127)
	at org.eclipse.core.databinding.observable.Realm.runWithDefault(Realm.java:337)
	at org.eclipse.e4.ui.internal.workbench.swt.PartRenderingEngine.run(PartRenderingEngine.java:1018)
	at org.eclipse.e4.ui.internal.workbench.E4Workbench.createAndRunUI(E4Workbench.java:156)
	at org.eclipse.ui.internal.Workbench$5.run(Workbench.java:694)
	at org.eclipse.core.databinding.observable.Realm.runWithDefault(Realm.java:337)
	at org.eclipse.ui.internal.Workbench.createAndRunWorkbench(Workbench.java:606)
	at org.eclipse.ui.PlatformUI.createAndRunWorkbench(PlatformUI.java:150)
	at org.eclipse.ui.internal.ide.application.IDEApplication.start(IDEApplication.java:139)
	at org.eclipse.tycho.surefire.osgibooter.UITestApplication.runApplication(UITestApplication.java:31)
	at org.eclipse.tycho.surefire.osgibooter.AbstractUITestApplication.run(AbstractUITestApplication.java:115)
	at org.eclipse.tycho.surefire.osgibooter.UITestApplication.start(UITestApplication.java:37)
	at org.eclipse.equinox.internal.app.EclipseAppHandle.run(EclipseAppHandle.java:196)
	at org.eclipse.core.runtime.internal.adaptor.EclipseAppLauncher.runApplication(EclipseAppLauncher.java:134)
	at org.eclipse.core.runtime.internal.adaptor.EclipseAppLauncher.start(EclipseAppLauncher.java:104)
	at org.eclipse.core.runtime.adaptor.EclipseStarter.run(EclipseStarter.java:380)
	at org.eclipse.core.runtime.adaptor.EclipseStarter.run(EclipseStarter.java:235)
	at sun.reflect.NativeMethodAccessorImpl.invoke0(Native Method)
	at sun.reflect.NativeMethodAccessorImpl.invoke(NativeMethodAccessorImpl.java:62)
	at sun.reflect.DelegatingMethodAccessorImpl.invoke(DelegatingMethodAccessorImpl.java:43)
	at java.lang.reflect.Method.invoke(Method.java:497)
	at org.eclipse.equinox.launcher.Main.invokeFramework(Main.java:669)
	at org.eclipse.equinox.launcher.Main.basicRun(Main.java:608)
	at org.eclipse.equinox.launcher.Main.run(Main.java:1515)
	at org.eclipse.equinox.launcher.Main.main(Main.java:1488)
Caused by: org.xml.sax.SAXParseExceptionpublicId: file:/jobs/genie.mylyn/mylyn-test-build/workspace/org.eclipse.mylyn.reviews/org.eclipse.mylyn.reviews.tests/target/org.eclipse.mylyn.reviews.tests/RemoteEditFactoryTest/Container/EPackage/EPackage.ecore; systemId: file:/jobs/genie.mylyn/mylyn-test-build/workspace/org.eclipse.mylyn.reviews/org.eclipse.mylyn.reviews.tests/target/org.eclipse.mylyn.reviews.tests/RemoteEditFactoryTest/Container/EPackage/EPackage.ecore; lineNumber: 1; columnNumber: 1; Content is not allowed in prolog.
	at com.sun.org.apache.xerces.internal.util.ErrorHandlerWrapper.createSAXParseException(ErrorHandlerWrapper.java:203)
	at com.sun.org.apache.xerces.internal.util.ErrorHandlerWrapper.fatalError(ErrorHandlerWrapper.java:177)
	at com.sun.org.apache.xerces.internal.impl.XMLErrorReporter.reportError(XMLErrorReporter.java:441)
	at com.sun.org.apache.xerces.internal.impl.XMLErrorReporter.reportError(XMLErrorReporter.java:368)
	at com.sun.org.apache.xerces.internal.impl.XMLScanner.reportFatalError(XMLScanner.java:1437)
	at com.sun.org.apache.xerces.internal.impl.XMLDocumentScannerImpl$PrologDriver.next(XMLDocumentScannerImpl.java:999)
	at com.sun.org.apache.xerces.internal.impl.XMLDocumentScannerImpl.next(XMLDocumentScannerImpl.java:606)
	at com.sun.org.apache.xerces.internal.impl.XMLDocumentFragmentScannerImpl.scanDocument(XMLDocumentFragmentScannerImpl.java:510)
	at com.sun.org.apache.xerces.internal.parsers.XML11Configuration.parse(XML11Configuration.java:848)
	at com.sun.org.apache.xerces.internal.parsers.XML11Configuration.parse(XML11Configuration.java:777)
	at com.sun.org.apache.xerces.internal.parsers.XMLParser.parse(XMLParser.java:141)
	at com.sun.org.apache.xerces.internal.parsers.AbstractSAXParser.parse(AbstractSAXParser.java:1213)
	at com.sun.org.apache.xerces.internal.jaxp.SAXParserImpl$JAXPSAXParser.parse(SAXParserImpl.java:649)
	at com.sun.org.apache.xerces.internal.jaxp.SAXParserImpl.parse(SAXParserImpl.java:333)
	at org.eclipse.emf.ecore.xmi.impl.XMLLoadImpl.load(XMLLoadImpl.java:175)
	at org.eclipse.emf.ecore.xmi.impl.XMLResourceImpl.doLoad(XMLResourceImpl.java:261)
	at org.eclipse.emf.ecore.resource.impl.ResourceImpl.load(ResourceImpl.java:1518)
	at org.eclipse.emf.ecore.resource.impl.ResourceImpl.load(ResourceImpl.java:1297)
	at org.eclipse.emf.ecore.resource.impl.ResourceSetImpl.demandLoad(ResourceSetImpl.java:259)
	at org.eclipse.emf.ecore.resource.impl.ResourceSetImpl.demandLoadHelper(ResourceSetImpl.java:274)
	... 62 more

Tests run: 31, Failures: 0, Errors: 0, Skipped: 0, Time elapsed: 0.746 sec

Results :

Tests run: 31, Failures: 0, Errors: 0, Skipped: 0

[INFO] All tests passed!
[INFO]                                                                         
[INFO] ------------------------------------------------------------------------
[INFO] Building org.eclipse.mylyn.reviews.development.feature 2.11.0-SNAPSHOT
[INFO] ------------------------------------------------------------------------
[INFO] 
[INFO] --- maven-clean-plugin:2.4.1:clean (default-clean) @ org.eclipse.mylyn.reviews.development.feature ---
[INFO] 
[INFO] --- tycho-packaging-plugin:0.21.0:build-qualifier-aggregator (default-build-qualifier-aggregator) @ org.eclipse.mylyn.reviews.development.feature ---
[INFO] The project's OSGi version is 2.11.0.x20160518-1752
[INFO] 
[INFO] --- tycho-packaging-plugin:0.21.0:validate-id (default-validate-id) @ org.eclipse.mylyn.reviews.development.feature ---
[INFO] 
[INFO] --- tycho-packaging-plugin:0.21.0:validate-version (default-validate-version) @ org.eclipse.mylyn.reviews.development.feature ---
[INFO] 
[INFO] --- jacoco-maven-plugin:0.5.6.201201232323:prepare-agent (default) @ org.eclipse.mylyn.reviews.development.feature ---
[INFO] Skipping JaCoCo execution
[INFO] 
[INFO] --- target-platform-configuration:0.21.0:target-platform (default-target-platform) @ org.eclipse.mylyn.reviews.development.feature ---
[INFO] 
[INFO] --- tycho-packaging-plugin:0.21.0:package-feature (default-package-feature) @ org.eclipse.mylyn.reviews.development.feature ---
[INFO] Building jar: /jobs/genie.mylyn/mylyn-test-build/workspace/org.eclipse.mylyn.reviews/org.eclipse.mylyn.reviews.development.feature/target/org.eclipse.mylyn.reviews.development.feature-2.11.0-SNAPSHOT.jar
[INFO] 
[INFO] --- tycho-p2-plugin:0.21.0:p2-metadata-default (default-p2-metadata-default) @ org.eclipse.mylyn.reviews.development.feature ---
[INFO] 
[INFO] --- tycho-p2-plugin:0.21.0:feature-p2-metadata (default-feature-p2-metadata) @ org.eclipse.mylyn.reviews.development.feature ---
[INFO]                                                                         
[INFO] ------------------------------------------------------------------------
[INFO] Building org.eclipse.mylyn.reviews.ui.tests 2.11.0-SNAPSHOT
[INFO] ------------------------------------------------------------------------
[INFO] 
[INFO] --- maven-clean-plugin:2.4.1:clean (default-clean) @ org.eclipse.mylyn.reviews.ui.tests ---
[INFO] 
[INFO] --- tycho-packaging-plugin:0.21.0:build-qualifier (default-build-qualifier) @ org.eclipse.mylyn.reviews.ui.tests ---
[INFO] The project's OSGi version is 2.11.0.x20160421-1821
[INFO] 
[INFO] --- tycho-packaging-plugin:0.21.0:validate-id (default-validate-id) @ org.eclipse.mylyn.reviews.ui.tests ---
[INFO] 
[INFO] --- tycho-packaging-plugin:0.21.0:validate-version (default-validate-version) @ org.eclipse.mylyn.reviews.ui.tests ---
[INFO] 
[INFO] --- jacoco-maven-plugin:0.5.6.201201232323:prepare-agent (default) @ org.eclipse.mylyn.reviews.ui.tests ---
[INFO] Skipping JaCoCo execution
[INFO] 
[INFO] --- maven-resources-plugin:2.4.1:resources (default-resources) @ org.eclipse.mylyn.reviews.ui.tests ---
[INFO] Using 'ISO-8859-1' encoding to copy filtered resources.
[INFO] skip non existing resourceDirectory /jobs/genie.mylyn/mylyn-test-build/workspace/org.eclipse.mylyn.reviews/org.eclipse.mylyn.reviews.ui.tests/src/main/resources
[INFO] 
[INFO] --- tycho-compiler-plugin:0.21.0:compile (default-compile) @ org.eclipse.mylyn.reviews.ui.tests ---
[INFO] Compiling 2 source files to /jobs/genie.mylyn/mylyn-test-build/workspace/org.eclipse.mylyn.reviews/org.eclipse.mylyn.reviews.ui.tests/target/classes
[INFO] 
[INFO] --- tycho-source-plugin:0.21.0:plugin-source (attach-source) @ org.eclipse.mylyn.reviews.ui.tests ---
[WARNING] bundle localization file /jobs/genie.mylyn/mylyn-test-build/workspace/org.eclipse.mylyn.reviews/org.eclipse.mylyn.reviews.ui.tests/plugin.properties not found
[INFO] Building jar: /jobs/genie.mylyn/mylyn-test-build/workspace/org.eclipse.mylyn.reviews/org.eclipse.mylyn.reviews.ui.tests/target/org.eclipse.mylyn.reviews.ui.tests-2.11.0-SNAPSHOT-sources.jar
[INFO] 
[INFO] --- maven-resources-plugin:2.4.1:testResources (default-testResources) @ org.eclipse.mylyn.reviews.ui.tests ---
[INFO] Using 'ISO-8859-1' encoding to copy filtered resources.
[INFO] skip non existing resourceDirectory /jobs/genie.mylyn/mylyn-test-build/workspace/org.eclipse.mylyn.reviews/org.eclipse.mylyn.reviews.ui.tests/src/test/resources
[INFO] 
[INFO] --- target-platform-configuration:0.21.0:target-platform (default-target-platform) @ org.eclipse.mylyn.reviews.ui.tests ---
[INFO] 
[INFO] --- tycho-packaging-plugin:0.21.0:package-plugin (default-package-plugin) @ org.eclipse.mylyn.reviews.ui.tests ---
[INFO] Building jar: /jobs/genie.mylyn/mylyn-test-build/workspace/org.eclipse.mylyn.reviews/org.eclipse.mylyn.reviews.ui.tests/target/org.eclipse.mylyn.reviews.ui.tests-2.11.0-SNAPSHOT.jar
[INFO] 
[INFO] --- tycho-p2-plugin:0.21.0:p2-metadata-default (default-p2-metadata-default) @ org.eclipse.mylyn.reviews.ui.tests ---
[INFO] 
[INFO] --- tycho-surefire-plugin:0.21.0:test (default-test) @ org.eclipse.mylyn.reviews.ui.tests ---
[INFO] Expected eclipse log file: /jobs/genie.mylyn/mylyn-test-build/workspace/org.eclipse.mylyn.reviews/org.eclipse.mylyn.reviews.ui.tests/target/work/data/.metadata/.log
[INFO] Command line:
	[/opt/public/common/jdk1.8.0_51.x64/jre/bin/java, -Dosgi.noShutdown=false, -Dosgi.os=linux, -Dosgi.ws=gtk, -Dosgi.arch=x86_64, -Xmx512m, -XX:MaxPermSize=256m, -Djava.io.tmpdir=/jobs/genie.mylyn/mylyn-test-build/workspace/org.eclipse.mylyn.reviews/org.eclipse.mylyn.reviews.ui.tests/target, -ea, -Dmylyn.credentials=/shared/mylyn/.credentials.properties, -Dorg.eclipse.mylyn.wikitext.tests.disableOutput=true, -Dhttp.proxyHost=proxy.eclipse.org, -Dhttp.proxyPort=9898, -Dhttps.proxyHost=proxy.eclipse.org, -Dhttps.proxyPort=9898, -DhttpnonProxyHosts=*.eclipse.org, -Dorg.eclipse.mylyn.gerrit.tests.alternate.push=true, -Dosgi.clean=true, -jar, /jobs/genie.mylyn/mylyn-test-build/workspace/.maven/repo/p2/osgi/bundle/org.eclipse.equinox.launcher/1.3.100.v20150511-1540/org.eclipse.equinox.launcher-1.3.100.v20150511-1540.jar, -data, /jobs/genie.mylyn/mylyn-test-build/workspace/org.eclipse.mylyn.reviews/org.eclipse.mylyn.reviews.ui.tests/target/work/data, -install, /jobs/genie.mylyn/mylyn-test-build/workspace/org.eclipse.mylyn.reviews/org.eclipse.mylyn.reviews.ui.tests/target/work, -configuration, /jobs/genie.mylyn/mylyn-test-build/workspace/org.eclipse.mylyn.reviews/org.eclipse.mylyn.reviews.ui.tests/target/work/configuration, -application, org.eclipse.tycho.surefire.osgibooter.uitest, -testproperties, /jobs/genie.mylyn/mylyn-test-build/workspace/org.eclipse.mylyn.reviews/org.eclipse.mylyn.reviews.ui.tests/target/surefire.properties, -testApplication, org.eclipse.ui.ide.workbench, -product, org.eclipse.sdk.ide, -eclipse.keyring, /jobs/genie.mylyn/mylyn-test-build/workspace/org.eclipse.mylyn.reviews/org.eclipse.mylyn.reviews.ui.tests/target/.eclipse.keyring, -eclipse.password, /jobs/genie.mylyn/mylyn-test-build/workspace/org.eclipse.mylyn.reviews/org.eclipse.mylyn.reviews.ui.tests/target/../../.gitignore]
Java HotSpot(TM) 64-Bit Server VM warning: ignoring option MaxPermSize=256m; support was removed in 8.0
[2016-05-30T8-6-13] Status WARNING: org.eclipse.mylyn.tasks.ui code=0 No search provider was registered. Tasks search is not available. null, 

-------------------------------------------------------
 T E S T S
-------------------------------------------------------
Running org.eclipse.mylyn.reviews.ui.tests.AllReviewsUiTests
Tests run: 23, Failures: 0, Errors: 0, Skipped: 0, Time elapsed: 4.521 sec

Results :

Tests run: 23, Failures: 0, Errors: 0, Skipped: 0

[INFO] All tests passed!
[INFO]                                                                         
[INFO] ------------------------------------------------------------------------
[INFO] Building org.eclipse.mylyn.all 3.20.0-SNAPSHOT
[INFO] ------------------------------------------------------------------------
[INFO] 
[INFO] --- maven-clean-plugin:2.4.1:clean (default-clean) @ org.eclipse.mylyn.all ---
[INFO] 
[INFO] --- jacoco-maven-plugin:0.5.6.201201232323:prepare-agent (default) @ org.eclipse.mylyn.all ---
[INFO] Skipping JaCoCo for project with packaging type 'pom'
[INFO] ------------------------------------------------------------------------
[INFO] Reactor Summary:
[INFO] 
[INFO] org.eclipse.mylyn-parent .......................... SUCCESS [30.494s]
[INFO] Mylyn Releng ...................................... SUCCESS [0.010s]
[INFO] org.eclipse.mylyn.discovery ....................... SUCCESS [14.539s]
[INFO] Mylyn Commons ..................................... SUCCESS [0.046s]
[INFO] org.eclipse.mylyn.commons.core .................... SUCCESS [37.655s]
[INFO] org.eclipse.mylyn.commons.screenshots ............. SUCCESS [0.602s]
[INFO] org.eclipse.mylyn.commons.ui ...................... SUCCESS [0.729s]
[INFO] org.eclipse.mylyn.commons.workbench ............... SUCCESS [0.564s]
[INFO] org.eclipse.mylyn.commons ......................... SUCCESS [0.147s]
[INFO] org.eclipse.mylyn.commons.identity.core ........... SUCCESS [0.262s]
[INFO] org.eclipse.mylyn.commons.identity ................ SUCCESS [0.127s]
[INFO] org.eclipse.mylyn.commons.net ..................... SUCCESS [0.382s]
[INFO] org.eclipse.mylyn.commons.notifications.core ...... SUCCESS [0.236s]
[INFO] org.eclipse.mylyn.commons.notifications.feed ...... SUCCESS [2.173s]
[INFO] org.eclipse.mylyn.commons.notifications.ui ........ SUCCESS [0.436s]
[INFO] org.eclipse.mylyn.commons.notifications ........... SUCCESS [0.205s]
[INFO] org.eclipse.mylyn.commons.repositories.core ....... SUCCESS [0.323s]
[INFO] org.eclipse.mylyn.commons.repositories.ui ......... SUCCESS [0.539s]
[INFO] org.eclipse.mylyn.commons.repositories ............ SUCCESS [0.149s]
[INFO] org.eclipse.mylyn.monitor.core .................... SUCCESS [0.254s]
[INFO] Mylyn Context ..................................... SUCCESS [0.045s]
[INFO] org.eclipse.mylyn.context.core .................... SUCCESS [0.449s]
[INFO] org.eclipse.mylyn.monitor.ui ...................... SUCCESS [0.311s]
[INFO] org.eclipse.mylyn.context.ui ...................... SUCCESS [0.616s]
[INFO] Mylyn Tasks ....................................... SUCCESS [0.044s]
[INFO] org.eclipse.mylyn.tasks.core ...................... SUCCESS [1.687s]
[INFO] org.eclipse.mylyn.discovery.core .................. SUCCESS [0.282s]
[INFO] org.eclipse.mylyn.discovery.ui .................... SUCCESS [0.472s]
[INFO] org.eclipse.mylyn.tasks.ui ........................ SUCCESS [2.324s]
[INFO] org.eclipse.mylyn.context.tasks.ui ................ SUCCESS [0.608s]
[INFO] org.eclipse.mylyn.discovery ....................... SUCCESS [0.131s]
[INFO] org.eclipse.mylyn.monitor ......................... SUCCESS [0.147s]
[INFO] org.eclipse.mylyn.tasks.index.core ................ SUCCESS [0.442s]
[INFO] org.eclipse.mylyn.tasks.index.ui .................. SUCCESS [0.557s]
[INFO] org.eclipse.mylyn.tasks.search .................... SUCCESS [0.563s]
[INFO] org.eclipse.mylyn_feature ......................... SUCCESS [0.319s]
[INFO] org.eclipse.mylyn.resources.ui .................... SUCCESS [0.443s]
[INFO] org.eclipse.mylyn.context_feature ................. SUCCESS [0.271s]
[INFO] org.eclipse.cdt.mylyn.ui .......................... SUCCESS [0.424s]
[INFO] org.eclipse.cdt.mylyn ............................. SUCCESS [0.181s]
[INFO] Mylyn Docs ........................................ SUCCESS [0.044s]
[INFO] org.eclipse.mylyn.wikitext.core ................... SUCCESS [0.608s]
[INFO] org.eclipse.mylyn.wikitext.asciidoc.core .......... SUCCESS [0.295s]
[INFO] org.eclipse.mylyn.wikitext.core.osgi .............. SUCCESS [0.184s]
[INFO] org.eclipse.mylyn.wikitext.ui ..................... SUCCESS [0.752s]
[INFO] org.eclipse.mylyn.wikitext.asciidoc.ui ............ SUCCESS [0.172s]
[INFO] org.eclipse.mylyn.wikitext.confluence.core ........ SUCCESS [0.279s]
[INFO] org.eclipse.mylyn.wikitext.confluence.ui .......... SUCCESS [0.257s]
[INFO] org.eclipse.mylyn.wikitext.context.ui ............. SUCCESS [0.295s]
[INFO] org.eclipse.mylyn.wikitext.core.ant ............... SUCCESS [0.263s]
[INFO] org.eclipse.mylyn.wikitext.textile.core ........... SUCCESS [0.307s]
[INFO] org.eclipse.mylyn.wikitext.help.ui ................ SUCCESS [5.936s]
[INFO] org.eclipse.mylyn.wikitext.html.core .............. SUCCESS [0.299s]
[INFO] org.eclipse.mylyn.wikitext.markdown.core .......... SUCCESS [0.258s]
[INFO] org.eclipse.mylyn.wikitext.markdown.ui ............ SUCCESS [0.166s]
[INFO] org.eclipse.mylyn.wikitext.mediawiki.core ......... SUCCESS [0.316s]
[INFO] org.eclipse.mylyn.wikitext.mediawiki.core.ant ..... SUCCESS [0.259s]
[INFO] org.eclipse.mylyn.wikitext.mediawiki.ui ........... SUCCESS [0.275s]
[INFO] org.eclipse.mylyn.wikitext.textile.ui ............. SUCCESS [0.266s]
[INFO] org.eclipse.mylyn.wikitext.tracwiki.core .......... SUCCESS [0.297s]
[INFO] org.eclipse.mylyn.wikitext.tracwiki.ui ............ SUCCESS [0.302s]
[INFO] org.eclipse.mylyn.wikitext.twiki.core ............. SUCCESS [0.295s]
[INFO] org.eclipse.mylyn.wikitext.twiki.ui ............... SUCCESS [0.366s]
[INFO] org.eclipse.mylyn.wikitext.tasks.ui ............... SUCCESS [3.888s]
[INFO] org.eclipse.mylyn.wikitext_feature ................ SUCCESS [0.230s]
[INFO] org.eclipse.mylyn.docs.epub.core .................. SUCCESS [0.759s]
[INFO] org.eclipse.mylyn.docs.epub.help .................. SUCCESS [0.289s]
[INFO] org.eclipse.mylyn.docs.epub.ui .................... SUCCESS [0.431s]
[INFO] org.eclipse.mylyn.docs.epub ....................... SUCCESS [0.199s]
[INFO] org.eclipse.mylyn.commons.xmlrpc .................. SUCCESS [0.286s]
[INFO] org.eclipse.mylyn.bugzilla.core ................... SUCCESS [0.688s]
[INFO] org.eclipse.mylyn.bugzilla.ui ..................... SUCCESS [1.124s]
[INFO] org.eclipse.mylyn.bugzilla_feature ................ SUCCESS [0.306s]
[INFO] Mylyn Versions .................................... SUCCESS [0.043s]
[INFO] org.eclipse.mylyn.versions.core ................... SUCCESS [0.227s]
[INFO] org.eclipse.mylyn.cvs.core ........................ SUCCESS [0.207s]
[INFO] org.eclipse.mylyn.versions.ui ..................... SUCCESS [0.294s]
[INFO] org.eclipse.mylyn.versions ........................ SUCCESS [0.110s]
[INFO] org.eclipse.mylyn.cvs ............................. SUCCESS [0.103s]
[INFO] Mylyn Reviews ..................................... SUCCESS [0.044s]
[INFO] org.eclipse.mylyn.reviews.core .................... SUCCESS [0.564s]
[INFO] org.eclipse.mylyn.reviews.edit .................... SUCCESS [0.379s]
[INFO] org.eclipse.mylyn.gerrit.core ..................... SUCCESS [0.595s]
[INFO] org.eclipse.mylyn.reviews.ui ...................... SUCCESS [0.824s]
[INFO] org.eclipse.mylyn.reviews.feature ................. SUCCESS [0.130s]
[INFO] org.eclipse.mylyn.gerrit.ui ....................... SUCCESS [0.595s]
[INFO] org.eclipse.mylyn.gerrit.feature .................. SUCCESS [0.150s]
[INFO] org.eclipse.mylyn.gerrit.dashboard.core ........... SUCCESS [0.283s]
[INFO] org.eclipse.mylyn.gerrit.dashboard.ui ............. SUCCESS [0.521s]
[INFO] org.eclipse.mylyn.gerrit.dashboard.feature ........ SUCCESS [0.143s]
[INFO] org.eclipse.mylyn.git.core ........................ SUCCESS [0.239s]
[INFO] org.eclipse.mylyn.git.ui .......................... SUCCESS [0.337s]
[INFO] org.eclipse.mylyn.git ............................. SUCCESS [0.101s]
[INFO] Mylyn Builds ...................................... SUCCESS [0.045s]
[INFO] org.eclipse.mylyn.builds.core ..................... SUCCESS [0.472s]
[INFO] org.eclipse.mylyn.team.ui ......................... SUCCESS [0.531s]
[INFO] org.eclipse.mylyn.team_feature .................... SUCCESS [0.141s]
[INFO] org.eclipse.mylyn.builds.ui ....................... SUCCESS [1.027s]
[INFO] org.eclipse.mylyn.builds .......................... SUCCESS [0.130s]
[INFO] org.eclipse.mylyn.commons.repositories.http.core .. SUCCESS [0.302s]
[INFO] org.eclipse.mylyn.commons.repositories.http ....... SUCCESS [0.160s]
[INFO] org.eclipse.mylyn.hudson.core ..................... SUCCESS [0.420s]
[INFO] org.eclipse.mylyn.hudson.ui ....................... SUCCESS [0.433s]
[INFO] org.eclipse.mylyn.hudson .......................... SUCCESS [0.145s]
[INFO] org.eclipse.mylyn.bugzilla.ide .................... SUCCESS [0.194s]
[INFO] org.eclipse.mylyn.help.ui ......................... SUCCESS [0.624s]
[INFO] org.eclipse.mylyn.ide.ui .......................... SUCCESS [0.442s]
[INFO] org.eclipse.mylyn.tasks.bugs ...................... SUCCESS [0.582s]
[INFO] org.eclipse.mylyn.tasks.ide ....................... SUCCESS [0.325s]
[INFO] org.eclipse.mylyn.ide_feature ..................... SUCCESS [0.240s]
[INFO] org.eclipse.mylyn.debug.ui ........................ SUCCESS [0.408s]
[INFO] org.eclipse.mylyn.ide.ant ......................... SUCCESS [0.515s]
[INFO] org.eclipse.mylyn.java.tasks ...................... SUCCESS [0.372s]
[INFO] org.eclipse.mylyn.java.ui ......................... SUCCESS [0.579s]
[INFO] org.eclipse.mylyn.java_feature .................... SUCCESS [0.241s]
[INFO] org.eclipse.mylyn.pde.ui .......................... SUCCESS [0.652s]
[INFO] org.eclipse.mylyn.pde_feature ..................... SUCCESS [0.251s]
[INFO] org.eclipse.mylyn.team.cvs ........................ SUCCESS [0.518s]
[INFO] org.eclipse.mylyn.team.cvs ........................ SUCCESS [0.210s]
[INFO] org.eclipse.mylyn.subclipse.core .................. SUCCESS [0.223s]
[INFO] org.eclipse.mylyn.subclipse.ui .................... SUCCESS [0.343s]
[INFO] org.eclipse.mylyn.subclipse ....................... SUCCESS [0.112s]
[INFO] org.eclipse.mylyn.trac.core ....................... SUCCESS [0.597s]
[INFO] org.eclipse.mylyn.trac.ui ......................... SUCCESS [6.463s]
[INFO] org.eclipse.mylyn.trac_feature .................... SUCCESS [0.337s]
[INFO] org.eclipse.mylyn.builds.sdk ...................... SUCCESS [0.394s]
[INFO] org.eclipse.mylyn.commons.sdk.util ................ SUCCESS [0.480s]
[INFO] org.eclipse.mylyn.commons.sdk ..................... SUCCESS [0.240s]
[INFO] org.eclipse.mylyn.context.sdk.util ................ SUCCESS [0.410s]
[INFO] org.eclipse.mylyn.context.sdk.java ................ SUCCESS [0.548s]
[INFO] org.eclipse.mylyn.context.sdk ..................... SUCCESS [0.306s]
[INFO] org.eclipse.mylyn.docs.epub.sdk ................... SUCCESS [0.205s]
[INFO] org.eclipse.mylyn.wikitext.help.sdk ............... SUCCESS [0.140s]
[INFO] org.eclipse.mylyn.wikitext.tests .................. SUCCESS [1:37.138s]
[INFO] org.eclipse.mylyn.wikitext.html.tests ............. SUCCESS [5.164s]
[INFO] org.eclipse.mylyn.wikitext.core.tests ............. SUCCESS [4.937s]
[INFO] org.eclipse.mylyn.wikitext.core.osgi.tests ........ SUCCESS [6.070s]
[INFO] org.eclipse.mylyn.wikitext.sdk .................... SUCCESS [0.299s]
[INFO] org.eclipse.mylyn.htmltext.ui ..................... SUCCESS [0.541s]
[INFO] org.eclipse.mylyn.htmltext ........................ SUCCESS [0.161s]
[INFO] org.eclipse.mylyn.docs.sdk ........................ SUCCESS [0.225s]
[INFO] org.eclipse.mylyn.reviews.sdk.feature ............. SUCCESS [0.129s]
[INFO] org.eclipse.mylyn.tests.util ...................... SUCCESS [0.450s]
[INFO] org.eclipse.mylyn.sdk_feature ..................... SUCCESS [0.425s]
[INFO] org.eclipse.mylyn.bugzilla.tests .................. SUCCESS [13:55.168s]
[INFO] org.eclipse.mylyn.tasks.core.tests ................ SUCCESS [10.998s]
[INFO] org.eclipse.mylyn.tasks.tests ..................... SUCCESS [1:33.648s]
[INFO] org.eclipse.mylyn.tasks.index.tests ............... SUCCESS [25.678s]
[INFO] org.eclipse.mylyn.tasks.ui.tests .................. SUCCESS [1:07.532s]
[INFO] org.eclipse.mylyn.trac.tests ...................... SUCCESS [12.151s]
[INFO] org.eclipse.mylyn.trac.core.tests ................. SUCCESS [11.885s]
[INFO] org.eclipse.mylyn.trac.ui.tests ................... SUCCESS [11.355s]
[INFO] org.eclipse.mylyn.test_feature .................... SUCCESS [0.408s]
[INFO] org.eclipse.mylyn.versions.sdk .................... SUCCESS [0.130s]
[INFO] Mylyn for Eclipse 4.x ............................. SUCCESS [17.380s]
[INFO] org.eclipse.mylyn-target .......................... SUCCESS [4.695s]
[INFO] org.eclipse.mylyn.commons.tck ..................... SUCCESS [0.169s]
[INFO] Mylyn Commons ..................................... SUCCESS [2.591s]
[INFO] org.eclipse.mylyn.commons-target .................. SUCCESS [0.048s]
[INFO] org.eclipse.mylyn.commons.tests ................... SUCCESS [21.942s]
[INFO] org.eclipse.mylyn.commons.ui.tests ................ SUCCESS [11.212s]
[INFO] org.eclipse.mylyn.commons.activity.ui ............. SUCCESS [0.358s]
[INFO] org.eclipse.mylyn.commons.activity ................ SUCCESS [0.171s]
[INFO] org.eclipse.mylyn.commons.activity.tests .......... SUCCESS [11.851s]
[INFO] org.eclipse.mylyn.monitor.tests ................... SUCCESS [10.319s]
[INFO] org.eclipse.mylyn.commons.notifications.tests ..... SUCCESS [11.369s]
[INFO] org.eclipse.mylyn.commons.repositories.http.tests . SUCCESS [16.802s]
[INFO] org.eclipse.mylyn.commons.repositories.tests ...... SUCCESS [12.010s]
[INFO] org.eclipse.mylyn.discovery.tests ................. SUCCESS [13.586s]
[INFO] org.eclipse.mylyn.commons.development ............. SUCCESS [0.216s]
[INFO] org.eclipse.mylyn.commons.identity.ui ............. SUCCESS [0.444s]
[INFO] Mylyn Versions .................................... SUCCESS [2.641s]
[INFO] org.eclipse.mylyn.versions.tests .................. SUCCESS [14.191s]
[INFO] org.eclipse.mylyn.versions.development ............ SUCCESS [0.112s]
[INFO] org.eclipse.mylyn.help.sdk ........................ SUCCESS [1.946s]
[INFO] org.eclipse.mylyn.tasks.index ..................... SUCCESS [0.324s]
[INFO] Mylyn Tasks ....................................... SUCCESS [2.654s]
[INFO] org.eclipse.mylyn.tasks-target .................... SUCCESS [0.050s]
[INFO] org.eclipse.mylyn.tasks.activity.core ............. SUCCESS [0.591s]
[INFO] org.eclipse.mylyn.tasks.activity.ui ............... SUCCESS [0.493s]
[INFO] org.eclipse.mylyn.tasks.activity.tests ............ SUCCESS [16.378s]
[INFO] org.eclipse.mylyn.tasks.connector-bugzilla-rest ... SUCCESS [0.052s]
[INFO] org.eclipse.mylyn.bugzilla.rest.core .............. SUCCESS [0.698s]
[INFO] org.eclipse.mylyn.bugzilla.rest.ui ................ SUCCESS [0.662s]
[INFO] org.eclipse.mylyn.bugzilla.rest ................... SUCCESS [0.400s]
[INFO] org.eclipse.mylyn.bugzilla.rest.core.tests ........ SUCCESS [4:30.886s]
[INFO] org.eclipse.mylyn.bugzilla.rest.tests ............. SUCCESS [18.275s]
[INFO] org.eclipse.mylyn.bugzilla.rest.ui.tests .......... SUCCESS [11.394s]
[INFO] org.eclipse.mylyn.cdt.tests ....................... SUCCESS [15.377s]
[INFO] Mylyn Context ..................................... SUCCESS [2.457s]
[INFO] org.eclipse.mylyn.context-target .................. SUCCESS [0.066s]
[INFO] org.eclipse.mylyn.context.tasks.tests ............. SUCCESS [18.614s]
[INFO] org.eclipse.mylyn.context.tests ................... SUCCESS [13.583s]
[INFO] org.eclipse.mylyn.debug.tests ..................... SUCCESS [13.578s]
[INFO] org.eclipse.mylyn.ide.tests ....................... SUCCESS [12.679s]
[INFO] org.eclipse.mylyn.java.tests ...................... SUCCESS [1:09.750s]
[INFO] org.eclipse.mylyn.resources.tests ................. SUCCESS [13.432s]
[INFO] org.eclipse.mylyn.team.tests ...................... SUCCESS [12.322s]
[INFO] org.eclipse.mylyn.context.development ............. SUCCESS [0.312s]
[INFO] org.eclipse.mylyn.context.tasks.ui.tests .......... SUCCESS [21.148s]
[INFO] Mylyn Builds ...................................... SUCCESS [2.643s]
[INFO] org.eclipse.mylyn.builds.tests .................... SUCCESS [12.255s]
[INFO] org.eclipse.mylyn.hudson.tests .................... SUCCESS [2:28.696s]
[INFO] org.eclipse.mylyn.builds.development .............. SUCCESS [0.168s]
[INFO] org.eclipse.mylyn.docs.epub.tests ................. SUCCESS [5.268s]
[INFO] org.eclipse.mylyn.wikitext.creole.core ............ SUCCESS [0.309s]
[INFO] org.eclipse.mylyn.wikitext.creole.tests ........... SUCCESS [5.862s]
[INFO] org.eclipse.mylyn.wikitext.markdown.tests ......... SUCCESS [5.106s]
[INFO] org.eclipse.mylyn.docs.development ................ SUCCESS [0.222s]
[INFO] org.eclipse.mylyn.wikitext.core.maven ............. SUCCESS [36.642s]
[INFO] org.eclipse.mylyn.wikitext.creole.ui .............. SUCCESS [0.326s]
[INFO] org.eclipse.mylyn.wikitext.commonmark ............. SUCCESS [0.373s]
[INFO] org.eclipse.mylyn.wikitext.commonmark.ui .......... SUCCESS [0.358s]
[INFO] org.eclipse.mylyn.wikitext.extras ................. SUCCESS [0.208s]
[INFO] org.eclipse.mylyn.wikitext.asciidoc.tests ......... SUCCESS [4.738s]
[INFO] org.eclipse.mylyn.wikitext.commonmark.tests ....... SUCCESS [8.716s]
[INFO] org.eclipse.mylyn.wikitext-standalone ............. SUCCESS [2:15.083s]
[INFO] org.eclipse.mylyn.docs.epub.ant.core .............. SUCCESS [0.311s]
[INFO] Mylyn Docs ........................................ SUCCESS [2.658s]
[INFO] org.eclipse.mylyn.gerrit.core.tests ............... SUCCESS [10.536s]
[INFO] org.eclipse.mylyn.gerrit.target ................... SUCCESS [0.059s]
[INFO] org.eclipse.mylyn.gerrit.tests .................... SUCCESS [10:36.335s]
[INFO] org.eclipse.mylyn.gerrit.ui.tests ................. SUCCESS [12.380s]
[INFO] org.eclipse.mylyn.reviews.core.tests .............. SUCCESS [14.857s]
[INFO] org.eclipse.mylyn.reviews.tests ................... SUCCESS [11.563s]
[INFO] org.eclipse.mylyn.reviews.development.feature ..... SUCCESS [0.170s]
[INFO] org.eclipse.mylyn.reviews.ui.tests ................ SUCCESS [26.955s]
[INFO] org.eclipse.mylyn.all ............................. SUCCESS [0.044s]
[INFO] ------------------------------------------------------------------------
[INFO] BUILD SUCCESS
[INFO] ------------------------------------------------------------------------
[INFO] Total time: 56:05.279s
[INFO] Finished at: Mon May 30 20:06:25 EDT 2016
[INFO] Final Memory: 602M/10594M
[INFO] ------------------------------------------------------------------------
[DEBUG] Closing connection to remote
[DEBUG] Waiting for process to finish
[DEBUG] Result: 0
Terminating xvnc.
Recording fingerprints
Archiving artifacts
Recording test results
Finished: UNSTABLE