Console Output

Started by user torkildr@gmail.com
Cleaning the workspace because project is configured to clean the workspace before each build.
Checkout:workspace / /home/hudson/genie.mylyn/.hudson/jobs/mylyn-docs-epub-release/workspace - hudson.remoting.LocalChannel@6db576a3
Using strategy: Default
Last Built Revision: Revision ab84484c84d3f93359086b1344f5dd8299561535 (origin/master)
Checkout:workspace / /home/hudson/genie.mylyn/.hudson/jobs/mylyn-docs-epub-release/workspace - hudson.remoting.LocalChannel@6db576a3
Cloning the remote Git repository
Cloning repository origin
Fetching upstream changes from git://git.eclipse.org/gitroot/mylyn/org.eclipse.mylyn.docs
Commencing build of Revision ab84484c84d3f93359086b1344f5dd8299561535 (origin/master)
Checking out Revision ab84484c84d3f93359086b1344f5dd8299561535 (origin/master)
[workspace] $ /bin/sh -xe /tmp/hudson8707601192673601861.sh
+ git checkout master
Switched to branch 'master'
Your branch is up-to-date with 'origin/master'.
+ git status
On branch master
Your branch is up-to-date with 'origin/master'.

nothing to commit, working directory clean
[INFO] Using Maven 3 installation: apache-maven-latest
[INFO] Checking Maven 3 installation environment
[workspace] $ /shared/common/apache-maven-latest/bin/mvn --help
[INFO] Checking Maven 3 installation version
[INFO] Detected Maven 3 installation version: 3.5.2
[WARN] Detected superfluous option: -B
[WARN] Detected superfluous option: -V
[workspace] $ /shared/common/apache-maven-latest/bin/mvn -U -B -V -e --fail-at-end -Possrh release:prepare release:perform -V -B -Dscm.developerConnection=scm:git:file:///gitroot/mylyn/org.eclipse.mylyn.docs.git -Dmaven.ext.class.path=/home/hudson/genie.mylyn/.hudson/maven/slavebundle/resources:/home/hudson/genie.mylyn/.hudson/maven/slavebundle/lib/maven3-eventspy-3.1.jar:/home/hudson/genie.mylyn/.hudson/war/webapp/WEB-INF/lib/hudson-remoting-3.0.0.jar -Dhudson.eventspy.port=50037 -f epub/core/pom.xml
[DEBUG] Waiting for connection on port: 50037
Apache Maven 3.5.2 (138edd61fd100ec658bfa2d307c43b76940a5d7d; 2017-10-18T03:58:13-04:00)
Maven home: /shared/common/apache-maven-latest
Java version: 1.8.0_131, vendor: Oracle Corporation
Java home: /opt/public/common/jdk1.8.0_131.x64/jre
Default locale: en_US, platform encoding: UTF-8
OS name: "linux", version: "3.12.60-52.54-default", arch: "amd64", family: "unix"
SLF4J: Class path contains multiple SLF4J bindings.
SLF4J: Found binding in [jar:file:/home/hudson/genie.mylyn/.hudson/maven/slavebundle/lib/maven3-eventspy-runtime.jar!/org/slf4j/impl/StaticLoggerBinder.class]
SLF4J: Found binding in [jar:file:/shared/common/apache-maven-latest/lib/maven-slf4j-provider-3.5.2.jar!/org/slf4j/impl/StaticLoggerBinder.class]
SLF4J: See http://www.slf4j.org/codes.html#multiple_bindings for an explanation.
[DEBUG] Connected to remote
[INFO] Error stacktraces are turned on.
[WARNING] Failed to notify spy org.hudsonci.maven.eventspy_31.DelegatingEventSpy: DEFAULT_GLOBAL_SETTINGS_FILE
[WARN] o.h.m.e.EventSpyProcessor - Unhandled event: org.apache.maven.toolchain.building.DefaultToolchainsBuildingRequest@d400943 (org.apache.maven.toolchain.building.DefaultToolchainsBuildingRequest)
[WARN] o.h.m.e.EventSpyProcessor - Unhandled event: org.apache.maven.toolchain.building.DefaultToolchainsBuildingRequest@d400943 (org.apache.maven.toolchain.building.DefaultToolchainsBuildingRequest)
[INFO] Scanning for projects...
[INFO] ------------------------------------------------------------------------
[INFO] Reactor Build Order:
[INFO] 
[INFO] Mylyn Docs: EPUB Core
[INFO] Eclipse EPUB Tools Core
[INFO] Eclipse EPUB Tools Ant Task
[INFO] Mylyn EPUB Core p2 Repository
[INFO] 
[INFO] ------------------------------------------------------------------------
[INFO] Building Mylyn Docs: EPUB Core 4.0.6-SNAPSHOT
[INFO] ------------------------------------------------------------------------
[INFO] 
[INFO] --- maven-release-plugin:2.5.3:prepare (default-cli) @ epub.core ---
[INFO] Verifying that there are no local modifications...
[INFO]   ignoring changes on: **/pom.xml.releaseBackup, **/pom.xml.next, **/pom.xml.tag, **/pom.xml.branch, **/release.properties, **/pom.xml.backup
[INFO] Executing: /bin/sh -c cd /jobs/genie.mylyn/mylyn-docs-epub-release/workspace/epub/core && git rev-parse --show-toplevel
[INFO] Working directory: /jobs/genie.mylyn/mylyn-docs-epub-release/workspace/epub/core
[INFO] Executing: /bin/sh -c cd /jobs/genie.mylyn/mylyn-docs-epub-release/workspace/epub/core && git status --porcelain .
[INFO] Working directory: /jobs/genie.mylyn/mylyn-docs-epub-release/workspace/epub/core
[INFO] Checking dependencies and plugins for snapshots ...
[INFO] Transforming 'Mylyn Docs: EPUB Core'...
[INFO] Transforming 'Eclipse EPUB Tools Core'...
[INFO] Transforming 'Eclipse EPUB Tools Ant Task'...
[INFO]   Updating org.eclipse.mylyn.docs.epub.core to 4.0.6
[INFO] Transforming 'Mylyn EPUB Core p2 Repository'...
[INFO] Not generating release POMs
[INFO] Executing goals 'clean verify'...
[INFO] [INFO] Scanning for projects...
[INFO] [INFO] ------------------------------------------------------------------------
[INFO] [INFO] Reactor Build Order:
[INFO] [INFO] 
[INFO] [INFO] Mylyn Docs: EPUB Core
[INFO] [INFO] Eclipse EPUB Tools Core
[INFO] [INFO] Eclipse EPUB Tools Ant Task
[INFO] [INFO] Mylyn EPUB Core p2 Repository
[INFO] [INFO] 
[INFO] [INFO] ------------------------------------------------------------------------
[INFO] [INFO] Building Mylyn Docs: EPUB Core 4.0.6
[INFO] [INFO] ------------------------------------------------------------------------
[INFO] [INFO] 
[INFO] [INFO] --- maven-clean-plugin:2.5:clean (default-clean) @ epub.core ---
[INFO] [INFO] 
[INFO] [INFO] --- maven-source-plugin:3.0.1:jar-no-fork (attach-sources) @ epub.core ---
[INFO] [INFO] 
[INFO] [INFO] --- maven-gpg-plugin:1.6:sign (sign-artifacts) @ epub.core ---
[INFO] gpg: problem with the agent: End of file
[INFO] gpg: no default secret key: Operation cancelled
[INFO] gpg: signing failed: Operation cancelled
[INFO] [INFO] ------------------------------------------------------------------------
[INFO] [INFO] Reactor Summary:
[INFO] [INFO] 
[INFO] [INFO] Mylyn Docs: EPUB Core .............................. FAILURE [  2.930 s]
[INFO] [INFO] Eclipse EPUB Tools Core ............................ SKIPPED
[INFO] [INFO] Eclipse EPUB Tools Ant Task ........................ SKIPPED
[INFO] [INFO] Mylyn EPUB Core p2 Repository ...................... SKIPPED
[INFO] [INFO] ------------------------------------------------------------------------
[INFO] [INFO] BUILD FAILURE
[INFO] [INFO] ------------------------------------------------------------------------
[INFO] [INFO] Total time: 3.991 s
[INFO] [INFO] Finished at: 2018-01-20T15:30:58-05:00
[INFO] [INFO] Final Memory: 23M/1536M
[INFO] [INFO] ------------------------------------------------------------------------
[INFO] [ERROR] Failed to execute goal org.apache.maven.plugins:maven-gpg-plugin:1.6:sign (sign-artifacts) on project epub.core: Exit code: 2 -> [Help 1]
[INFO] [ERROR] 
[INFO] [ERROR] To see the full stack trace of the errors, re-run Maven with the -e switch.
[INFO] [ERROR] Re-run Maven using the -X switch to enable full debug logging.
[INFO] [ERROR] 
[INFO] [ERROR] For more information about the errors and possible solutions, please read the following articles:
[INFO] [ERROR] [Help 1] http://cwiki.apache.org/confluence/display/MAVEN/MojoExecutionException
[INFO] ------------------------------------------------------------------------
[INFO] Reactor Summary:
[INFO] 
[INFO] Mylyn Docs: EPUB Core .............................. FAILURE [  6.951 s]
[INFO] Eclipse EPUB Tools Core ............................ SKIPPED
[INFO] Eclipse EPUB Tools Ant Task ........................ SKIPPED
[INFO] Mylyn EPUB Core p2 Repository ...................... SKIPPED
[INFO] ------------------------------------------------------------------------
[INFO] BUILD FAILURE
[INFO] ------------------------------------------------------------------------
[INFO] Total time: 9.820 s
[INFO] Finished at: 2018-01-20T15:30:58-05:00
[INFO] Final Memory: 32M/1544M
[INFO] ------------------------------------------------------------------------
[INFO] o.h.m.e.h.MavenExecutionResultHandler - Build failed with exception(s)
[INFO] o.h.m.e.h.MavenExecutionResultHandler - [1] org.apache.maven.lifecycle.LifecycleExecutionException: Failed to execute goal org.apache.maven.plugins:maven-release-plugin:2.5.3:prepare (default-cli) on project epub.core: Maven execution failed, exit code: '1'
[DEBUG] Closing connection to remote
[ERROR] Failed to execute goal org.apache.maven.plugins:maven-release-plugin:2.5.3:prepare (default-cli) on project epub.core: Maven execution failed, exit code: '1' -> [Help 1]
org.apache.maven.lifecycle.LifecycleExecutionException: Failed to execute goal org.apache.maven.plugins:maven-release-plugin:2.5.3:prepare (default-cli) on project epub.core: Maven execution failed, exit code: '1'
    at org.apache.maven.lifecycle.internal.MojoExecutor.execute (MojoExecutor.java:213)
    at org.apache.maven.lifecycle.internal.MojoExecutor.execute (MojoExecutor.java:154)
    at org.apache.maven.lifecycle.internal.MojoExecutor.execute (MojoExecutor.java:146)
    at org.apache.maven.lifecycle.internal.LifecycleModuleBuilder.buildProject (LifecycleModuleBuilder.java:117)
    at org.apache.maven.lifecycle.internal.LifecycleModuleBuilder.buildProject (LifecycleModuleBuilder.java:81)
    at org.apache.maven.lifecycle.internal.builder.singlethreaded.SingleThreadedBuilder.build (SingleThreadedBuilder.java:51)
    at org.apache.maven.lifecycle.internal.LifecycleStarter.execute (LifecycleStarter.java:128)
    at org.apache.maven.DefaultMaven.doExecute (DefaultMaven.java:309)
    at org.apache.maven.DefaultMaven.doExecute (DefaultMaven.java:194)
    at org.apache.maven.DefaultMaven.execute (DefaultMaven.java:107)
    at org.apache.maven.cli.MavenCli.execute (MavenCli.java:955)
    at org.apache.maven.cli.MavenCli.doMain (MavenCli.java:290)
    at org.apache.maven.cli.MavenCli.main (MavenCli.java:194)
    at sun.reflect.NativeMethodAccessorImpl.invoke0 (Native Method)
    at sun.reflect.NativeMethodAccessorImpl.invoke (NativeMethodAccessorImpl.java:62)
    at sun.reflect.DelegatingMethodAccessorImpl.invoke (DelegatingMethodAccessorImpl.java:43)
    at java.lang.reflect.Method.invoke (Method.java:498)
    at org.codehaus.plexus.classworlds.launcher.Launcher.launchEnhanced (Launcher.java:289)
    at org.codehaus.plexus.classworlds.launcher.Launcher.launch (Launcher.java:229)
    at org.codehaus.plexus.classworlds.launcher.Launcher.mainWithExitCode (Launcher.java:415)
    at org.codehaus.plexus.classworlds.launcher.Launcher.main (Launcher.java:356)
Caused by: org.apache.maven.plugin.MojoExecutionException: Maven execution failed, exit code: '1'
    at org.apache.maven.plugins.release.PrepareReleaseMojo.prepareRelease (PrepareReleaseMojo.java:290)
    at org.apache.maven.plugins.release.PrepareReleaseMojo.execute (PrepareReleaseMojo.java:240)
    at org.apache.maven.plugin.DefaultBuildPluginManager.executeMojo (DefaultBuildPluginManager.java:134)
    at org.apache.maven.lifecycle.internal.MojoExecutor.execute (MojoExecutor.java:208)
    at org.apache.maven.lifecycle.internal.MojoExecutor.execute (MojoExecutor.java:154)
    at org.apache.maven.lifecycle.internal.MojoExecutor.execute (MojoExecutor.java:146)
    at org.apache.maven.lifecycle.internal.LifecycleModuleBuilder.buildProject (LifecycleModuleBuilder.java:117)
    at org.apache.maven.lifecycle.internal.LifecycleModuleBuilder.buildProject (LifecycleModuleBuilder.java:81)
    at org.apache.maven.lifecycle.internal.builder.singlethreaded.SingleThreadedBuilder.build (SingleThreadedBuilder.java:51)
    at org.apache.maven.lifecycle.internal.LifecycleStarter.execute (LifecycleStarter.java:128)
    at org.apache.maven.DefaultMaven.doExecute (DefaultMaven.java:309)
    at org.apache.maven.DefaultMaven.doExecute (DefaultMaven.java:194)
    at org.apache.maven.DefaultMaven.execute (DefaultMaven.java:107)
    at org.apache.maven.cli.MavenCli.execute (MavenCli.java:955)
    at org.apache.maven.cli.MavenCli.doMain (MavenCli.java:290)
    at org.apache.maven.cli.MavenCli.main (MavenCli.java:194)
    at sun.reflect.NativeMethodAccessorImpl.invoke0 (Native Method)
    at sun.reflect.NativeMethodAccessorImpl.invoke (NativeMethodAccessorImpl.java:62)
    at sun.reflect.DelegatingMethodAccessorImpl.invoke (DelegatingMethodAccessorImpl.java:43)
    at java.lang.reflect.Method.invoke (Method.java:498)
    at org.codehaus.plexus.classworlds.launcher.Launcher.launchEnhanced (Launcher.java:289)
    at org.codehaus.plexus.classworlds.launcher.Launcher.launch (Launcher.java:229)
    at org.codehaus.plexus.classworlds.launcher.Launcher.mainWithExitCode (Launcher.java:415)
    at org.codehaus.plexus.classworlds.launcher.Launcher.main (Launcher.java:356)
Caused by: org.apache.maven.shared.release.ReleaseExecutionException: Maven execution failed, exit code: '1'
    at org.apache.maven.shared.release.phase.AbstractRunGoalsPhase.execute (AbstractRunGoalsPhase.java:91)
    at org.apache.maven.shared.release.phase.RunPrepareGoalsPhase.execute (RunPrepareGoalsPhase.java:44)
    at org.apache.maven.shared.release.DefaultReleaseManager.prepare (DefaultReleaseManager.java:234)
    at org.apache.maven.shared.release.DefaultReleaseManager.prepare (DefaultReleaseManager.java:169)
    at org.apache.maven.shared.release.DefaultReleaseManager.prepare (DefaultReleaseManager.java:146)
    at org.apache.maven.shared.release.DefaultReleaseManager.prepare (DefaultReleaseManager.java:107)
    at org.apache.maven.plugins.release.PrepareReleaseMojo.prepareRelease (PrepareReleaseMojo.java:286)
    at org.apache.maven.plugins.release.PrepareReleaseMojo.execute (PrepareReleaseMojo.java:240)
    at org.apache.maven.plugin.DefaultBuildPluginManager.executeMojo (DefaultBuildPluginManager.java:134)
    at org.apache.maven.lifecycle.internal.MojoExecutor.execute (MojoExecutor.java:208)
    at org.apache.maven.lifecycle.internal.MojoExecutor.execute (MojoExecutor.java:154)
    at org.apache.maven.lifecycle.internal.MojoExecutor.execute (MojoExecutor.java:146)
    at org.apache.maven.lifecycle.internal.LifecycleModuleBuilder.buildProject (LifecycleModuleBuilder.java:117)
    at org.apache.maven.lifecycle.internal.LifecycleModuleBuilder.buildProject (LifecycleModuleBuilder.java:81)
    at org.apache.maven.lifecycle.internal.builder.singlethreaded.SingleThreadedBuilder.build (SingleThreadedBuilder.java:51)
    at org.apache.maven.lifecycle.internal.LifecycleStarter.execute (LifecycleStarter.java:128)
    at org.apache.maven.DefaultMaven.doExecute (DefaultMaven.java:309)
    at org.apache.maven.DefaultMaven.doExecute (DefaultMaven.java:194)
    at org.apache.maven.DefaultMaven.execute (DefaultMaven.java:107)
    at org.apache.maven.cli.MavenCli.execute (MavenCli.java:955)
    at org.apache.maven.cli.MavenCli.doMain (MavenCli.java:290)
    at org.apache.maven.cli.MavenCli.main (MavenCli.java:194)
    at sun.reflect.NativeMethodAccessorImpl.invoke0 (Native Method)
    at sun.reflect.NativeMethodAccessorImpl.invoke (NativeMethodAccessorImpl.java:62)
    at sun.reflect.DelegatingMethodAccessorImpl.invoke (DelegatingMethodAccessorImpl.java:43)
    at java.lang.reflect.Method.invoke (Method.java:498)
    at org.codehaus.plexus.classworlds.launcher.Launcher.launchEnhanced (Launcher.java:289)
    at org.codehaus.plexus.classworlds.launcher.Launcher.launch (Launcher.java:229)
    at org.codehaus.plexus.classworlds.launcher.Launcher.mainWithExitCode (Launcher.java:415)
    at org.codehaus.plexus.classworlds.launcher.Launcher.main (Launcher.java:356)
Caused by: org.apache.maven.shared.release.exec.MavenExecutorException: Maven execution failed, exit code: '1'
    at org.apache.maven.shared.release.exec.InvokerMavenExecutor.executeGoals (InvokerMavenExecutor.java:433)
    at org.apache.maven.shared.release.exec.AbstractMavenExecutor.executeGoals (AbstractMavenExecutor.java:114)
    at org.apache.maven.shared.release.phase.AbstractRunGoalsPhase.execute (AbstractRunGoalsPhase.java:85)
    at org.apache.maven.shared.release.phase.RunPrepareGoalsPhase.execute (RunPrepareGoalsPhase.java:44)
    at org.apache.maven.shared.release.DefaultReleaseManager.prepare (DefaultReleaseManager.java:234)
    at org.apache.maven.shared.release.DefaultReleaseManager.prepare (DefaultReleaseManager.java:169)
    at org.apache.maven.shared.release.DefaultReleaseManager.prepare (DefaultReleaseManager.java:146)
    at org.apache.maven.shared.release.DefaultReleaseManager.prepare (DefaultReleaseManager.java:107)
    at org.apache.maven.plugins.release.PrepareReleaseMojo.prepareRelease (PrepareReleaseMojo.java:286)
    at org.apache.maven.plugins.release.PrepareReleaseMojo.execute (PrepareReleaseMojo.java:240)
    at org.apache.maven.plugin.DefaultBuildPluginManager.executeMojo (DefaultBuildPluginManager.java:134)
    at org.apache.maven.lifecycle.internal.MojoExecutor.execute (MojoExecutor.java:208)
    at org.apache.maven.lifecycle.internal.MojoExecutor.execute (MojoExecutor.java:154)
    at org.apache.maven.lifecycle.internal.MojoExecutor.execute (MojoExecutor.java:146)
    at org.apache.maven.lifecycle.internal.LifecycleModuleBuilder.buildProject (LifecycleModuleBuilder.java:117)
    at org.apache.maven.lifecycle.internal.LifecycleModuleBuilder.buildProject (LifecycleModuleBuilder.java:81)
    at org.apache.maven.lifecycle.internal.builder.singlethreaded.SingleThreadedBuilder.build (SingleThreadedBuilder.java:51)
    at org.apache.maven.lifecycle.internal.LifecycleStarter.execute (LifecycleStarter.java:128)
    at org.apache.maven.DefaultMaven.doExecute (DefaultMaven.java:309)
    at org.apache.maven.DefaultMaven.doExecute (DefaultMaven.java:194)
    at org.apache.maven.DefaultMaven.execute (DefaultMaven.java:107)
    at org.apache.maven.cli.MavenCli.execute (MavenCli.java:955)
    at org.apache.maven.cli.MavenCli.doMain (MavenCli.java:290)
    at org.apache.maven.cli.MavenCli.main (MavenCli.java:194)
    at sun.reflect.NativeMethodAccessorImpl.invoke0 (Native Method)
    at sun.reflect.NativeMethodAccessorImpl.invoke (NativeMethodAccessorImpl.java:62)
    at sun.reflect.DelegatingMethodAccessorImpl.invoke (DelegatingMethodAccessorImpl.java:43)
    at java.lang.reflect.Method.invoke (Method.java:498)
    at org.codehaus.plexus.classworlds.launcher.Launcher.launchEnhanced (Launcher.java:289)
    at org.codehaus.plexus.classworlds.launcher.Launcher.launch (Launcher.java:229)
    at org.codehaus.plexus.classworlds.launcher.Launcher.mainWithExitCode (Launcher.java:415)
    at org.codehaus.plexus.classworlds.launcher.Launcher.main (Launcher.java:356)
[ERROR] 
[ERROR] Re-run Maven using the -X switch to enable full debug logging.
[ERROR] 
[ERROR] For more information about the errors and possible solutions, please read the following articles:
[ERROR] [Help 1] http://cwiki.apache.org/confluence/display/MAVEN/MojoExecutionException
[DEBUG] Waiting for process to finish
[DEBUG] Result: 1
Recording test results
Finished: FAILURE