Console Output

Skipping 3,414 KB.. Full Log
	assertEquals("http://mock-repo-evolved.com/tickets/123", new TaskURL().getValue(taskWithBrowserUrl));
	                                                                       ^^^^^^^^
Discouraged access: The method 'CommitTemplateVariables.TaskURL.getValue(ITask)' is not API (restriction on classpath entry '/jobs/genie.mylyn/mylyn-context-nightly/workspace/org.eclipse.mylyn.team.ui/target/classes')
[WARNING] /jobs/genie.mylyn/mylyn-context-nightly/workspace/org.eclipse.mylyn.team.tests/src/org/eclipse/mylyn/team/tests/CommitTemplateVariablesTest.java:[22] 
	assertEquals("http://mock-repo-evolved.com/tickets/123", new TaskURL().getValue(taskWithBrowserUrl));
	                                                                                ^^^^^^^^^^^^^^^^^^
Discouraged access: The field 'MockRepositoryConnectorTestCase.taskWithBrowserUrl' is not API (restriction on classpath entry '/home/hudson/genie.mylyn/.jenkins/jobs/mylyn-context-nightly/workspace/.repository/p2/osgi/bundle/org.eclipse.mylyn.tasks.tests/3.26.0.N20190930-2129/org.eclipse.mylyn.tasks.tests-3.26.0.N20190930-2129.jar')
[WARNING] /jobs/genie.mylyn/mylyn-context-nightly/workspace/org.eclipse.mylyn.team.tests/src/org/eclipse/mylyn/team/tests/TeamPropertiesLinkProviderTest.java:[27] 
	import org.eclipse.mylyn.internal.team.ui.ContextChangeSet;
	       ^^^^^^^^^^^^^^^^^^^^^^^^^^^^^^^^^^^^^^^^^^^^^^^^^^^
Discouraged access: The type 'ContextChangeSet' is not API (restriction on classpath entry '/jobs/genie.mylyn/mylyn-context-nightly/workspace/org.eclipse.mylyn.team.ui/target/classes')
[WARNING] /jobs/genie.mylyn/mylyn-context-nightly/workspace/org.eclipse.mylyn.team.tests/src/org/eclipse/mylyn/team/tests/TeamPropertiesLinkProviderTest.java:[28] 
	import org.eclipse.mylyn.internal.team.ui.FocusedTeamUiPlugin;
	       ^^^^^^^^^^^^^^^^^^^^^^^^^^^^^^^^^^^^^^^^^^^^^^^^^^^^^^
Discouraged access: The type 'FocusedTeamUiPlugin' is not API (restriction on classpath entry '/jobs/genie.mylyn/mylyn-context-nightly/workspace/org.eclipse.mylyn.team.ui/target/classes')
[WARNING] /jobs/genie.mylyn/mylyn-context-nightly/workspace/org.eclipse.mylyn.team.tests/src/org/eclipse/mylyn/team/tests/TeamPropertiesLinkProviderTest.java:[29] 
	import org.eclipse.mylyn.internal.team.ui.properties.TeamPropertiesLinkProvider;
	       ^^^^^^^^^^^^^^^^^^^^^^^^^^^^^^^^^^^^^^^^^^^^^^^^^^^^^^^^^^^^^^^^^^^^^^^^
Discouraged access: The type 'TeamPropertiesLinkProvider' is not API (restriction on classpath entry '/jobs/genie.mylyn/mylyn-context-nightly/workspace/org.eclipse.mylyn.team.ui/target/classes')
[WARNING] /jobs/genie.mylyn/mylyn-context-nightly/workspace/org.eclipse.mylyn.team.tests/src/org/eclipse/mylyn/team/tests/TeamPropertiesLinkProviderTest.java:[30] 
	import org.eclipse.mylyn.tasks.tests.connector.MockTask;
	       ^^^^^^^^^^^^^^^^^^^^^^^^^^^^^^^^^^^^^^^^^^^^^^^^
Discouraged access: The type 'MockTask' is not API (restriction on classpath entry '/home/hudson/genie.mylyn/.jenkins/jobs/mylyn-context-nightly/workspace/.repository/p2/osgi/bundle/org.eclipse.mylyn.tasks.tests/3.26.0.N20190930-2129/org.eclipse.mylyn.tasks.tests-3.26.0.N20190930-2129.jar')
[WARNING] /jobs/genie.mylyn/mylyn-context-nightly/workspace/org.eclipse.mylyn.team.tests/src/org/eclipse/mylyn/team/tests/TeamPropertiesLinkProviderTest.java:[32] 
	import org.eclipse.team.internal.core.subscribers.ActiveChangeSetManager;
	       ^^^^^^^^^^^^^^^^^^^^^^^^^^^^^^^^^^^^^^^^^^^^^^^^^^^^^^^^^^^^^^^^^
Discouraged access: The type 'ActiveChangeSetManager' is not API (restriction on classpath entry '/home/hudson/genie.mylyn/.jenkins/jobs/mylyn-context-nightly/workspace/.repository/p2/osgi/bundle/org.eclipse.team.core/3.8.200.v20180309-1840/org.eclipse.team.core-3.8.200.v20180309-1840.jar')
[WARNING] /jobs/genie.mylyn/mylyn-context-nightly/workspace/org.eclipse.mylyn.team.tests/src/org/eclipse/mylyn/team/tests/TeamPropertiesLinkProviderTest.java:[66] 
	MockTask task = new MockTask("1");
	^^^^^^^^
Discouraged access: The type 'MockTask' is not API (restriction on classpath entry '/home/hudson/genie.mylyn/.jenkins/jobs/mylyn-context-nightly/workspace/.repository/p2/osgi/bundle/org.eclipse.mylyn.tasks.tests/3.26.0.N20190930-2129/org.eclipse.mylyn.tasks.tests-3.26.0.N20190930-2129.jar')
[WARNING] /jobs/genie.mylyn/mylyn-context-nightly/workspace/org.eclipse.mylyn.team.tests/src/org/eclipse/mylyn/team/tests/TeamPropertiesLinkProviderTest.java:[66] 
	MockTask task = new MockTask("1");
	                    ^^^^^^^^
Discouraged access: The type 'MockTask' is not API (restriction on classpath entry '/home/hudson/genie.mylyn/.jenkins/jobs/mylyn-context-nightly/workspace/.repository/p2/osgi/bundle/org.eclipse.mylyn.tasks.tests/3.26.0.N20190930-2129/org.eclipse.mylyn.tasks.tests-3.26.0.N20190930-2129.jar')
[WARNING] /jobs/genie.mylyn/mylyn-context-nightly/workspace/org.eclipse.mylyn.team.tests/src/org/eclipse/mylyn/team/tests/TeamPropertiesLinkProviderTest.java:[66] 
	MockTask task = new MockTask("1");
	                    ^^^^^^^^
Discouraged access: The constructor 'MockTask(String)' is not API (restriction on classpath entry '/home/hudson/genie.mylyn/.jenkins/jobs/mylyn-context-nightly/workspace/.repository/p2/osgi/bundle/org.eclipse.mylyn.tasks.tests/3.26.0.N20190930-2129/org.eclipse.mylyn.tasks.tests-3.26.0.N20190930-2129.jar')
[WARNING] /jobs/genie.mylyn/mylyn-context-nightly/workspace/org.eclipse.mylyn.team.tests/src/org/eclipse/mylyn/team/tests/TeamPropertiesLinkProviderTest.java:[67] 
	task.setSummary("summary");
	     ^^^^^^^^^^
Discouraged access: The method 'AbstractTask.setSummary(String)' is not API (restriction on classpath entry '/home/hudson/genie.mylyn/.jenkins/jobs/mylyn-context-nightly/workspace/.repository/p2/osgi/bundle/org.eclipse.mylyn.tasks.core/3.26.0.N20190930-2129/org.eclipse.mylyn.tasks.core-3.26.0.N20190930-2129.jar')
[WARNING] /jobs/genie.mylyn/mylyn-context-nightly/workspace/org.eclipse.mylyn.team.tests/src/org/eclipse/mylyn/team/tests/TeamPropertiesLinkProviderTest.java:[68] 
	task.setUrl("http://url");
	     ^^^^^^
Discouraged access: The method 'AbstractTask.setUrl(String)' is not API (restriction on classpath entry '/home/hudson/genie.mylyn/.jenkins/jobs/mylyn-context-nightly/workspace/.repository/p2/osgi/bundle/org.eclipse.mylyn.tasks.core/3.26.0.N20190930-2129/org.eclipse.mylyn.tasks.core-3.26.0.N20190930-2129.jar')
[WARNING] /jobs/genie.mylyn/mylyn-context-nightly/workspace/org.eclipse.mylyn.team.tests/src/org/eclipse/mylyn/team/tests/TeamPropertiesLinkProviderTest.java:[70] 
	ContextChangeSet changeSet = new ContextChangeSet(task, new StubChangeSetManager()) {
	^^^^^^^^^^^^^^^^
Discouraged access: The type 'ContextChangeSet' is not API (restriction on classpath entry '/jobs/genie.mylyn/mylyn-context-nightly/workspace/org.eclipse.mylyn.team.ui/target/classes')
[WARNING] /jobs/genie.mylyn/mylyn-context-nightly/workspace/org.eclipse.mylyn.team.tests/src/org/eclipse/mylyn/team/tests/TeamPropertiesLinkProviderTest.java:[70] 
	ContextChangeSet changeSet = new ContextChangeSet(task, new StubChangeSetManager()) {
	                                 ^^^^^^^^^^^^^^^^
Discouraged access: The type 'ContextChangeSet' is not API (restriction on classpath entry '/jobs/genie.mylyn/mylyn-context-nightly/workspace/org.eclipse.mylyn.team.ui/target/classes')
[WARNING] /jobs/genie.mylyn/mylyn-context-nightly/workspace/org.eclipse.mylyn.team.tests/src/org/eclipse/mylyn/team/tests/TeamPropertiesLinkProviderTest.java:[70] 
	ContextChangeSet changeSet = new ContextChangeSet(task, new StubChangeSetManager()) {
	                                 ^^^^^^^^^^^^^^^^
Discouraged access: The constructor 'ContextChangeSet(ITask, ActiveChangeSetManager)' is not API (restriction on classpath entry '/jobs/genie.mylyn/mylyn-context-nightly/workspace/org.eclipse.mylyn.team.ui/target/classes')
[WARNING] /jobs/genie.mylyn/mylyn-context-nightly/workspace/org.eclipse.mylyn.team.tests/src/org/eclipse/mylyn/team/tests/TeamPropertiesLinkProviderTest.java:[78] 
	FocusedTeamUiPlugin.getDefault()
	^^^^^^^^^^^^^^^^^^^
Discouraged access: The type 'FocusedTeamUiPlugin' is not API (restriction on classpath entry '/jobs/genie.mylyn/mylyn-context-nightly/workspace/org.eclipse.mylyn.team.ui/target/classes')
[WARNING] /jobs/genie.mylyn/mylyn-context-nightly/workspace/org.eclipse.mylyn.team.tests/src/org/eclipse/mylyn/team/tests/TeamPropertiesLinkProviderTest.java:[78] 
	FocusedTeamUiPlugin.getDefault()
	                    ^^^^^^^^^^
Discouraged access: The method 'FocusedTeamUiPlugin.getDefault()' is not API (restriction on classpath entry '/jobs/genie.mylyn/mylyn-context-nightly/workspace/org.eclipse.mylyn.team.ui/target/classes')
[WARNING] /jobs/genie.mylyn/mylyn-context-nightly/workspace/org.eclipse.mylyn.team.tests/src/org/eclipse/mylyn/team/tests/TeamPropertiesLinkProviderTest.java:[80] 
	.setValue(FocusedTeamUiPlugin.COMMIT_TEMPLATE, "${task.key}: ${task.description}");
	          ^^^^^^^^^^^^^^^^^^^^^^^^^^^^^^^^^^^
Discouraged access: The type 'FocusedTeamUiPlugin' is not API (restriction on classpath entry '/jobs/genie.mylyn/mylyn-context-nightly/workspace/org.eclipse.mylyn.team.ui/target/classes')
[WARNING] /jobs/genie.mylyn/mylyn-context-nightly/workspace/org.eclipse.mylyn.team.tests/src/org/eclipse/mylyn/team/tests/TeamPropertiesLinkProviderTest.java:[80] 
	.setValue(FocusedTeamUiPlugin.COMMIT_TEMPLATE, "${task.key}: ${task.description}");
	                              ^^^^^^^^^^^^^^^
Discouraged access: The field 'FocusedTeamUiPlugin.COMMIT_TEMPLATE' is not API (restriction on classpath entry '/jobs/genie.mylyn/mylyn-context-nightly/workspace/org.eclipse.mylyn.team.ui/target/classes')
[WARNING] /jobs/genie.mylyn/mylyn-context-nightly/workspace/org.eclipse.mylyn.team.tests/src/org/eclipse/mylyn/team/tests/TeamPropertiesLinkProviderTest.java:[81] 
	assertEquals("1: summary", changeSet.getComment());
	                                     ^^^^^^^^^^
Discouraged access: The method 'ContextChangeSet.getComment()' is not API (restriction on classpath entry '/jobs/genie.mylyn/mylyn-context-nightly/workspace/org.eclipse.mylyn.team.ui/target/classes')
[WARNING] /jobs/genie.mylyn/mylyn-context-nightly/workspace/org.eclipse.mylyn.team.tests/src/org/eclipse/mylyn/team/tests/TeamPropertiesLinkProviderTest.java:[83] 
	TeamPropertiesLinkProvider linkProvider = new TeamPropertiesLinkProvider();
	^^^^^^^^^^^^^^^^^^^^^^^^^^
Discouraged access: The type 'TeamPropertiesLinkProvider' is not API (restriction on classpath entry '/jobs/genie.mylyn/mylyn-context-nightly/workspace/org.eclipse.mylyn.team.ui/target/classes')
[WARNING] /jobs/genie.mylyn/mylyn-context-nightly/workspace/org.eclipse.mylyn.team.tests/src/org/eclipse/mylyn/team/tests/TeamPropertiesLinkProviderTest.java:[83] 
	TeamPropertiesLinkProvider linkProvider = new TeamPropertiesLinkProvider();
	                                              ^^^^^^^^^^^^^^^^^^^^^^^^^^
Discouraged access: The type 'TeamPropertiesLinkProvider' is not API (restriction on classpath entry '/jobs/genie.mylyn/mylyn-context-nightly/workspace/org.eclipse.mylyn.team.ui/target/classes')
[WARNING] /jobs/genie.mylyn/mylyn-context-nightly/workspace/org.eclipse.mylyn.team.tests/src/org/eclipse/mylyn/team/tests/TeamPropertiesLinkProviderTest.java:[83] 
	TeamPropertiesLinkProvider linkProvider = new TeamPropertiesLinkProvider();
	                                              ^^^^^^^^^^^^^^^^^^^^^^^^^^
Discouraged access: The constructor 'TeamPropertiesLinkProvider()' is not API (restriction on classpath entry '/jobs/genie.mylyn/mylyn-context-nightly/workspace/org.eclipse.mylyn.team.ui/target/classes')
[WARNING] /jobs/genie.mylyn/mylyn-context-nightly/workspace/org.eclipse.mylyn.team.tests/src/org/eclipse/mylyn/team/tests/TeamPropertiesLinkProviderTest.java:[84] 
	assertNull(linkProvider.getCommitCommentTemplate(project1));
	                        ^^^^^^^^^^^^^^^^^^^^^^^^
Discouraged access: The method 'TeamPropertiesLinkProvider.getCommitCommentTemplate(IResource)' is not API (restriction on classpath entry '/jobs/genie.mylyn/mylyn-context-nightly/workspace/org.eclipse.mylyn.team.ui/target/classes')
[WARNING] /jobs/genie.mylyn/mylyn-context-nightly/workspace/org.eclipse.mylyn.team.tests/src/org/eclipse/mylyn/team/tests/TeamPropertiesLinkProviderTest.java:[85] 
	assertTrue(linkProvider.canAccessProperties(project1));
	                        ^^^^^^^^^^^^^^^^^^^
Discouraged access: The method 'TeamPropertiesLinkProvider.canAccessProperties(IResource)' is not API (restriction on classpath entry '/jobs/genie.mylyn/mylyn-context-nightly/workspace/org.eclipse.mylyn.team.ui/target/classes')
[WARNING] /jobs/genie.mylyn/mylyn-context-nightly/workspace/org.eclipse.mylyn.team.tests/src/org/eclipse/mylyn/team/tests/TeamPropertiesLinkProviderTest.java:[87] 
	assertTrue(linkProvider.setCommitCommentTemplate(project1, "ab${task.url}cd"));
	                        ^^^^^^^^^^^^^^^^^^^^^^^^
Discouraged access: The method 'TeamPropertiesLinkProvider.setCommitCommentTemplate(IResource, String)' is not API (restriction on classpath entry '/jobs/genie.mylyn/mylyn-context-nightly/workspace/org.eclipse.mylyn.team.ui/target/classes')
[WARNING] /jobs/genie.mylyn/mylyn-context-nightly/workspace/org.eclipse.mylyn.team.tests/src/org/eclipse/mylyn/team/tests/TeamPropertiesLinkProviderTest.java:[88] 
	assertEquals("ab${task.url}cd", linkProvider.getCommitCommentTemplate(project1));
	                                             ^^^^^^^^^^^^^^^^^^^^^^^^
Discouraged access: The method 'TeamPropertiesLinkProvider.getCommitCommentTemplate(IResource)' is not API (restriction on classpath entry '/jobs/genie.mylyn/mylyn-context-nightly/workspace/org.eclipse.mylyn.team.ui/target/classes')
[WARNING] /jobs/genie.mylyn/mylyn-context-nightly/workspace/org.eclipse.mylyn.team.tests/src/org/eclipse/mylyn/team/tests/TeamPropertiesLinkProviderTest.java:[89] 
	assertEquals("abhttp://urlcd", changeSet.getComment());
	                                         ^^^^^^^^^^
Discouraged access: The method 'ContextChangeSet.getComment()' is not API (restriction on classpath entry '/jobs/genie.mylyn/mylyn-context-nightly/workspace/org.eclipse.mylyn.team.ui/target/classes')
[WARNING] /jobs/genie.mylyn/mylyn-context-nightly/workspace/org.eclipse.mylyn.team.tests/src/org/eclipse/mylyn/team/tests/TeamPropertiesLinkProviderTest.java:[90] 
	assertTrue(linkProvider.canAccessProperties(project1));
	                        ^^^^^^^^^^^^^^^^^^^
Discouraged access: The method 'TeamPropertiesLinkProvider.canAccessProperties(IResource)' is not API (restriction on classpath entry '/jobs/genie.mylyn/mylyn-context-nightly/workspace/org.eclipse.mylyn.team.ui/target/classes')
[WARNING] /jobs/genie.mylyn/mylyn-context-nightly/workspace/org.eclipse.mylyn.team.tests/src/org/eclipse/mylyn/team/tests/TeamPropertiesLinkProviderTest.java:[98] 
	assertEquals("ab${task.url}cd", linkProvider.getCommitCommentTemplate(file));
	                                             ^^^^^^^^^^^^^^^^^^^^^^^^
Discouraged access: The method 'TeamPropertiesLinkProvider.getCommitCommentTemplate(IResource)' is not API (restriction on classpath entry '/jobs/genie.mylyn/mylyn-context-nightly/workspace/org.eclipse.mylyn.team.ui/target/classes')
[WARNING] /jobs/genie.mylyn/mylyn-context-nightly/workspace/org.eclipse.mylyn.team.tests/src/org/eclipse/mylyn/team/tests/TeamPropertiesLinkProviderTest.java:[99] 
	assertEquals("abhttp://urlcd", changeSet.getComment());
	                                         ^^^^^^^^^^
Discouraged access: The method 'ContextChangeSet.getComment()' is not API (restriction on classpath entry '/jobs/genie.mylyn/mylyn-context-nightly/workspace/org.eclipse.mylyn.team.ui/target/classes')
[WARNING] /jobs/genie.mylyn/mylyn-context-nightly/workspace/org.eclipse.mylyn.team.tests/src/org/eclipse/mylyn/team/tests/TeamPropertiesLinkProviderTest.java:[100] 
	assertTrue(linkProvider.canAccessProperties(file));
	                        ^^^^^^^^^^^^^^^^^^^
Discouraged access: The method 'TeamPropertiesLinkProvider.canAccessProperties(IResource)' is not API (restriction on classpath entry '/jobs/genie.mylyn/mylyn-context-nightly/workspace/org.eclipse.mylyn.team.ui/target/classes')
[WARNING] /jobs/genie.mylyn/mylyn-context-nightly/workspace/org.eclipse.mylyn.team.tests/src/org/eclipse/mylyn/team/tests/TeamPropertiesLinkProviderTest.java:[102] 
	linkProvider.setCommitCommentTemplate(file, null);
	             ^^^^^^^^^^^^^^^^^^^^^^^^
Discouraged access: The method 'TeamPropertiesLinkProvider.setCommitCommentTemplate(IResource, String)' is not API (restriction on classpath entry '/jobs/genie.mylyn/mylyn-context-nightly/workspace/org.eclipse.mylyn.team.ui/target/classes')
[WARNING] /jobs/genie.mylyn/mylyn-context-nightly/workspace/org.eclipse.mylyn.team.tests/src/org/eclipse/mylyn/team/tests/TeamPropertiesLinkProviderTest.java:[103] 
	assertNull(linkProvider.getCommitCommentTemplate(file));
	                        ^^^^^^^^^^^^^^^^^^^^^^^^
Discouraged access: The method 'TeamPropertiesLinkProvider.getCommitCommentTemplate(IResource)' is not API (restriction on classpath entry '/jobs/genie.mylyn/mylyn-context-nightly/workspace/org.eclipse.mylyn.team.ui/target/classes')
[WARNING] /jobs/genie.mylyn/mylyn-context-nightly/workspace/org.eclipse.mylyn.team.tests/src/org/eclipse/mylyn/team/tests/TeamPropertiesLinkProviderTest.java:[104] 
	assertNull(linkProvider.getCommitCommentTemplate(project1));
	                        ^^^^^^^^^^^^^^^^^^^^^^^^
Discouraged access: The method 'TeamPropertiesLinkProvider.getCommitCommentTemplate(IResource)' is not API (restriction on classpath entry '/jobs/genie.mylyn/mylyn-context-nightly/workspace/org.eclipse.mylyn.team.ui/target/classes')
[WARNING] /jobs/genie.mylyn/mylyn-context-nightly/workspace/org.eclipse.mylyn.team.tests/src/org/eclipse/mylyn/team/tests/TeamPropertiesLinkProviderTest.java:[105] 
	assertTrue(linkProvider.canAccessProperties(file));
	                        ^^^^^^^^^^^^^^^^^^^
Discouraged access: The method 'TeamPropertiesLinkProvider.canAccessProperties(IResource)' is not API (restriction on classpath entry '/jobs/genie.mylyn/mylyn-context-nightly/workspace/org.eclipse.mylyn.team.ui/target/classes')
[WARNING] /jobs/genie.mylyn/mylyn-context-nightly/workspace/org.eclipse.mylyn.team.tests/src/org/eclipse/mylyn/team/tests/TeamPropertiesLinkProviderTest.java:[106] 
	assertTrue(linkProvider.canAccessProperties(project1));
	                        ^^^^^^^^^^^^^^^^^^^
Discouraged access: The method 'TeamPropertiesLinkProvider.canAccessProperties(IResource)' is not API (restriction on classpath entry '/jobs/genie.mylyn/mylyn-context-nightly/workspace/org.eclipse.mylyn.team.ui/target/classes')
[WARNING] /jobs/genie.mylyn/mylyn-context-nightly/workspace/org.eclipse.mylyn.team.tests/src/org/eclipse/mylyn/team/tests/TeamPropertiesLinkProviderTest.java:[110] 
	MockTask task = new MockTask("1");
	^^^^^^^^
Discouraged access: The type 'MockTask' is not API (restriction on classpath entry '/home/hudson/genie.mylyn/.jenkins/jobs/mylyn-context-nightly/workspace/.repository/p2/osgi/bundle/org.eclipse.mylyn.tasks.tests/3.26.0.N20190930-2129/org.eclipse.mylyn.tasks.tests-3.26.0.N20190930-2129.jar')
[WARNING] /jobs/genie.mylyn/mylyn-context-nightly/workspace/org.eclipse.mylyn.team.tests/src/org/eclipse/mylyn/team/tests/TeamPropertiesLinkProviderTest.java:[110] 
	MockTask task = new MockTask("1");
	                    ^^^^^^^^
Discouraged access: The type 'MockTask' is not API (restriction on classpath entry '/home/hudson/genie.mylyn/.jenkins/jobs/mylyn-context-nightly/workspace/.repository/p2/osgi/bundle/org.eclipse.mylyn.tasks.tests/3.26.0.N20190930-2129/org.eclipse.mylyn.tasks.tests-3.26.0.N20190930-2129.jar')
[WARNING] /jobs/genie.mylyn/mylyn-context-nightly/workspace/org.eclipse.mylyn.team.tests/src/org/eclipse/mylyn/team/tests/TeamPropertiesLinkProviderTest.java:[110] 
	MockTask task = new MockTask("1");
	                    ^^^^^^^^
Discouraged access: The constructor 'MockTask(String)' is not API (restriction on classpath entry '/home/hudson/genie.mylyn/.jenkins/jobs/mylyn-context-nightly/workspace/.repository/p2/osgi/bundle/org.eclipse.mylyn.tasks.tests/3.26.0.N20190930-2129/org.eclipse.mylyn.tasks.tests-3.26.0.N20190930-2129.jar')
[WARNING] /jobs/genie.mylyn/mylyn-context-nightly/workspace/org.eclipse.mylyn.team.tests/src/org/eclipse/mylyn/team/tests/TeamPropertiesLinkProviderTest.java:[111] 
	task.setSummary("summary");
	     ^^^^^^^^^^
Discouraged access: The method 'AbstractTask.setSummary(String)' is not API (restriction on classpath entry '/home/hudson/genie.mylyn/.jenkins/jobs/mylyn-context-nightly/workspace/.repository/p2/osgi/bundle/org.eclipse.mylyn.tasks.core/3.26.0.N20190930-2129/org.eclipse.mylyn.tasks.core-3.26.0.N20190930-2129.jar')
[WARNING] /jobs/genie.mylyn/mylyn-context-nightly/workspace/org.eclipse.mylyn.team.tests/src/org/eclipse/mylyn/team/tests/TeamPropertiesLinkProviderTest.java:[112] 
	task.setUrl("http://url");
	     ^^^^^^
Discouraged access: The method 'AbstractTask.setUrl(String)' is not API (restriction on classpath entry '/home/hudson/genie.mylyn/.jenkins/jobs/mylyn-context-nightly/workspace/.repository/p2/osgi/bundle/org.eclipse.mylyn.tasks.core/3.26.0.N20190930-2129/org.eclipse.mylyn.tasks.core-3.26.0.N20190930-2129.jar')
[WARNING] /jobs/genie.mylyn/mylyn-context-nightly/workspace/org.eclipse.mylyn.team.tests/src/org/eclipse/mylyn/team/tests/TeamPropertiesLinkProviderTest.java:[114] 
	ContextChangeSet changeSet = new ContextChangeSet(task, new StubChangeSetManager()) {
	^^^^^^^^^^^^^^^^
Discouraged access: The type 'ContextChangeSet' is not API (restriction on classpath entry '/jobs/genie.mylyn/mylyn-context-nightly/workspace/org.eclipse.mylyn.team.ui/target/classes')
[WARNING] /jobs/genie.mylyn/mylyn-context-nightly/workspace/org.eclipse.mylyn.team.tests/src/org/eclipse/mylyn/team/tests/TeamPropertiesLinkProviderTest.java:[114] 
	ContextChangeSet changeSet = new ContextChangeSet(task, new StubChangeSetManager()) {
	                                 ^^^^^^^^^^^^^^^^
Discouraged access: The type 'ContextChangeSet' is not API (restriction on classpath entry '/jobs/genie.mylyn/mylyn-context-nightly/workspace/org.eclipse.mylyn.team.ui/target/classes')
[WARNING] /jobs/genie.mylyn/mylyn-context-nightly/workspace/org.eclipse.mylyn.team.tests/src/org/eclipse/mylyn/team/tests/TeamPropertiesLinkProviderTest.java:[114] 
	ContextChangeSet changeSet = new ContextChangeSet(task, new StubChangeSetManager()) {
	                                 ^^^^^^^^^^^^^^^^
Discouraged access: The constructor 'ContextChangeSet(ITask, ActiveChangeSetManager)' is not API (restriction on classpath entry '/jobs/genie.mylyn/mylyn-context-nightly/workspace/org.eclipse.mylyn.team.ui/target/classes')
[WARNING] /jobs/genie.mylyn/mylyn-context-nightly/workspace/org.eclipse.mylyn.team.tests/src/org/eclipse/mylyn/team/tests/TeamPropertiesLinkProviderTest.java:[123] 
	FocusedTeamUiPlugin.getDefault()
	^^^^^^^^^^^^^^^^^^^
Discouraged access: The type 'FocusedTeamUiPlugin' is not API (restriction on classpath entry '/jobs/genie.mylyn/mylyn-context-nightly/workspace/org.eclipse.mylyn.team.ui/target/classes')
[WARNING] /jobs/genie.mylyn/mylyn-context-nightly/workspace/org.eclipse.mylyn.team.tests/src/org/eclipse/mylyn/team/tests/TeamPropertiesLinkProviderTest.java:[123] 
	FocusedTeamUiPlugin.getDefault()
	                    ^^^^^^^^^^
Discouraged access: The method 'FocusedTeamUiPlugin.getDefault()' is not API (restriction on classpath entry '/jobs/genie.mylyn/mylyn-context-nightly/workspace/org.eclipse.mylyn.team.ui/target/classes')
[WARNING] /jobs/genie.mylyn/mylyn-context-nightly/workspace/org.eclipse.mylyn.team.tests/src/org/eclipse/mylyn/team/tests/TeamPropertiesLinkProviderTest.java:[125] 
	.setValue(FocusedTeamUiPlugin.COMMIT_TEMPLATE, "global template: ${task.key}");
	          ^^^^^^^^^^^^^^^^^^^^^^^^^^^^^^^^^^^
Discouraged access: The type 'FocusedTeamUiPlugin' is not API (restriction on classpath entry '/jobs/genie.mylyn/mylyn-context-nightly/workspace/org.eclipse.mylyn.team.ui/target/classes')
[WARNING] /jobs/genie.mylyn/mylyn-context-nightly/workspace/org.eclipse.mylyn.team.tests/src/org/eclipse/mylyn/team/tests/TeamPropertiesLinkProviderTest.java:[125] 
	.setValue(FocusedTeamUiPlugin.COMMIT_TEMPLATE, "global template: ${task.key}");
	                              ^^^^^^^^^^^^^^^
Discouraged access: The field 'FocusedTeamUiPlugin.COMMIT_TEMPLATE' is not API (restriction on classpath entry '/jobs/genie.mylyn/mylyn-context-nightly/workspace/org.eclipse.mylyn.team.ui/target/classes')
[WARNING] /jobs/genie.mylyn/mylyn-context-nightly/workspace/org.eclipse.mylyn.team.tests/src/org/eclipse/mylyn/team/tests/TeamPropertiesLinkProviderTest.java:[128] 
	TeamPropertiesLinkProvider linkProvider = new TeamPropertiesLinkProvider();
	^^^^^^^^^^^^^^^^^^^^^^^^^^
Discouraged access: The type 'TeamPropertiesLinkProvider' is not API (restriction on classpath entry '/jobs/genie.mylyn/mylyn-context-nightly/workspace/org.eclipse.mylyn.team.ui/target/classes')
[WARNING] /jobs/genie.mylyn/mylyn-context-nightly/workspace/org.eclipse.mylyn.team.tests/src/org/eclipse/mylyn/team/tests/TeamPropertiesLinkProviderTest.java:[128] 
	TeamPropertiesLinkProvider linkProvider = new TeamPropertiesLinkProvider();
	                                              ^^^^^^^^^^^^^^^^^^^^^^^^^^
Discouraged access: The type 'TeamPropertiesLinkProvider' is not API (restriction on classpath entry '/jobs/genie.mylyn/mylyn-context-nightly/workspace/org.eclipse.mylyn.team.ui/target/classes')
[WARNING] /jobs/genie.mylyn/mylyn-context-nightly/workspace/org.eclipse.mylyn.team.tests/src/org/eclipse/mylyn/team/tests/TeamPropertiesLinkProviderTest.java:[128] 
	TeamPropertiesLinkProvider linkProvider = new TeamPropertiesLinkProvider();
	                                              ^^^^^^^^^^^^^^^^^^^^^^^^^^
Discouraged access: The constructor 'TeamPropertiesLinkProvider()' is not API (restriction on classpath entry '/jobs/genie.mylyn/mylyn-context-nightly/workspace/org.eclipse.mylyn.team.ui/target/classes')
[WARNING] /jobs/genie.mylyn/mylyn-context-nightly/workspace/org.eclipse.mylyn.team.tests/src/org/eclipse/mylyn/team/tests/TeamPropertiesLinkProviderTest.java:[129] 
	assertTrue(linkProvider.setCommitCommentTemplate(project2, "project template: ${task.key}"));
	                        ^^^^^^^^^^^^^^^^^^^^^^^^
Discouraged access: The method 'TeamPropertiesLinkProvider.setCommitCommentTemplate(IResource, String)' is not API (restriction on classpath entry '/jobs/genie.mylyn/mylyn-context-nightly/workspace/org.eclipse.mylyn.team.ui/target/classes')
[WARNING] /jobs/genie.mylyn/mylyn-context-nightly/workspace/org.eclipse.mylyn.team.tests/src/org/eclipse/mylyn/team/tests/TeamPropertiesLinkProviderTest.java:[132] 
	assertEquals("global template: 1", changeSet.getComment());
	                                             ^^^^^^^^^^
Discouraged access: The method 'ContextChangeSet.getComment()' is not API (restriction on classpath entry '/jobs/genie.mylyn/mylyn-context-nightly/workspace/org.eclipse.mylyn.team.ui/target/classes')
[WARNING] /jobs/genie.mylyn/mylyn-context-nightly/workspace/org.eclipse.mylyn.team.tests/src/org/eclipse/mylyn/team/tests/TeamPropertiesLinkProviderTest.java:[135] 
	assertEquals("project template: 1", changeSet.getComment());
	                                              ^^^^^^^^^^
Discouraged access: The method 'ContextChangeSet.getComment()' is not API (restriction on classpath entry '/jobs/genie.mylyn/mylyn-context-nightly/workspace/org.eclipse.mylyn.team.ui/target/classes')
[WARNING] /jobs/genie.mylyn/mylyn-context-nightly/workspace/org.eclipse.mylyn.team.tests/src/org/eclipse/mylyn/team/tests/TeamPropertiesLinkProviderTest.java:[139] 
	MockTask task = new MockTask("1");
	^^^^^^^^
Discouraged access: The type 'MockTask' is not API (restriction on classpath entry '/home/hudson/genie.mylyn/.jenkins/jobs/mylyn-context-nightly/workspace/.repository/p2/osgi/bundle/org.eclipse.mylyn.tasks.tests/3.26.0.N20190930-2129/org.eclipse.mylyn.tasks.tests-3.26.0.N20190930-2129.jar')
[WARNING] /jobs/genie.mylyn/mylyn-context-nightly/workspace/org.eclipse.mylyn.team.tests/src/org/eclipse/mylyn/team/tests/TeamPropertiesLinkProviderTest.java:[139] 
	MockTask task = new MockTask("1");
	                    ^^^^^^^^
Discouraged access: The type 'MockTask' is not API (restriction on classpath entry '/home/hudson/genie.mylyn/.jenkins/jobs/mylyn-context-nightly/workspace/.repository/p2/osgi/bundle/org.eclipse.mylyn.tasks.tests/3.26.0.N20190930-2129/org.eclipse.mylyn.tasks.tests-3.26.0.N20190930-2129.jar')
[WARNING] /jobs/genie.mylyn/mylyn-context-nightly/workspace/org.eclipse.mylyn.team.tests/src/org/eclipse/mylyn/team/tests/TeamPropertiesLinkProviderTest.java:[139] 
	MockTask task = new MockTask("1");
	                    ^^^^^^^^
Discouraged access: The constructor 'MockTask(String)' is not API (restriction on classpath entry '/home/hudson/genie.mylyn/.jenkins/jobs/mylyn-context-nightly/workspace/.repository/p2/osgi/bundle/org.eclipse.mylyn.tasks.tests/3.26.0.N20190930-2129/org.eclipse.mylyn.tasks.tests-3.26.0.N20190930-2129.jar')
[WARNING] /jobs/genie.mylyn/mylyn-context-nightly/workspace/org.eclipse.mylyn.team.tests/src/org/eclipse/mylyn/team/tests/TeamPropertiesLinkProviderTest.java:[140] 
	task.setSummary("summary");
	     ^^^^^^^^^^
Discouraged access: The method 'AbstractTask.setSummary(String)' is not API (restriction on classpath entry '/home/hudson/genie.mylyn/.jenkins/jobs/mylyn-context-nightly/workspace/.repository/p2/osgi/bundle/org.eclipse.mylyn.tasks.core/3.26.0.N20190930-2129/org.eclipse.mylyn.tasks.core-3.26.0.N20190930-2129.jar')
[WARNING] /jobs/genie.mylyn/mylyn-context-nightly/workspace/org.eclipse.mylyn.team.tests/src/org/eclipse/mylyn/team/tests/TeamPropertiesLinkProviderTest.java:[141] 
	task.setUrl("http://url");
	     ^^^^^^
Discouraged access: The method 'AbstractTask.setUrl(String)' is not API (restriction on classpath entry '/home/hudson/genie.mylyn/.jenkins/jobs/mylyn-context-nightly/workspace/.repository/p2/osgi/bundle/org.eclipse.mylyn.tasks.core/3.26.0.N20190930-2129/org.eclipse.mylyn.tasks.core-3.26.0.N20190930-2129.jar')
[WARNING] /jobs/genie.mylyn/mylyn-context-nightly/workspace/org.eclipse.mylyn.team.tests/src/org/eclipse/mylyn/team/tests/TeamPropertiesLinkProviderTest.java:[143] 
	ContextChangeSet changeSet = new ContextChangeSet(task, new StubChangeSetManager()) {
	^^^^^^^^^^^^^^^^
Discouraged access: The type 'ContextChangeSet' is not API (restriction on classpath entry '/jobs/genie.mylyn/mylyn-context-nightly/workspace/org.eclipse.mylyn.team.ui/target/classes')
[WARNING] /jobs/genie.mylyn/mylyn-context-nightly/workspace/org.eclipse.mylyn.team.tests/src/org/eclipse/mylyn/team/tests/TeamPropertiesLinkProviderTest.java:[143] 
	ContextChangeSet changeSet = new ContextChangeSet(task, new StubChangeSetManager()) {
	                                 ^^^^^^^^^^^^^^^^
Discouraged access: The type 'ContextChangeSet' is not API (restriction on classpath entry '/jobs/genie.mylyn/mylyn-context-nightly/workspace/org.eclipse.mylyn.team.ui/target/classes')
[WARNING] /jobs/genie.mylyn/mylyn-context-nightly/workspace/org.eclipse.mylyn.team.tests/src/org/eclipse/mylyn/team/tests/TeamPropertiesLinkProviderTest.java:[143] 
	ContextChangeSet changeSet = new ContextChangeSet(task, new StubChangeSetManager()) {
	                                 ^^^^^^^^^^^^^^^^
Discouraged access: The constructor 'ContextChangeSet(ITask, ActiveChangeSetManager)' is not API (restriction on classpath entry '/jobs/genie.mylyn/mylyn-context-nightly/workspace/org.eclipse.mylyn.team.ui/target/classes')
[WARNING] /jobs/genie.mylyn/mylyn-context-nightly/workspace/org.eclipse.mylyn.team.tests/src/org/eclipse/mylyn/team/tests/TeamPropertiesLinkProviderTest.java:[156] 
	FocusedTeamUiPlugin.getDefault().getPreferenceStore().setValue(FocusedTeamUiPlugin.COMMIT_TEMPLATE, "global");
	^^^^^^^^^^^^^^^^^^^
Discouraged access: The type 'FocusedTeamUiPlugin' is not API (restriction on classpath entry '/jobs/genie.mylyn/mylyn-context-nightly/workspace/org.eclipse.mylyn.team.ui/target/classes')
[WARNING] /jobs/genie.mylyn/mylyn-context-nightly/workspace/org.eclipse.mylyn.team.tests/src/org/eclipse/mylyn/team/tests/TeamPropertiesLinkProviderTest.java:[156] 
	FocusedTeamUiPlugin.getDefault().getPreferenceStore().setValue(FocusedTeamUiPlugin.COMMIT_TEMPLATE, "global");
	                    ^^^^^^^^^^
Discouraged access: The method 'FocusedTeamUiPlugin.getDefault()' is not API (restriction on classpath entry '/jobs/genie.mylyn/mylyn-context-nightly/workspace/org.eclipse.mylyn.team.ui/target/classes')
[WARNING] /jobs/genie.mylyn/mylyn-context-nightly/workspace/org.eclipse.mylyn.team.tests/src/org/eclipse/mylyn/team/tests/TeamPropertiesLinkProviderTest.java:[156] 
	FocusedTeamUiPlugin.getDefault().getPreferenceStore().setValue(FocusedTeamUiPlugin.COMMIT_TEMPLATE, "global");
	                                                               ^^^^^^^^^^^^^^^^^^^^^^^^^^^^^^^^^^^
Discouraged access: The type 'FocusedTeamUiPlugin' is not API (restriction on classpath entry '/jobs/genie.mylyn/mylyn-context-nightly/workspace/org.eclipse.mylyn.team.ui/target/classes')
[WARNING] /jobs/genie.mylyn/mylyn-context-nightly/workspace/org.eclipse.mylyn.team.tests/src/org/eclipse/mylyn/team/tests/TeamPropertiesLinkProviderTest.java:[156] 
	FocusedTeamUiPlugin.getDefault().getPreferenceStore().setValue(FocusedTeamUiPlugin.COMMIT_TEMPLATE, "global");
	                                                                                   ^^^^^^^^^^^^^^^
Discouraged access: The field 'FocusedTeamUiPlugin.COMMIT_TEMPLATE' is not API (restriction on classpath entry '/jobs/genie.mylyn/mylyn-context-nightly/workspace/org.eclipse.mylyn.team.ui/target/classes')
[WARNING] /jobs/genie.mylyn/mylyn-context-nightly/workspace/org.eclipse.mylyn.team.tests/src/org/eclipse/mylyn/team/tests/TeamPropertiesLinkProviderTest.java:[159] 
	TeamPropertiesLinkProvider linkProvider = new TeamPropertiesLinkProvider();
	^^^^^^^^^^^^^^^^^^^^^^^^^^
Discouraged access: The type 'TeamPropertiesLinkProvider' is not API (restriction on classpath entry '/jobs/genie.mylyn/mylyn-context-nightly/workspace/org.eclipse.mylyn.team.ui/target/classes')
[WARNING] /jobs/genie.mylyn/mylyn-context-nightly/workspace/org.eclipse.mylyn.team.tests/src/org/eclipse/mylyn/team/tests/TeamPropertiesLinkProviderTest.java:[159] 
	TeamPropertiesLinkProvider linkProvider = new TeamPropertiesLinkProvider();
	                                              ^^^^^^^^^^^^^^^^^^^^^^^^^^
Discouraged access: The type 'TeamPropertiesLinkProvider' is not API (restriction on classpath entry '/jobs/genie.mylyn/mylyn-context-nightly/workspace/org.eclipse.mylyn.team.ui/target/classes')
[WARNING] /jobs/genie.mylyn/mylyn-context-nightly/workspace/org.eclipse.mylyn.team.tests/src/org/eclipse/mylyn/team/tests/TeamPropertiesLinkProviderTest.java:[159] 
	TeamPropertiesLinkProvider linkProvider = new TeamPropertiesLinkProvider();
	                                              ^^^^^^^^^^^^^^^^^^^^^^^^^^
Discouraged access: The constructor 'TeamPropertiesLinkProvider()' is not API (restriction on classpath entry '/jobs/genie.mylyn/mylyn-context-nightly/workspace/org.eclipse.mylyn.team.ui/target/classes')
[WARNING] /jobs/genie.mylyn/mylyn-context-nightly/workspace/org.eclipse.mylyn.team.tests/src/org/eclipse/mylyn/team/tests/TeamPropertiesLinkProviderTest.java:[160] 
	assertTrue(linkProvider.setCommitCommentTemplate(project1, "project1"));
	                        ^^^^^^^^^^^^^^^^^^^^^^^^
Discouraged access: The method 'TeamPropertiesLinkProvider.setCommitCommentTemplate(IResource, String)' is not API (restriction on classpath entry '/jobs/genie.mylyn/mylyn-context-nightly/workspace/org.eclipse.mylyn.team.ui/target/classes')
[WARNING] /jobs/genie.mylyn/mylyn-context-nightly/workspace/org.eclipse.mylyn.team.tests/src/org/eclipse/mylyn/team/tests/TeamPropertiesLinkProviderTest.java:[161] 
	assertEquals("global", changeSet.getComment());
	                                 ^^^^^^^^^^
Discouraged access: The method 'ContextChangeSet.getComment()' is not API (restriction on classpath entry '/jobs/genie.mylyn/mylyn-context-nightly/workspace/org.eclipse.mylyn.team.ui/target/classes')
[WARNING] /jobs/genie.mylyn/mylyn-context-nightly/workspace/org.eclipse.mylyn.team.tests/src/org/eclipse/mylyn/team/tests/TeamPropertiesLinkProviderTest.java:[163] 
	assertTrue(linkProvider.setCommitCommentTemplate(project2, "project2"));
	                        ^^^^^^^^^^^^^^^^^^^^^^^^
Discouraged access: The method 'TeamPropertiesLinkProvider.setCommitCommentTemplate(IResource, String)' is not API (restriction on classpath entry '/jobs/genie.mylyn/mylyn-context-nightly/workspace/org.eclipse.mylyn.team.ui/target/classes')
[WARNING] /jobs/genie.mylyn/mylyn-context-nightly/workspace/org.eclipse.mylyn.team.tests/src/org/eclipse/mylyn/team/tests/TeamPropertiesLinkProviderTest.java:[164] 
	assertEquals("project2", changeSet.getComment());
	                                   ^^^^^^^^^^
Discouraged access: The method 'ContextChangeSet.getComment()' is not API (restriction on classpath entry '/jobs/genie.mylyn/mylyn-context-nightly/workspace/org.eclipse.mylyn.team.ui/target/classes')
[WARNING] /jobs/genie.mylyn/mylyn-context-nightly/workspace/org.eclipse.mylyn.team.tests/src/org/eclipse/mylyn/team/tests/TeamPropertiesLinkProviderTest.java:[167] 
	public class StubChangeSetManager extends ActiveChangeSetManager {
	                                          ^^^^^^^^^^^^^^^^^^^^^^
Discouraged access: The type 'ActiveChangeSetManager' is not API (restriction on classpath entry '/home/hudson/genie.mylyn/.jenkins/jobs/mylyn-context-nightly/workspace/.repository/p2/osgi/bundle/org.eclipse.team.core/3.8.200.v20180309-1840/org.eclipse.team.core-3.8.200.v20180309-1840.jar')
[WARNING] /jobs/genie.mylyn/mylyn-context-nightly/workspace/org.eclipse.mylyn.team.tests/src/org/eclipse/mylyn/team/tests/CommitTemplateTest.java:[20] 
	import org.eclipse.mylyn.internal.tasks.core.AbstractTask;
	       ^^^^^^^^^^^^^^^^^^^^^^^^^^^^^^^^^^^^^^^^^^^^^^^^^^
Discouraged access: The type 'AbstractTask' is not API (restriction on classpath entry '/home/hudson/genie.mylyn/.jenkins/jobs/mylyn-context-nightly/workspace/.repository/p2/osgi/bundle/org.eclipse.mylyn.tasks.core/3.26.0.N20190930-2129/org.eclipse.mylyn.tasks.core-3.26.0.N20190930-2129.jar')
[WARNING] /jobs/genie.mylyn/mylyn-context-nightly/workspace/org.eclipse.mylyn.team.tests/src/org/eclipse/mylyn/team/tests/CommitTemplateTest.java:[21] 
	import org.eclipse.mylyn.internal.tasks.core.TaskTask;
	       ^^^^^^^^^^^^^^^^^^^^^^^^^^^^^^^^^^^^^^^^^^^^^^
Discouraged access: The type 'TaskTask' is not API (restriction on classpath entry '/home/hudson/genie.mylyn/.jenkins/jobs/mylyn-context-nightly/workspace/.repository/p2/osgi/bundle/org.eclipse.mylyn.tasks.core/3.26.0.N20190930-2129/org.eclipse.mylyn.tasks.core-3.26.0.N20190930-2129.jar')
[WARNING] /jobs/genie.mylyn/mylyn-context-nightly/workspace/org.eclipse.mylyn.team.tests/src/org/eclipse/mylyn/team/tests/CommitTemplateTest.java:[22] 
	import org.eclipse.mylyn.internal.team.ui.FocusedTeamUiPlugin;
	       ^^^^^^^^^^^^^^^^^^^^^^^^^^^^^^^^^^^^^^^^^^^^^^^^^^^^^^
Discouraged access: The type 'FocusedTeamUiPlugin' is not API (restriction on classpath entry '/jobs/genie.mylyn/mylyn-context-nightly/workspace/org.eclipse.mylyn.team.ui/target/classes')
[WARNING] /jobs/genie.mylyn/mylyn-context-nightly/workspace/org.eclipse.mylyn.team.tests/src/org/eclipse/mylyn/team/tests/CommitTemplateTest.java:[23] 
	import org.eclipse.mylyn.internal.team.ui.templates.CommitTemplateManager;
	       ^^^^^^^^^^^^^^^^^^^^^^^^^^^^^^^^^^^^^^^^^^^^^^^^^^^^^^^^^^^^^^^^^^
Discouraged access: The type 'CommitTemplateManager' is not API (restriction on classpath entry '/jobs/genie.mylyn/mylyn-context-nightly/workspace/org.eclipse.mylyn.team.ui/target/classes')
[WARNING] /jobs/genie.mylyn/mylyn-context-nightly/workspace/org.eclipse.mylyn.team.tests/src/org/eclipse/mylyn/team/tests/CommitTemplateTest.java:[24] 
	import org.eclipse.mylyn.tasks.tests.connector.MockTask;
	       ^^^^^^^^^^^^^^^^^^^^^^^^^^^^^^^^^^^^^^^^^^^^^^^^
Discouraged access: The type 'MockTask' is not API (restriction on classpath entry '/home/hudson/genie.mylyn/.jenkins/jobs/mylyn-context-nightly/workspace/.repository/p2/osgi/bundle/org.eclipse.mylyn.tasks.tests/3.26.0.N20190930-2129/org.eclipse.mylyn.tasks.tests-3.26.0.N20190930-2129.jar')
[WARNING] /jobs/genie.mylyn/mylyn-context-nightly/workspace/org.eclipse.mylyn.team.tests/src/org/eclipse/mylyn/team/tests/CommitTemplateTest.java:[35] 
	TaskTask testTask = new TaskTask("no url", taskId, "summary");
	^^^^^^^^
Discouraged access: The type 'TaskTask' is not API (restriction on classpath entry '/home/hudson/genie.mylyn/.jenkins/jobs/mylyn-context-nightly/workspace/.repository/p2/osgi/bundle/org.eclipse.mylyn.tasks.core/3.26.0.N20190930-2129/org.eclipse.mylyn.tasks.core-3.26.0.N20190930-2129.jar')
[WARNING] /jobs/genie.mylyn/mylyn-context-nightly/workspace/org.eclipse.mylyn.team.tests/src/org/eclipse/mylyn/team/tests/CommitTemplateTest.java:[35] 
	TaskTask testTask = new TaskTask("no url", taskId, "summary");
	                        ^^^^^^^^
Discouraged access: The type 'TaskTask' is not API (restriction on classpath entry '/home/hudson/genie.mylyn/.jenkins/jobs/mylyn-context-nightly/workspace/.repository/p2/osgi/bundle/org.eclipse.mylyn.tasks.core/3.26.0.N20190930-2129/org.eclipse.mylyn.tasks.core-3.26.0.N20190930-2129.jar')
[WARNING] /jobs/genie.mylyn/mylyn-context-nightly/workspace/org.eclipse.mylyn.team.tests/src/org/eclipse/mylyn/team/tests/CommitTemplateTest.java:[35] 
	TaskTask testTask = new TaskTask("no url", taskId, "summary");
	                        ^^^^^^^^
Discouraged access: The constructor 'TaskTask(String, String, String)' is not API (restriction on classpath entry '/home/hudson/genie.mylyn/.jenkins/jobs/mylyn-context-nightly/workspace/.repository/p2/osgi/bundle/org.eclipse.mylyn.tasks.core/3.26.0.N20190930-2129/org.eclipse.mylyn.tasks.core-3.26.0.N20190930-2129.jar')
[WARNING] /jobs/genie.mylyn/mylyn-context-nightly/workspace/org.eclipse.mylyn.team.tests/src/org/eclipse/mylyn/team/tests/CommitTemplateTest.java:[36] 
	testTask.setTaskKey(taskId);
	         ^^^^^^^^^^
Discouraged access: The method 'AbstractTask.setTaskKey(String)' is not API (restriction on classpath entry '/home/hudson/genie.mylyn/.jenkins/jobs/mylyn-context-nightly/workspace/.repository/p2/osgi/bundle/org.eclipse.mylyn.tasks.core/3.26.0.N20190930-2129/org.eclipse.mylyn.tasks.core-3.26.0.N20190930-2129.jar')
[WARNING] /jobs/genie.mylyn/mylyn-context-nightly/workspace/org.eclipse.mylyn.team.tests/src/org/eclipse/mylyn/team/tests/CommitTemplateTest.java:[38] 
	String commitComment = FocusedTeamUiPlugin.getDefault()
	                       ^^^^^^^^^^^^^^^^^^^
Discouraged access: The type 'FocusedTeamUiPlugin' is not API (restriction on classpath entry '/jobs/genie.mylyn/mylyn-context-nightly/workspace/org.eclipse.mylyn.team.ui/target/classes')
[WARNING] /jobs/genie.mylyn/mylyn-context-nightly/workspace/org.eclipse.mylyn.team.tests/src/org/eclipse/mylyn/team/tests/CommitTemplateTest.java:[38] 
	String commitComment = FocusedTeamUiPlugin.getDefault()
	                                           ^^^^^^^^^^
Discouraged access: The method 'FocusedTeamUiPlugin.getDefault()' is not API (restriction on classpath entry '/jobs/genie.mylyn/mylyn-context-nightly/workspace/org.eclipse.mylyn.team.ui/target/classes')
[WARNING] /jobs/genie.mylyn/mylyn-context-nightly/workspace/org.eclipse.mylyn.team.tests/src/org/eclipse/mylyn/team/tests/CommitTemplateTest.java:[39] 
	.getCommitTemplateManager()
	 ^^^^^^^^^^^^^^^^^^^^^^^^
Discouraged access: The method 'FocusedTeamUiPlugin.getCommitTemplateManager()' is not API (restriction on classpath entry '/jobs/genie.mylyn/mylyn-context-nightly/workspace/org.eclipse.mylyn.team.ui/target/classes')
[WARNING] /jobs/genie.mylyn/mylyn-context-nightly/workspace/org.eclipse.mylyn.team.tests/src/org/eclipse/mylyn/team/tests/CommitTemplateTest.java:[40] 
	.generateComment(testTask, template);
	 ^^^^^^^^^^^^^^^
Discouraged access: The method 'CommitTemplateManager.generateComment(ITask, String)' is not API (restriction on classpath entry '/jobs/genie.mylyn/mylyn-context-nightly/workspace/org.eclipse.mylyn.team.ui/target/classes')
[WARNING] /jobs/genie.mylyn/mylyn-context-nightly/workspace/org.eclipse.mylyn.team.tests/src/org/eclipse/mylyn/team/tests/CommitTemplateTest.java:[43] 
	testTask.setTaskKey(null);
	         ^^^^^^^^^^
Discouraged access: The method 'AbstractTask.setTaskKey(String)' is not API (restriction on classpath entry '/home/hudson/genie.mylyn/.jenkins/jobs/mylyn-context-nightly/workspace/.repository/p2/osgi/bundle/org.eclipse.mylyn.tasks.core/3.26.0.N20190930-2129/org.eclipse.mylyn.tasks.core-3.26.0.N20190930-2129.jar')
[WARNING] /jobs/genie.mylyn/mylyn-context-nightly/workspace/org.eclipse.mylyn.team.tests/src/org/eclipse/mylyn/team/tests/CommitTemplateTest.java:[45] 
	commitComment = FocusedTeamUiPlugin.getDefault().getCommitTemplateManager().generateComment(testTask, template);
	                ^^^^^^^^^^^^^^^^^^^
Discouraged access: The type 'FocusedTeamUiPlugin' is not API (restriction on classpath entry '/jobs/genie.mylyn/mylyn-context-nightly/workspace/org.eclipse.mylyn.team.ui/target/classes')
[WARNING] /jobs/genie.mylyn/mylyn-context-nightly/workspace/org.eclipse.mylyn.team.tests/src/org/eclipse/mylyn/team/tests/CommitTemplateTest.java:[45] 
	commitComment = FocusedTeamUiPlugin.getDefault().getCommitTemplateManager().generateComment(testTask, template);
	                                    ^^^^^^^^^^
Discouraged access: The method 'FocusedTeamUiPlugin.getDefault()' is not API (restriction on classpath entry '/jobs/genie.mylyn/mylyn-context-nightly/workspace/org.eclipse.mylyn.team.ui/target/classes')
[WARNING] /jobs/genie.mylyn/mylyn-context-nightly/workspace/org.eclipse.mylyn.team.tests/src/org/eclipse/mylyn/team/tests/CommitTemplateTest.java:[45] 
	commitComment = FocusedTeamUiPlugin.getDefault().getCommitTemplateManager().generateComment(testTask, template);
	                                                 ^^^^^^^^^^^^^^^^^^^^^^^^
Discouraged access: The method 'FocusedTeamUiPlugin.getCommitTemplateManager()' is not API (restriction on classpath entry '/jobs/genie.mylyn/mylyn-context-nightly/workspace/org.eclipse.mylyn.team.ui/target/classes')
[WARNING] /jobs/genie.mylyn/mylyn-context-nightly/workspace/org.eclipse.mylyn.team.tests/src/org/eclipse/mylyn/team/tests/CommitTemplateTest.java:[45] 
	commitComment = FocusedTeamUiPlugin.getDefault().getCommitTemplateManager().generateComment(testTask, template);
	                                                                            ^^^^^^^^^^^^^^^
Discouraged access: The method 'CommitTemplateManager.generateComment(ITask, String)' is not API (restriction on classpath entry '/jobs/genie.mylyn/mylyn-context-nightly/workspace/org.eclipse.mylyn.team.ui/target/classes')
[WARNING] /jobs/genie.mylyn/mylyn-context-nightly/workspace/org.eclipse.mylyn.team.tests/src/org/eclipse/mylyn/team/tests/CommitTemplateTest.java:[53] 
	TaskTask testTask = createTask();
	^^^^^^^^
Discouraged access: The type 'TaskTask' is not API (restriction on classpath entry '/home/hudson/genie.mylyn/.jenkins/jobs/mylyn-context-nightly/workspace/.repository/p2/osgi/bundle/org.eclipse.mylyn.tasks.core/3.26.0.N20190930-2129/org.eclipse.mylyn.tasks.core-3.26.0.N20190930-2129.jar')
[WARNING] /jobs/genie.mylyn/mylyn-context-nightly/workspace/org.eclipse.mylyn.team.tests/src/org/eclipse/mylyn/team/tests/CommitTemplateTest.java:[55] 
	String commitComment = FocusedTeamUiPlugin.getDefault()
	                       ^^^^^^^^^^^^^^^^^^^
Discouraged access: The type 'FocusedTeamUiPlugin' is not API (restriction on classpath entry '/jobs/genie.mylyn/mylyn-context-nightly/workspace/org.eclipse.mylyn.team.ui/target/classes')
[WARNING] /jobs/genie.mylyn/mylyn-context-nightly/workspace/org.eclipse.mylyn.team.tests/src/org/eclipse/mylyn/team/tests/CommitTemplateTest.java:[55] 
	String commitComment = FocusedTeamUiPlugin.getDefault()
	                                           ^^^^^^^^^^
Discouraged access: The method 'FocusedTeamUiPlugin.getDefault()' is not API (restriction on classpath entry '/jobs/genie.mylyn/mylyn-context-nightly/workspace/org.eclipse.mylyn.team.ui/target/classes')
[WARNING] /jobs/genie.mylyn/mylyn-context-nightly/workspace/org.eclipse.mylyn.team.tests/src/org/eclipse/mylyn/team/tests/CommitTemplateTest.java:[56] 
	.getCommitTemplateManager()
	 ^^^^^^^^^^^^^^^^^^^^^^^^
Discouraged access: The method 'FocusedTeamUiPlugin.getCommitTemplateManager()' is not API (restriction on classpath entry '/jobs/genie.mylyn/mylyn-context-nightly/workspace/org.eclipse.mylyn.team.ui/target/classes')
[WARNING] /jobs/genie.mylyn/mylyn-context-nightly/workspace/org.eclipse.mylyn.team.tests/src/org/eclipse/mylyn/team/tests/CommitTemplateTest.java:[57] 
	.generateComment(testTask, template);
	 ^^^^^^^^^^^^^^^
Discouraged access: The method 'CommitTemplateManager.generateComment(ITask, String)' is not API (restriction on classpath entry '/jobs/genie.mylyn/mylyn-context-nightly/workspace/org.eclipse.mylyn.team.ui/target/classes')
[WARNING] /jobs/genie.mylyn/mylyn-context-nightly/workspace/org.eclipse.mylyn.team.tests/src/org/eclipse/mylyn/team/tests/CommitTemplateTest.java:[58] 
	assertTrue(commitComment.contains(testTask.getSummary()));
	                                           ^^^^^^^^^^
Discouraged access: The method 'AbstractTask.getSummary()' is not API (restriction on classpath entry '/home/hudson/genie.mylyn/.jenkins/jobs/mylyn-context-nightly/workspace/.repository/p2/osgi/bundle/org.eclipse.mylyn.tasks.core/3.26.0.N20190930-2129/org.eclipse.mylyn.tasks.core-3.26.0.N20190930-2129.jar')
[WARNING] /jobs/genie.mylyn/mylyn-context-nightly/workspace/org.eclipse.mylyn.team.tests/src/org/eclipse/mylyn/team/tests/CommitTemplateTest.java:[67] 
	TaskTask testTask = createTask();
	^^^^^^^^
Discouraged access: The type 'TaskTask' is not API (restriction on classpath entry '/home/hudson/genie.mylyn/.jenkins/jobs/mylyn-context-nightly/workspace/.repository/p2/osgi/bundle/org.eclipse.mylyn.tasks.core/3.26.0.N20190930-2129/org.eclipse.mylyn.tasks.core-3.26.0.N20190930-2129.jar')
[WARNING] /jobs/genie.mylyn/mylyn-context-nightly/workspace/org.eclipse.mylyn.team.tests/src/org/eclipse/mylyn/team/tests/CommitTemplateTest.java:[69] 
	String commitComment = FocusedTeamUiPlugin.getDefault()
	                       ^^^^^^^^^^^^^^^^^^^
Discouraged access: The type 'FocusedTeamUiPlugin' is not API (restriction on classpath entry '/jobs/genie.mylyn/mylyn-context-nightly/workspace/org.eclipse.mylyn.team.ui/target/classes')
[WARNING] /jobs/genie.mylyn/mylyn-context-nightly/workspace/org.eclipse.mylyn.team.tests/src/org/eclipse/mylyn/team/tests/CommitTemplateTest.java:[69] 
	String commitComment = FocusedTeamUiPlugin.getDefault()
	                                           ^^^^^^^^^^
Discouraged access: The method 'FocusedTeamUiPlugin.getDefault()' is not API (restriction on classpath entry '/jobs/genie.mylyn/mylyn-context-nightly/workspace/org.eclipse.mylyn.team.ui/target/classes')
[WARNING] /jobs/genie.mylyn/mylyn-context-nightly/workspace/org.eclipse.mylyn.team.tests/src/org/eclipse/mylyn/team/tests/CommitTemplateTest.java:[70] 
	.getCommitTemplateManager()
	 ^^^^^^^^^^^^^^^^^^^^^^^^
Discouraged access: The method 'FocusedTeamUiPlugin.getCommitTemplateManager()' is not API (restriction on classpath entry '/jobs/genie.mylyn/mylyn-context-nightly/workspace/org.eclipse.mylyn.team.ui/target/classes')
[WARNING] /jobs/genie.mylyn/mylyn-context-nightly/workspace/org.eclipse.mylyn.team.tests/src/org/eclipse/mylyn/team/tests/CommitTemplateTest.java:[71] 
	.generateComment(testTask, template);
	 ^^^^^^^^^^^^^^^
Discouraged access: The method 'CommitTemplateManager.generateComment(ITask, String)' is not API (restriction on classpath entry '/jobs/genie.mylyn/mylyn-context-nightly/workspace/org.eclipse.mylyn.team.ui/target/classes')
[WARNING] /jobs/genie.mylyn/mylyn-context-nightly/workspace/org.eclipse.mylyn.team.tests/src/org/eclipse/mylyn/team/tests/CommitTemplateTest.java:[72] 
	assertTrue(commitComment.contains(testTask.getSummary()));
	                                           ^^^^^^^^^^
Discouraged access: The method 'AbstractTask.getSummary()' is not API (restriction on classpath entry '/home/hudson/genie.mylyn/.jenkins/jobs/mylyn-context-nightly/workspace/.repository/p2/osgi/bundle/org.eclipse.mylyn.tasks.core/3.26.0.N20190930-2129/org.eclipse.mylyn.tasks.core-3.26.0.N20190930-2129.jar')
[WARNING] /jobs/genie.mylyn/mylyn-context-nightly/workspace/org.eclipse.mylyn.team.tests/src/org/eclipse/mylyn/team/tests/CommitTemplateTest.java:[81] 
	TaskTask testTask = createTask();
	^^^^^^^^
Discouraged access: The type 'TaskTask' is not API (restriction on classpath entry '/home/hudson/genie.mylyn/.jenkins/jobs/mylyn-context-nightly/workspace/.repository/p2/osgi/bundle/org.eclipse.mylyn.tasks.core/3.26.0.N20190930-2129/org.eclipse.mylyn.tasks.core-3.26.0.N20190930-2129.jar')
[WARNING] /jobs/genie.mylyn/mylyn-context-nightly/workspace/org.eclipse.mylyn.team.tests/src/org/eclipse/mylyn/team/tests/CommitTemplateTest.java:[83] 
	String commitComment = FocusedTeamUiPlugin.getDefault()
	                       ^^^^^^^^^^^^^^^^^^^
Discouraged access: The type 'FocusedTeamUiPlugin' is not API (restriction on classpath entry '/jobs/genie.mylyn/mylyn-context-nightly/workspace/org.eclipse.mylyn.team.ui/target/classes')
[WARNING] /jobs/genie.mylyn/mylyn-context-nightly/workspace/org.eclipse.mylyn.team.tests/src/org/eclipse/mylyn/team/tests/CommitTemplateTest.java:[83] 
	String commitComment = FocusedTeamUiPlugin.getDefault()
	                                           ^^^^^^^^^^
Discouraged access: The method 'FocusedTeamUiPlugin.getDefault()' is not API (restriction on classpath entry '/jobs/genie.mylyn/mylyn-context-nightly/workspace/org.eclipse.mylyn.team.ui/target/classes')
[WARNING] /jobs/genie.mylyn/mylyn-context-nightly/workspace/org.eclipse.mylyn.team.tests/src/org/eclipse/mylyn/team/tests/CommitTemplateTest.java:[84] 
	.getCommitTemplateManager()
	 ^^^^^^^^^^^^^^^^^^^^^^^^
Discouraged access: The method 'FocusedTeamUiPlugin.getCommitTemplateManager()' is not API (restriction on classpath entry '/jobs/genie.mylyn/mylyn-context-nightly/workspace/org.eclipse.mylyn.team.ui/target/classes')
[WARNING] /jobs/genie.mylyn/mylyn-context-nightly/workspace/org.eclipse.mylyn.team.tests/src/org/eclipse/mylyn/team/tests/CommitTemplateTest.java:[85] 
	.generateComment(testTask, template);
	 ^^^^^^^^^^^^^^^
Discouraged access: The method 'CommitTemplateManager.generateComment(ITask, String)' is not API (restriction on classpath entry '/jobs/genie.mylyn/mylyn-context-nightly/workspace/org.eclipse.mylyn.team.ui/target/classes')
[WARNING] /jobs/genie.mylyn/mylyn-context-nightly/workspace/org.eclipse.mylyn.team.tests/src/org/eclipse/mylyn/team/tests/CommitTemplateTest.java:[86] 
	assertTrue(commitComment.contains(testTask.getSummary()));
	                                           ^^^^^^^^^^
Discouraged access: The method 'AbstractTask.getSummary()' is not API (restriction on classpath entry '/home/hudson/genie.mylyn/.jenkins/jobs/mylyn-context-nightly/workspace/.repository/p2/osgi/bundle/org.eclipse.mylyn.tasks.core/3.26.0.N20190930-2129/org.eclipse.mylyn.tasks.core-3.26.0.N20190930-2129.jar')
[WARNING] /jobs/genie.mylyn/mylyn-context-nightly/workspace/org.eclipse.mylyn.team.tests/src/org/eclipse/mylyn/team/tests/CommitTemplateTest.java:[93] 
	CommitTemplateManager manager = FocusedTeamUiPlugin.getDefault().getCommitTemplateManager();
	^^^^^^^^^^^^^^^^^^^^^
Discouraged access: The type 'CommitTemplateManager' is not API (restriction on classpath entry '/jobs/genie.mylyn/mylyn-context-nightly/workspace/org.eclipse.mylyn.team.ui/target/classes')
[WARNING] /jobs/genie.mylyn/mylyn-context-nightly/workspace/org.eclipse.mylyn.team.tests/src/org/eclipse/mylyn/team/tests/CommitTemplateTest.java:[93] 
	CommitTemplateManager manager = FocusedTeamUiPlugin.getDefault().getCommitTemplateManager();
	                                ^^^^^^^^^^^^^^^^^^^
Discouraged access: The type 'FocusedTeamUiPlugin' is not API (restriction on classpath entry '/jobs/genie.mylyn/mylyn-context-nightly/workspace/org.eclipse.mylyn.team.ui/target/classes')
[WARNING] /jobs/genie.mylyn/mylyn-context-nightly/workspace/org.eclipse.mylyn.team.tests/src/org/eclipse/mylyn/team/tests/CommitTemplateTest.java:[93] 
	CommitTemplateManager manager = FocusedTeamUiPlugin.getDefault().getCommitTemplateManager();
	                                                    ^^^^^^^^^^
Discouraged access: The method 'FocusedTeamUiPlugin.getDefault()' is not API (restriction on classpath entry '/jobs/genie.mylyn/mylyn-context-nightly/workspace/org.eclipse.mylyn.team.ui/target/classes')
[WARNING] /jobs/genie.mylyn/mylyn-context-nightly/workspace/org.eclipse.mylyn.team.tests/src/org/eclipse/mylyn/team/tests/CommitTemplateTest.java:[93] 
	CommitTemplateManager manager = FocusedTeamUiPlugin.getDefault().getCommitTemplateManager();
	                                                                 ^^^^^^^^^^^^^^^^^^^^^^^^
Discouraged access: The method 'FocusedTeamUiPlugin.getCommitTemplateManager()' is not API (restriction on classpath entry '/jobs/genie.mylyn/mylyn-context-nightly/workspace/org.eclipse.mylyn.team.ui/target/classes')
[WARNING] /jobs/genie.mylyn/mylyn-context-nightly/workspace/org.eclipse.mylyn.team.tests/src/org/eclipse/mylyn/team/tests/CommitTemplateTest.java:[94] 
	TaskTask testTask = createTask();
	^^^^^^^^
Discouraged access: The type 'TaskTask' is not API (restriction on classpath entry '/home/hudson/genie.mylyn/.jenkins/jobs/mylyn-context-nightly/workspace/.repository/p2/osgi/bundle/org.eclipse.mylyn.tasks.core/3.26.0.N20190930-2129/org.eclipse.mylyn.tasks.core-3.26.0.N20190930-2129.jar')
[WARNING] /jobs/genie.mylyn/mylyn-context-nightly/workspace/org.eclipse.mylyn.team.tests/src/org/eclipse/mylyn/team/tests/CommitTemplateTest.java:[96] 
	assertEquals("ABC", manager.generateComment(testTask, "${TestVar(\"ABC\")}"));
	                            ^^^^^^^^^^^^^^^
Discouraged access: The method 'CommitTemplateManager.generateComment(ITask, String)' is not API (restriction on classpath entry '/jobs/genie.mylyn/mylyn-context-nightly/workspace/org.eclipse.mylyn.team.ui/target/classes')
[WARNING] /jobs/genie.mylyn/mylyn-context-nightly/workspace/org.eclipse.mylyn.team.tests/src/org/eclipse/mylyn/team/tests/CommitTemplateTest.java:[97] 
	assertEquals("one ABC two", manager.generateComment(testTask, "one ${TestVar(\"ABC\")} two"));
	                                    ^^^^^^^^^^^^^^^
Discouraged access: The method 'CommitTemplateManager.generateComment(ITask, String)' is not API (restriction on classpath entry '/jobs/genie.mylyn/mylyn-context-nightly/workspace/org.eclipse.mylyn.team.ui/target/classes')
[WARNING] /jobs/genie.mylyn/mylyn-context-nightly/workspace/org.eclipse.mylyn.team.tests/src/org/eclipse/mylyn/team/tests/CommitTemplateTest.java:[98] 
	assertEquals("oneABCtwo", manager.generateComment(testTask, "one${TestVar(\"ABC\")}two"));
	                                  ^^^^^^^^^^^^^^^
Discouraged access: The method 'CommitTemplateManager.generateComment(ITask, String)' is not API (restriction on classpath entry '/jobs/genie.mylyn/mylyn-context-nightly/workspace/org.eclipse.mylyn.team.ui/target/classes')
[WARNING] /jobs/genie.mylyn/mylyn-context-nightly/workspace/org.eclipse.mylyn.team.tests/src/org/eclipse/mylyn/team/tests/CommitTemplateTest.java:[99] 
	assertEquals("oneABC-DEFtwo", manager.generateComment(testTask, "one${TestVar(\"ABC\",\"DEF\")}two"));
	                                      ^^^^^^^^^^^^^^^
Discouraged access: The method 'CommitTemplateManager.generateComment(ITask, String)' is not API (restriction on classpath entry '/jobs/genie.mylyn/mylyn-context-nightly/workspace/org.eclipse.mylyn.team.ui/target/classes')
[WARNING] /jobs/genie.mylyn/mylyn-context-nightly/workspace/org.eclipse.mylyn.team.tests/src/org/eclipse/mylyn/team/tests/CommitTemplateTest.java:[100] 
	assertEquals("oneABC-DEFtwo", manager.generateComment(testTask, "one${TestVar(\"ABC\", \"DEF\")}two"));
	                                      ^^^^^^^^^^^^^^^
Discouraged access: The method 'CommitTemplateManager.generateComment(ITask, String)' is not API (restriction on classpath entry '/jobs/genie.mylyn/mylyn-context-nightly/workspace/org.eclipse.mylyn.team.ui/target/classes')
[WARNING] /jobs/genie.mylyn/mylyn-context-nightly/workspace/org.eclipse.mylyn.team.tests/src/org/eclipse/mylyn/team/tests/CommitTemplateTest.java:[101] 
	assertEquals("oneABC-DEFtwo", manager.generateComment(testTask, "one${TestVar(\"ABC\" ,\"DEF\")}two"));
	                                      ^^^^^^^^^^^^^^^
Discouraged access: The method 'CommitTemplateManager.generateComment(ITask, String)' is not API (restriction on classpath entry '/jobs/genie.mylyn/mylyn-context-nightly/workspace/org.eclipse.mylyn.team.ui/target/classes')
[WARNING] /jobs/genie.mylyn/mylyn-context-nightly/workspace/org.eclipse.mylyn.team.tests/src/org/eclipse/mylyn/team/tests/CommitTemplateTest.java:[102] 
	assertEquals("oneABC-DEFtwo", manager.generateComment(testTask, "one${TestVar(\"ABC\" , \"DEF\")}two"));
	                                      ^^^^^^^^^^^^^^^
Discouraged access: The method 'CommitTemplateManager.generateComment(ITask, String)' is not API (restriction on classpath entry '/jobs/genie.mylyn/mylyn-context-nightly/workspace/org.eclipse.mylyn.team.ui/target/classes')
[WARNING] /jobs/genie.mylyn/mylyn-context-nightly/workspace/org.eclipse.mylyn.team.tests/src/org/eclipse/mylyn/team/tests/CommitTemplateTest.java:[103] 
	assertEquals("oneABC-DEFtwo", manager.generateComment(testTask, "one${TestVar( \"ABC\" , \"DEF\" )}two"));
	                                      ^^^^^^^^^^^^^^^
Discouraged access: The method 'CommitTemplateManager.generateComment(ITask, String)' is not API (restriction on classpath entry '/jobs/genie.mylyn/mylyn-context-nightly/workspace/org.eclipse.mylyn.team.ui/target/classes')
[WARNING] /jobs/genie.mylyn/mylyn-context-nightly/workspace/org.eclipse.mylyn.team.tests/src/org/eclipse/mylyn/team/tests/CommitTemplateTest.java:[105] 
	manager.generateComment(testTask, "one${TestVar(\"ABC\", \"DEF\", \"GHI\")}two"));
	        ^^^^^^^^^^^^^^^
Discouraged access: The method 'CommitTemplateManager.generateComment(ITask, String)' is not API (restriction on classpath entry '/jobs/genie.mylyn/mylyn-context-nightly/workspace/org.eclipse.mylyn.team.ui/target/classes')
[WARNING] /jobs/genie.mylyn/mylyn-context-nightly/workspace/org.eclipse.mylyn.team.tests/src/org/eclipse/mylyn/team/tests/CommitTemplateTest.java:[107] 
	manager.generateComment(testTask, "${task.status} ${TestVar( \"x\" , \"y\" )} ${task.description}"));
	        ^^^^^^^^^^^^^^^
Discouraged access: The method 'CommitTemplateManager.generateComment(ITask, String)' is not API (restriction on classpath entry '/jobs/genie.mylyn/mylyn-context-nightly/workspace/org.eclipse.mylyn.team.ui/target/classes')
[WARNING] /jobs/genie.mylyn/mylyn-context-nightly/workspace/org.eclipse.mylyn.team.tests/src/org/eclipse/mylyn/team/tests/CommitTemplateTest.java:[109] 
	manager.generateComment(testTask, "one ${TestVar(\"ABC\")} ${TestVar(\"DEF\")} two"));
	        ^^^^^^^^^^^^^^^
Discouraged access: The method 'CommitTemplateManager.generateComment(ITask, String)' is not API (restriction on classpath entry '/jobs/genie.mylyn/mylyn-context-nightly/workspace/org.eclipse.mylyn.team.ui/target/classes')
[WARNING] /jobs/genie.mylyn/mylyn-context-nightly/workspace/org.eclipse.mylyn.team.tests/src/org/eclipse/mylyn/team/tests/CommitTemplateTest.java:[110] 
	assertEquals("one two", manager.generateComment(testTask, "one ${TestVar(\"\")} two"));
	                                ^^^^^^^^^^^^^^^
Discouraged access: The method 'CommitTemplateManager.generateComment(ITask, String)' is not API (restriction on classpath entry '/jobs/genie.mylyn/mylyn-context-nightly/workspace/org.eclipse.mylyn.team.ui/target/classes')
[WARNING] /jobs/genie.mylyn/mylyn-context-nightly/workspace/org.eclipse.mylyn.team.tests/src/org/eclipse/mylyn/team/tests/CommitTemplateTest.java:[112] 
	manager.generateComment(testTask, "${task.status} ${TestVar()} ${task.description}"));
	        ^^^^^^^^^^^^^^^
Discouraged access: The method 'CommitTemplateManager.generateComment(ITask, String)' is not API (restriction on classpath entry '/jobs/genie.mylyn/mylyn-context-nightly/workspace/org.eclipse.mylyn.team.ui/target/classes')
[WARNING] /jobs/genie.mylyn/mylyn-context-nightly/workspace/org.eclipse.mylyn.team.tests/src/org/eclipse/mylyn/team/tests/CommitTemplateTest.java:[116] 
	CommitTemplateManager manager = FocusedTeamUiPlugin.getDefault().getCommitTemplateManager();
	^^^^^^^^^^^^^^^^^^^^^
Discouraged access: The type 'CommitTemplateManager' is not API (restriction on classpath entry '/jobs/genie.mylyn/mylyn-context-nightly/workspace/org.eclipse.mylyn.team.ui/target/classes')
[WARNING] /jobs/genie.mylyn/mylyn-context-nightly/workspace/org.eclipse.mylyn.team.tests/src/org/eclipse/mylyn/team/tests/CommitTemplateTest.java:[116] 
	CommitTemplateManager manager = FocusedTeamUiPlugin.getDefault().getCommitTemplateManager();
	                                ^^^^^^^^^^^^^^^^^^^
Discouraged access: The type 'FocusedTeamUiPlugin' is not API (restriction on classpath entry '/jobs/genie.mylyn/mylyn-context-nightly/workspace/org.eclipse.mylyn.team.ui/target/classes')
[WARNING] /jobs/genie.mylyn/mylyn-context-nightly/workspace/org.eclipse.mylyn.team.tests/src/org/eclipse/mylyn/team/tests/CommitTemplateTest.java:[116] 
	CommitTemplateManager manager = FocusedTeamUiPlugin.getDefault().getCommitTemplateManager();
	                                                    ^^^^^^^^^^
Discouraged access: The method 'FocusedTeamUiPlugin.getDefault()' is not API (restriction on classpath entry '/jobs/genie.mylyn/mylyn-context-nightly/workspace/org.eclipse.mylyn.team.ui/target/classes')
[WARNING] /jobs/genie.mylyn/mylyn-context-nightly/workspace/org.eclipse.mylyn.team.tests/src/org/eclipse/mylyn/team/tests/CommitTemplateTest.java:[116] 
	CommitTemplateManager manager = FocusedTeamUiPlugin.getDefault().getCommitTemplateManager();
	                                                                 ^^^^^^^^^^^^^^^^^^^^^^^^
Discouraged access: The method 'FocusedTeamUiPlugin.getCommitTemplateManager()' is not API (restriction on classpath entry '/jobs/genie.mylyn/mylyn-context-nightly/workspace/org.eclipse.mylyn.team.ui/target/classes')
[WARNING] /jobs/genie.mylyn/mylyn-context-nightly/workspace/org.eclipse.mylyn.team.tests/src/org/eclipse/mylyn/team/tests/CommitTemplateTest.java:[117] 
	TaskTask testTask = createTask();
	^^^^^^^^
Discouraged access: The type 'TaskTask' is not API (restriction on classpath entry '/home/hudson/genie.mylyn/.jenkins/jobs/mylyn-context-nightly/workspace/.repository/p2/osgi/bundle/org.eclipse.mylyn.tasks.core/3.26.0.N20190930-2129/org.eclipse.mylyn.tasks.core-3.26.0.N20190930-2129.jar')
[WARNING] /jobs/genie.mylyn/mylyn-context-nightly/workspace/org.eclipse.mylyn.team.tests/src/org/eclipse/mylyn/team/tests/CommitTemplateTest.java:[120] 
	manager.generateComment(testTask, "${task.status} ${TestVar( \"x , \"y\" )} ${task.description}"));
	        ^^^^^^^^^^^^^^^
Discouraged access: The method 'CommitTemplateManager.generateComment(ITask, String)' is not API (restriction on classpath entry '/jobs/genie.mylyn/mylyn-context-nightly/workspace/org.eclipse.mylyn.team.ui/target/classes')
[WARNING] /jobs/genie.mylyn/mylyn-context-nightly/workspace/org.eclipse.mylyn.team.tests/src/org/eclipse/mylyn/team/tests/CommitTemplateTest.java:[122] 
	manager.generateComment(testTask, "${task.status} ${TestVar( \"x\" \"y\" )} ${task.description}"));
	        ^^^^^^^^^^^^^^^
Discouraged access: The method 'CommitTemplateManager.generateComment(ITask, String)' is not API (restriction on classpath entry '/jobs/genie.mylyn/mylyn-context-nightly/workspace/org.eclipse.mylyn.team.ui/target/classes')
[WARNING] /jobs/genie.mylyn/mylyn-context-nightly/workspace/org.eclipse.mylyn.team.tests/src/org/eclipse/mylyn/team/tests/CommitTemplateTest.java:[124] 
	manager.generateComment(testTask, "${task.status} ${TestVar( \"x , )} ${task.description}"));
	        ^^^^^^^^^^^^^^^
Discouraged access: The method 'CommitTemplateManager.generateComment(ITask, String)' is not API (restriction on classpath entry '/jobs/genie.mylyn/mylyn-context-nightly/workspace/org.eclipse.mylyn.team.ui/target/classes')
[WARNING] /jobs/genie.mylyn/mylyn-context-nightly/workspace/org.eclipse.mylyn.team.tests/src/org/eclipse/mylyn/team/tests/CommitTemplateTest.java:[126] 
	manager.generateComment(testTask, "${task.status} ${TestVar( \"x\" , )} ${task.description}"));
	        ^^^^^^^^^^^^^^^
Discouraged access: The method 'CommitTemplateManager.generateComment(ITask, String)' is not API (restriction on classpath entry '/jobs/genie.mylyn/mylyn-context-nightly/workspace/org.eclipse.mylyn.team.ui/target/classes')
[WARNING] /jobs/genie.mylyn/mylyn-context-nightly/workspace/org.eclipse.mylyn.team.tests/src/org/eclipse/mylyn/team/tests/CommitTemplateTest.java:[128] 
	manager.generateComment(testTask, "${task.status} ${TestVar( x )} ${task.description}"));
	        ^^^^^^^^^^^^^^^
Discouraged access: The method 'CommitTemplateManager.generateComment(ITask, String)' is not API (restriction on classpath entry '/jobs/genie.mylyn/mylyn-context-nightly/workspace/org.eclipse.mylyn.team.ui/target/classes')
[WARNING] /jobs/genie.mylyn/mylyn-context-nightly/workspace/org.eclipse.mylyn.team.tests/src/org/eclipse/mylyn/team/tests/CommitTemplateTest.java:[130] 
	manager.generateComment(testTask, "${task.status} ${noexist( \"x\" )} ${task.description}"));
	        ^^^^^^^^^^^^^^^
Discouraged access: The method 'CommitTemplateManager.generateComment(ITask, String)' is not API (restriction on classpath entry '/jobs/genie.mylyn/mylyn-context-nightly/workspace/org.eclipse.mylyn.team.ui/target/classes')
[WARNING] /jobs/genie.mylyn/mylyn-context-nightly/workspace/org.eclipse.mylyn.team.tests/src/org/eclipse/mylyn/team/tests/CommitTemplateTest.java:[133] 
	private TaskTask createTask() {
	        ^^^^^^^^
Discouraged access: The type 'TaskTask' is not API (restriction on classpath entry '/home/hudson/genie.mylyn/.jenkins/jobs/mylyn-context-nightly/workspace/.repository/p2/osgi/bundle/org.eclipse.mylyn.tasks.core/3.26.0.N20190930-2129/org.eclipse.mylyn.tasks.core-3.26.0.N20190930-2129.jar')
[WARNING] /jobs/genie.mylyn/mylyn-context-nightly/workspace/org.eclipse.mylyn.team.tests/src/org/eclipse/mylyn/team/tests/CommitTemplateTest.java:[135] 
	TaskTask testTask = new TaskTask("no url", taskId, "summary");
	^^^^^^^^
Discouraged access: The type 'TaskTask' is not API (restriction on classpath entry '/home/hudson/genie.mylyn/.jenkins/jobs/mylyn-context-nightly/workspace/.repository/p2/osgi/bundle/org.eclipse.mylyn.tasks.core/3.26.0.N20190930-2129/org.eclipse.mylyn.tasks.core-3.26.0.N20190930-2129.jar')
[WARNING] /jobs/genie.mylyn/mylyn-context-nightly/workspace/org.eclipse.mylyn.team.tests/src/org/eclipse/mylyn/team/tests/CommitTemplateTest.java:[135] 
	TaskTask testTask = new TaskTask("no url", taskId, "summary");
	                        ^^^^^^^^
Discouraged access: The constructor 'TaskTask(String, String, String)' is not API (restriction on classpath entry '/home/hudson/genie.mylyn/.jenkins/jobs/mylyn-context-nightly/workspace/.repository/p2/osgi/bundle/org.eclipse.mylyn.tasks.core/3.26.0.N20190930-2129/org.eclipse.mylyn.tasks.core-3.26.0.N20190930-2129.jar')
[WARNING] /jobs/genie.mylyn/mylyn-context-nightly/workspace/org.eclipse.mylyn.team.tests/src/org/eclipse/mylyn/team/tests/CommitTemplateTest.java:[135] 
	TaskTask testTask = new TaskTask("no url", taskId, "summary");
	                        ^^^^^^^^
Discouraged access: The type 'TaskTask' is not API (restriction on classpath entry '/home/hudson/genie.mylyn/.jenkins/jobs/mylyn-context-nightly/workspace/.repository/p2/osgi/bundle/org.eclipse.mylyn.tasks.core/3.26.0.N20190930-2129/org.eclipse.mylyn.tasks.core-3.26.0.N20190930-2129.jar')
[WARNING] /jobs/genie.mylyn/mylyn-context-nightly/workspace/org.eclipse.mylyn.team.tests/src/org/eclipse/mylyn/team/tests/CommitTemplateTest.java:[136] 
	testTask.setTaskKey(null);
	         ^^^^^^^^^^
Discouraged access: The method 'AbstractTask.setTaskKey(String)' is not API (restriction on classpath entry '/home/hudson/genie.mylyn/.jenkins/jobs/mylyn-context-nightly/workspace/.repository/p2/osgi/bundle/org.eclipse.mylyn.tasks.core/3.26.0.N20190930-2129/org.eclipse.mylyn.tasks.core-3.26.0.N20190930-2129.jar')
[WARNING] /jobs/genie.mylyn/mylyn-context-nightly/workspace/org.eclipse.mylyn.team.tests/src/org/eclipse/mylyn/team/tests/CommitTemplateTest.java:[137] 
	testTask.setSummary("TestSummary");
	         ^^^^^^^^^^
Discouraged access: The method 'AbstractTask.setSummary(String)' is not API (restriction on classpath entry '/home/hudson/genie.mylyn/.jenkins/jobs/mylyn-context-nightly/workspace/.repository/p2/osgi/bundle/org.eclipse.mylyn.tasks.core/3.26.0.N20190930-2129/org.eclipse.mylyn.tasks.core-3.26.0.N20190930-2129.jar')
[WARNING] /jobs/genie.mylyn/mylyn-context-nightly/workspace/org.eclipse.mylyn.team.tests/src/org/eclipse/mylyn/team/tests/CommitTemplateTest.java:[142] 
	String template = FocusedTeamUiPlugin.getDefault()
	                  ^^^^^^^^^^^^^^^^^^^
Discouraged access: The type 'FocusedTeamUiPlugin' is not API (restriction on classpath entry '/jobs/genie.mylyn/mylyn-context-nightly/workspace/org.eclipse.mylyn.team.ui/target/classes')
[WARNING] /jobs/genie.mylyn/mylyn-context-nightly/workspace/org.eclipse.mylyn.team.tests/src/org/eclipse/mylyn/team/tests/CommitTemplateTest.java:[142] 
	String template = FocusedTeamUiPlugin.getDefault()
	                                      ^^^^^^^^^^
Discouraged access: The method 'FocusedTeamUiPlugin.getDefault()' is not API (restriction on classpath entry '/jobs/genie.mylyn/mylyn-context-nightly/workspace/org.eclipse.mylyn.team.ui/target/classes')
[WARNING] /jobs/genie.mylyn/mylyn-context-nightly/workspace/org.eclipse.mylyn.team.tests/src/org/eclipse/mylyn/team/tests/CommitTemplateTest.java:[144] 
	.getString(FocusedTeamUiPlugin.COMMIT_TEMPLATE);
	           ^^^^^^^^^^^^^^^^^^^^^^^^^^^^^^^^^^^
Discouraged access: The type 'FocusedTeamUiPlugin' is not API (restriction on classpath entry '/jobs/genie.mylyn/mylyn-context-nightly/workspace/org.eclipse.mylyn.team.ui/target/classes')
[WARNING] /jobs/genie.mylyn/mylyn-context-nightly/workspace/org.eclipse.mylyn.team.tests/src/org/eclipse/mylyn/team/tests/CommitTemplateTest.java:[144] 
	.getString(FocusedTeamUiPlugin.COMMIT_TEMPLATE);
	                               ^^^^^^^^^^^^^^^
Discouraged access: The field 'FocusedTeamUiPlugin.COMMIT_TEMPLATE' is not API (restriction on classpath entry '/jobs/genie.mylyn/mylyn-context-nightly/workspace/org.eclipse.mylyn.team.ui/target/classes')
[WARNING] /jobs/genie.mylyn/mylyn-context-nightly/workspace/org.eclipse.mylyn.team.tests/src/org/eclipse/mylyn/team/tests/CommitTemplateTest.java:[146] 
	AbstractTask task = new MockTask("12345");
	^^^^^^^^^^^^
Discouraged access: The type 'AbstractTask' is not API (restriction on classpath entry '/home/hudson/genie.mylyn/.jenkins/jobs/mylyn-context-nightly/workspace/.repository/p2/osgi/bundle/org.eclipse.mylyn.tasks.core/3.26.0.N20190930-2129/org.eclipse.mylyn.tasks.core-3.26.0.N20190930-2129.jar')
[WARNING] /jobs/genie.mylyn/mylyn-context-nightly/workspace/org.eclipse.mylyn.team.tests/src/org/eclipse/mylyn/team/tests/CommitTemplateTest.java:[146] 
	AbstractTask task = new MockTask("12345");
	                        ^^^^^^^^
Discouraged access: The constructor 'MockTask(String)' is not API (restriction on classpath entry '/home/hudson/genie.mylyn/.jenkins/jobs/mylyn-context-nightly/workspace/.repository/p2/osgi/bundle/org.eclipse.mylyn.tasks.tests/3.26.0.N20190930-2129/org.eclipse.mylyn.tasks.tests-3.26.0.N20190930-2129.jar')
[WARNING] /jobs/genie.mylyn/mylyn-context-nightly/workspace/org.eclipse.mylyn.team.tests/src/org/eclipse/mylyn/team/tests/CommitTemplateTest.java:[146] 
	AbstractTask task = new MockTask("12345");
	                        ^^^^^^^^
Discouraged access: The type 'MockTask' is not API (restriction on classpath entry '/home/hudson/genie.mylyn/.jenkins/jobs/mylyn-context-nightly/workspace/.repository/p2/osgi/bundle/org.eclipse.mylyn.tasks.tests/3.26.0.N20190930-2129/org.eclipse.mylyn.tasks.tests-3.26.0.N20190930-2129.jar')
[WARNING] /jobs/genie.mylyn/mylyn-context-nightly/workspace/org.eclipse.mylyn.team.tests/src/org/eclipse/mylyn/team/tests/CommitTemplateTest.java:[147] 
	String comment = FocusedTeamUiPlugin.getDefault().getCommitTemplateManager().generateComment(task, template);
	                 ^^^^^^^^^^^^^^^^^^^
Discouraged access: The type 'FocusedTeamUiPlugin' is not API (restriction on classpath entry '/jobs/genie.mylyn/mylyn-context-nightly/workspace/org.eclipse.mylyn.team.ui/target/classes')
[WARNING] /jobs/genie.mylyn/mylyn-context-nightly/workspace/org.eclipse.mylyn.team.tests/src/org/eclipse/mylyn/team/tests/CommitTemplateTest.java:[147] 
	String comment = FocusedTeamUiPlugin.getDefault().getCommitTemplateManager().generateComment(task, template);
	                                     ^^^^^^^^^^
Discouraged access: The method 'FocusedTeamUiPlugin.getDefault()' is not API (restriction on classpath entry '/jobs/genie.mylyn/mylyn-context-nightly/workspace/org.eclipse.mylyn.team.ui/target/classes')
[WARNING] /jobs/genie.mylyn/mylyn-context-nightly/workspace/org.eclipse.mylyn.team.tests/src/org/eclipse/mylyn/team/tests/CommitTemplateTest.java:[147] 
	String comment = FocusedTeamUiPlugin.getDefault().getCommitTemplateManager().generateComment(task, template);
	                                                  ^^^^^^^^^^^^^^^^^^^^^^^^
Discouraged access: The method 'FocusedTeamUiPlugin.getCommitTemplateManager()' is not API (restriction on classpath entry '/jobs/genie.mylyn/mylyn-context-nightly/workspace/org.eclipse.mylyn.team.ui/target/classes')
[WARNING] /jobs/genie.mylyn/mylyn-context-nightly/workspace/org.eclipse.mylyn.team.tests/src/org/eclipse/mylyn/team/tests/CommitTemplateTest.java:[147] 
	String comment = FocusedTeamUiPlugin.getDefault().getCommitTemplateManager().generateComment(task, template);
	                                                                             ^^^^^^^^^^^^^^^
Discouraged access: The method 'CommitTemplateManager.generateComment(ITask, String)' is not API (restriction on classpath entry '/jobs/genie.mylyn/mylyn-context-nightly/workspace/org.eclipse.mylyn.team.ui/target/classes')
[WARNING] /jobs/genie.mylyn/mylyn-context-nightly/workspace/org.eclipse.mylyn.team.tests/src/org/eclipse/mylyn/team/tests/CommitTemplateTest.java:[149] 
	String taskId = FocusedTeamUiPlugin.getDefault()
	                ^^^^^^^^^^^^^^^^^^^
Discouraged access: The type 'FocusedTeamUiPlugin' is not API (restriction on classpath entry '/jobs/genie.mylyn/mylyn-context-nightly/workspace/org.eclipse.mylyn.team.ui/target/classes')
[WARNING] /jobs/genie.mylyn/mylyn-context-nightly/workspace/org.eclipse.mylyn.team.tests/src/org/eclipse/mylyn/team/tests/CommitTemplateTest.java:[149] 
	String taskId = FocusedTeamUiPlugin.getDefault()
	                                    ^^^^^^^^^^
Discouraged access: The method 'FocusedTeamUiPlugin.getDefault()' is not API (restriction on classpath entry '/jobs/genie.mylyn/mylyn-context-nightly/workspace/org.eclipse.mylyn.team.ui/target/classes')
[WARNING] /jobs/genie.mylyn/mylyn-context-nightly/workspace/org.eclipse.mylyn.team.tests/src/org/eclipse/mylyn/team/tests/CommitTemplateTest.java:[150] 
	.getCommitTemplateManager()
	 ^^^^^^^^^^^^^^^^^^^^^^^^
Discouraged access: The method 'FocusedTeamUiPlugin.getCommitTemplateManager()' is not API (restriction on classpath entry '/jobs/genie.mylyn/mylyn-context-nightly/workspace/org.eclipse.mylyn.team.ui/target/classes')
[WARNING] /jobs/genie.mylyn/mylyn-context-nightly/workspace/org.eclipse.mylyn.team.tests/src/org/eclipse/mylyn/team/tests/CommitTemplateTest.java:[151] 
	.getTaskIdFromCommentOrLabel(comment);
	 ^^^^^^^^^^^^^^^^^^^^^^^^^^^
Discouraged access: The method 'CommitTemplateManager.getTaskIdFromCommentOrLabel(String)' is not API (restriction on classpath entry '/jobs/genie.mylyn/mylyn-context-nightly/workspace/org.eclipse.mylyn.team.ui/target/classes')
[WARNING] /jobs/genie.mylyn/mylyn-context-nightly/workspace/org.eclipse.mylyn.team.tests/src/org/eclipse/mylyn/team/tests/CommitTemplateTest.java:[156] 
	String template = FocusedTeamUiPlugin.getDefault()
	                  ^^^^^^^^^^^^^^^^^^^
Discouraged access: The type 'FocusedTeamUiPlugin' is not API (restriction on classpath entry '/jobs/genie.mylyn/mylyn-context-nightly/workspace/org.eclipse.mylyn.team.ui/target/classes')
[WARNING] /jobs/genie.mylyn/mylyn-context-nightly/workspace/org.eclipse.mylyn.team.tests/src/org/eclipse/mylyn/team/tests/CommitTemplateTest.java:[156] 
	String template = FocusedTeamUiPlugin.getDefault()
	                                      ^^^^^^^^^^
Discouraged access: The method 'FocusedTeamUiPlugin.getDefault()' is not API (restriction on classpath entry '/jobs/genie.mylyn/mylyn-context-nightly/workspace/org.eclipse.mylyn.team.ui/target/classes')
[WARNING] /jobs/genie.mylyn/mylyn-context-nightly/workspace/org.eclipse.mylyn.team.tests/src/org/eclipse/mylyn/team/tests/CommitTemplateTest.java:[158] 
	.getString(FocusedTeamUiPlugin.COMMIT_TEMPLATE);
	           ^^^^^^^^^^^^^^^^^^^^^^^^^^^^^^^^^^^
Discouraged access: The type 'FocusedTeamUiPlugin' is not API (restriction on classpath entry '/jobs/genie.mylyn/mylyn-context-nightly/workspace/org.eclipse.mylyn.team.ui/target/classes')
[WARNING] /jobs/genie.mylyn/mylyn-context-nightly/workspace/org.eclipse.mylyn.team.tests/src/org/eclipse/mylyn/team/tests/CommitTemplateTest.java:[158] 
	.getString(FocusedTeamUiPlugin.COMMIT_TEMPLATE);
	                               ^^^^^^^^^^^^^^^
Discouraged access: The field 'FocusedTeamUiPlugin.COMMIT_TEMPLATE' is not API (restriction on classpath entry '/jobs/genie.mylyn/mylyn-context-nightly/workspace/org.eclipse.mylyn.team.ui/target/classes')
[WARNING] /jobs/genie.mylyn/mylyn-context-nightly/workspace/org.eclipse.mylyn.team.tests/src/org/eclipse/mylyn/team/tests/CommitTemplateTest.java:[160] 
	AbstractTask task = new MockTask("12345");
	^^^^^^^^^^^^
Discouraged access: The type 'AbstractTask' is not API (restriction on classpath entry '/home/hudson/genie.mylyn/.jenkins/jobs/mylyn-context-nightly/workspace/.repository/p2/osgi/bundle/org.eclipse.mylyn.tasks.core/3.26.0.N20190930-2129/org.eclipse.mylyn.tasks.core-3.26.0.N20190930-2129.jar')
[WARNING] /jobs/genie.mylyn/mylyn-context-nightly/workspace/org.eclipse.mylyn.team.tests/src/org/eclipse/mylyn/team/tests/CommitTemplateTest.java:[160] 
	AbstractTask task = new MockTask("12345");
	                        ^^^^^^^^
Discouraged access: The constructor 'MockTask(String)' is not API (restriction on classpath entry '/home/hudson/genie.mylyn/.jenkins/jobs/mylyn-context-nightly/workspace/.repository/p2/osgi/bundle/org.eclipse.mylyn.tasks.tests/3.26.0.N20190930-2129/org.eclipse.mylyn.tasks.tests-3.26.0.N20190930-2129.jar')
[WARNING] /jobs/genie.mylyn/mylyn-context-nightly/workspace/org.eclipse.mylyn.team.tests/src/org/eclipse/mylyn/team/tests/CommitTemplateTest.java:[160] 
	AbstractTask task = new MockTask("12345");
	                        ^^^^^^^^
Discouraged access: The type 'MockTask' is not API (restriction on classpath entry '/home/hudson/genie.mylyn/.jenkins/jobs/mylyn-context-nightly/workspace/.repository/p2/osgi/bundle/org.eclipse.mylyn.tasks.tests/3.26.0.N20190930-2129/org.eclipse.mylyn.tasks.tests-3.26.0.N20190930-2129.jar')
[WARNING] /jobs/genie.mylyn/mylyn-context-nightly/workspace/org.eclipse.mylyn.team.tests/src/org/eclipse/mylyn/team/tests/CommitTemplateTest.java:[161] 
	String comment = FocusedTeamUiPlugin.getDefault().getCommitTemplateManager().generateComment(task, template)
	                 ^^^^^^^^^^^^^^^^^^^
Discouraged access: The type 'FocusedTeamUiPlugin' is not API (restriction on classpath entry '/jobs/genie.mylyn/mylyn-context-nightly/workspace/org.eclipse.mylyn.team.ui/target/classes')
[WARNING] /jobs/genie.mylyn/mylyn-context-nightly/workspace/org.eclipse.mylyn.team.tests/src/org/eclipse/mylyn/team/tests/CommitTemplateTest.java:[161] 
	String comment = FocusedTeamUiPlugin.getDefault().getCommitTemplateManager().generateComment(task, template)
	                                     ^^^^^^^^^^
Discouraged access: The method 'FocusedTeamUiPlugin.getDefault()' is not API (restriction on classpath entry '/jobs/genie.mylyn/mylyn-context-nightly/workspace/org.eclipse.mylyn.team.ui/target/classes')
[WARNING] /jobs/genie.mylyn/mylyn-context-nightly/workspace/org.eclipse.mylyn.team.tests/src/org/eclipse/mylyn/team/tests/CommitTemplateTest.java:[161] 
	String comment = FocusedTeamUiPlugin.getDefault().getCommitTemplateManager().generateComment(task, template)
	                                                  ^^^^^^^^^^^^^^^^^^^^^^^^
Discouraged access: The method 'FocusedTeamUiPlugin.getCommitTemplateManager()' is not API (restriction on classpath entry '/jobs/genie.mylyn/mylyn-context-nightly/workspace/org.eclipse.mylyn.team.ui/target/classes')
[WARNING] /jobs/genie.mylyn/mylyn-context-nightly/workspace/org.eclipse.mylyn.team.tests/src/org/eclipse/mylyn/team/tests/CommitTemplateTest.java:[161] 
	String comment = FocusedTeamUiPlugin.getDefault().getCommitTemplateManager().generateComment(task, template)
	                                                                             ^^^^^^^^^^^^^^^
Discouraged access: The method 'CommitTemplateManager.generateComment(ITask, String)' is not API (restriction on classpath entry '/jobs/genie.mylyn/mylyn-context-nightly/workspace/org.eclipse.mylyn.team.ui/target/classes')
[WARNING] /jobs/genie.mylyn/mylyn-context-nightly/workspace/org.eclipse.mylyn.team.tests/src/org/eclipse/mylyn/team/tests/CommitTemplateTest.java:[164] 
	String taskId = FocusedTeamUiPlugin.getDefault()
	                ^^^^^^^^^^^^^^^^^^^
Discouraged access: The type 'FocusedTeamUiPlugin' is not API (restriction on classpath entry '/jobs/genie.mylyn/mylyn-context-nightly/workspace/org.eclipse.mylyn.team.ui/target/classes')
[WARNING] /jobs/genie.mylyn/mylyn-context-nightly/workspace/org.eclipse.mylyn.team.tests/src/org/eclipse/mylyn/team/tests/CommitTemplateTest.java:[164] 
	String taskId = FocusedTeamUiPlugin.getDefault()
	                                    ^^^^^^^^^^
Discouraged access: The method 'FocusedTeamUiPlugin.getDefault()' is not API (restriction on classpath entry '/jobs/genie.mylyn/mylyn-context-nightly/workspace/org.eclipse.mylyn.team.ui/target/classes')
[WARNING] /jobs/genie.mylyn/mylyn-context-nightly/workspace/org.eclipse.mylyn.team.tests/src/org/eclipse/mylyn/team/tests/CommitTemplateTest.java:[165] 
	.getCommitTemplateManager()
	 ^^^^^^^^^^^^^^^^^^^^^^^^
Discouraged access: The method 'FocusedTeamUiPlugin.getCommitTemplateManager()' is not API (restriction on classpath entry '/jobs/genie.mylyn/mylyn-context-nightly/workspace/org.eclipse.mylyn.team.ui/target/classes')
[WARNING] /jobs/genie.mylyn/mylyn-context-nightly/workspace/org.eclipse.mylyn.team.tests/src/org/eclipse/mylyn/team/tests/TestSyncViewRefresh.java:[17] 
	import org.eclipse.team.internal.ui.synchronize.SynchronizeView;
	       ^^^^^^^^^^^^^^^^^^^^^^^^^^^^^^^^^^^^^^^^^^^^^^^^^^^^^^^^
Discouraged access: The type 'SynchronizeView' is not API (restriction on classpath entry '/home/hudson/genie.mylyn/.jenkins/jobs/mylyn-context-nightly/workspace/.repository/p2/osgi/bundle/org.eclipse.team.ui/3.8.100.v20180418-1233/org.eclipse.team.ui-3.8.100.v20180418-1233.jar')
[WARNING] /jobs/genie.mylyn/mylyn-context-nightly/workspace/org.eclipse.mylyn.team.tests/src/org/eclipse/mylyn/team/tests/TestSyncViewRefresh.java:[33] 
	assertTrue(view instanceof SynchronizeView);
	                           ^^^^^^^^^^^^^^^
Discouraged access: The type 'SynchronizeView' is not API (restriction on classpath entry '/home/hudson/genie.mylyn/.jenkins/jobs/mylyn-context-nightly/workspace/.repository/p2/osgi/bundle/org.eclipse.team.ui/3.8.100.v20180418-1233/org.eclipse.team.ui-3.8.100.v20180418-1233.jar')
[WARNING] /jobs/genie.mylyn/mylyn-context-nightly/workspace/org.eclipse.mylyn.team.tests/src/org/eclipse/mylyn/team/tests/TestSyncViewRefresh.java:[34] 
	SynchronizeView syncView = (SynchronizeView) view;
	^^^^^^^^^^^^^^^
Discouraged access: The type 'SynchronizeView' is not API (restriction on classpath entry '/home/hudson/genie.mylyn/.jenkins/jobs/mylyn-context-nightly/workspace/.repository/p2/osgi/bundle/org.eclipse.team.ui/3.8.100.v20180418-1233/org.eclipse.team.ui-3.8.100.v20180418-1233.jar')
[WARNING] /jobs/genie.mylyn/mylyn-context-nightly/workspace/org.eclipse.mylyn.team.tests/src/org/eclipse/mylyn/team/tests/TestSyncViewRefresh.java:[34] 
	SynchronizeView syncView = (SynchronizeView) view;
	                            ^^^^^^^^^^^^^^^
Discouraged access: The type 'SynchronizeView' is not API (restriction on classpath entry '/home/hudson/genie.mylyn/.jenkins/jobs/mylyn-context-nightly/workspace/.repository/p2/osgi/bundle/org.eclipse.team.ui/3.8.100.v20180418-1233/org.eclipse.team.ui-3.8.100.v20180418-1233.jar')
343 problems (343 warnings)
[INFO] 
[INFO] --- tycho-source-plugin:1.5.0:plugin-source (attach-source) @ org.eclipse.mylyn.team.tests ---
[INFO] Building jar: /jobs/genie.mylyn/mylyn-context-nightly/workspace/org.eclipse.mylyn.team.tests/target/org.eclipse.mylyn.team.tests-3.26.0-SNAPSHOT-sources.jar
[INFO] 
[INFO] --- maven-resources-plugin:2.4.1:testResources (default-testResources) @ org.eclipse.mylyn.team.tests ---
[INFO] Using 'ISO-8859-1' encoding to copy filtered resources.
[INFO] skip non existing resourceDirectory /jobs/genie.mylyn/mylyn-context-nightly/workspace/org.eclipse.mylyn.team.tests/src/test/resources
[INFO] 
[INFO] --- target-platform-configuration:1.5.0:target-platform (default-target-platform) @ org.eclipse.mylyn.team.tests ---
[INFO] 
[INFO] --- tycho-packaging-plugin:1.5.0:package-plugin (default-package-plugin) @ org.eclipse.mylyn.team.tests ---
[INFO] Building jar: /jobs/genie.mylyn/mylyn-context-nightly/workspace/org.eclipse.mylyn.team.tests/target/org.eclipse.mylyn.team.tests-3.26.0-SNAPSHOT.jar
[INFO] 
[INFO] --- tycho-p2-plugin:1.5.0:p2-metadata-default (default-p2-metadata-default) @ org.eclipse.mylyn.team.tests ---
[INFO] 
[INFO] --- tycho-surefire-plugin:1.5.0:test (default-test) @ org.eclipse.mylyn.team.tests ---
[INFO] Expected eclipse log file: /jobs/genie.mylyn/mylyn-context-nightly/workspace/org.eclipse.mylyn.team.tests/target/work/data/.metadata/.log
[INFO] Command line:
	[/opt/public/common/java/oracle/jdk1.8.0_202_x64/jre/bin/java, -Dosgi.noShutdown=false, -Dosgi.os=linux, -Dosgi.ws=gtk, -Dosgi.arch=x86_64, -Xmx512m, -Djava.io.tmpdir=/jobs/genie.mylyn/mylyn-context-nightly/workspace/org.eclipse.mylyn.team.tests/target, -ea, -Dmylyn.credentials=/shared/mylyn/.credentials.properties, -Dorg.eclipse.mylyn.wikitext.tests.disableOutput=true, -Dhttp.proxyHost=proxy.eclipse.org, -Dhttp.proxyPort=9898, -Dhttps.proxyHost=proxy.eclipse.org, -Dhttps.proxyPort=9898, -Dhttp.nonProxyHosts=*.eclipse.org, -Dosgi.clean=true, -jar, /jobs/genie.mylyn/mylyn-context-nightly/workspace/.repository/p2/osgi/bundle/org.eclipse.equinox.launcher/1.5.0.v20180512-1130/org.eclipse.equinox.launcher-1.5.0.v20180512-1130.jar, -data, /jobs/genie.mylyn/mylyn-context-nightly/workspace/org.eclipse.mylyn.team.tests/target/work/data, -install, /jobs/genie.mylyn/mylyn-context-nightly/workspace/org.eclipse.mylyn.team.tests/target/work, -configuration, /jobs/genie.mylyn/mylyn-context-nightly/workspace/org.eclipse.mylyn.team.tests/target/work/configuration, -application, org.eclipse.tycho.surefire.osgibooter.uitest, -testproperties, /jobs/genie.mylyn/mylyn-context-nightly/workspace/org.eclipse.mylyn.team.tests/target/surefire.properties, -testApplication, org.eclipse.ui.ide.workbench, -product, org.eclipse.sdk.ide, -eclipse.keyring, /jobs/genie.mylyn/mylyn-context-nightly/workspace/org.eclipse.mylyn.team.tests/target/.eclipse.keyring, -eclipse.password, /jobs/genie.mylyn/mylyn-context-nightly/workspace/org.eclipse.mylyn.team.tests/target/../../.gitignore, -timeout, 10800000]
Picked up JAVA_TOOL_OPTIONS: -Xmx2G -Djava.io.tmpdir=/tmp/genie.mylyn -DforkCount=1
Launching application org.eclipse.ui.ide.workbench...
[2020-06-01T3-28-45] Status ERROR: org.eclipse.mylyn.tasks.ui code=0 Loading of brand 'exceptional' for kind 'mock' failed. org.eclipse.mylyn.tasks.tests.TestException: Test of exception handling, Exception:
org.eclipse.mylyn.tasks.tests.TestException: Test of exception handling

[2020-06-01T3-28-45] Status ERROR: org.eclipse.mylyn.tasks.ui code=0 Loading of brand 'exceptional' for kind 'mock.dynamic' failed. org.eclipse.mylyn.tasks.tests.TestException: Test of exception handling, Exception:
org.eclipse.mylyn.tasks.tests.TestException: Test of exception handling

Running org.eclipse.mylyn.team.tests.AllTeamTests
Tests run: 22, Failures: 0, Errors: 0, Skipped: 0, Time elapsed: 2.104 s - in org.eclipse.mylyn.team.tests.AllTeamTests
testInitialPage(org.eclipse.mylyn.team.tests.TestSyncViewRefresh)  Time elapsed: 0.142 s
testDisabledMode(org.eclipse.mylyn.team.tests.ChangeSetManagerTest)  Time elapsed: 0.249 s
testContentsAfterDecay(org.eclipse.mylyn.team.tests.ChangeSetManagerTest)  Time elapsed: 0.176 s
testSingleContextActivation(org.eclipse.mylyn.team.tests.ChangeSetManagerTest)  Time elapsed: 0.075 s
testCreateTemplate(org.eclipse.mylyn.team.tests.CommitTemplateTest)  Time elapsed: 0.01 s
testRegex(org.eclipse.mylyn.team.tests.CommitTemplateTest)  Time elapsed: 0 s
testTemplateVariableWithParametersIncorrectSyntax(org.eclipse.mylyn.team.tests.CommitTemplateTest)  Time elapsed: 0.003 s
testRepositoryTaskCommentParsing(org.eclipse.mylyn.team.tests.CommitTemplateTest)  Time elapsed: 0.003 s
testTemplateNullKeyTrailingCharacters(org.eclipse.mylyn.team.tests.CommitTemplateTest)  Time elapsed: 0.001 s
testTemplateWithTab(org.eclipse.mylyn.team.tests.CommitTemplateTest)  Time elapsed: 0.001 s
testTemplateVariableWithParameters(org.eclipse.mylyn.team.tests.CommitTemplateTest)  Time elapsed: 0.003 s
testTemplateCollapseWhitespace(org.eclipse.mylyn.team.tests.CommitTemplateTest)  Time elapsed: 0.001 s
testRepositoryTaskCommentParsingMultiline(org.eclipse.mylyn.team.tests.CommitTemplateTest)  Time elapsed: 0.001 s
testCommitCommentTemplate(org.eclipse.mylyn.team.tests.TeamPropertiesLinkProviderTest)  Time elapsed: 0.294 s
testChangeSetCommitCommentChangedResources(org.eclipse.mylyn.team.tests.TeamPropertiesLinkProviderTest)  Time elapsed: 0.058 s
testChangeSetCommitCommentMultipleProjects(org.eclipse.mylyn.team.tests.TeamPropertiesLinkProviderTest)  Time elapsed: 0.062 s
test07LegacyMatching(org.eclipse.mylyn.team.tests.TaskFinderTest)  Time elapsed: 0.003 s
testGuessTaskKey(org.eclipse.mylyn.team.tests.TaskFinderTest)  Time elapsed: 0 s
testExtractTaskId(org.eclipse.mylyn.team.tests.TaskFinderTest)  Time elapsed: 0 s
testUrlMatching(org.eclipse.mylyn.team.tests.TaskFinderTest)  Time elapsed: 0 s
testTaskUrl(org.eclipse.mylyn.team.tests.CommitTemplateVariablesTest)  Time elapsed: 0.008 s
testCopyCommitMessage(org.eclipse.mylyn.team.tests.CopyCommitMessageHandlerTest)  Time elapsed: 0.554 s

Results:

Tests run: 22, Failures: 0, Errors: 0, Skipped: 0

[INFO] All tests passed!
[INFO] 
[INFO] --< org.eclipse.mylyn.context:org.eclipse.mylyn.context.development >---
[INFO] Building org.eclipse.mylyn.context.development 3.26.0-SNAPSHOT   [36/37]
[INFO] --------------------------[ eclipse-feature ]---------------------------
[INFO] 
[INFO] --- maven-clean-plugin:2.5:clean (default-clean) @ org.eclipse.mylyn.context.development ---
[INFO] Deleting /jobs/genie.mylyn/mylyn-context-nightly/workspace/org.eclipse.mylyn.context.development-feature/target
[INFO] 
[INFO] --- tycho-packaging-plugin:1.5.0:build-qualifier-aggregator (default-build-qualifier-aggregator) @ org.eclipse.mylyn.context.development ---
[INFO] The project's OSGi version is 3.26.0.N20200425-1736
[INFO] 
[INFO] --- tycho-packaging-plugin:1.5.0:validate-id (default-validate-id) @ org.eclipse.mylyn.context.development ---
[INFO] 
[INFO] --- tycho-packaging-plugin:1.5.0:validate-version (default-validate-version) @ org.eclipse.mylyn.context.development ---
[INFO] 
[INFO] --- jacoco-maven-plugin:0.5.6.201201232323:prepare-agent (default) @ org.eclipse.mylyn.context.development ---
[INFO] Skipping JaCoCo execution
[INFO] 
[INFO] --- target-platform-configuration:1.5.0:target-platform (default-target-platform) @ org.eclipse.mylyn.context.development ---
[INFO] 
[INFO] --- tycho-packaging-plugin:1.5.0:package-feature (default-package-feature) @ org.eclipse.mylyn.context.development ---
[INFO] Building jar: /jobs/genie.mylyn/mylyn-context-nightly/workspace/org.eclipse.mylyn.context.development-feature/target/org.eclipse.mylyn.context.development-3.26.0-SNAPSHOT.jar
[INFO] 
[INFO] --- tycho-p2-plugin:1.5.0:p2-metadata-default (default-p2-metadata-default) @ org.eclipse.mylyn.context.development ---
[INFO] 
[INFO] --- tycho-p2-plugin:1.5.0:feature-p2-metadata (default-feature-p2-metadata) @ org.eclipse.mylyn.context.development ---
[INFO] 
[INFO] --< org.eclipse.mylyn.context:org.eclipse.mylyn.context.tasks.ui.tests >--
[INFO] Building org.eclipse.mylyn.context.tasks.ui.tests 3.26.0-SNAPSHOT [37/37]
[INFO] ------------------------[ eclipse-test-plugin ]-------------------------
[INFO] 
[INFO] --- maven-clean-plugin:2.5:clean (default-clean) @ org.eclipse.mylyn.context.tasks.ui.tests ---
[INFO] Deleting /jobs/genie.mylyn/mylyn-context-nightly/workspace/org.eclipse.mylyn.context.tasks.ui.tests/target
[INFO] 
[INFO] --- tycho-packaging-plugin:1.5.0:build-qualifier (default-build-qualifier) @ org.eclipse.mylyn.context.tasks.ui.tests ---
[INFO] The project's OSGi version is 3.26.0.N20190801-2134
[INFO] 
[INFO] --- tycho-packaging-plugin:1.5.0:validate-id (default-validate-id) @ org.eclipse.mylyn.context.tasks.ui.tests ---
[INFO] 
[INFO] --- tycho-packaging-plugin:1.5.0:validate-version (default-validate-version) @ org.eclipse.mylyn.context.tasks.ui.tests ---
[INFO] 
[INFO] --- jacoco-maven-plugin:0.5.6.201201232323:prepare-agent (default) @ org.eclipse.mylyn.context.tasks.ui.tests ---
[INFO] Skipping JaCoCo execution
[INFO] 
[INFO] --- maven-resources-plugin:2.4.1:resources (default-resources) @ org.eclipse.mylyn.context.tasks.ui.tests ---
[INFO] Using 'ISO-8859-1' encoding to copy filtered resources.
[INFO] skip non existing resourceDirectory /jobs/genie.mylyn/mylyn-context-nightly/workspace/org.eclipse.mylyn.context.tasks.ui.tests/src/main/resources
[INFO] 
[INFO] --- tycho-compiler-plugin:1.5.0:compile (default-compile) @ org.eclipse.mylyn.context.tasks.ui.tests ---
[INFO] Compiling 2 source files to /jobs/genie.mylyn/mylyn-context-nightly/workspace/org.eclipse.mylyn.context.tasks.ui.tests/target/classes
[INFO] 
[INFO] --- tycho-source-plugin:1.5.0:plugin-source (attach-source) @ org.eclipse.mylyn.context.tasks.ui.tests ---
[INFO] Building jar: /jobs/genie.mylyn/mylyn-context-nightly/workspace/org.eclipse.mylyn.context.tasks.ui.tests/target/org.eclipse.mylyn.context.tasks.ui.tests-3.26.0-SNAPSHOT-sources.jar
[INFO] 
[INFO] --- maven-resources-plugin:2.4.1:testResources (default-testResources) @ org.eclipse.mylyn.context.tasks.ui.tests ---
[INFO] Using 'ISO-8859-1' encoding to copy filtered resources.
[INFO] skip non existing resourceDirectory /jobs/genie.mylyn/mylyn-context-nightly/workspace/org.eclipse.mylyn.context.tasks.ui.tests/src/test/resources
[INFO] 
[INFO] --- target-platform-configuration:1.5.0:target-platform (default-target-platform) @ org.eclipse.mylyn.context.tasks.ui.tests ---
[INFO] 
[INFO] --- tycho-packaging-plugin:1.5.0:package-plugin (default-package-plugin) @ org.eclipse.mylyn.context.tasks.ui.tests ---
[INFO] Building jar: /jobs/genie.mylyn/mylyn-context-nightly/workspace/org.eclipse.mylyn.context.tasks.ui.tests/target/org.eclipse.mylyn.context.tasks.ui.tests-3.26.0-SNAPSHOT.jar
[INFO] 
[INFO] --- tycho-p2-plugin:1.5.0:p2-metadata-default (default-p2-metadata-default) @ org.eclipse.mylyn.context.tasks.ui.tests ---
[INFO] 
[INFO] --- tycho-surefire-plugin:1.5.0:test (default-test) @ org.eclipse.mylyn.context.tasks.ui.tests ---
[INFO] Expected eclipse log file: /jobs/genie.mylyn/mylyn-context-nightly/workspace/org.eclipse.mylyn.context.tasks.ui.tests/target/work/data/.metadata/.log
[INFO] Command line:
	[/opt/public/common/java/oracle/jdk1.8.0_202_x64/jre/bin/java, -Dosgi.noShutdown=false, -Dosgi.os=linux, -Dosgi.ws=gtk, -Dosgi.arch=x86_64, -Xmx512m, -Djava.io.tmpdir=/jobs/genie.mylyn/mylyn-context-nightly/workspace/org.eclipse.mylyn.context.tasks.ui.tests/target, -ea, -Dmylyn.credentials=/shared/mylyn/.credentials.properties, -Dorg.eclipse.mylyn.wikitext.tests.disableOutput=true, -Dhttp.proxyHost=proxy.eclipse.org, -Dhttp.proxyPort=9898, -Dhttps.proxyHost=proxy.eclipse.org, -Dhttps.proxyPort=9898, -Dhttp.nonProxyHosts=*.eclipse.org, -Dosgi.clean=true, -jar, /jobs/genie.mylyn/mylyn-context-nightly/workspace/.repository/p2/osgi/bundle/org.eclipse.equinox.launcher/1.5.0.v20180512-1130/org.eclipse.equinox.launcher-1.5.0.v20180512-1130.jar, -data, /jobs/genie.mylyn/mylyn-context-nightly/workspace/org.eclipse.mylyn.context.tasks.ui.tests/target/work/data, -install, /jobs/genie.mylyn/mylyn-context-nightly/workspace/org.eclipse.mylyn.context.tasks.ui.tests/target/work, -configuration, /jobs/genie.mylyn/mylyn-context-nightly/workspace/org.eclipse.mylyn.context.tasks.ui.tests/target/work/configuration, -application, org.eclipse.tycho.surefire.osgibooter.uitest, -testproperties, /jobs/genie.mylyn/mylyn-context-nightly/workspace/org.eclipse.mylyn.context.tasks.ui.tests/target/surefire.properties, -testApplication, org.eclipse.ui.ide.workbench, -product, org.eclipse.sdk.ide, -eclipse.keyring, /jobs/genie.mylyn/mylyn-context-nightly/workspace/org.eclipse.mylyn.context.tasks.ui.tests/target/.eclipse.keyring, -eclipse.password, /jobs/genie.mylyn/mylyn-context-nightly/workspace/org.eclipse.mylyn.context.tasks.ui.tests/target/../../.gitignore, -timeout, 10800000]
Picked up JAVA_TOOL_OPTIONS: -Xmx2G -Djava.io.tmpdir=/tmp/genie.mylyn -DforkCount=1
Launching application org.eclipse.ui.ide.workbench...
[2020-06-01T3-28-58] Status ERROR: org.eclipse.mylyn.tasks.ui code=0 Loading of brand 'exceptional' for kind 'mock' failed. org.eclipse.mylyn.tasks.tests.TestException: Test of exception handling, Exception:
org.eclipse.mylyn.tasks.tests.TestException: Test of exception handling

[2020-06-01T3-28-58] Status ERROR: org.eclipse.mylyn.tasks.ui code=0 Loading of brand 'exceptional' for kind 'mock.dynamic' failed. org.eclipse.mylyn.tasks.tests.TestException: Test of exception handling, Exception:
org.eclipse.mylyn.tasks.tests.TestException: Test of exception handling

Running org.eclipse.mylyn.context.tasks.ui.tests.AllContextTasksUiTests
Tests run: 15, Failures: 1, Errors: 0, Skipped: 0, Time elapsed: 10.996 s <<< FAILURE! - in org.eclipse.mylyn.context.tasks.ui.tests.AllContextTasksUiTests
testDeactivatingDirtyTaskNonActiveEditor(org.eclipse.mylyn.internal.context.tasks.ui.ContextTaskActivationListenerTest)  Time elapsed: 1.111 s
testDeactivatingCleanTaskWithDirtyTask(org.eclipse.mylyn.internal.context.tasks.ui.ContextTaskActivationListenerTest)  Time elapsed: 0.137 s
testDeactivatingTaskWithNoDirtyFiles(org.eclipse.mylyn.internal.context.tasks.ui.ContextTaskActivationListenerTest)  Time elapsed: 0.843 s
testDeactivatingTaskAndSavingSomeWithOnlyOneDirtyFile(org.eclipse.mylyn.internal.context.tasks.ui.ContextTaskActivationListenerTest)  Time elapsed: 0.497 s
testDeactivatingDirtyTaskWithMultipleDirtyFiles(org.eclipse.mylyn.internal.context.tasks.ui.ContextTaskActivationListenerTest)  Time elapsed: 1.526 s
testDeactivatingTaskAndCancellingWithOnlyOneDirtyFile(org.eclipse.mylyn.internal.context.tasks.ui.ContextTaskActivationListenerTest)  Time elapsed: 0.654 s
testDeactivatingTaskAndCancellingWithOnlyDirtyFiles(org.eclipse.mylyn.internal.context.tasks.ui.ContextTaskActivationListenerTest)  Time elapsed: 0.354 s
testDeactivatingTaskWithNothingOpen(org.eclipse.mylyn.internal.context.tasks.ui.ContextTaskActivationListenerTest)  Time elapsed: 0.13 s
testDeactivatingWithInactiveDirtyTask(org.eclipse.mylyn.internal.context.tasks.ui.ContextTaskActivationListenerTest)  Time elapsed: 0.2 s
testDeactivatingDirtyTask(org.eclipse.mylyn.internal.context.tasks.ui.ContextTaskActivationListenerTest)  Time elapsed: 0.198 s  <<< FAILURE!
junit.framework.AssertionFailedError
	at org.eclipse.mylyn.internal.context.tasks.ui.ContextTaskActivationListenerTest.testDeactivatingDirtyTask(ContextTaskActivationListenerTest.java:129)

testDeactivatingTaskAndSavingAllWithOnlyDirtyFiles(org.eclipse.mylyn.internal.context.tasks.ui.ContextTaskActivationListenerTest)  Time elapsed: 0.419 s
testDeactivatingMultipleDirtyTasks(org.eclipse.mylyn.internal.context.tasks.ui.ContextTaskActivationListenerTest)  Time elapsed: 0.297 s
testDeactivatingTaskAndSavingSomeWithOnlyDirtyFiles(org.eclipse.mylyn.internal.context.tasks.ui.ContextTaskActivationListenerTest)  Time elapsed: 0.248 s
testDeactivatingTaskAndSavingAllWithOnlyOneDirtyFile(org.eclipse.mylyn.internal.context.tasks.ui.ContextTaskActivationListenerTest)  Time elapsed: 0.34 s
testDeactivatingDirtyTasksWithMultipleDirtyFiles(org.eclipse.mylyn.internal.context.tasks.ui.ContextTaskActivationListenerTest)  Time elapsed: 4.021 s

Results:

Failures: 
  ContextTaskActivationListenerTest.testDeactivatingDirtyTask:129

Tests run: 15, Failures: 1, Errors: 0, Skipped: 0

[ERROR] There are test failures.

Please refer to /jobs/genie.mylyn/mylyn-context-nightly/workspace/org.eclipse.mylyn.context.tasks.ui.tests/target/surefire-reports for the individual test results.
[INFO] ------------------------------------------------------------------------
[INFO] Reactor Summary:
[INFO] 
[INFO] Mylyn Context 3.26.0-SNAPSHOT ...................... SUCCESS [  1.464 s]
[INFO] org.eclipse.mylyn.bugzilla.ide 3.26.0-SNAPSHOT ..... SUCCESS [  7.563 s]
[INFO] org.eclipse.mylyn.context.core 3.26.0-SNAPSHOT ..... SUCCESS [  1.794 s]
[INFO] org.eclipse.mylyn.context.ui 3.26.0-SNAPSHOT ....... SUCCESS [  4.037 s]
[INFO] org.eclipse.mylyn.context.tasks.ui 3.26.0-SNAPSHOT . SUCCESS [  1.075 s]
[INFO] org.eclipse.mylyn.resources.ui 3.26.0-SNAPSHOT ..... SUCCESS [  0.783 s]
[INFO] org.eclipse.mylyn.context_feature 3.26.0-SNAPSHOT .. SUCCESS [  0.318 s]
[INFO] org.eclipse.cdt.mylyn.ui 3.26.0-SNAPSHOT ........... SUCCESS [  1.135 s]
[INFO] org.eclipse.cdt.mylyn 5.22.0-SNAPSHOT .............. SUCCESS [  0.113 s]
[INFO] org.eclipse.mylyn.ide.ui 3.26.0-SNAPSHOT ........... SUCCESS [  0.478 s]
[INFO] org.eclipse.mylyn.context.sdk.util 3.26.0-SNAPSHOT . SUCCESS [  0.322 s]
[INFO] org.eclipse.mylyn.cdt.tests 3.26.0-SNAPSHOT ........ SUCCESS [ 17.264 s]
[INFO] org.eclipse.mylyn.team.ui 3.26.0-SNAPSHOT .......... SUCCESS [  1.077 s]
[INFO] org.eclipse.mylyn.team_feature 3.26.0-SNAPSHOT ..... SUCCESS [  0.105 s]
[INFO] org.eclipse.mylyn.ide_feature 3.26.0-SNAPSHOT ...... SUCCESS [  0.107 s]
[INFO] org.eclipse.mylyn.debug.ui 3.26.0-SNAPSHOT ......... SUCCESS [  0.448 s]
[INFO] org.eclipse.mylyn.ide.ant 3.26.0-SNAPSHOT .......... SUCCESS [  0.408 s]
[INFO] org.eclipse.mylyn.java.tasks 3.26.0-SNAPSHOT ....... SUCCESS [  0.496 s]
[INFO] org.eclipse.mylyn.java.ui 3.26.0-SNAPSHOT .......... SUCCESS [  1.040 s]
[INFO] org.eclipse.mylyn.java_feature 3.26.0-SNAPSHOT ..... SUCCESS [  0.258 s]
[INFO] org.eclipse.mylyn.pde.ui 3.26.0-SNAPSHOT ........... SUCCESS [  0.764 s]
[INFO] org.eclipse.mylyn.pde_feature 3.26.0-SNAPSHOT ...... SUCCESS [  0.119 s]
[INFO] org.eclipse.mylyn.team.cvs 3.26.0-SNAPSHOT ......... SUCCESS [  0.423 s]
[INFO] org.eclipse.mylyn.team.cvs 3.26.0-SNAPSHOT ......... SUCCESS [  2.903 s]
[INFO] org.eclipse.mylyn.context.sdk.java 3.26.0-SNAPSHOT . SUCCESS [  2.658 s]
[INFO] org.eclipse.mylyn.context.sdk 3.26.0-SNAPSHOT ...... SUCCESS [  0.838 s]
[INFO] Mylyn Context 3.26.0-SNAPSHOT ...................... SUCCESS [  3.316 s]
[INFO] org.eclipse.mylyn.context-target 3.26.0-SNAPSHOT ... SUCCESS [  0.513 s]
[INFO] org.eclipse.mylyn.context.tasks.tests 3.26.0-SNAPSHOT SUCCESS [ 17.019 s]
[INFO] org.eclipse.mylyn.context.tests 3.26.0-SNAPSHOT .... SUCCESS [ 13.506 s]
[INFO] org.eclipse.mylyn.debug.tests 3.26.0-SNAPSHOT ...... SUCCESS [ 13.632 s]
[INFO] org.eclipse.mylyn.ide.tests 3.26.0-SNAPSHOT ........ SUCCESS [ 14.022 s]
[INFO] org.eclipse.mylyn.java.tests 3.26.0-SNAPSHOT ....... SUCCESS [01:11 min]
[INFO] org.eclipse.mylyn.resources.tests 3.26.0-SNAPSHOT .. SUCCESS [ 10.276 s]
[INFO] org.eclipse.mylyn.team.tests 3.26.0-SNAPSHOT ....... SUCCESS [ 14.666 s]
[INFO] org.eclipse.mylyn.context.development 3.26.0-SNAPSHOT SUCCESS [  0.296 s]
[INFO] org.eclipse.mylyn.context.tasks.ui.tests 3.26.0-SNAPSHOT SUCCESS [ 21.134 s]
[INFO] ------------------------------------------------------------------------
[INFO] BUILD SUCCESS
[INFO] ------------------------------------------------------------------------
[INFO] Total time:  05:22 min
[INFO] Finished at: 2020-06-01T03:29:11-04:00
[INFO] ------------------------------------------------------------------------
[workspace] $ /bin/sh -xe /tmp/genie.mylyn/jenkins3727132716663073165.sh
+ git rev-parse HEAD
+ curl -O https://hudson.eclipse.org/mylyn/job/mylyn-commons-nightly/lastSuccessfulBuild/artifact/org.eclipse.mylyn.commons.stamp
  % Total    % Received % Xferd  Average Speed   Time    Time     Time  Current
                                 Dload  Upload   Total   Spent    Left  Speed

  0     0    0     0    0     0      0      0 --:--:-- --:--:-- --:--:--     0
  0     0    0     0    0     0      0      0 --:--:--  0:00:01 --:--:--     0
  0     0    0     0    0     0      0      0 --:--:--  0:00:02 --:--:--     0
100    41  100    41    0     0     16      0  0:00:02  0:00:02 --:--:--    16
+ curl -O https://hudson.eclipse.org/mylyn/job/mylyn-versions-nightly/lastSuccessfulBuild/artifact/org.eclipse.mylyn.versions.stamp
  % Total    % Received % Xferd  Average Speed   Time    Time     Time  Current
                                 Dload  Upload   Total   Spent    Left  Speed

  0     0    0     0    0     0      0      0 --:--:-- --:--:-- --:--:--     0
  0     0    0     0    0     0      0      0 --:--:-- --:--:-- --:--:--     0
100    41  100    41    0     0     33      0  0:00:01  0:00:01 --:--:--    33
+ curl -O https://hudson.eclipse.org/mylyn/job/mylyn-tasks-nightly/lastSuccessfulBuild/artifact/org.eclipse.mylyn.tasks.stamp
  % Total    % Received % Xferd  Average Speed   Time    Time     Time  Current
                                 Dload  Upload   Total   Spent    Left  Speed

  0     0    0     0    0     0      0      0 --:--:-- --:--:-- --:--:--     0
  0     0    0     0    0     0      0      0 --:--:-- --:--:-- --:--:--     0
  0     0    0     0    0     0      0      0 --:--:--  0:00:01 --:--:--     0
  0     0    0     0    0     0      0      0 --:--:--  0:00:02 --:--:--     0
100    41  100    41    0     0     18      0  0:00:02  0:00:02 --:--:--    18
[workspace] $ /bin/sh -xe /tmp/genie.mylyn/jenkins3965129204313014788.sh
+ rm -rf /home/data/httpd/download.eclipse.org/mylyn/snapshots/nightly/context/artifacts.jar /home/data/httpd/download.eclipse.org/mylyn/snapshots/nightly/context/content.jar /home/data/httpd/download.eclipse.org/mylyn/snapshots/nightly/context/features /home/data/httpd/download.eclipse.org/mylyn/snapshots/nightly/context/org.eclipse.mylyn.context.stamp /home/data/httpd/download.eclipse.org/mylyn/snapshots/nightly/context/plugins /home/data/httpd/download.eclipse.org/mylyn/snapshots/nightly/context/site.xml
+ cp -r org.eclipse.mylyn.context.stamp org.eclipse.mylyn.context-site/target/site/artifacts.jar org.eclipse.mylyn.context-site/target/site/content.jar org.eclipse.mylyn.context-site/target/site/features org.eclipse.mylyn.context-site/target/site/plugins org.eclipse.mylyn.context-site/target/site/site.xml /home/data/httpd/download.eclipse.org/mylyn/snapshots/nightly/context/
Terminating xvnc.
Recording test results
Build step 'Publish JUnit test result report' changed build result to UNSTABLE
Recording fingerprints
Archiving artifacts
Started calculate disk usage of build
Finished Calculation of disk usage of build in 0 seconds
Started calculate disk usage of workspace
Finished Calculation of disk usage of workspace in 0 seconds
Finished: UNSTABLE