FailedConsole Output

Skipping 10,415 KB.. Full Log
ess: The method 'UserCredentials.getPassword()' is not API (restriction on classpath entry '/jobs/genie.mylyn/mylyn-3.22.x-release/workspace/org.eclipse.mylyn.commons/org.eclipse.mylyn.commons.repositories.core/target/classes')
[WARNING] /jobs/genie.mylyn/mylyn-3.22.x-release/workspace/org.eclipse.mylyn.tasks/org.eclipse.mylyn.trac.tests/src/org/eclipse/mylyn/trac/tests/support/TracFixture.java:[119] 
	public ITracClient connect(String url, String username, String password) throws Exception {
	       ^^^^^^^^^^^
Discouraged access: The type 'ITracClient' is not API (restriction on classpath entry '/jobs/genie.mylyn/mylyn-3.22.x-release/workspace/org.eclipse.mylyn.tasks/org.eclipse.mylyn.trac.core/target/classes')
[WARNING] /jobs/genie.mylyn/mylyn-3.22.x-release/workspace/org.eclipse.mylyn.tasks/org.eclipse.mylyn.trac.tests/src/org/eclipse/mylyn/trac/tests/support/TracFixture.java:[123] 
	public ITracClient connect(String url, String username, String password, Proxy proxy) throws Exception {
	       ^^^^^^^^^^^
Discouraged access: The type 'ITracClient' is not API (restriction on classpath entry '/jobs/genie.mylyn/mylyn-3.22.x-release/workspace/org.eclipse.mylyn.tasks/org.eclipse.mylyn.trac.core/target/classes')
[WARNING] /jobs/genie.mylyn/mylyn-3.22.x-release/workspace/org.eclipse.mylyn.tasks/org.eclipse.mylyn.trac.tests/src/org/eclipse/mylyn/trac/tests/support/TracFixture.java:[127] 
	public ITracClient connect(String url, String username, String password, final Proxy proxy, Version version)
	       ^^^^^^^^^^^
Discouraged access: The type 'ITracClient' is not API (restriction on classpath entry '/jobs/genie.mylyn/mylyn-3.22.x-release/workspace/org.eclipse.mylyn.tasks/org.eclipse.mylyn.trac.core/target/classes')
[WARNING] /jobs/genie.mylyn/mylyn-3.22.x-release/workspace/org.eclipse.mylyn.tasks/org.eclipse.mylyn.trac.tests/src/org/eclipse/mylyn/trac/tests/support/TracFixture.java:[127] 
	public ITracClient connect(String url, String username, String password, final Proxy proxy, Version version)
	                                                                                            ^^^^^^^
Discouraged access: The type 'ITracClient.Version' is not API (restriction on classpath entry '/jobs/genie.mylyn/mylyn-3.22.x-release/workspace/org.eclipse.mylyn.tasks/org.eclipse.mylyn.trac.core/target/classes')
[WARNING] /jobs/genie.mylyn/mylyn-3.22.x-release/workspace/org.eclipse.mylyn.tasks/org.eclipse.mylyn.trac.tests/src/org/eclipse/mylyn/trac/tests/support/TracFixture.java:[134] 
	return TracClientFactory.createClient(location, version);
	       ^^^^^^^^^^^^^^^^^
Discouraged access: The type 'TracClientFactory' is not API (restriction on classpath entry '/jobs/genie.mylyn/mylyn-3.22.x-release/workspace/org.eclipse.mylyn.tasks/org.eclipse.mylyn.trac.core/target/classes')
[WARNING] /jobs/genie.mylyn/mylyn-3.22.x-release/workspace/org.eclipse.mylyn.tasks/org.eclipse.mylyn.trac.tests/src/org/eclipse/mylyn/trac/tests/support/TracFixture.java:[134] 
	return TracClientFactory.createClient(location, version);
	       ^^^^^^^^^^^^^^^^^^^^^^^^^^^^^^^^^^^^^^^^^^^^^^^^^
Discouraged access: The method 'TracClientFactory.createClient(AbstractWebLocation, ITracClient.Version)' is not API (restriction on classpath entry '/jobs/genie.mylyn/mylyn-3.22.x-release/workspace/org.eclipse.mylyn.tasks/org.eclipse.mylyn.trac.core/target/classes')
[WARNING] /jobs/genie.mylyn/mylyn-3.22.x-release/workspace/org.eclipse.mylyn.tasks/org.eclipse.mylyn.trac.tests/src/org/eclipse/mylyn/trac/tests/support/TracFixture.java:[137] 
	public Version getAccessMode() {
	       ^^^^^^^
Discouraged access: The type 'ITracClient.Version' is not API (restriction on classpath entry '/jobs/genie.mylyn/mylyn-3.22.x-release/workspace/org.eclipse.mylyn.tasks/org.eclipse.mylyn.trac.core/target/classes')
[WARNING] /jobs/genie.mylyn/mylyn-3.22.x-release/workspace/org.eclipse.mylyn.tasks/org.eclipse.mylyn.trac.tests/src/org/eclipse/mylyn/trac/tests/support/TracFixture.java:[146] 
	return Version.XML_RPC.name().equals(getAccessMode());
	       ^^^^^^^^^^^^^^^
Discouraged access: The type 'ITracClient.Version' is not API (restriction on classpath entry '/jobs/genie.mylyn/mylyn-3.22.x-release/workspace/org.eclipse.mylyn.tasks/org.eclipse.mylyn.trac.core/target/classes')
[WARNING] /jobs/genie.mylyn/mylyn-3.22.x-release/workspace/org.eclipse.mylyn.tasks/org.eclipse.mylyn.trac.tests/src/org/eclipse/mylyn/trac/tests/support/TracFixture.java:[146] 
	return Version.XML_RPC.name().equals(getAccessMode());
	               ^^^^^^^
Discouraged access: The field 'ITracClient.Version.XML_RPC' is not API (restriction on classpath entry '/jobs/genie.mylyn/mylyn-3.22.x-release/workspace/org.eclipse.mylyn.tasks/org.eclipse.mylyn.trac.core/target/classes')
[WARNING] /jobs/genie.mylyn/mylyn-3.22.x-release/workspace/org.eclipse.mylyn.tasks/org.eclipse.mylyn.trac.tests/src/org/eclipse/mylyn/trac/tests/support/TracFixture.java:[149] 
	public TaskRepository singleRepository(TracRepositoryConnector connector) {
	                                       ^^^^^^^^^^^^^^^^^^^^^^^
Discouraged access: The type 'TracRepositoryConnector' is not API (restriction on classpath entry '/jobs/genie.mylyn/mylyn-3.22.x-release/workspace/org.eclipse.mylyn.tasks/org.eclipse.mylyn.trac.core/target/classes')
[WARNING] /jobs/genie.mylyn/mylyn-3.22.x-release/workspace/org.eclipse.mylyn.tasks/org.eclipse.mylyn.trac.tests/src/org/eclipse/mylyn/trac/tests/support/TracFixture.java:[150] 
	connector.getClientManager().writeCache();
	^^^^^^^^^^^^^^^^^^^^^^^^^^^^
Discouraged access: The method 'TracRepositoryConnector.getClientManager()' is not API (restriction on classpath entry '/jobs/genie.mylyn/mylyn-3.22.x-release/workspace/org.eclipse.mylyn.tasks/org.eclipse.mylyn.trac.core/target/classes')
[WARNING] /jobs/genie.mylyn/mylyn-3.22.x-release/workspace/org.eclipse.mylyn.tasks/org.eclipse.mylyn.trac.tests/src/org/eclipse/mylyn/trac/tests/support/TracFixture.java:[150] 
	connector.getClientManager().writeCache();
	^^^^^^^^^^^^^^^^^^^^^^^^^^^^^^^^^^^^^^^^^
Discouraged access: The method 'TracClientManager.writeCache()' is not API (restriction on classpath entry '/jobs/genie.mylyn/mylyn-3.22.x-release/workspace/org.eclipse.mylyn.tasks/org.eclipse.mylyn.trac.core/target/classes')
[WARNING] /jobs/genie.mylyn/mylyn-3.22.x-release/workspace/org.eclipse.mylyn.tasks/org.eclipse.mylyn.trac.tests/src/org/eclipse/mylyn/trac/tests/support/TracFixture.java:[151] 
	TaskRepository repository = super.singleRepository();
	                            ^^^^^^^^^^^^^^^^^^^^^^^^
Discouraged access: The method 'TestFixture.singleRepository()' is not API (restriction on classpath entry '/jobs/genie.mylyn/mylyn-3.22.x-release/workspace/org.eclipse.mylyn.tasks/org.eclipse.mylyn.tests.util/target/classes')
[WARNING] /jobs/genie.mylyn/mylyn-3.22.x-release/workspace/org.eclipse.mylyn.tasks/org.eclipse.mylyn.trac.tests/src/org/eclipse/mylyn/trac/tests/support/TracFixture.java:[154] 
	connector.getClientManager().clearClients();
	^^^^^^^^^^^^^^^^^^^^^^^^^^^^
Discouraged access: The method 'TracRepositoryConnector.getClientManager()' is not API (restriction on classpath entry '/jobs/genie.mylyn/mylyn-3.22.x-release/workspace/org.eclipse.mylyn.tasks/org.eclipse.mylyn.trac.core/target/classes')
[WARNING] /jobs/genie.mylyn/mylyn-3.22.x-release/workspace/org.eclipse.mylyn.tasks/org.eclipse.mylyn.trac.tests/src/org/eclipse/mylyn/trac/tests/support/TracFixture.java:[154] 
	connector.getClientManager().clearClients();
	^^^^^^^^^^^^^^^^^^^^^^^^^^^^^^^^^^^^^^^^^^^
Discouraged access: The method 'TracClientManager.clearClients()' is not API (restriction on classpath entry '/jobs/genie.mylyn/mylyn-3.22.x-release/workspace/org.eclipse.mylyn.tasks/org.eclipse.mylyn.trac.core/target/classes')
[WARNING] /jobs/genie.mylyn/mylyn-3.22.x-release/workspace/org.eclipse.mylyn.tasks/org.eclipse.mylyn.trac.tests/src/org/eclipse/mylyn/trac/tests/support/TracFixture.java:[156] 
	connector.getClientManager().readCache();
	^^^^^^^^^^^^^^^^^^^^^^^^^^^^
Discouraged access: The method 'TracRepositoryConnector.getClientManager()' is not API (restriction on classpath entry '/jobs/genie.mylyn/mylyn-3.22.x-release/workspace/org.eclipse.mylyn.tasks/org.eclipse.mylyn.trac.core/target/classes')
[WARNING] /jobs/genie.mylyn/mylyn-3.22.x-release/workspace/org.eclipse.mylyn.tasks/org.eclipse.mylyn.trac.tests/src/org/eclipse/mylyn/trac/tests/support/TracFixture.java:[156] 
	connector.getClientManager().readCache();
	^^^^^^^^^^^^^^^^^^^^^^^^^^^^^^^^^^^^^^^^
Discouraged access: The method 'TracClientManager.readCache()' is not API (restriction on classpath entry '/jobs/genie.mylyn/mylyn-3.22.x-release/workspace/org.eclipse.mylyn.tasks/org.eclipse.mylyn.trac.core/target/classes')
[WARNING] /jobs/genie.mylyn/mylyn-3.22.x-release/workspace/org.eclipse.mylyn.tasks/org.eclipse.mylyn.trac.tests/src/org/eclipse/mylyn/trac/tests/support/TracFixture.java:[167] 
	repository.setTimeZoneId(ITracClient.TIME_ZONE);
	                         ^^^^^^^^^^^^^^^^^^^^^
Discouraged access: The type 'ITracClient' is not API (restriction on classpath entry '/jobs/genie.mylyn/mylyn-3.22.x-release/workspace/org.eclipse.mylyn.tasks/org.eclipse.mylyn.trac.core/target/classes')
[WARNING] /jobs/genie.mylyn/mylyn-3.22.x-release/workspace/org.eclipse.mylyn.tasks/org.eclipse.mylyn.trac.tests/src/org/eclipse/mylyn/trac/tests/support/TracFixture.java:[167] 
	repository.setTimeZoneId(ITracClient.TIME_ZONE);
	                                     ^^^^^^^^^
Discouraged access: The field 'ITracClient.TIME_ZONE' is not API (restriction on classpath entry '/jobs/genie.mylyn/mylyn-3.22.x-release/workspace/org.eclipse.mylyn.tasks/org.eclipse.mylyn.trac.core/target/classes')
[WARNING] /jobs/genie.mylyn/mylyn-3.22.x-release/workspace/org.eclipse.mylyn.tasks/org.eclipse.mylyn.trac.tests/src/org/eclipse/mylyn/trac/tests/support/TracFixture.java:[168] 
	repository.setCharacterEncoding(ITracClient.CHARSET);
	                                ^^^^^^^^^^^^^^^^^^^
Discouraged access: The type 'ITracClient' is not API (restriction on classpath entry '/jobs/genie.mylyn/mylyn-3.22.x-release/workspace/org.eclipse.mylyn.tasks/org.eclipse.mylyn.trac.core/target/classes')
[WARNING] /jobs/genie.mylyn/mylyn-3.22.x-release/workspace/org.eclipse.mylyn.tasks/org.eclipse.mylyn.trac.tests/src/org/eclipse/mylyn/trac/tests/support/TracFixture.java:[168] 
	repository.setCharacterEncoding(ITracClient.CHARSET);
	                                            ^^^^^^^
Discouraged access: The field 'ITracClient.CHARSET' is not API (restriction on classpath entry '/jobs/genie.mylyn/mylyn-3.22.x-release/workspace/org.eclipse.mylyn.tasks/org.eclipse.mylyn.trac.core/target/classes')
[WARNING] /jobs/genie.mylyn/mylyn-3.22.x-release/workspace/org.eclipse.mylyn.tasks/org.eclipse.mylyn.trac.tests/src/org/eclipse/mylyn/trac/tests/support/TracFixture.java:[174] 
	TracCorePlugin.getDefault().getConnector().getClientManager().clearClients();
	^^^^^^^^^^^^^^
Discouraged access: The type 'TracCorePlugin' is not API (restriction on classpath entry '/jobs/genie.mylyn/mylyn-3.22.x-release/workspace/org.eclipse.mylyn.tasks/org.eclipse.mylyn.trac.core/target/classes')
[WARNING] /jobs/genie.mylyn/mylyn-3.22.x-release/workspace/org.eclipse.mylyn.tasks/org.eclipse.mylyn.trac.tests/src/org/eclipse/mylyn/trac/tests/support/TracFixture.java:[174] 
	TracCorePlugin.getDefault().getConnector().getClientManager().clearClients();
	^^^^^^^^^^^^^^^^^^^^^^^^^^^
Discouraged access: The method 'TracCorePlugin.getDefault()' is not API (restriction on classpath entry '/jobs/genie.mylyn/mylyn-3.22.x-release/workspace/org.eclipse.mylyn.tasks/org.eclipse.mylyn.trac.core/target/classes')
[WARNING] /jobs/genie.mylyn/mylyn-3.22.x-release/workspace/org.eclipse.mylyn.tasks/org.eclipse.mylyn.trac.tests/src/org/eclipse/mylyn/trac/tests/support/TracFixture.java:[174] 
	TracCorePlugin.getDefault().getConnector().getClientManager().clearClients();
	^^^^^^^^^^^^^^^^^^^^^^^^^^^^^^^^^^^^^^^^^^
Discouraged access: The method 'TracCorePlugin.getConnector()' is not API (restriction on classpath entry '/jobs/genie.mylyn/mylyn-3.22.x-release/workspace/org.eclipse.mylyn.tasks/org.eclipse.mylyn.trac.core/target/classes')
[WARNING] /jobs/genie.mylyn/mylyn-3.22.x-release/workspace/org.eclipse.mylyn.tasks/org.eclipse.mylyn.trac.tests/src/org/eclipse/mylyn/trac/tests/support/TracFixture.java:[174] 
	TracCorePlugin.getDefault().getConnector().getClientManager().clearClients();
	^^^^^^^^^^^^^^^^^^^^^^^^^^^^^^^^^^^^^^^^^^^^^^^^^^^^^^^^^^^^^
Discouraged access: The method 'TracRepositoryConnector.getClientManager()' is not API (restriction on classpath entry '/jobs/genie.mylyn/mylyn-3.22.x-release/workspace/org.eclipse.mylyn.tasks/org.eclipse.mylyn.trac.core/target/classes')
[WARNING] /jobs/genie.mylyn/mylyn-3.22.x-release/workspace/org.eclipse.mylyn.tasks/org.eclipse.mylyn.trac.tests/src/org/eclipse/mylyn/trac/tests/support/TracFixture.java:[174] 
	TracCorePlugin.getDefault().getConnector().getClientManager().clearClients();
	^^^^^^^^^^^^^^^^^^^^^^^^^^^^^^^^^^^^^^^^^^^^^^^^^^^^^^^^^^^^^^^^^^^^^^^^^^^^
Discouraged access: The method 'TracClientManager.clearClients()' is not API (restriction on classpath entry '/jobs/genie.mylyn/mylyn-3.22.x-release/workspace/org.eclipse.mylyn.tasks/org.eclipse.mylyn.trac.core/target/classes')
[WARNING] /jobs/genie.mylyn/mylyn-3.22.x-release/workspace/org.eclipse.mylyn.tasks/org.eclipse.mylyn.trac.tests/src/org/eclipse/mylyn/trac/tests/support/TracFixture.java:[178] 
	public TracRepositoryConnector connector() {
	       ^^^^^^^^^^^^^^^^^^^^^^^
Discouraged access: The type 'TracRepositoryConnector' is not API (restriction on classpath entry '/jobs/genie.mylyn/mylyn-3.22.x-release/workspace/org.eclipse.mylyn.tasks/org.eclipse.mylyn.trac.core/target/classes')
[WARNING] /jobs/genie.mylyn/mylyn-3.22.x-release/workspace/org.eclipse.mylyn.tasks/org.eclipse.mylyn.trac.tests/src/org/eclipse/mylyn/trac/tests/support/TracFixture.java:[179] 
	return (TracRepositoryConnector) super.connector();
	        ^^^^^^^^^^^^^^^^^^^^^^^
Discouraged access: The type 'TracRepositoryConnector' is not API (restriction on classpath entry '/jobs/genie.mylyn/mylyn-3.22.x-release/workspace/org.eclipse.mylyn.tasks/org.eclipse.mylyn.trac.core/target/classes')
[WARNING] /jobs/genie.mylyn/mylyn-3.22.x-release/workspace/org.eclipse.mylyn.tasks/org.eclipse.mylyn.trac.tests/src/org/eclipse/mylyn/trac/tests/support/TracFixture.java:[179] 
	return (TracRepositoryConnector) super.connector();
	                                 ^^^^^^^^^^^^^^^^^
Discouraged access: The method 'TestFixture.connector()' is not API (restriction on classpath entry '/jobs/genie.mylyn/mylyn-3.22.x-release/workspace/org.eclipse.mylyn.tasks/org.eclipse.mylyn.tests.util/target/classes')
[WARNING] /jobs/genie.mylyn/mylyn-3.22.x-release/workspace/org.eclipse.mylyn.tasks/org.eclipse.mylyn.trac.tests/src/org/eclipse/mylyn/trac/tests/support/TracFixture.java:[192] 
	return getInfo().contains("AllBasicAuth");
	       ^^^^^^^^^
Discouraged access: The method 'TestFixture.getInfo()' is not API (restriction on classpath entry '/jobs/genie.mylyn/mylyn-3.22.x-release/workspace/org.eclipse.mylyn.tasks/org.eclipse.mylyn.tests.util/target/classes')
[WARNING] /jobs/genie.mylyn/mylyn-3.22.x-release/workspace/org.eclipse.mylyn.tasks/org.eclipse.mylyn.trac.tests/src/org/eclipse/mylyn/trac/tests/support/TracFixture.java:[197] 
	return super.isExcluded() || excluded;
	       ^^^^^^^^^^^^^^^^^^
Discouraged access: The method 'TestFixture.isExcluded()' is not API (restriction on classpath entry '/jobs/genie.mylyn/mylyn-3.22.x-release/workspace/org.eclipse.mylyn.tasks/org.eclipse.mylyn.tests.util/target/classes')
[WARNING] /jobs/genie.mylyn/mylyn-3.22.x-release/workspace/org.eclipse.mylyn.tasks/org.eclipse.mylyn.trac.tests/src/org/eclipse/mylyn/trac/tests/support/XmlRpcServer.java:[24] 
	import org.eclipse.mylyn.internal.trac.core.client.TracXmlRpcClient;
	       ^^^^^^^^^^^^^^^^^^^^^^^^^^^^^^^^^^^^^^^^^^^^^^^^^^^^^^^^^^^^
Discouraged access: The type 'TracXmlRpcClient' is not API (restriction on classpath entry '/jobs/genie.mylyn/mylyn-3.22.x-release/workspace/org.eclipse.mylyn.tasks/org.eclipse.mylyn.trac.core/target/classes')
[WARNING] /jobs/genie.mylyn/mylyn-3.22.x-release/workspace/org.eclipse.mylyn.tasks/org.eclipse.mylyn.trac.tests/src/org/eclipse/mylyn/trac/tests/support/XmlRpcServer.java:[270] 
	public XmlRpcServer(TracXmlRpcClient client) throws Exception {
	                    ^^^^^^^^^^^^^^^^
Discouraged access: The type 'TracXmlRpcClient' is not API (restriction on classpath entry '/jobs/genie.mylyn/mylyn-3.22.x-release/workspace/org.eclipse.mylyn.tasks/org.eclipse.mylyn.trac.core/target/classes')
[WARNING] /jobs/genie.mylyn/mylyn-3.22.x-release/workspace/org.eclipse.mylyn.tasks/org.eclipse.mylyn.trac.tests/src/org/eclipse/mylyn/trac/tests/support/XmlRpcServer.java:[271] 
	this.client = client.getClient();
	              ^^^^^^^^^^^^^^^^^^
Discouraged access: The method 'TracXmlRpcClient.getClient()' is not API (restriction on classpath entry '/jobs/genie.mylyn/mylyn-3.22.x-release/workspace/org.eclipse.mylyn.tasks/org.eclipse.mylyn.trac.core/target/classes')
1130 problems (1130 warnings)
[INFO] 
[INFO] --- tycho-source-plugin:1.0.0:plugin-source (attach-source) @ org.eclipse.mylyn.trac.tests ---
[WARNING] bundle localization file /jobs/genie.mylyn/mylyn-3.22.x-release/workspace/org.eclipse.mylyn.tasks/org.eclipse.mylyn.trac.tests/plugin.properties not found
[INFO] Building jar: /jobs/genie.mylyn/mylyn-3.22.x-release/workspace/org.eclipse.mylyn.tasks/org.eclipse.mylyn.trac.tests/target/org.eclipse.mylyn.trac.tests-3.22.0-SNAPSHOT-sources.jar
[INFO] 
[INFO] --- maven-resources-plugin:2.4.1:testResources (default-testResources) @ org.eclipse.mylyn.trac.tests ---
[INFO] Using 'ISO-8859-1' encoding to copy filtered resources.
[INFO] skip non existing resourceDirectory /jobs/genie.mylyn/mylyn-3.22.x-release/workspace/org.eclipse.mylyn.tasks/org.eclipse.mylyn.trac.tests/src/test/resources
[INFO] 
[INFO] --- target-platform-configuration:1.0.0:target-platform (default-target-platform) @ org.eclipse.mylyn.trac.tests ---
[INFO] 
[INFO] --- tycho-packaging-plugin:1.0.0:package-plugin (default-package-plugin) @ org.eclipse.mylyn.trac.tests ---
[INFO] Building jar: /jobs/genie.mylyn/mylyn-3.22.x-release/workspace/org.eclipse.mylyn.tasks/org.eclipse.mylyn.trac.tests/target/org.eclipse.mylyn.trac.tests-3.22.0-SNAPSHOT.jar
[INFO] 
[INFO] --- tycho-p2-plugin:1.0.0:p2-metadata-default (default-p2-metadata-default) @ org.eclipse.mylyn.trac.tests ---
[INFO]                                                                         
[INFO] ------------------------------------------------------------------------
[INFO] Building org.eclipse.mylyn.tests 3.22.0-SNAPSHOT
[INFO] ------------------------------------------------------------------------
[INFO] 
[INFO] --- maven-clean-plugin:2.4.1:clean (default-clean) @ org.eclipse.mylyn.tests ---
[INFO] 
[INFO] --- tycho-packaging-plugin:1.0.0:build-qualifier (default-build-qualifier) @ org.eclipse.mylyn.tests ---
[INFO] The project's OSGi version is 3.22.0.v20170213-1929
[INFO] 
[INFO] --- tycho-packaging-plugin:1.0.0:validate-id (default-validate-id) @ org.eclipse.mylyn.tests ---
[INFO] 
[INFO] --- tycho-packaging-plugin:1.0.0:validate-version (default-validate-version) @ org.eclipse.mylyn.tests ---
[INFO] 
[INFO] --- jacoco-maven-plugin:0.5.6.201201232323:prepare-agent (default) @ org.eclipse.mylyn.tests ---
[INFO] Skipping JaCoCo execution
[INFO] 
[INFO] --- maven-resources-plugin:2.4.1:resources (default-resources) @ org.eclipse.mylyn.tests ---
[INFO] Using 'ISO-8859-1' encoding to copy filtered resources.
[INFO] skip non existing resourceDirectory /jobs/genie.mylyn/mylyn-3.22.x-release/workspace/org.eclipse.mylyn/org.eclipse.mylyn.tests/src/main/resources
[INFO] 
[INFO] --- tycho-compiler-plugin:1.0.0:compile (default-compile) @ org.eclipse.mylyn.tests ---
[INFO] Compiling 11 source files to /jobs/genie.mylyn/mylyn-3.22.x-release/workspace/org.eclipse.mylyn/org.eclipse.mylyn.tests/target/classes
[WARNING] /jobs/genie.mylyn/mylyn-3.22.x-release/workspace/org.eclipse.mylyn/org.eclipse.mylyn.tests/src/org/eclipse/mylyn/tests/AllConnectorHeartbeatTests.java:[14] 
	import org.eclipse.mylyn.commons.sdk.util.ManagedSuite;
	       ^^^^^^^^^^^^^^^^^^^^^^^^^^^^^^^^^^^^^^^^^^^^^^^
Discouraged access: The type 'ManagedSuite' is not API (restriction on classpath entry '/jobs/genie.mylyn/mylyn-3.22.x-release/workspace/org.eclipse.mylyn.commons/org.eclipse.mylyn.commons.sdk.util/target/classes')
[WARNING] /jobs/genie.mylyn/mylyn-3.22.x-release/workspace/org.eclipse.mylyn/org.eclipse.mylyn.tests/src/org/eclipse/mylyn/tests/AllConnectorHeartbeatTests.java:[15] 
	import org.eclipse.mylyn.commons.sdk.util.ManagedTestSuite;
	       ^^^^^^^^^^^^^^^^^^^^^^^^^^^^^^^^^^^^^^^^^^^^^^^^^^^
Discouraged access: The type 'ManagedTestSuite' is not API (restriction on classpath entry '/jobs/genie.mylyn/mylyn-3.22.x-release/workspace/org.eclipse.mylyn.commons/org.eclipse.mylyn.commons.sdk.util/target/classes')
[WARNING] /jobs/genie.mylyn/mylyn-3.22.x-release/workspace/org.eclipse.mylyn/org.eclipse.mylyn.tests/src/org/eclipse/mylyn/tests/AllConnectorHeartbeatTests.java:[16] 
	import org.eclipse.mylyn.commons.sdk.util.TestConfiguration;
	       ^^^^^^^^^^^^^^^^^^^^^^^^^^^^^^^^^^^^^^^^^^^^^^^^^^^^
Discouraged access: The type 'TestConfiguration' is not API (restriction on classpath entry '/jobs/genie.mylyn/mylyn-3.22.x-release/workspace/org.eclipse.mylyn.commons/org.eclipse.mylyn.commons.sdk.util/target/classes')
[WARNING] /jobs/genie.mylyn/mylyn-3.22.x-release/workspace/org.eclipse.mylyn/org.eclipse.mylyn.tests/src/org/eclipse/mylyn/tests/AllConnectorHeartbeatTests.java:[29] 
	TestConfiguration configuration = ManagedSuite.getTestConfiguration();
	^^^^^^^^^^^^^^^^^
Discouraged access: The type 'TestConfiguration' is not API (restriction on classpath entry '/jobs/genie.mylyn/mylyn-3.22.x-release/workspace/org.eclipse.mylyn.commons/org.eclipse.mylyn.commons.sdk.util/target/classes')
[WARNING] /jobs/genie.mylyn/mylyn-3.22.x-release/workspace/org.eclipse.mylyn/org.eclipse.mylyn.tests/src/org/eclipse/mylyn/tests/AllConnectorHeartbeatTests.java:[29] 
	TestConfiguration configuration = ManagedSuite.getTestConfiguration();
	                                  ^^^^^^^^^^^^
Discouraged access: The type 'ManagedSuite' is not API (restriction on classpath entry '/jobs/genie.mylyn/mylyn-3.22.x-release/workspace/org.eclipse.mylyn.commons/org.eclipse.mylyn.commons.sdk.util/target/classes')
[WARNING] /jobs/genie.mylyn/mylyn-3.22.x-release/workspace/org.eclipse.mylyn/org.eclipse.mylyn.tests/src/org/eclipse/mylyn/tests/AllConnectorHeartbeatTests.java:[29] 
	TestConfiguration configuration = ManagedSuite.getTestConfiguration();
	                                  ^^^^^^^^^^^^^^^^^^^^^^^^^^^^^^^^^^^
Discouraged access: The method 'ManagedSuite.getTestConfiguration()' is not API (restriction on classpath entry '/jobs/genie.mylyn/mylyn-3.22.x-release/workspace/org.eclipse.mylyn.commons/org.eclipse.mylyn.commons.sdk.util/target/classes')
[WARNING] /jobs/genie.mylyn/mylyn-3.22.x-release/workspace/org.eclipse.mylyn/org.eclipse.mylyn.tests/src/org/eclipse/mylyn/tests/AllConnectorHeartbeatTests.java:[31] 
	configuration = new TestConfiguration();
	                ^^^^^^^^^^^^^^^^^^^^^^^
Discouraged access: The constructor 'TestConfiguration()' is not API (restriction on classpath entry '/jobs/genie.mylyn/mylyn-3.22.x-release/workspace/org.eclipse.mylyn.commons/org.eclipse.mylyn.commons.sdk.util/target/classes')
[WARNING] /jobs/genie.mylyn/mylyn-3.22.x-release/workspace/org.eclipse.mylyn/org.eclipse.mylyn.tests/src/org/eclipse/mylyn/tests/AllConnectorHeartbeatTests.java:[31] 
	configuration = new TestConfiguration();
	                    ^^^^^^^^^^^^^^^^^
Discouraged access: The type 'TestConfiguration' is not API (restriction on classpath entry '/jobs/genie.mylyn/mylyn-3.22.x-release/workspace/org.eclipse.mylyn.commons/org.eclipse.mylyn.commons.sdk.util/target/classes')
[WARNING] /jobs/genie.mylyn/mylyn-3.22.x-release/workspace/org.eclipse.mylyn/org.eclipse.mylyn.tests/src/org/eclipse/mylyn/tests/AllConnectorHeartbeatTests.java:[32] 
	configuration.setDefaultOnly(true);
	^^^^^^^^^^^^^^^^^^^^^^^^^^^^^^^^^^
Discouraged access: The method 'TestConfiguration.setDefaultOnly(boolean)' is not API (restriction on classpath entry '/jobs/genie.mylyn/mylyn-3.22.x-release/workspace/org.eclipse.mylyn.commons/org.eclipse.mylyn.commons.sdk.util/target/classes')
[WARNING] /jobs/genie.mylyn/mylyn-3.22.x-release/workspace/org.eclipse.mylyn/org.eclipse.mylyn.tests/src/org/eclipse/mylyn/tests/AllConnectorHeartbeatTests.java:[33] 
	ManagedSuite.setTestConfiguration(configuration);
	^^^^^^^^^^^^
Discouraged access: The type 'ManagedSuite' is not API (restriction on classpath entry '/jobs/genie.mylyn/mylyn-3.22.x-release/workspace/org.eclipse.mylyn.commons/org.eclipse.mylyn.commons.sdk.util/target/classes')
[WARNING] /jobs/genie.mylyn/mylyn-3.22.x-release/workspace/org.eclipse.mylyn/org.eclipse.mylyn.tests/src/org/eclipse/mylyn/tests/AllConnectorHeartbeatTests.java:[33] 
	ManagedSuite.setTestConfiguration(configuration);
	^^^^^^^^^^^^^^^^^^^^^^^^^^^^^^^^^^^^^^^^^^^^^^^^
Discouraged access: The method 'ManagedSuite.setTestConfiguration(TestConfiguration)' is not API (restriction on classpath entry '/jobs/genie.mylyn/mylyn-3.22.x-release/workspace/org.eclipse.mylyn.commons/org.eclipse.mylyn.commons.sdk.util/target/classes')
[WARNING] /jobs/genie.mylyn/mylyn-3.22.x-release/workspace/org.eclipse.mylyn/org.eclipse.mylyn.tests/src/org/eclipse/mylyn/tests/AllConnectorHeartbeatTests.java:[36] 
	TestSuite suite = new ManagedTestSuite(AllConnectorHeartbeatTests.class.getName());
	                  ^^^^^^^^^^^^^^^^^^^^^^^^^^^^^^^^^^^^^^^^^^^^^^^^^^^^^^^^^^^^^^^^
Discouraged access: The constructor 'ManagedTestSuite(String)' is not API (restriction on classpath entry '/jobs/genie.mylyn/mylyn-3.22.x-release/workspace/org.eclipse.mylyn.commons/org.eclipse.mylyn.commons.sdk.util/target/classes')
[WARNING] /jobs/genie.mylyn/mylyn-3.22.x-release/workspace/org.eclipse.mylyn/org.eclipse.mylyn.tests/src/org/eclipse/mylyn/tests/AllConnectorHeartbeatTests.java:[36] 
	TestSuite suite = new ManagedTestSuite(AllConnectorHeartbeatTests.class.getName());
	                      ^^^^^^^^^^^^^^^^
Discouraged access: The type 'ManagedTestSuite' is not API (restriction on classpath entry '/jobs/genie.mylyn/mylyn-3.22.x-release/workspace/org.eclipse.mylyn.commons/org.eclipse.mylyn.commons.sdk.util/target/classes')
[WARNING] /jobs/genie.mylyn/mylyn-3.22.x-release/workspace/org.eclipse.mylyn/org.eclipse.mylyn.tests/src/org/eclipse/mylyn/tests/AllNonConnectorTests.java:[14] 
	import org.eclipse.mylyn.builds.tests.AllBuildsTests;
	       ^^^^^^^^^^^^^^^^^^^^^^^^^^^^^^^^^^^^^^^^^^^^^
Discouraged access: The type 'AllBuildsTests' is not API (restriction on classpath entry '/jobs/genie.mylyn/mylyn-3.22.x-release/workspace/org.eclipse.mylyn.builds/org.eclipse.mylyn.builds.tests/target/classes')
[WARNING] /jobs/genie.mylyn/mylyn-3.22.x-release/workspace/org.eclipse.mylyn/org.eclipse.mylyn.tests/src/org/eclipse/mylyn/tests/AllNonConnectorTests.java:[15] 
	import org.eclipse.mylyn.cdt.tests.AllCdtTests;
	       ^^^^^^^^^^^^^^^^^^^^^^^^^^^^^^^^^^^^^^^
Discouraged access: The type 'AllCdtTests' is not API (restriction on classpath entry '/jobs/genie.mylyn/mylyn-3.22.x-release/workspace/org.eclipse.mylyn.context/org.eclipse.mylyn.cdt.tests/target/classes')
[WARNING] /jobs/genie.mylyn/mylyn-3.22.x-release/workspace/org.eclipse.mylyn/org.eclipse.mylyn.tests/src/org/eclipse/mylyn/tests/AllNonConnectorTests.java:[16] 
	import org.eclipse.mylyn.commons.notifications.tests.AllNotificationsTests;
	       ^^^^^^^^^^^^^^^^^^^^^^^^^^^^^^^^^^^^^^^^^^^^^^^^^^^^^^^^^^^^^^^^^^^
Discouraged access: The type 'AllNotificationsTests' is not API (restriction on classpath entry '/jobs/genie.mylyn/mylyn-3.22.x-release/workspace/org.eclipse.mylyn.commons/org.eclipse.mylyn.commons.notifications.tests/target/classes')
[WARNING] /jobs/genie.mylyn/mylyn-3.22.x-release/workspace/org.eclipse.mylyn/org.eclipse.mylyn.tests/src/org/eclipse/mylyn/tests/AllNonConnectorTests.java:[17] 
	import org.eclipse.mylyn.commons.sdk.util.ManagedTestSuite;
	       ^^^^^^^^^^^^^^^^^^^^^^^^^^^^^^^^^^^^^^^^^^^^^^^^^^^
Discouraged access: The type 'ManagedTestSuite' is not API (restriction on classpath entry '/jobs/genie.mylyn/mylyn-3.22.x-release/workspace/org.eclipse.mylyn.commons/org.eclipse.mylyn.commons.sdk.util/target/classes')
[WARNING] /jobs/genie.mylyn/mylyn-3.22.x-release/workspace/org.eclipse.mylyn/org.eclipse.mylyn.tests/src/org/eclipse/mylyn/tests/AllNonConnectorTests.java:[18] 
	import org.eclipse.mylyn.commons.sdk.util.TestConfiguration;
	       ^^^^^^^^^^^^^^^^^^^^^^^^^^^^^^^^^^^^^^^^^^^^^^^^^^^^
Discouraged access: The type 'TestConfiguration' is not API (restriction on classpath entry '/jobs/genie.mylyn/mylyn-3.22.x-release/workspace/org.eclipse.mylyn.commons/org.eclipse.mylyn.commons.sdk.util/target/classes')
[WARNING] /jobs/genie.mylyn/mylyn-3.22.x-release/workspace/org.eclipse.mylyn/org.eclipse.mylyn.tests/src/org/eclipse/mylyn/tests/AllNonConnectorTests.java:[19] 
	import org.eclipse.mylyn.commons.tests.AllCommonsTests;
	       ^^^^^^^^^^^^^^^^^^^^^^^^^^^^^^^^^^^^^^^^^^^^^^^
Discouraged access: The type 'AllCommonsTests' is not API (restriction on classpath entry '/jobs/genie.mylyn/mylyn-3.22.x-release/workspace/org.eclipse.mylyn.commons/org.eclipse.mylyn.commons.tests/target/classes')
[WARNING] /jobs/genie.mylyn/mylyn-3.22.x-release/workspace/org.eclipse.mylyn/org.eclipse.mylyn.tests/src/org/eclipse/mylyn/tests/AllNonConnectorTests.java:[20] 
	import org.eclipse.mylyn.context.tasks.tests.AllContextTasksTests;
	       ^^^^^^^^^^^^^^^^^^^^^^^^^^^^^^^^^^^^^^^^^^^^^^^^^^^^^^^^^^
Discouraged access: The type 'AllContextTasksTests' is not API (restriction on classpath entry '/jobs/genie.mylyn/mylyn-3.22.x-release/workspace/org.eclipse.mylyn.context/org.eclipse.mylyn.context.tasks.tests/target/classes')
[WARNING] /jobs/genie.mylyn/mylyn-3.22.x-release/workspace/org.eclipse.mylyn/org.eclipse.mylyn.tests/src/org/eclipse/mylyn/tests/AllNonConnectorTests.java:[21] 
	import org.eclipse.mylyn.context.tests.AllContextTests;
	       ^^^^^^^^^^^^^^^^^^^^^^^^^^^^^^^^^^^^^^^^^^^^^^^
Discouraged access: The type 'AllContextTests' is not API (restriction on classpath entry '/jobs/genie.mylyn/mylyn-3.22.x-release/workspace/org.eclipse.mylyn.context/org.eclipse.mylyn.context.tests/target/classes')
[WARNING] /jobs/genie.mylyn/mylyn-3.22.x-release/workspace/org.eclipse.mylyn/org.eclipse.mylyn.tests/src/org/eclipse/mylyn/tests/AllNonConnectorTests.java:[22] 
	import org.eclipse.mylyn.discovery.tests.AllDiscoveryTests;
	       ^^^^^^^^^^^^^^^^^^^^^^^^^^^^^^^^^^^^^^^^^^^^^^^^^^^
Discouraged access: The type 'AllDiscoveryTests' is not API (restriction on classpath entry '/jobs/genie.mylyn/mylyn-3.22.x-release/workspace/org.eclipse.mylyn.commons/org.eclipse.mylyn.discovery.tests/target/classes')
[WARNING] /jobs/genie.mylyn/mylyn-3.22.x-release/workspace/org.eclipse.mylyn/org.eclipse.mylyn.tests/src/org/eclipse/mylyn/tests/AllNonConnectorTests.java:[23] 
	import org.eclipse.mylyn.ide.tests.AllIdeTests;
	       ^^^^^^^^^^^^^^^^^^^^^^^^^^^^^^^^^^^^^^^
Discouraged access: The type 'AllIdeTests' is not API (restriction on classpath entry '/jobs/genie.mylyn/mylyn-3.22.x-release/workspace/org.eclipse.mylyn.context/org.eclipse.mylyn.ide.tests/target/classes')
[WARNING] /jobs/genie.mylyn/mylyn-3.22.x-release/workspace/org.eclipse.mylyn/org.eclipse.mylyn.tests/src/org/eclipse/mylyn/tests/AllNonConnectorTests.java:[24] 
	import org.eclipse.mylyn.java.tests.AllJavaTests;
	       ^^^^^^^^^^^^^^^^^^^^^^^^^^^^^^^^^^^^^^^^^
Discouraged access: The type 'AllJavaTests' is not API (restriction on classpath entry '/jobs/genie.mylyn/mylyn-3.22.x-release/workspace/org.eclipse.mylyn.context/org.eclipse.mylyn.java.tests/target/classes')
[WARNING] /jobs/genie.mylyn/mylyn-3.22.x-release/workspace/org.eclipse.mylyn/org.eclipse.mylyn.tests/src/org/eclipse/mylyn/tests/AllNonConnectorTests.java:[25] 
	import org.eclipse.mylyn.monitor.tests.AllMonitorTests;
	       ^^^^^^^^^^^^^^^^^^^^^^^^^^^^^^^^^^^^^^^^^^^^^^^
Discouraged access: The type 'AllMonitorTests' is not API (restriction on classpath entry '/jobs/genie.mylyn/mylyn-3.22.x-release/workspace/org.eclipse.mylyn.commons/org.eclipse.mylyn.monitor.tests/target/classes')
[WARNING] /jobs/genie.mylyn/mylyn-3.22.x-release/workspace/org.eclipse.mylyn/org.eclipse.mylyn.tests/src/org/eclipse/mylyn/tests/AllNonConnectorTests.java:[26] 
	import org.eclipse.mylyn.resources.tests.AllResourcesTests;
	       ^^^^^^^^^^^^^^^^^^^^^^^^^^^^^^^^^^^^^^^^^^^^^^^^^^^
Discouraged access: The type 'AllResourcesTests' is not API (restriction on classpath entry '/jobs/genie.mylyn/mylyn-3.22.x-release/workspace/org.eclipse.mylyn.context/org.eclipse.mylyn.resources.tests/target/classes')
[WARNING] /jobs/genie.mylyn/mylyn-3.22.x-release/workspace/org.eclipse.mylyn/org.eclipse.mylyn.tests/src/org/eclipse/mylyn/tests/AllNonConnectorTests.java:[27] 
	import org.eclipse.mylyn.reviews.tests.AllReviewsTests;
	       ^^^^^^^^^^^^^^^^^^^^^^^^^^^^^^^^^^^^^^^^^^^^^^^
Discouraged access: The type 'AllReviewsTests' is not API (restriction on classpath entry '/jobs/genie.mylyn/mylyn-3.22.x-release/workspace/org.eclipse.mylyn.reviews/org.eclipse.mylyn.reviews.tests/target/classes')
[WARNING] /jobs/genie.mylyn/mylyn-3.22.x-release/workspace/org.eclipse.mylyn/org.eclipse.mylyn.tests/src/org/eclipse/mylyn/tests/AllNonConnectorTests.java:[28] 
	import org.eclipse.mylyn.tasks.tests.AllTasksTests;
	       ^^^^^^^^^^^^^^^^^^^^^^^^^^^^^^^^^^^^^^^^^^^
Discouraged access: The type 'AllTasksTests' is not API (restriction on classpath entry '/jobs/genie.mylyn/mylyn-3.22.x-release/workspace/org.eclipse.mylyn.tasks/org.eclipse.mylyn.tasks.tests/target/classes')
[WARNING] /jobs/genie.mylyn/mylyn-3.22.x-release/workspace/org.eclipse.mylyn/org.eclipse.mylyn.tests/src/org/eclipse/mylyn/tests/AllNonConnectorTests.java:[29] 
	import org.eclipse.mylyn.team.tests.AllTeamTests;
	       ^^^^^^^^^^^^^^^^^^^^^^^^^^^^^^^^^^^^^^^^^
Discouraged access: The type 'AllTeamTests' is not API (restriction on classpath entry '/jobs/genie.mylyn/mylyn-3.22.x-release/workspace/org.eclipse.mylyn.context/org.eclipse.mylyn.team.tests/target/classes')
[WARNING] /jobs/genie.mylyn/mylyn-3.22.x-release/workspace/org.eclipse.mylyn/org.eclipse.mylyn.tests/src/org/eclipse/mylyn/tests/AllNonConnectorTests.java:[43] 
	TestSuite suite = new ManagedTestSuite(AllNonConnectorTests.class.getName());
	                  ^^^^^^^^^^^^^^^^^^^^^^^^^^^^^^^^^^^^^^^^^^^^^^^^^^^^^^^^^^
Discouraged access: The constructor 'ManagedTestSuite(String)' is not API (restriction on classpath entry '/jobs/genie.mylyn/mylyn-3.22.x-release/workspace/org.eclipse.mylyn.commons/org.eclipse.mylyn.commons.sdk.util/target/classes')
[WARNING] /jobs/genie.mylyn/mylyn-3.22.x-release/workspace/org.eclipse.mylyn/org.eclipse.mylyn.tests/src/org/eclipse/mylyn/tests/AllNonConnectorTests.java:[43] 
	TestSuite suite = new ManagedTestSuite(AllNonConnectorTests.class.getName());
	                      ^^^^^^^^^^^^^^^^
Discouraged access: The type 'ManagedTestSuite' is not API (restriction on classpath entry '/jobs/genie.mylyn/mylyn-3.22.x-release/workspace/org.eclipse.mylyn.commons/org.eclipse.mylyn.commons.sdk.util/target/classes')
[WARNING] /jobs/genie.mylyn/mylyn-3.22.x-release/workspace/org.eclipse.mylyn/org.eclipse.mylyn.tests/src/org/eclipse/mylyn/tests/AllNonConnectorTests.java:[44] 
	addTests(suite, TestConfiguration.getDefault());
	                ^^^^^^^^^^^^^^^^^
Discouraged access: The type 'TestConfiguration' is not API (restriction on classpath entry '/jobs/genie.mylyn/mylyn-3.22.x-release/workspace/org.eclipse.mylyn.commons/org.eclipse.mylyn.commons.sdk.util/target/classes')
[WARNING] /jobs/genie.mylyn/mylyn-3.22.x-release/workspace/org.eclipse.mylyn/org.eclipse.mylyn.tests/src/org/eclipse/mylyn/tests/AllNonConnectorTests.java:[44] 
	addTests(suite, TestConfiguration.getDefault());
	                ^^^^^^^^^^^^^^^^^^^^^^^^^^^^^^
Discouraged access: The method 'TestConfiguration.getDefault()' is not API (restriction on classpath entry '/jobs/genie.mylyn/mylyn-3.22.x-release/workspace/org.eclipse.mylyn.commons/org.eclipse.mylyn.commons.sdk.util/target/classes')
[WARNING] /jobs/genie.mylyn/mylyn-3.22.x-release/workspace/org.eclipse.mylyn/org.eclipse.mylyn.tests/src/org/eclipse/mylyn/tests/AllNonConnectorTests.java:[48] 
	static void addTests(TestSuite suite, TestConfiguration configuration) {
	                                      ^^^^^^^^^^^^^^^^^
Discouraged access: The type 'TestConfiguration' is not API (restriction on classpath entry '/jobs/genie.mylyn/mylyn-3.22.x-release/workspace/org.eclipse.mylyn.commons/org.eclipse.mylyn.commons.sdk.util/target/classes')
[WARNING] /jobs/genie.mylyn/mylyn-3.22.x-release/workspace/org.eclipse.mylyn/org.eclipse.mylyn.tests/src/org/eclipse/mylyn/tests/AllNonConnectorTests.java:[50] 
	suite.addTest(AllCommonsTests.suite(configuration));
	              ^^^^^^^^^^^^^^^
Discouraged access: The type 'AllCommonsTests' is not API (restriction on classpath entry '/jobs/genie.mylyn/mylyn-3.22.x-release/workspace/org.eclipse.mylyn.commons/org.eclipse.mylyn.commons.tests/target/classes')
[WARNING] /jobs/genie.mylyn/mylyn-3.22.x-release/workspace/org.eclipse.mylyn/org.eclipse.mylyn.tests/src/org/eclipse/mylyn/tests/AllNonConnectorTests.java:[50] 
	suite.addTest(AllCommonsTests.suite(configuration));
	              ^^^^^^^^^^^^^^^^^^^^^^^^^^^^^^^^^^^^
Discouraged access: The method 'AllCommonsTests.suite(TestConfiguration)' is not API (restriction on classpath entry '/jobs/genie.mylyn/mylyn-3.22.x-release/workspace/org.eclipse.mylyn.commons/org.eclipse.mylyn.commons.tests/target/classes')
[WARNING] /jobs/genie.mylyn/mylyn-3.22.x-release/workspace/org.eclipse.mylyn/org.eclipse.mylyn.tests/src/org/eclipse/mylyn/tests/AllNonConnectorTests.java:[51] 
	suite.addTest(AllNotificationsTests.suite());
	              ^^^^^^^^^^^^^^^^^^^^^
Discouraged access: The type 'AllNotificationsTests' is not API (restriction on classpath entry '/jobs/genie.mylyn/mylyn-3.22.x-release/workspace/org.eclipse.mylyn.commons/org.eclipse.mylyn.commons.notifications.tests/target/classes')
[WARNING] /jobs/genie.mylyn/mylyn-3.22.x-release/workspace/org.eclipse.mylyn/org.eclipse.mylyn.tests/src/org/eclipse/mylyn/tests/AllNonConnectorTests.java:[51] 
	suite.addTest(AllNotificationsTests.suite());
	              ^^^^^^^^^^^^^^^^^^^^^^^^^^^^^
Discouraged access: The method 'AllNotificationsTests.suite()' is not API (restriction on classpath entry '/jobs/genie.mylyn/mylyn-3.22.x-release/workspace/org.eclipse.mylyn.commons/org.eclipse.mylyn.commons.notifications.tests/target/classes')
[WARNING] /jobs/genie.mylyn/mylyn-3.22.x-release/workspace/org.eclipse.mylyn/org.eclipse.mylyn.tests/src/org/eclipse/mylyn/tests/AllNonConnectorTests.java:[52] 
	suite.addTest(AllContextTests.suite());
	              ^^^^^^^^^^^^^^^
Discouraged access: The type 'AllContextTests' is not API (restriction on classpath entry '/jobs/genie.mylyn/mylyn-3.22.x-release/workspace/org.eclipse.mylyn.context/org.eclipse.mylyn.context.tests/target/classes')
[WARNING] /jobs/genie.mylyn/mylyn-3.22.x-release/workspace/org.eclipse.mylyn/org.eclipse.mylyn.tests/src/org/eclipse/mylyn/tests/AllNonConnectorTests.java:[52] 
	suite.addTest(AllContextTests.suite());
	              ^^^^^^^^^^^^^^^^^^^^^^^
Discouraged access: The method 'AllContextTests.suite()' is not API (restriction on classpath entry '/jobs/genie.mylyn/mylyn-3.22.x-release/workspace/org.eclipse.mylyn.context/org.eclipse.mylyn.context.tests/target/classes')
[WARNING] /jobs/genie.mylyn/mylyn-3.22.x-release/workspace/org.eclipse.mylyn/org.eclipse.mylyn.tests/src/org/eclipse/mylyn/tests/AllNonConnectorTests.java:[53] 
	suite.addTest(AllContextTasksTests.suite());
	              ^^^^^^^^^^^^^^^^^^^^
Discouraged access: The type 'AllContextTasksTests' is not API (restriction on classpath entry '/jobs/genie.mylyn/mylyn-3.22.x-release/workspace/org.eclipse.mylyn.context/org.eclipse.mylyn.context.tasks.tests/target/classes')
[WARNING] /jobs/genie.mylyn/mylyn-3.22.x-release/workspace/org.eclipse.mylyn/org.eclipse.mylyn.tests/src/org/eclipse/mylyn/tests/AllNonConnectorTests.java:[53] 
	suite.addTest(AllContextTasksTests.suite());
	              ^^^^^^^^^^^^^^^^^^^^^^^^^^^^
Discouraged access: The method 'AllContextTasksTests.suite()' is not API (restriction on classpath entry '/jobs/genie.mylyn/mylyn-3.22.x-release/workspace/org.eclipse.mylyn.context/org.eclipse.mylyn.context.tasks.tests/target/classes')
[WARNING] /jobs/genie.mylyn/mylyn-3.22.x-release/workspace/org.eclipse.mylyn/org.eclipse.mylyn.tests/src/org/eclipse/mylyn/tests/AllNonConnectorTests.java:[54] 
	suite.addTest(AllDiscoveryTests.suite(configuration));
	              ^^^^^^^^^^^^^^^^^
Discouraged access: The type 'AllDiscoveryTests' is not API (restriction on classpath entry '/jobs/genie.mylyn/mylyn-3.22.x-release/workspace/org.eclipse.mylyn.commons/org.eclipse.mylyn.discovery.tests/target/classes')
[WARNING] /jobs/genie.mylyn/mylyn-3.22.x-release/workspace/org.eclipse.mylyn/org.eclipse.mylyn.tests/src/org/eclipse/mylyn/tests/AllNonConnectorTests.java:[54] 
	suite.addTest(AllDiscoveryTests.suite(configuration));
	              ^^^^^^^^^^^^^^^^^^^^^^^^^^^^^^^^^^^^^^
Discouraged access: The method 'AllDiscoveryTests.suite(TestConfiguration)' is not API (restriction on classpath entry '/jobs/genie.mylyn/mylyn-3.22.x-release/workspace/org.eclipse.mylyn.commons/org.eclipse.mylyn.discovery.tests/target/classes')
[WARNING] /jobs/genie.mylyn/mylyn-3.22.x-release/workspace/org.eclipse.mylyn/org.eclipse.mylyn.tests/src/org/eclipse/mylyn/tests/AllNonConnectorTests.java:[55] 
	suite.addTest(AllJavaTests.suite());
	              ^^^^^^^^^^^^
Discouraged access: The type 'AllJavaTests' is not API (restriction on classpath entry '/jobs/genie.mylyn/mylyn-3.22.x-release/workspace/org.eclipse.mylyn.context/org.eclipse.mylyn.java.tests/target/classes')
[WARNING] /jobs/genie.mylyn/mylyn-3.22.x-release/workspace/org.eclipse.mylyn/org.eclipse.mylyn.tests/src/org/eclipse/mylyn/tests/AllNonConnectorTests.java:[55] 
	suite.addTest(AllJavaTests.suite());
	              ^^^^^^^^^^^^^^^^^^^^
Discouraged access: The method 'AllJavaTests.suite()' is not API (restriction on classpath entry '/jobs/genie.mylyn/mylyn-3.22.x-release/workspace/org.eclipse.mylyn.context/org.eclipse.mylyn.java.tests/target/classes')
[WARNING] /jobs/genie.mylyn/mylyn-3.22.x-release/workspace/org.eclipse.mylyn/org.eclipse.mylyn.tests/src/org/eclipse/mylyn/tests/AllNonConnectorTests.java:[56] 
	suite.addTest(AllCdtTests.suite());
	              ^^^^^^^^^^^
Discouraged access: The type 'AllCdtTests' is not API (restriction on classpath entry '/jobs/genie.mylyn/mylyn-3.22.x-release/workspace/org.eclipse.mylyn.context/org.eclipse.mylyn.cdt.tests/target/classes')
[WARNING] /jobs/genie.mylyn/mylyn-3.22.x-release/workspace/org.eclipse.mylyn/org.eclipse.mylyn.tests/src/org/eclipse/mylyn/tests/AllNonConnectorTests.java:[56] 
	suite.addTest(AllCdtTests.suite());
	              ^^^^^^^^^^^^^^^^^^^
Discouraged access: The method 'AllCdtTests.suite()' is not API (restriction on classpath entry '/jobs/genie.mylyn/mylyn-3.22.x-release/workspace/org.eclipse.mylyn.context/org.eclipse.mylyn.cdt.tests/target/classes')
[WARNING] /jobs/genie.mylyn/mylyn-3.22.x-release/workspace/org.eclipse.mylyn/org.eclipse.mylyn.tests/src/org/eclipse/mylyn/tests/AllNonConnectorTests.java:[57] 
	suite.addTest(AllMonitorTests.suite());
	              ^^^^^^^^^^^^^^^
Discouraged access: The type 'AllMonitorTests' is not API (restriction on classpath entry '/jobs/genie.mylyn/mylyn-3.22.x-release/workspace/org.eclipse.mylyn.commons/org.eclipse.mylyn.monitor.tests/target/classes')
[WARNING] /jobs/genie.mylyn/mylyn-3.22.x-release/workspace/org.eclipse.mylyn/org.eclipse.mylyn.tests/src/org/eclipse/mylyn/tests/AllNonConnectorTests.java:[57] 
	suite.addTest(AllMonitorTests.suite());
	              ^^^^^^^^^^^^^^^^^^^^^^^
Discouraged access: The method 'AllMonitorTests.suite()' is not API (restriction on classpath entry '/jobs/genie.mylyn/mylyn-3.22.x-release/workspace/org.eclipse.mylyn.commons/org.eclipse.mylyn.monitor.tests/target/classes')
[WARNING] /jobs/genie.mylyn/mylyn-3.22.x-release/workspace/org.eclipse.mylyn/org.eclipse.mylyn.tests/src/org/eclipse/mylyn/tests/AllNonConnectorTests.java:[58] 
	suite.addTest(AllIdeTests.suite());
	              ^^^^^^^^^^^
Discouraged access: The type 'AllIdeTests' is not API (restriction on classpath entry '/jobs/genie.mylyn/mylyn-3.22.x-release/workspace/org.eclipse.mylyn.context/org.eclipse.mylyn.ide.tests/target/classes')
[WARNING] /jobs/genie.mylyn/mylyn-3.22.x-release/workspace/org.eclipse.mylyn/org.eclipse.mylyn.tests/src/org/eclipse/mylyn/tests/AllNonConnectorTests.java:[58] 
	suite.addTest(AllIdeTests.suite());
	              ^^^^^^^^^^^^^^^^^^^
Discouraged access: The method 'AllIdeTests.suite()' is not API (restriction on classpath entry '/jobs/genie.mylyn/mylyn-3.22.x-release/workspace/org.eclipse.mylyn.context/org.eclipse.mylyn.ide.tests/target/classes')
[WARNING] /jobs/genie.mylyn/mylyn-3.22.x-release/workspace/org.eclipse.mylyn/org.eclipse.mylyn.tests/src/org/eclipse/mylyn/tests/AllNonConnectorTests.java:[59] 
	suite.addTest(AllTasksTests.suite(configuration));
	              ^^^^^^^^^^^^^
Discouraged access: The type 'AllTasksTests' is not API (restriction on classpath entry '/jobs/genie.mylyn/mylyn-3.22.x-release/workspace/org.eclipse.mylyn.tasks/org.eclipse.mylyn.tasks.tests/target/classes')
[WARNING] /jobs/genie.mylyn/mylyn-3.22.x-release/workspace/org.eclipse.mylyn/org.eclipse.mylyn.tests/src/org/eclipse/mylyn/tests/AllNonConnectorTests.java:[59] 
	suite.addTest(AllTasksTests.suite(configuration));
	              ^^^^^^^^^^^^^^^^^^^^^^^^^^^^^^^^^^
Discouraged access: The method 'AllTasksTests.suite(TestConfiguration)' is not API (restriction on classpath entry '/jobs/genie.mylyn/mylyn-3.22.x-release/workspace/org.eclipse.mylyn.tasks/org.eclipse.mylyn.tasks.tests/target/classes')
[WARNING] /jobs/genie.mylyn/mylyn-3.22.x-release/workspace/org.eclipse.mylyn/org.eclipse.mylyn.tests/src/org/eclipse/mylyn/tests/AllNonConnectorTests.java:[60] 
	suite.addTest(AllBuildsTests.suite());
	              ^^^^^^^^^^^^^^
Discouraged access: The type 'AllBuildsTests' is not API (restriction on classpath entry '/jobs/genie.mylyn/mylyn-3.22.x-release/workspace/org.eclipse.mylyn.builds/org.eclipse.mylyn.builds.tests/target/classes')
[WARNING] /jobs/genie.mylyn/mylyn-3.22.x-release/workspace/org.eclipse.mylyn/org.eclipse.mylyn.tests/src/org/eclipse/mylyn/tests/AllNonConnectorTests.java:[60] 
	suite.addTest(AllBuildsTests.suite());
	              ^^^^^^^^^^^^^^^^^^^^^^
Discouraged access: The method 'AllBuildsTests.suite()' is not API (restriction on classpath entry '/jobs/genie.mylyn/mylyn-3.22.x-release/workspace/org.eclipse.mylyn.builds/org.eclipse.mylyn.builds.tests/target/classes')
[WARNING] /jobs/genie.mylyn/mylyn-3.22.x-release/workspace/org.eclipse.mylyn/org.eclipse.mylyn.tests/src/org/eclipse/mylyn/tests/AllNonConnectorTests.java:[61] 
	suite.addTest(AllReviewsTests.suite());
	              ^^^^^^^^^^^^^^^
Discouraged access: The type 'AllReviewsTests' is not API (restriction on classpath entry '/jobs/genie.mylyn/mylyn-3.22.x-release/workspace/org.eclipse.mylyn.reviews/org.eclipse.mylyn.reviews.tests/target/classes')
[WARNING] /jobs/genie.mylyn/mylyn-3.22.x-release/workspace/org.eclipse.mylyn/org.eclipse.mylyn.tests/src/org/eclipse/mylyn/tests/AllNonConnectorTests.java:[61] 
	suite.addTest(AllReviewsTests.suite());
	              ^^^^^^^^^^^^^^^^^^^^^^^
Discouraged access: The method 'AllReviewsTests.suite()' is not API (restriction on classpath entry '/jobs/genie.mylyn/mylyn-3.22.x-release/workspace/org.eclipse.mylyn.reviews/org.eclipse.mylyn.reviews.tests/target/classes')
[WARNING] /jobs/genie.mylyn/mylyn-3.22.x-release/workspace/org.eclipse.mylyn/org.eclipse.mylyn.tests/src/org/eclipse/mylyn/tests/AllNonConnectorTests.java:[62] 
	suite.addTest(AllResourcesTests.suite());
	              ^^^^^^^^^^^^^^^^^
Discouraged access: The type 'AllResourcesTests' is not API (restriction on classpath entry '/jobs/genie.mylyn/mylyn-3.22.x-release/workspace/org.eclipse.mylyn.context/org.eclipse.mylyn.resources.tests/target/classes')
[WARNING] /jobs/genie.mylyn/mylyn-3.22.x-release/workspace/org.eclipse.mylyn/org.eclipse.mylyn.tests/src/org/eclipse/mylyn/tests/AllNonConnectorTests.java:[62] 
	suite.addTest(AllResourcesTests.suite());
	              ^^^^^^^^^^^^^^^^^^^^^^^^^
Discouraged access: The method 'AllResourcesTests.suite()' is not API (restriction on classpath entry '/jobs/genie.mylyn/mylyn-3.22.x-release/workspace/org.eclipse.mylyn.context/org.eclipse.mylyn.resources.tests/target/classes')
[WARNING] /jobs/genie.mylyn/mylyn-3.22.x-release/workspace/org.eclipse.mylyn/org.eclipse.mylyn.tests/src/org/eclipse/mylyn/tests/AllNonConnectorTests.java:[63] 
	suite.addTest(AllTeamTests.suite());
	              ^^^^^^^^^^^^
Discouraged access: The type 'AllTeamTests' is not API (restriction on classpath entry '/jobs/genie.mylyn/mylyn-3.22.x-release/workspace/org.eclipse.mylyn.context/org.eclipse.mylyn.team.tests/target/classes')
[WARNING] /jobs/genie.mylyn/mylyn-3.22.x-release/workspace/org.eclipse.mylyn/org.eclipse.mylyn.tests/src/org/eclipse/mylyn/tests/AllNonConnectorTests.java:[63] 
	suite.addTest(AllTeamTests.suite());
	              ^^^^^^^^^^^^^^^^^^^^
Discouraged access: The method 'AllTeamTests.suite()' is not API (restriction on classpath entry '/jobs/genie.mylyn/mylyn-3.22.x-release/workspace/org.eclipse.mylyn.context/org.eclipse.mylyn.team.tests/target/classes')
[WARNING] /jobs/genie.mylyn/mylyn-3.22.x-release/workspace/org.eclipse.mylyn/org.eclipse.mylyn.tests/src/org/eclipse/mylyn/tests/AllLocalTests.java:[14] 
	import org.eclipse.mylyn.bugzilla.rest.core.tests.AllBugzillaRestCoreTests;
	       ^^^^^^^^^^^^^^^^^^^^^^^^^^^^^^^^^^^^^^^^^^^^^^^^^^^^^^^^^^^^^^^^^^^
Discouraged access: The type 'AllBugzillaRestCoreTests' is not API (restriction on classpath entry '/jobs/genie.mylyn/mylyn-3.22.x-release/workspace/org.eclipse.mylyn.tasks/connector-bugzilla-rest/org.eclipse.mylyn.bugzilla.rest.core.tests/target/classes')
[WARNING] /jobs/genie.mylyn/mylyn-3.22.x-release/workspace/org.eclipse.mylyn/org.eclipse.mylyn.tests/src/org/eclipse/mylyn/tests/AllLocalTests.java:[15] 
	import org.eclipse.mylyn.bugzilla.tests.AllBugzillaTests;
	       ^^^^^^^^^^^^^^^^^^^^^^^^^^^^^^^^^^^^^^^^^^^^^^^^^
Discouraged access: The type 'AllBugzillaTests' is not API (restriction on classpath entry '/jobs/genie.mylyn/mylyn-3.22.x-release/workspace/org.eclipse.mylyn.tasks/org.eclipse.mylyn.bugzilla.tests/target/classes')
[WARNING] /jobs/genie.mylyn/mylyn-3.22.x-release/workspace/org.eclipse.mylyn/org.eclipse.mylyn.tests/src/org/eclipse/mylyn/tests/AllLocalTests.java:[16] 
	import org.eclipse.mylyn.commons.sdk.util.ManagedSuite;
	       ^^^^^^^^^^^^^^^^^^^^^^^^^^^^^^^^^^^^^^^^^^^^^^^
Discouraged access: The type 'ManagedSuite' is not API (restriction on classpath entry '/jobs/genie.mylyn/mylyn-3.22.x-release/workspace/org.eclipse.mylyn.commons/org.eclipse.mylyn.commons.sdk.util/target/classes')
[WARNING] /jobs/genie.mylyn/mylyn-3.22.x-release/workspace/org.eclipse.mylyn/org.eclipse.mylyn.tests/src/org/eclipse/mylyn/tests/AllLocalTests.java:[17] 
	import org.eclipse.mylyn.commons.sdk.util.ManagedTestSuite;
	       ^^^^^^^^^^^^^^^^^^^^^^^^^^^^^^^^^^^^^^^^^^^^^^^^^^^
Discouraged access: The type 'ManagedTestSuite' is not API (restriction on classpath entry '/jobs/genie.mylyn/mylyn-3.22.x-release/workspace/org.eclipse.mylyn.commons/org.eclipse.mylyn.commons.sdk.util/target/classes')
[WARNING] /jobs/genie.mylyn/mylyn-3.22.x-release/workspace/org.eclipse.mylyn/org.eclipse.mylyn.tests/src/org/eclipse/mylyn/tests/AllLocalTests.java:[18] 
	import org.eclipse.mylyn.commons.sdk.util.TestConfiguration;
	       ^^^^^^^^^^^^^^^^^^^^^^^^^^^^^^^^^^^^^^^^^^^^^^^^^^^^
Discouraged access: The type 'TestConfiguration' is not API (restriction on classpath entry '/jobs/genie.mylyn/mylyn-3.22.x-release/workspace/org.eclipse.mylyn.commons/org.eclipse.mylyn.commons.sdk.util/target/classes')
[WARNING] /jobs/genie.mylyn/mylyn-3.22.x-release/workspace/org.eclipse.mylyn/org.eclipse.mylyn.tests/src/org/eclipse/mylyn/tests/AllLocalTests.java:[19] 
	import org.eclipse.mylyn.gerrit.tests.AllGerritTests;
	       ^^^^^^^^^^^^^^^^^^^^^^^^^^^^^^^^^^^^^^^^^^^^^
Discouraged access: The type 'AllGerritTests' is not API (restriction on classpath entry '/jobs/genie.mylyn/mylyn-3.22.x-release/workspace/org.eclipse.mylyn.reviews/org.eclipse.mylyn.gerrit.tests/target/classes')
[WARNING] /jobs/genie.mylyn/mylyn-3.22.x-release/workspace/org.eclipse.mylyn/org.eclipse.mylyn.tests/src/org/eclipse/mylyn/tests/AllLocalTests.java:[20] 
	import org.eclipse.mylyn.hudson.tests.AllHudsonTests;
	       ^^^^^^^^^^^^^^^^^^^^^^^^^^^^^^^^^^^^^^^^^^^^^
Discouraged access: The type 'AllHudsonTests' is not API (restriction on classpath entry '/jobs/genie.mylyn/mylyn-3.22.x-release/workspace/org.eclipse.mylyn.builds/org.eclipse.mylyn.hudson.tests/target/classes')
[WARNING] /jobs/genie.mylyn/mylyn-3.22.x-release/workspace/org.eclipse.mylyn/org.eclipse.mylyn.tests/src/org/eclipse/mylyn/tests/AllLocalTests.java:[21] 
	import org.eclipse.mylyn.trac.tests.AllTracTests;
	       ^^^^^^^^^^^^^^^^^^^^^^^^^^^^^^^^^^^^^^^^^
Discouraged access: The type 'AllTracTests' is not API (restriction on classpath entry '/jobs/genie.mylyn/mylyn-3.22.x-release/workspace/org.eclipse.mylyn.tasks/org.eclipse.mylyn.trac.tests/target/classes')
[WARNING] /jobs/genie.mylyn/mylyn-3.22.x-release/workspace/org.eclipse.mylyn/org.eclipse.mylyn.tests/src/org/eclipse/mylyn/tests/AllLocalTests.java:[33] 
	TestConfiguration configuration = ManagedSuite.getTestConfiguration();
	^^^^^^^^^^^^^^^^^
Discouraged access: The type 'TestConfiguration' is not API (restriction on classpath entry '/jobs/genie.mylyn/mylyn-3.22.x-release/workspace/org.eclipse.mylyn.commons/org.eclipse.mylyn.commons.sdk.util/target/classes')
[WARNING] /jobs/genie.mylyn/mylyn-3.22.x-release/workspace/org.eclipse.mylyn/org.eclipse.mylyn.tests/src/org/eclipse/mylyn/tests/AllLocalTests.java:[33] 
	TestConfiguration configuration = ManagedSuite.getTestConfiguration();
	                                  ^^^^^^^^^^^^
Discouraged access: The type 'ManagedSuite' is not API (restriction on classpath entry '/jobs/genie.mylyn/mylyn-3.22.x-release/workspace/org.eclipse.mylyn.commons/org.eclipse.mylyn.commons.sdk.util/target/classes')
[WARNING] /jobs/genie.mylyn/mylyn-3.22.x-release/workspace/org.eclipse.mylyn/org.eclipse.mylyn.tests/src/org/eclipse/mylyn/tests/AllLocalTests.java:[33] 
	TestConfiguration configuration = ManagedSuite.getTestConfiguration();
	                                  ^^^^^^^^^^^^^^^^^^^^^^^^^^^^^^^^^^^
Discouraged access: The method 'ManagedSuite.getTestConfiguration()' is not API (restriction on classpath entry '/jobs/genie.mylyn/mylyn-3.22.x-release/workspace/org.eclipse.mylyn.commons/org.eclipse.mylyn.commons.sdk.util/target/classes')
[WARNING] /jobs/genie.mylyn/mylyn-3.22.x-release/workspace/org.eclipse.mylyn/org.eclipse.mylyn.tests/src/org/eclipse/mylyn/tests/AllLocalTests.java:[35] 
	configuration = new TestConfiguration();
	                ^^^^^^^^^^^^^^^^^^^^^^^
Discouraged access: The constructor 'TestConfiguration()' is not API (restriction on classpath entry '/jobs/genie.mylyn/mylyn-3.22.x-release/workspace/org.eclipse.mylyn.commons/org.eclipse.mylyn.commons.sdk.util/target/classes')
[WARNING] /jobs/genie.mylyn/mylyn-3.22.x-release/workspace/org.eclipse.mylyn/org.eclipse.mylyn.tests/src/org/eclipse/mylyn/tests/AllLocalTests.java:[35] 
	configuration = new TestConfiguration();
	                    ^^^^^^^^^^^^^^^^^
Discouraged access: The type 'TestConfiguration' is not API (restriction on classpath entry '/jobs/genie.mylyn/mylyn-3.22.x-release/workspace/org.eclipse.mylyn.commons/org.eclipse.mylyn.commons.sdk.util/target/classes')
[WARNING] /jobs/genie.mylyn/mylyn-3.22.x-release/workspace/org.eclipse.mylyn/org.eclipse.mylyn.tests/src/org/eclipse/mylyn/tests/AllLocalTests.java:[36] 
	configuration.setLocalOnly(true);
	^^^^^^^^^^^^^^^^^^^^^^^^^^^^^^^^
Discouraged access: The method 'TestConfiguration.setLocalOnly(boolean)' is not API (restriction on classpath entry '/jobs/genie.mylyn/mylyn-3.22.x-release/workspace/org.eclipse.mylyn.commons/org.eclipse.mylyn.commons.sdk.util/target/classes')
[WARNING] /jobs/genie.mylyn/mylyn-3.22.x-release/workspace/org.eclipse.mylyn/org.eclipse.mylyn.tests/src/org/eclipse/mylyn/tests/AllLocalTests.java:[37] 
	ManagedSuite.setTestConfiguration(configuration);
	^^^^^^^^^^^^
Discouraged access: The type 'ManagedSuite' is not API (restriction on classpath entry '/jobs/genie.mylyn/mylyn-3.22.x-release/workspace/org.eclipse.mylyn.commons/org.eclipse.mylyn.commons.sdk.util/target/classes')
[WARNING] /jobs/genie.mylyn/mylyn-3.22.x-release/workspace/org.eclipse.mylyn/org.eclipse.mylyn.tests/src/org/eclipse/mylyn/tests/AllLocalTests.java:[37] 
	ManagedSuite.setTestConfiguration(configuration);
	^^^^^^^^^^^^^^^^^^^^^^^^^^^^^^^^^^^^^^^^^^^^^^^^
Discouraged access: The method 'ManagedSuite.setTestConfiguration(TestConfiguration)' is not API (restriction on classpath entry '/jobs/genie.mylyn/mylyn-3.22.x-release/workspace/org.eclipse.mylyn.commons/org.eclipse.mylyn.commons.sdk.util/target/classes')
[WARNING] /jobs/genie.mylyn/mylyn-3.22.x-release/workspace/org.eclipse.mylyn/org.eclipse.mylyn.tests/src/org/eclipse/mylyn/tests/AllLocalTests.java:[40] 
	TestSuite suite = new ManagedTestSuite(AllLocalTests.class.getName());
	                  ^^^^^^^^^^^^^^^^^^^^^^^^^^^^^^^^^^^^^^^^^^^^^^^^^^^
Discouraged access: The constructor 'ManagedTestSuite(String)' is not API (restriction on classpath entry '/jobs/genie.mylyn/mylyn-3.22.x-release/workspace/org.eclipse.mylyn.commons/org.eclipse.mylyn.commons.sdk.util/target/classes')
[WARNING] /jobs/genie.mylyn/mylyn-3.22.x-release/workspace/org.eclipse.mylyn/org.eclipse.mylyn.tests/src/org/eclipse/mylyn/tests/AllLocalTests.java:[40] 
	TestSuite suite = new ManagedTestSuite(AllLocalTests.class.getName());
	                      ^^^^^^^^^^^^^^^^
Discouraged access: The type 'ManagedTestSuite' is not API (restriction on classpath entry '/jobs/genie.mylyn/mylyn-3.22.x-release/workspace/org.eclipse.mylyn.commons/org.eclipse.mylyn.commons.sdk.util/target/classes')
[WARNING] /jobs/genie.mylyn/mylyn-3.22.x-release/workspace/org.eclipse.mylyn/org.eclipse.mylyn.tests/src/org/eclipse/mylyn/tests/AllLocalTests.java:[46] 
	static void addTests(TestSuite suite, TestConfiguration configuration) {
	                                      ^^^^^^^^^^^^^^^^^
Discouraged access: The type 'TestConfiguration' is not API (restriction on classpath entry '/jobs/genie.mylyn/mylyn-3.22.x-release/workspace/org.eclipse.mylyn.commons/org.eclipse.mylyn.commons.sdk.util/target/classes')
[WARNING] /jobs/genie.mylyn/mylyn-3.22.x-release/workspace/org.eclipse.mylyn/org.eclipse.mylyn.tests/src/org/eclipse/mylyn/tests/AllLocalTests.java:[47] 
	suite.addTest(AllBugzillaTests.suite(configuration));
	              ^^^^^^^^^^^^^^^^
Discouraged access: The type 'AllBugzillaTests' is not API (restriction on classpath entry '/jobs/genie.mylyn/mylyn-3.22.x-release/workspace/org.eclipse.mylyn.tasks/org.eclipse.mylyn.bugzilla.tests/target/classes')
[WARNING] /jobs/genie.mylyn/mylyn-3.22.x-release/workspace/org.eclipse.mylyn/org.eclipse.mylyn.tests/src/org/eclipse/mylyn/tests/AllLocalTests.java:[47] 
	suite.addTest(AllBugzillaTests.suite(configuration));
	              ^^^^^^^^^^^^^^^^^^^^^^^^^^^^^^^^^^^^^
Discouraged access: The method 'AllBugzillaTests.suite(TestConfiguration)' is not API (restriction on classpath entry '/jobs/genie.mylyn/mylyn-3.22.x-release/workspace/org.eclipse.mylyn.tasks/org.eclipse.mylyn.bugzilla.tests/target/classes')
[WARNING] /jobs/genie.mylyn/mylyn-3.22.x-release/workspace/org.eclipse.mylyn/org.eclipse.mylyn.tests/src/org/eclipse/mylyn/tests/AllLocalTests.java:[48] 
	suite.addTest(AllTracTests.suite(configuration));
	              ^^^^^^^^^^^^
Discouraged access: The type 'AllTracTests' is not API (restriction on classpath entry '/jobs/genie.mylyn/mylyn-3.22.x-release/workspace/org.eclipse.mylyn.tasks/org.eclipse.mylyn.trac.tests/target/classes')
[WARNING] /jobs/genie.mylyn/mylyn-3.22.x-release/workspace/org.eclipse.mylyn/org.eclipse.mylyn.tests/src/org/eclipse/mylyn/tests/AllLocalTests.java:[48] 
	suite.addTest(AllTracTests.suite(configuration));
	              ^^^^^^^^^^^^^^^^^^^^^^^^^^^^^^^^^
Discouraged access: The method 'AllTracTests.suite(TestConfiguration)' is not API (restriction on classpath entry '/jobs/genie.mylyn/mylyn-3.22.x-release/workspace/org.eclipse.mylyn.tasks/org.eclipse.mylyn.trac.tests/target/classes')
[WARNING] /jobs/genie.mylyn/mylyn-3.22.x-release/workspace/org.eclipse.mylyn/org.eclipse.mylyn.tests/src/org/eclipse/mylyn/tests/AllLocalTests.java:[49] 
	suite.addTest(AllHudsonTests.suite(configuration));
	              ^^^^^^^^^^^^^^
Discouraged access: The type 'AllHudsonTests' is not API (restriction on classpath entry '/jobs/genie.mylyn/mylyn-3.22.x-release/workspace/org.eclipse.mylyn.builds/org.eclipse.mylyn.hudson.tests/target/classes')
[WARNING] /jobs/genie.mylyn/mylyn-3.22.x-release/workspace/org.eclipse.mylyn/org.eclipse.mylyn.tests/src/org/eclipse/mylyn/tests/AllLocalTests.java:[49] 
	suite.addTest(AllHudsonTests.suite(configuration));
	              ^^^^^^^^^^^^^^^^^^^^^^^^^^^^^^^^^^^
Discouraged access: The method 'AllHudsonTests.suite(TestConfiguration)' is not API (restriction on classpath entry '/jobs/genie.mylyn/mylyn-3.22.x-release/workspace/org.eclipse.mylyn.builds/org.eclipse.mylyn.hudson.tests/target/classes')
[WARNING] /jobs/genie.mylyn/mylyn-3.22.x-release/workspace/org.eclipse.mylyn/org.eclipse.mylyn.tests/src/org/eclipse/mylyn/tests/AllLocalTests.java:[50] 
	suite.addTest(AllGerritTests.suite(configuration));
	              ^^^^^^^^^^^^^^
Discouraged access: The type 'AllGerritTests' is not API (restriction on classpath entry '/jobs/genie.mylyn/mylyn-3.22.x-release/workspace/org.eclipse.mylyn.reviews/org.eclipse.mylyn.gerrit.tests/target/classes')
[WARNING] /jobs/genie.mylyn/mylyn-3.22.x-release/workspace/org.eclipse.mylyn/org.eclipse.mylyn.tests/src/org/eclipse/mylyn/tests/AllLocalTests.java:[50] 
	suite.addTest(AllGerritTests.suite(configuration));
	              ^^^^^^^^^^^^^^^^^^^^^^^^^^^^^^^^^^^
Discouraged access: The method 'AllGerritTests.suite(TestConfiguration)' is not API (restriction on classpath entry '/jobs/genie.mylyn/mylyn-3.22.x-release/workspace/org.eclipse.mylyn.reviews/org.eclipse.mylyn.gerrit.tests/target/classes')
[WARNING] /jobs/genie.mylyn/mylyn-3.22.x-release/workspace/org.eclipse.mylyn/org.eclipse.mylyn.tests/src/org/eclipse/mylyn/tests/AllLocalTests.java:[51] 
	suite.addTest(new JUnit4TestAdapter(AllBugzillaRestCoreTests.class));
	                                    ^^^^^^^^^^^^^^^^^^^^^^^^
Discouraged access: The type 'AllBugzillaRestCoreTests' is not API (restriction on classpath entry '/jobs/genie.mylyn/mylyn-3.22.x-release/workspace/org.eclipse.mylyn.tasks/connector-bugzilla-rest/org.eclipse.mylyn.bugzilla.rest.core.tests/target/classes')
[WARNING] /jobs/genie.mylyn/mylyn-3.22.x-release/workspace/org.eclipse.mylyn/org.eclipse.mylyn.tests/src/org/eclipse/mylyn/tests/AllHeartbeatTests.java:[14] 
	import org.eclipse.mylyn.commons.sdk.util.ManagedTestSuite;
	       ^^^^^^^^^^^^^^^^^^^^^^^^^^^^^^^^^^^^^^^^^^^^^^^^^^^
Discouraged access: The type 'ManagedTestSuite' is not API (restriction on classpath entry '/jobs/genie.mylyn/mylyn-3.22.x-release/workspace/org.eclipse.mylyn.commons/org.eclipse.mylyn.commons.sdk.util/target/classes')
[WARNING] /jobs/genie.mylyn/mylyn-3.22.x-release/workspace/org.eclipse.mylyn/org.eclipse.mylyn.tests/src/org/eclipse/mylyn/tests/AllHeartbeatTests.java:[15] 
	import org.eclipse.mylyn.commons.sdk.util.TestConfiguration;
	       ^^^^^^^^^^^^^^^^^^^^^^^^^^^^^^^^^^^^^^^^^^^^^^^^^^^^
Discouraged access: The type 'TestConfiguration' is not API (restriction on classpath entry '/jobs/genie.mylyn/mylyn-3.22.x-release/workspace/org.eclipse.mylyn.commons/org.eclipse.mylyn.commons.sdk.util/target/classes')
[WARNING] /jobs/genie.mylyn/mylyn-3.22.x-release/workspace/org.eclipse.mylyn/org.eclipse.mylyn.tests/src/org/eclipse/mylyn/tests/AllHeartbeatTests.java:[26] 
	TestConfiguration configuration = new TestConfiguration();
	^^^^^^^^^^^^^^^^^
Discouraged access: The type 'TestConfiguration' is not API (restriction on classpath entry '/jobs/genie.mylyn/mylyn-3.22.x-release/workspace/org.eclipse.mylyn.commons/org.eclipse.mylyn.commons.sdk.util/target/classes')
[WARNING] /jobs/genie.mylyn/mylyn-3.22.x-release/workspace/org.eclipse.mylyn/org.eclipse.mylyn.tests/src/org/eclipse/mylyn/tests/AllHeartbeatTests.java:[26] 
	TestConfiguration configuration = new TestConfiguration();
	                                  ^^^^^^^^^^^^^^^^^^^^^^^
Discouraged access: The constructor 'TestConfiguration()' is not API (restriction on classpath entry '/jobs/genie.mylyn/mylyn-3.22.x-release/workspace/org.eclipse.mylyn.commons/org.eclipse.mylyn.commons.sdk.util/target/classes')
[WARNING] /jobs/genie.mylyn/mylyn-3.22.x-release/workspace/org.eclipse.mylyn/org.eclipse.mylyn.tests/src/org/eclipse/mylyn/tests/AllHeartbeatTests.java:[26] 
	TestConfiguration configuration = new TestConfiguration();
	                                      ^^^^^^^^^^^^^^^^^
Discouraged access: The type 'TestConfiguration' is not API (restriction on classpath entry '/jobs/genie.mylyn/mylyn-3.22.x-release/workspace/org.eclipse.mylyn.commons/org.eclipse.mylyn.commons.sdk.util/target/classes')
[WARNING] /jobs/genie.mylyn/mylyn-3.22.x-release/workspace/org.eclipse.mylyn/org.eclipse.mylyn.tests/src/org/eclipse/mylyn/tests/AllHeartbeatTests.java:[27] 
	configuration.setLocalOnly(true);
	^^^^^^^^^^^^^^^^^^^^^^^^^^^^^^^^
Discouraged access: The method 'TestConfiguration.setLocalOnly(boolean)' is not API (restriction on classpath entry '/jobs/genie.mylyn/mylyn-3.22.x-release/workspace/org.eclipse.mylyn.commons/org.eclipse.mylyn.commons.sdk.util/target/classes')
[WARNING] /jobs/genie.mylyn/mylyn-3.22.x-release/workspace/org.eclipse.mylyn/org.eclipse.mylyn.tests/src/org/eclipse/mylyn/tests/AllHeartbeatTests.java:[29] 
	TestSuite suite = new ManagedTestSuite(AllHeartbeatTests.class.getName());
	                  ^^^^^^^^^^^^^^^^^^^^^^^^^^^^^^^^^^^^^^^^^^^^^^^^^^^^^^^
Discouraged access: The constructor 'ManagedTestSuite(String)' is not API (restriction on classpath entry '/jobs/genie.mylyn/mylyn-3.22.x-release/workspace/org.eclipse.mylyn.commons/org.eclipse.mylyn.commons.sdk.util/target/classes')
[WARNING] /jobs/genie.mylyn/mylyn-3.22.x-release/workspace/org.eclipse.mylyn/org.eclipse.mylyn.tests/src/org/eclipse/mylyn/tests/AllHeartbeatTests.java:[29] 
	TestSuite suite = new ManagedTestSuite(AllHeartbeatTests.class.getName());
	                      ^^^^^^^^^^^^^^^^
Discouraged access: The type 'ManagedTestSuite' is not API (restriction on classpath entry '/jobs/genie.mylyn/mylyn-3.22.x-release/workspace/org.eclipse.mylyn.commons/org.eclipse.mylyn.commons.sdk.util/target/classes')
[WARNING] /jobs/genie.mylyn/mylyn-3.22.x-release/workspace/org.eclipse.mylyn/org.eclipse.mylyn.tests/src/org/eclipse/mylyn/tests/integration/ChangeDataDirTest.java:[19] 
	import org.eclipse.mylyn.commons.sdk.util.CommonTestUtil;
	       ^^^^^^^^^^^^^^^^^^^^^^^^^^^^^^^^^^^^^^^^^^^^^^^^^
Discouraged access: The type 'CommonTestUtil' is not API (restriction on classpath entry '/jobs/genie.mylyn/mylyn-3.22.x-release/workspace/org.eclipse.mylyn.commons/org.eclipse.mylyn.commons.sdk.util/target/classes')
[WARNING] /jobs/genie.mylyn/mylyn-3.22.x-release/workspace/org.eclipse.mylyn/org.eclipse.mylyn.tests/src/org/eclipse/mylyn/tests/integration/ChangeDataDirTest.java:[20] 
	import org.eclipse.mylyn.internal.context.core.ContextCorePlugin;
	       ^^^^^^^^^^^^^^^^^^^^^^^^^^^^^^^^^^^^^^^^^^^^^^^^^^^^^^^^^
Discouraged access: The type 'ContextCorePlugin' is not API (restriction on classpath entry '/jobs/genie.mylyn/mylyn-3.22.x-release/workspace/org.eclipse.mylyn.context/org.eclipse.mylyn.context.core/target/classes')
[WARNING] /jobs/genie.mylyn/mylyn-3.22.x-release/workspace/org.eclipse.mylyn/org.eclipse.mylyn.tests/src/org/eclipse/mylyn/tests/integration/ChangeDataDirTest.java:[21] 
	import org.eclipse.mylyn.internal.tasks.core.AbstractTask;
	       ^^^^^^^^^^^^^^^^^^^^^^^^^^^^^^^^^^^^^^^^^^^^^^^^^^
Discouraged access: The type 'AbstractTask' is not API (restriction on classpath entry '/jobs/genie.mylyn/mylyn-3.22.x-release/workspace/org.eclipse.mylyn.tasks/org.eclipse.mylyn.tasks.core/target/classes')
[WARNING] /jobs/genie.mylyn/mylyn-3.22.x-release/workspace/org.eclipse.mylyn/org.eclipse.mylyn.tests/src/org/eclipse/mylyn/tests/integration/ChangeDataDirTest.java:[22] 
	import org.eclipse.mylyn.internal.tasks.core.LocalRepositoryConnector;
	       ^^^^^^^^^^^^^^^^^^^^^^^^^^^^^^^^^^^^^^^^^^^^^^^^^^^^^^^^^^^^^^
Discouraged access: The type 'LocalRepositoryConnector' is not API (restriction on classpath entry '/jobs/genie.mylyn/mylyn-3.22.x-release/workspace/org.eclipse.mylyn.tasks/org.eclipse.mylyn.tasks.core/target/classes')
[WARNING] /jobs/genie.mylyn/mylyn-3.22.x-release/workspace/org.eclipse.mylyn/org.eclipse.mylyn.tests/src/org/eclipse/mylyn/tests/integration/ChangeDataDirTest.java:[23] 
	import org.eclipse.mylyn.internal.tasks.core.TaskList;
	       ^^^^^^^^^^^^^^^^^^^^^^^^^^^^^^^^^^^^^^^^^^^^^^
Discouraged access: The type 'TaskList' is not API (restriction on classpath entry '/jobs/genie.mylyn/mylyn-3.22.x-release/workspace/org.eclipse.mylyn.tasks/org.eclipse.mylyn.tasks.core/target/classes')
[WARNING] /jobs/genie.mylyn/mylyn-3.22.x-release/workspace/org.eclipse.mylyn/org.eclipse.mylyn.tests/src/org/eclipse/mylyn/tests/integration/ChangeDataDirTest.java:[24] 
	import org.eclipse.mylyn.internal.tasks.ui.TasksUiPlugin;
	       ^^^^^^^^^^^^^^^^^^^^^^^^^^^^^^^^^^^^^^^^^^^^^^^^^
Discouraged access: The type 'TasksUiPlugin' is not API (restriction on classpath entry '/jobs/genie.mylyn/mylyn-3.22.x-release/workspace/org.eclipse.mylyn.tasks/org.eclipse.mylyn.tasks.ui/target/classes')
[WARNING] /jobs/genie.mylyn/mylyn-3.22.x-release/workspace/org.eclipse.mylyn/org.eclipse.mylyn.tests/src/org/eclipse/mylyn/tests/integration/ChangeDataDirTest.java:[25] 
	import org.eclipse.mylyn.internal.tasks.ui.util.TasksUiInternal;
	       ^^^^^^^^^^^^^^^^^^^^^^^^^^^^^^^^^^^^^^^^^^^^^^^^^^^^^^^^
Discouraged access: The type 'TasksUiInternal' is not API (restriction on classpath entry '/jobs/genie.mylyn/mylyn-3.22.x-release/workspace/org.eclipse.mylyn.tasks/org.eclipse.mylyn.tasks.ui/target/classes')
[WARNING] /jobs/genie.mylyn/mylyn-3.22.x-release/workspace/org.eclipse.mylyn/org.eclipse.mylyn.tests/src/org/eclipse/mylyn/tests/integration/ChangeDataDirTest.java:[27] 
	import org.eclipse.mylyn.tasks.tests.TaskTestUtil;
	       ^^^^^^^^^^^^^^^^^^^^^^^^^^^^^^^^^^^^^^^^^^
Discouraged access: The type 'TaskTestUtil' is not API (restriction on classpath entry '/jobs/genie.mylyn/mylyn-3.22.x-release/workspace/org.eclipse.mylyn.tasks/org.eclipse.mylyn.tasks.tests/target/classes')
[WARNING] /jobs/genie.mylyn/mylyn-3.22.x-release/workspace/org.eclipse.mylyn/org.eclipse.mylyn.tests/src/org/eclipse/mylyn/tests/integration/ChangeDataDirTest.java:[41] 
	private TaskList taskList;
	        ^^^^^^^^
Discouraged access: The type 'TaskList' is not API (restriction on classpath entry '/jobs/genie.mylyn/mylyn-3.22.x-release/workspace/org.eclipse.mylyn.tasks/org.eclipse.mylyn.tasks.core/target/classes')
[WARNING] /jobs/genie.mylyn/mylyn-3.22.x-release/workspace/org.eclipse.mylyn/org.eclipse.mylyn.tests/src/org/eclipse/mylyn/tests/integration/ChangeDataDirTest.java:[45] 
	defaultDir = TasksUiPlugin.getDefault().getDefaultDataDirectory();
	             ^^^^^^^^^^^^^
Discouraged access: The type 'TasksUiPlugin' is not API (restriction on classpath entry '/jobs/genie.mylyn/mylyn-3.22.x-release/workspace/org.eclipse.mylyn.tasks/org.eclipse.mylyn.tasks.ui/target/classes')
[WARNING] /jobs/genie.mylyn/mylyn-3.22.x-release/workspace/org.eclipse.mylyn/org.eclipse.mylyn.tests/src/org/eclipse/mylyn/tests/integration/ChangeDataDirTest.java:[45] 
	defaultDir = TasksUiPlugin.getDefault().getDefaultDataDirectory();
	             ^^^^^^^^^^^^^^^^^^^^^^^^^^
Discouraged access: The method 'TasksUiPlugin.getDefault()' is not API (restriction on classpath entry '/jobs/genie.mylyn/mylyn-3.22.x-release/workspace/org.eclipse.mylyn.tasks/org.eclipse.mylyn.tasks.ui/target/classes')
[WARNING] /jobs/genie.mylyn/mylyn-3.22.x-release/workspace/org.eclipse.mylyn/org.eclipse.mylyn.tests/src/org/eclipse/mylyn/tests/integration/ChangeDataDirTest.java:[45] 
	defaultDir = TasksUiPlugin.getDefault().getDefaultDataDirectory();
	             ^^^^^^^^^^^^^^^^^^^^^^^^^^^^^^^^^^^^^^^^^^^^^^^^^^^^
Discouraged access: The method 'TasksUiPlugin.getDefaultDataDirectory()' is not API (restriction on classpath entry '/jobs/genie.mylyn/mylyn-3.22.x-release/workspace/org.eclipse.mylyn.tasks/org.eclipse.mylyn.tasks.ui/target/classes')
[WARNING] /jobs/genie.mylyn/mylyn-3.22.x-release/workspace/org.eclipse.mylyn/org.eclipse.mylyn.tests/src/org/eclipse/mylyn/tests/integration/ChangeDataDirTest.java:[54] 
	taskList = TasksUiPlugin.getTaskList();
	           ^^^^^^^^^^^^^
Discouraged access: The type 'TasksUiPlugin' is not API (restriction on classpath entry '/jobs/genie.mylyn/mylyn-3.22.x-release/workspace/org.eclipse.mylyn.tasks/org.eclipse.mylyn.tasks.ui/target/classes')
[WARNING] /jobs/genie.mylyn/mylyn-3.22.x-release/workspace/org.eclipse.mylyn/org.eclipse.mylyn.tests/src/org/eclipse/mylyn/tests/integration/ChangeDataDirTest.java:[54] 
	taskList = TasksUiPlugin.getTaskList();
	           ^^^^^^^^^^^^^^^^^^^^^^^^^^^
Discouraged access: The method 'TasksUiPlugin.getTaskList()' is not API (restriction on classpath entry '/jobs/genie.mylyn/mylyn-3.22.x-release/workspace/org.eclipse.mylyn.tasks/org.eclipse.mylyn.tasks.ui/target/classes')
[WARNING] /jobs/genie.mylyn/mylyn-3.22.x-release/workspace/org.eclipse.mylyn/org.eclipse.mylyn.tests/src/org/eclipse/mylyn/tests/integration/ChangeDataDirTest.java:[56] 
	TaskTestUtil.resetTaskList();
	^^^^^^^^^^^^
Discouraged access: The type 'TaskTestUtil' is not API (restriction on classpath entry '/jobs/genie.mylyn/mylyn-3.22.x-release/workspace/org.eclipse.mylyn.tasks/org.eclipse.mylyn.tasks.tests/target/classes')
[WARNING] /jobs/genie.mylyn/mylyn-3.22.x-release/workspace/org.eclipse.mylyn/org.eclipse.mylyn.tests/src/org/eclipse/mylyn/tests/integration/ChangeDataDirTest.java:[56] 
	TaskTestUtil.resetTaskList();
	^^^^^^^^^^^^^^^^^^^^^^^^^^^^
Discouraged access: The method 'TaskTestUtil.resetTaskList()' is not API (restriction on classpath entry '/jobs/genie.mylyn/mylyn-3.22.x-release/workspace/org.eclipse.mylyn.tasks/org.eclipse.mylyn.tasks.tests/target/classes')
[WARNING] /jobs/genie.mylyn/mylyn-3.22.x-release/workspace/org.eclipse.mylyn/org.eclipse.mylyn.tests/src/org/eclipse/mylyn/tests/integration/ChangeDataDirTest.java:[61] 
	TaskTestUtil.resetTaskList();
	^^^^^^^^^^^^
Discouraged access: The type 'TaskTestUtil' is not API (restriction on classpath entry '/jobs/genie.mylyn/mylyn-3.22.x-release/workspace/org.eclipse.mylyn.tasks/org.eclipse.mylyn.tasks.tests/target/classes')
[WARNING] /jobs/genie.mylyn/mylyn-3.22.x-release/workspace/org.eclipse.mylyn/org.eclipse.mylyn.tests/src/org/eclipse/mylyn/tests/integration/ChangeDataDirTest.java:[61] 
	TaskTestUtil.resetTaskList();
	^^^^^^^^^^^^^^^^^^^^^^^^^^^^
Discouraged access: The method 'TaskTestUtil.resetTaskList()' is not API (restriction on classpath entry '/jobs/genie.mylyn/mylyn-3.22.x-release/workspace/org.eclipse.mylyn.tasks/org.eclipse.mylyn.tasks.tests/target/classes')
[WARNING] /jobs/genie.mylyn/mylyn-3.22.x-release/workspace/org.eclipse.mylyn/org.eclipse.mylyn.tests/src/org/eclipse/mylyn/tests/integration/ChangeDataDirTest.java:[62] 
	TasksUiPlugin.getDefault().setDataDirectory(defaultDir);
	^^^^^^^^^^^^^
Discouraged access: The type 'TasksUiPlugin' is not API (restriction on classpath entry '/jobs/genie.mylyn/mylyn-3.22.x-release/workspace/org.eclipse.mylyn.tasks/org.eclipse.mylyn.tasks.ui/target/classes')
[WARNING] /jobs/genie.mylyn/mylyn-3.22.x-release/workspace/org.eclipse.mylyn/org.eclipse.mylyn.tests/src/org/eclipse/mylyn/tests/integration/ChangeDataDirTest.java:[62] 
	TasksUiPlugin.getDefault().setDataDirectory(defaultDir);
	^^^^^^^^^^^^^^^^^^^^^^^^^^
Discouraged access: The method 'TasksUiPlugin.getDefault()' is not API (restriction on classpath entry '/jobs/genie.mylyn/mylyn-3.22.x-release/workspace/org.eclipse.mylyn.tasks/org.eclipse.mylyn.tasks.ui/target/classes')
[WARNING] /jobs/genie.mylyn/mylyn-3.22.x-release/workspace/org.eclipse.mylyn/org.eclipse.mylyn.tests/src/org/eclipse/mylyn/tests/integration/ChangeDataDirTest.java:[62] 
	TasksUiPlugin.getDefault().setDataDirectory(defaultDir);
	^^^^^^^^^^^^^^^^^^^^^^^^^^^^^^^^^^^^^^^^^^^^^^^^^^^^^^^
Discouraged access: The method 'TasksUiPlugin.setDataDirectory(String)' is not API (restriction on classpath entry '/jobs/genie.mylyn/mylyn-3.22.x-release/workspace/org.eclipse.mylyn.tasks/org.eclipse.mylyn.tasks.ui/target/classes')
[WARNING] /jobs/genie.mylyn/mylyn-3.22.x-release/workspace/org.eclipse.mylyn/org.eclipse.mylyn.tests/src/org/eclipse/mylyn/tests/integration/ChangeDataDirTest.java:[70] 
	TasksUiPlugin.getDefault().setDataDirectory(newDataDir);
	^^^^^^^^^^^^^
Discouraged access: The type 'TasksUiPlugin' is not API (restriction on classpath entry '/jobs/genie.mylyn/mylyn-3.22.x-release/workspace/org.eclipse.mylyn.tasks/org.eclipse.mylyn.tasks.ui/target/classes')
[WARNING] /jobs/genie.mylyn/mylyn-3.22.x-release/workspace/org.eclipse.mylyn/org.eclipse.mylyn.tests/src/org/eclipse/mylyn/tests/integration/ChangeDataDirTest.java:[70] 
	TasksUiPlugin.getDefault().setDataDirectory(newDataDir);
	^^^^^^^^^^^^^^^^^^^^^^^^^^
Discouraged access: The method 'TasksUiPlugin.getDefault()' is not API (restriction on classpath entry '/jobs/genie.mylyn/mylyn-3.22.x-release/workspace/org.eclipse.mylyn.tasks/org.eclipse.mylyn.tasks.ui/target/classes')
[WARNING] /jobs/genie.mylyn/mylyn-3.22.x-release/workspace/org.eclipse.mylyn/org.eclipse.mylyn.tests/src/org/eclipse/mylyn/tests/integration/ChangeDataDirTest.java:[70] 
	TasksUiPlugin.getDefault().setDataDirectory(newDataDir);
	^^^^^^^^^^^^^^^^^^^^^^^^^^^^^^^^^^^^^^^^^^^^^^^^^^^^^^^
Discouraged access: The method 'TasksUiPlugin.setDataDirectory(String)' is not API (restriction on classpath entry '/jobs/genie.mylyn/mylyn-3.22.x-release/workspace/org.eclipse.mylyn.tasks/org.eclipse.mylyn.tasks.ui/target/classes')
[WARNING] /jobs/genie.mylyn/mylyn-3.22.x-release/workspace/org.eclipse.mylyn/org.eclipse.mylyn.tests/src/org/eclipse/mylyn/tests/integration/ChangeDataDirTest.java:[71] 
	assertEquals(newDataDir, TasksUiPlugin.getDefault().getDataDirectory());
	                         ^^^^^^^^^^^^^
Discouraged access: The type 'TasksUiPlugin' is not API (restriction on classpath entry '/jobs/genie.mylyn/mylyn-3.22.x-release/workspace/org.eclipse.mylyn.tasks/org.eclipse.mylyn.tasks.ui/target/classes')
[WARNING] /jobs/genie.mylyn/mylyn-3.22.x-release/workspace/org.eclipse.mylyn/org.eclipse.mylyn.tests/src/org/eclipse/mylyn/tests/integration/ChangeDataDirTest.java:[71] 
	assertEquals(newDataDir, TasksUiPlugin.getDefault().getDataDirectory());
	                         ^^^^^^^^^^^^^^^^^^^^^^^^^^
Discouraged access: The method 'TasksUiPlugin.getDefault()' is not API (restriction on classpath entry '/jobs/genie.mylyn/mylyn-3.22.x-release/workspace/org.eclipse.mylyn.tasks/org.eclipse.mylyn.tasks.ui/target/classes')
[WARNING] /jobs/genie.mylyn/mylyn-3.22.x-release/workspace/org.eclipse.mylyn/org.eclipse.mylyn.tests/src/org/eclipse/mylyn/tests/integration/ChangeDataDirTest.java:[71] 
	assertEquals(newDataDir, TasksUiPlugin.getDefault().getDataDirectory());
	                         ^^^^^^^^^^^^^^^^^^^^^^^^^^^^^^^^^^^^^^^^^^^^^
Discouraged access: The method 'TasksUiPlugin.getDataDirectory()' is not API (restriction on classpath entry '/jobs/genie.mylyn/mylyn-3.22.x-release/workspace/org.eclipse.mylyn.tasks/org.eclipse.mylyn.tasks.ui/target/classes')
[WARNING] /jobs/genie.mylyn/mylyn-3.22.x-release/workspace/org.eclipse.mylyn/org.eclipse.mylyn.tests/src/org/eclipse/mylyn/tests/integration/ChangeDataDirTest.java:[72] 
	assertEquals(newDataDir, TasksUiPlugin.getTaskDataManager().getDataPath());
	                         ^^^^^^^^^^^^^
Discouraged access: The type 'TasksUiPlugin' is not API (restriction on classpath entry '/jobs/genie.mylyn/mylyn-3.22.x-release/workspace/org.eclipse.mylyn.tasks/org.eclipse.mylyn.tasks.ui/target/classes')
[WARNING] /jobs/genie.mylyn/mylyn-3.22.x-release/workspace/org.eclipse.mylyn/org.eclipse.mylyn.tests/src/org/eclipse/mylyn/tests/integration/ChangeDataDirTest.java:[72] 
	assertEquals(newDataDir, TasksUiPlugin.getTaskDataManager().getDataPath());
	                         ^^^^^^^^^^^^^^^^^^^^^^^^^^^^^^^^^^
Discouraged access: The method 'TasksUiPlugin.getTaskDataManager()' is not API (restriction on classpath entry '/jobs/genie.mylyn/mylyn-3.22.x-release/workspace/org.eclipse.mylyn.tasks/org.eclipse.mylyn.tasks.ui/target/classes')
[WARNING] /jobs/genie.mylyn/mylyn-3.22.x-release/workspace/org.eclipse.mylyn/org.eclipse.mylyn.tests/src/org/eclipse/mylyn/tests/integration/ChangeDataDirTest.java:[72] 
	assertEquals(newDataDir, TasksUiPlugin.getTaskDataManager().getDataPath());
	                         ^^^^^^^^^^^^^^^^^^^^^^^^^^^^^^^^^^^^^^^^^^^^^^^^
Discouraged access: The method 'TaskDataManager.getDataPath()' is not API (restriction on classpath entry '/jobs/genie.mylyn/mylyn-3.22.x-release/workspace/org.eclipse.mylyn.tasks/org.eclipse.mylyn.tasks.core/target/classes')
[WARNING] /jobs/genie.mylyn/mylyn-3.22.x-release/workspace/org.eclipse.mylyn/org.eclipse.mylyn.tests/src/org/eclipse/mylyn/tests/integration/ChangeDataDirTest.java:[73] 
	assertEquals(new File(newDataDir, "contexts"), ContextCorePlugin.getContextStore().getContextDirectory());
	                                               ^^^^^^^^^^^^^^^^^
Discouraged access: The type 'ContextCorePlugin' is not API (restriction on classpath entry '/jobs/genie.mylyn/mylyn-3.22.x-release/workspace/org.eclipse.mylyn.context/org.eclipse.mylyn.context.core/target/classes')
[WARNING] /jobs/genie.mylyn/mylyn-3.22.x-release/workspace/org.eclipse.mylyn/org.eclipse.mylyn.tests/src/org/eclipse/mylyn/tests/integration/ChangeDataDirTest.java:[73] 
	assertEquals(new File(newDataDir, "contexts"), ContextCorePlugin.getContextStore().getContextDirectory());
	                                               ^^^^^^^^^^^^^^^^^^^^^^^^^^^^^^^^^^^
Discouraged access: The method 'ContextCorePlugin.getContextStore()' is not API (restriction on classpath entry '/jobs/genie.mylyn/mylyn-3.22.x-release/workspace/org.eclipse.mylyn.context/org.eclipse.mylyn.context.core/target/classes')
[WARNING] /jobs/genie.mylyn/mylyn-3.22.x-release/workspace/org.eclipse.mylyn/org.eclipse.mylyn.tests/src/org/eclipse/mylyn/tests/integration/ChangeDataDirTest.java:[73] 
	assertEquals(new File(newDataDir, "contexts"), ContextCorePlugin.getContextStore().getContextDirectory());
	                                               ^^^^^^^^^^^^^^^^^^^^^^^^^^^^^^^^^^^^^^^^^^^^^^^^^^^^^^^^^
Discouraged access: The method 'LocalContextStore.getContextDirectory()' is not API (restriction on classpath entry '/jobs/genie.mylyn/mylyn-3.22.x-release/workspace/org.eclipse.mylyn.context/org.eclipse.mylyn.context.core/target/classes')
[WARNING] /jobs/genie.mylyn/mylyn-3.22.x-release/workspace/org.eclipse.mylyn/org.eclipse.mylyn.tests/src/org/eclipse/mylyn/tests/integration/ChangeDataDirTest.java:[78] 
	AbstractTask task = TasksUiInternal.createNewLocalTask("label");
	^^^^^^^^^^^^
Discouraged access: The type 'AbstractTask' is not API (restriction on classpath entry '/jobs/genie.mylyn/mylyn-3.22.x-release/workspace/org.eclipse.mylyn.tasks/org.eclipse.mylyn.tasks.core/target/classes')
[WARNING] /jobs/genie.mylyn/mylyn-3.22.x-release/workspace/org.eclipse.mylyn/org.eclipse.mylyn.tests/src/org/eclipse/mylyn/tests/integration/ChangeDataDirTest.java:[78] 
	AbstractTask task = TasksUiInternal.createNewLocalTask("label");
	                    ^^^^^^^^^^^^^^^
Discouraged access: The type 'TasksUiInternal' is not API (restriction on classpath entry '/jobs/genie.mylyn/mylyn-3.22.x-release/workspace/org.eclipse.mylyn.tasks/org.eclipse.mylyn.tasks.ui/target/classes')
[WARNING] /jobs/genie.mylyn/mylyn-3.22.x-release/workspace/org.eclipse.mylyn/org.eclipse.mylyn.tests/src/org/eclipse/mylyn/tests/integration/ChangeDataDirTest.java:[78] 
	AbstractTask task = TasksUiInternal.createNewLocalTask("label");
	                    ^^^^^^^^^^^^^^^^^^^^^^^^^^^^^^^^^^^^^^^^^^^
Discouraged access: The method 'TasksUiInternal.createNewLocalTask(String)' is not API (restriction on classpath entry '/jobs/genie.mylyn/mylyn-3.22.x-release/workspace/org.eclipse.mylyn.tasks/org.eclipse.mylyn.tasks.ui/target/classes')
[WARNING] /jobs/genie.mylyn/mylyn-3.22.x-release/workspace/org.eclipse.mylyn/org.eclipse.mylyn.tests/src/org/eclipse/mylyn/tests/integration/ChangeDataDirTest.java:[79] 
	String handle = task.getHandleIdentifier();
	                ^^^^^^^^^^^^^^^^^^^^^^^^^^
Discouraged access: The method 'AbstractTask.getHandleIdentifier()' is not API (restriction on classpath entry '/jobs/genie.mylyn/mylyn-3.22.x-release/workspace/org.eclipse.mylyn.tasks/org.eclipse.mylyn.tasks.core/target/classes')
[WARNING] /jobs/genie.mylyn/mylyn-3.22.x-release/workspace/org.eclipse.mylyn/org.eclipse.mylyn.tests/src/org/eclipse/mylyn/tests/integration/ChangeDataDirTest.java:[80] 
	taskList.addTask(task, taskList.getUnmatchedContainer(LocalRepositoryConnector.REPOSITORY_URL));
	^^^^^^^^^^^^^^^^^^^^^^^^^^^^^^^^^^^^^^^^^^^^^^^^^^^^^^^^^^^^^^^^^^^^^^^^^^^^^^^^^^^^^^^^^^^^^^^
Discouraged access: The method 'TaskList.addTask(ITask, AbstractTaskContainer)' is not API (restriction on classpath entry '/jobs/genie.mylyn/mylyn-3.22.x-release/workspace/org.eclipse.mylyn.tasks/org.eclipse.mylyn.tasks.core/target/classes')
[WARNING] /jobs/genie.mylyn/mylyn-3.22.x-release/workspace/org.eclipse.mylyn/org.eclipse.mylyn.tests/src/org/eclipse/mylyn/tests/integration/ChangeDataDirTest.java:[80] 
	taskList.addTask(task, taskList.getUnmatchedContainer(LocalRepositoryConnector.REPOSITORY_URL));
	                       ^^^^^^^^^^^^^^^^^^^^^^^^^^^^^^^^^^^^^^^^^^^^^^^^^^^^^^^^^^^^^^^^^^^^^^^
Discouraged access: The method 'TaskList.getUnmatchedContainer(String)' is not API (restriction on classpath entry '/jobs/genie.mylyn/mylyn-3.22.x-release/workspace/org.eclipse.mylyn.tasks/org.eclipse.mylyn.tasks.core/target/classes')
[WARNING] /jobs/genie.mylyn/mylyn-3.22.x-release/workspace/org.eclipse.mylyn/org.eclipse.mylyn.tests/src/org/eclipse/mylyn/tests/integration/ChangeDataDirTest.java:[80] 
	taskList.addTask(task, taskList.getUnmatchedContainer(LocalRepositoryConnector.REPOSITORY_URL));
	                                                      ^^^^^^^^^^^^^^^^^^^^^^^^^^^^^^^^^^^^^^^
Discouraged access: The type 'LocalRepositoryConnector' is not API (restriction on classpath entry '/jobs/genie.mylyn/mylyn-3.22.x-release/workspace/org.eclipse.mylyn.tasks/org.eclipse.mylyn.tasks.core/target/classes')
[WARNING] /jobs/genie.mylyn/mylyn-3.22.x-release/workspace/org.eclipse.mylyn/org.eclipse.mylyn.tests/src/org/eclipse/mylyn/tests/integration/ChangeDataDirTest.java:[80] 
	taskList.addTask(task, taskList.getUnmatchedContainer(LocalRepositoryConnector.REPOSITORY_URL));
	                                                                               ^^^^^^^^^^^^^^
Discouraged access: The field 'LocalRepositoryConnector.REPOSITORY_URL' is not API (restriction on classpath entry '/jobs/genie.mylyn/mylyn-3.22.x-release/workspace/org.eclipse.mylyn.tasks/org.eclipse.mylyn.tasks.core/target/classes')
[WARNING] /jobs/genie.mylyn/mylyn-3.22.x-release/workspace/org.eclipse.mylyn/org.eclipse.mylyn.tests/src/org/eclipse/mylyn/tests/integration/ChangeDataDirTest.java:[82] 
	ITask readTaskBeforeMove = taskList.getTask(handle);
	                           ^^^^^^^^^^^^^^^^^^^^^^^^
Discouraged access: The method 'TaskList.getTask(String)' is not API (restriction on classpath entry '/jobs/genie.mylyn/mylyn-3.22.x-release/workspace/org.eclipse.mylyn.tasks/org.eclipse.mylyn.tasks.core/target/classes')
[WARNING] /jobs/genie.mylyn/mylyn-3.22.x-release/workspace/org.eclipse.mylyn/org.eclipse.mylyn.tests/src/org/eclipse/mylyn/tests/integration/ChangeDataDirTest.java:[84] 
	assertTrue(taskList.getAllTasks().size() > 0);
	           ^^^^^^^^^^^^^^^^^^^^^^
Discouraged access: The method 'TaskList.getAllTasks()' is not API (restriction on classpath entry '/jobs/genie.mylyn/mylyn-3.22.x-release/workspace/org.eclipse.mylyn.tasks/org.eclipse.mylyn.tasks.core/target/classes')
[WARNING] /jobs/genie.mylyn/mylyn-3.22.x-release/workspace/org.eclipse.mylyn/org.eclipse.mylyn.tests/src/org/eclipse/mylyn/tests/integration/ChangeDataDirTest.java:[85] 
	TaskTestUtil.saveNow();
	^^^^^^^^^^^^
Discouraged access: The type 'TaskTestUtil' is not API (restriction on classpath entry '/jobs/genie.mylyn/mylyn-3.22.x-release/workspace/org.eclipse.mylyn.tasks/org.eclipse.mylyn.tasks.tests/target/classes')
[WARNING] /jobs/genie.mylyn/mylyn-3.22.x-release/workspace/org.eclipse.mylyn/org.eclipse.mylyn.tests/src/org/eclipse/mylyn/tests/integration/ChangeDataDirTest.java:[85] 
	TaskTestUtil.saveNow();
	^^^^^^^^^^^^^^^^^^^^^^
Discouraged access: The method 'TaskTestUtil.saveNow()' is not API (restriction on classpath entry '/jobs/genie.mylyn/mylyn-3.22.x-release/workspace/org.eclipse.mylyn.tasks/org.eclipse.mylyn.tasks.tests/target/classes')
[WARNING] /jobs/genie.mylyn/mylyn-3.22.x-release/workspace/org.eclipse.mylyn/org.eclipse.mylyn.tests/src/org/eclipse/mylyn/tests/integration/ChangeDataDirTest.java:[87] 
	CommonTestUtil.copyFolderRecursively(new File(TasksUiPlugin.getDefault().getDataDirectory()), new File(
	^^^^^^^^^^^^^^
Discouraged access: The type 'CommonTestUtil' is not API (restriction on classpath entry '/jobs/genie.mylyn/mylyn-3.22.x-release/workspace/org.eclipse.mylyn.commons/org.eclipse.mylyn.commons.sdk.util/target/classes')
[WARNING] /jobs/genie.mylyn/mylyn-3.22.x-release/workspace/org.eclipse.mylyn/org.eclipse.mylyn.tests/src/org/eclipse/mylyn/tests/integration/ChangeDataDirTest.java:[87] 
	CommonTestUtil.copyFolderRecursively(new File(TasksUiPlugin.getDefault().getDataDirectory()), new File(
				newDataDir));
	^^^^^^^^^^^^^^^^^^^^^^^^^^^^^^^^^^^^^^^^^^^^^^^^^^^^^^^^^^^^^^^^^^^^^^^^^^^^^^^^^^^^^^^^^^^^^^^^^^^^^^^^^^^^^^^^^^^^^^^^
Discouraged access: The method 'CommonTestUtil.copyFolderRecursively(File, File)' is not API (restriction on classpath entry '/jobs/genie.mylyn/mylyn-3.22.x-release/workspace/org.eclipse.mylyn.commons/org.eclipse.mylyn.commons.sdk.util/target/classes')
[WARNING] /jobs/genie.mylyn/mylyn-3.22.x-release/workspace/org.eclipse.mylyn/org.eclipse.mylyn.tests/src/org/eclipse/mylyn/tests/integration/ChangeDataDirTest.java:[87] 
	CommonTestUtil.copyFolderRecursively(new File(TasksUiPlugin.getDefault().getDataDirectory()), new File(
	                                              ^^^^^^^^^^^^^
Discouraged access: The type 'TasksUiPlugin' is not API (restriction on classpath entry '/jobs/genie.mylyn/mylyn-3.22.x-release/workspace/org.eclipse.mylyn.tasks/org.eclipse.mylyn.tasks.ui/target/classes')
[WARNING] /jobs/genie.mylyn/mylyn-3.22.x-release/workspace/org.eclipse.mylyn/org.eclipse.mylyn.tests/src/org/eclipse/mylyn/tests/integration/ChangeDataDirTest.java:[87] 
	CommonTestUtil.copyFolderRecursively(new File(TasksUiPlugin.getDefault().getDataDirectory()), new File(
	                                              ^^^^^^^^^^^^^^^^^^^^^^^^^^
Discouraged access: The method 'TasksUiPlugin.getDefault()' is not API (restriction on classpath entry '/jobs/genie.mylyn/mylyn-3.22.x-release/workspace/org.eclipse.mylyn.tasks/org.eclipse.mylyn.tasks.ui/target/classes')
[WARNING] /jobs/genie.mylyn/mylyn-3.22.x-release/workspace/org.eclipse.mylyn/org.eclipse.mylyn.tests/src/org/eclipse/mylyn/tests/integration/ChangeDataDirTest.java:[87] 
	CommonTestUtil.copyFolderRecursively(new File(TasksUiPlugin.getDefault().getDataDirectory()), new File(
	                                              ^^^^^^^^^^^^^^^^^^^^^^^^^^^^^^^^^^^^^^^^^^^^^
Discouraged access: The method 'TasksUiPlugin.getDataDirectory()' is not API (restriction on classpath entry '/jobs/genie.mylyn/mylyn-3.22.x-release/workspace/org.eclipse.mylyn.tasks/org.eclipse.mylyn.tasks.ui/target/classes')
[WARNING] /jobs/genie.mylyn/mylyn-3.22.x-release/workspace/org.eclipse.mylyn/org.eclipse.mylyn.tests/src/org/eclipse/mylyn/tests/integration/ChangeDataDirTest.java:[89] 
	TasksUiPlugin.getDefault().setDataDirectory(newDataDir);
	^^^^^^^^^^^^^
Discouraged access: The type 'TasksUiPlugin' is not API (restriction on classpath entry '/jobs/genie.mylyn/mylyn-3.22.x-release/workspace/org.eclipse.mylyn.tasks/org.eclipse.mylyn.tasks.ui/target/classes')
[WARNING] /jobs/genie.mylyn/mylyn-3.22.x-release/workspace/org.eclipse.mylyn/org.eclipse.mylyn.tests/src/org/eclipse/mylyn/tests/integration/ChangeDataDirTest.java:[89] 
	TasksUiPlugin.getDefault().setDataDirectory(newDataDir);
	^^^^^^^^^^^^^^^^^^^^^^^^^^
Discouraged access: The method 'TasksUiPlugin.getDefault()' is not API (restriction on classpath entry '/jobs/genie.mylyn/mylyn-3.22.x-release/workspace/org.eclipse.mylyn.tasks/org.eclipse.mylyn.tasks.ui/target/classes')
[WARNING] /jobs/genie.mylyn/mylyn-3.22.x-release/workspace/org.eclipse.mylyn/org.eclipse.mylyn.tests/src/org/eclipse/mylyn/tests/integration/ChangeDataDirTest.java:[89] 
	TasksUiPlugin.getDefault().setDataDirectory(newDataDir);
	^^^^^^^^^^^^^^^^^^^^^^^^^^^^^^^^^^^^^^^^^^^^^^^^^^^^^^^
Discouraged access: The method 'TasksUiPlugin.setDataDirectory(String)' is not API (restriction on classpath entry '/jobs/genie.mylyn/mylyn-3.22.x-release/workspace/org.eclipse.mylyn.tasks/org.eclipse.mylyn.tasks.ui/target/classes')
[WARNING] /jobs/genie.mylyn/mylyn-3.22.x-release/workspace/org.eclipse.mylyn/org.eclipse.mylyn.tests/src/org/eclipse/mylyn/tests/integration/ChangeDataDirTest.java:[90] 
	assertTrue(taskList.getAllTasks().size() > 0);
	           ^^^^^^^^^^^^^^^^^^^^^^
Discouraged access: The method 'TaskList.getAllTasks()' is not API (restriction on classpath entry '/jobs/genie.mylyn/mylyn-3.22.x-release/workspace/org.eclipse.mylyn.tasks/org.eclipse.mylyn.tasks.core/target/classes')
[WARNING] /jobs/genie.mylyn/mylyn-3.22.x-release/workspace/org.eclipse.mylyn/org.eclipse.mylyn.tests/src/org/eclipse/mylyn/tests/integration/ChangeDataDirTest.java:[92] 
	ITask readTaskAfterMove = taskList.getTask(handle);
	                          ^^^^^^^^^^^^^^^^^^^^^^^^
Discouraged access: The method 'TaskList.getTask(String)' is not API (restriction on classpath entry '/jobs/genie.mylyn/mylyn-3.22.x-release/workspace/org.eclipse.mylyn.tasks/org.eclipse.mylyn.tasks.core/target/classes')
[WARNING] /jobs/genie.mylyn/mylyn-3.22.x-release/workspace/org.eclipse.mylyn/org.eclipse.mylyn.tests/src/org/eclipse/mylyn/tests/AllTests.java:[14] 
	import org.eclipse.mylyn.commons.sdk.util.ManagedSuite;
	       ^^^^^^^^^^^^^^^^^^^^^^^^^^^^^^^^^^^^^^^^^^^^^^^
Discouraged access: The type 'ManagedSuite' is not API (restriction on classpath entry '/jobs/genie.mylyn/mylyn-3.22.x-release/workspace/org.eclipse.mylyn.commons/org.eclipse.mylyn.commons.sdk.util/target/classes')
[WARNING] /jobs/genie.mylyn/mylyn-3.22.x-release/workspace/org.eclipse.mylyn/org.eclipse.mylyn.tests/src/org/eclipse/mylyn/tests/AllTests.java:[15] 
	import org.eclipse.mylyn.commons.sdk.util.ManagedTestSuite;
	       ^^^^^^^^^^^^^^^^^^^^^^^^^^^^^^^^^^^^^^^^^^^^^^^^^^^
Discouraged access: The type 'ManagedTestSuite' is not API (restriction on classpath entry '/jobs/genie.mylyn/mylyn-3.22.x-release/workspace/org.eclipse.mylyn.commons/org.eclipse.mylyn.commons.sdk.util/target/classes')
[WARNING] /jobs/genie.mylyn/mylyn-3.22.x-release/workspace/org.eclipse.mylyn/org.eclipse.mylyn.tests/src/org/eclipse/mylyn/tests/AllTests.java:[16] 
	import org.eclipse.mylyn.commons.sdk.util.TestConfiguration;
	       ^^^^^^^^^^^^^^^^^^^^^^^^^^^^^^^^^^^^^^^^^^^^^^^^^^^^
Discouraged access: The type 'TestConfiguration' is not API (restriction on classpath entry '/jobs/genie.mylyn/mylyn-3.22.x-release/workspace/org.eclipse.mylyn.commons/org.eclipse.mylyn.commons.sdk.util/target/classes')
[WARNING] /jobs/genie.mylyn/mylyn-3.22.x-release/workspace/org.eclipse.mylyn/org.eclipse.mylyn.tests/src/org/eclipse/mylyn/tests/AllTests.java:[28] 
	TestConfiguration configuration = ManagedSuite.getTestConfiguration();
	^^^^^^^^^^^^^^^^^
Discouraged access: The type 'TestConfiguration' is not API (restriction on classpath entry '/jobs/genie.mylyn/mylyn-3.22.x-release/workspace/org.eclipse.mylyn.commons/org.eclipse.mylyn.commons.sdk.util/target/classes')
[WARNING] /jobs/genie.mylyn/mylyn-3.22.x-release/workspace/org.eclipse.mylyn/org.eclipse.mylyn.tests/src/org/eclipse/mylyn/tests/AllTests.java:[28] 
	TestConfiguration configuration = ManagedSuite.getTestConfiguration();
	                                  ^^^^^^^^^^^^
Discouraged access: The type 'ManagedSuite' is not API (restriction on classpath entry '/jobs/genie.mylyn/mylyn-3.22.x-release/workspace/org.eclipse.mylyn.commons/org.eclipse.mylyn.commons.sdk.util/target/classes')
[WARNING] /jobs/genie.mylyn/mylyn-3.22.x-release/workspace/org.eclipse.mylyn/org.eclipse.mylyn.tests/src/org/eclipse/mylyn/tests/AllTests.java:[28] 
	TestConfiguration configuration = ManagedSuite.getTestConfiguration();
	                                  ^^^^^^^^^^^^^^^^^^^^^^^^^^^^^^^^^^^
Discouraged access: The method 'ManagedSuite.getTestConfiguration()' is not API (restriction on classpath entry '/jobs/genie.mylyn/mylyn-3.22.x-release/workspace/org.eclipse.mylyn.commons/org.eclipse.mylyn.commons.sdk.util/target/classes')
[WARNING] /jobs/genie.mylyn/mylyn-3.22.x-release/workspace/org.eclipse.mylyn/org.eclipse.mylyn.tests/src/org/eclipse/mylyn/tests/AllTests.java:[30] 
	configuration = new TestConfiguration();
	                ^^^^^^^^^^^^^^^^^^^^^^^
Discouraged access: The constructor 'TestConfiguration()' is not API (restriction on classpath entry '/jobs/genie.mylyn/mylyn-3.22.x-release/workspace/org.eclipse.mylyn.commons/org.eclipse.mylyn.commons.sdk.util/target/classes')
[WARNING] /jobs/genie.mylyn/mylyn-3.22.x-release/workspace/org.eclipse.mylyn/org.eclipse.mylyn.tests/src/org/eclipse/mylyn/tests/AllTests.java:[30] 
	configuration = new TestConfiguration();
	                    ^^^^^^^^^^^^^^^^^
Discouraged access: The type 'TestConfiguration' is not API (restriction on classpath entry '/jobs/genie.mylyn/mylyn-3.22.x-release/workspace/org.eclipse.mylyn.commons/org.eclipse.mylyn.commons.sdk.util/target/classes')
[WARNING] /jobs/genie.mylyn/mylyn-3.22.x-release/workspace/org.eclipse.mylyn/org.eclipse.mylyn.tests/src/org/eclipse/mylyn/tests/AllTests.java:[31] 
	ManagedSuite.setTestConfiguration(configuration);
	^^^^^^^^^^^^
Discouraged access: The type 'ManagedSuite' is not API (restriction on classpath entry '/jobs/genie.mylyn/mylyn-3.22.x-release/workspace/org.eclipse.mylyn.commons/org.eclipse.mylyn.commons.sdk.util/target/classes')
[WARNING] /jobs/genie.mylyn/mylyn-3.22.x-release/workspace/org.eclipse.mylyn/org.eclipse.mylyn.tests/src/org/eclipse/mylyn/tests/AllTests.java:[31] 
	ManagedSuite.setTestConfiguration(configuration);
	^^^^^^^^^^^^^^^^^^^^^^^^^^^^^^^^^^^^^^^^^^^^^^^^
Discouraged access: The method 'ManagedSuite.setTestConfiguration(TestConfiguration)' is not API (restriction on classpath entry '/jobs/genie.mylyn/mylyn-3.22.x-release/workspace/org.eclipse.mylyn.commons/org.eclipse.mylyn.commons.sdk.util/target/classes')
[WARNING] /jobs/genie.mylyn/mylyn-3.22.x-release/workspace/org.eclipse.mylyn/org.eclipse.mylyn.tests/src/org/eclipse/mylyn/tests/AllTests.java:[34] 
	TestSuite suite = new ManagedTestSuite(AllTests.class.getName());
	                  ^^^^^^^^^^^^^^^^^^^^^^^^^^^^^^^^^^^^^^^^^^^^^^
Discouraged access: The constructor 'ManagedTestSuite(String)' is not API (restriction on classpath entry '/jobs/genie.mylyn/mylyn-3.22.x-release/workspace/org.eclipse.mylyn.commons/org.eclipse.mylyn.commons.sdk.util/target/classes')
[WARNING] /jobs/genie.mylyn/mylyn-3.22.x-release/workspace/org.eclipse.mylyn/org.eclipse.mylyn.tests/src/org/eclipse/mylyn/tests/AllTests.java:[34] 
	TestSuite suite = new ManagedTestSuite(AllTests.class.getName());
	                      ^^^^^^^^^^^^^^^^
Discouraged access: The type 'ManagedTestSuite' is not API (restriction on classpath entry '/jobs/genie.mylyn/mylyn-3.22.x-release/workspace/org.eclipse.mylyn.commons/org.eclipse.mylyn.commons.sdk.util/target/classes')
[WARNING] /jobs/genie.mylyn/mylyn-3.22.x-release/workspace/org.eclipse.mylyn/org.eclipse.mylyn.tests/src/org/eclipse/mylyn/tests/AllConnectorTests.java:[14] 
	import org.eclipse.mylyn.bugzilla.rest.core.tests.AllBugzillaRestCoreTests;
	       ^^^^^^^^^^^^^^^^^^^^^^^^^^^^^^^^^^^^^^^^^^^^^^^^^^^^^^^^^^^^^^^^^^^
Discouraged access: The type 'AllBugzillaRestCoreTests' is not API (restriction on classpath entry '/jobs/genie.mylyn/mylyn-3.22.x-release/workspace/org.eclipse.mylyn.tasks/connector-bugzilla-rest/org.eclipse.mylyn.bugzilla.rest.core.tests/target/classes')
[WARNING] /jobs/genie.mylyn/mylyn-3.22.x-release/workspace/org.eclipse.mylyn/org.eclipse.mylyn.tests/src/org/eclipse/mylyn/tests/AllConnectorTests.java:[15] 
	import org.eclipse.mylyn.bugzilla.tests.AllBugzillaTests;
	       ^^^^^^^^^^^^^^^^^^^^^^^^^^^^^^^^^^^^^^^^^^^^^^^^^
Discouraged access: The type 'AllBugzillaTests' is not API (restriction on classpath entry '/jobs/genie.mylyn/mylyn-3.22.x-release/workspace/org.eclipse.mylyn.tasks/org.eclipse.mylyn.bugzilla.tests/target/classes')
[WARNING] /jobs/genie.mylyn/mylyn-3.22.x-release/workspace/org.eclipse.mylyn/org.eclipse.mylyn.tests/src/org/eclipse/mylyn/tests/AllConnectorTests.java:[16] 
	import org.eclipse.mylyn.commons.sdk.util.ManagedSuite;
	       ^^^^^^^^^^^^^^^^^^^^^^^^^^^^^^^^^^^^^^^^^^^^^^^
Discouraged access: The type 'ManagedSuite' is not API (restriction on classpath entry '/jobs/genie.mylyn/mylyn-3.22.x-release/workspace/org.eclipse.mylyn.commons/org.eclipse.mylyn.commons.sdk.util/target/classes')
[WARNING] /jobs/genie.mylyn/mylyn-3.22.x-release/workspace/org.eclipse.mylyn/org.eclipse.mylyn.tests/src/org/eclipse/mylyn/tests/AllConnectorTests.java:[17] 
	import org.eclipse.mylyn.commons.sdk.util.ManagedSuite.TestConfigurationProperty;
	       ^^^^^^^^^^^^^^^^^^^^^^^^^^^^^^^^^^^^^^^^^^^^^^^^^^^^^^^^^^^^^^^^^^^^^^^^^
Discouraged access: The type 'ManagedSuite.TestConfigurationProperty' is not API (restriction on classpath entry '/jobs/genie.mylyn/mylyn-3.22.x-release/workspace/org.eclipse.mylyn.commons/org.eclipse.mylyn.commons.sdk.util/target/classes')
[WARNING] /jobs/genie.mylyn/mylyn-3.22.x-release/workspace/org.eclipse.mylyn/org.eclipse.mylyn.tests/src/org/eclipse/mylyn/tests/AllConnectorTests.java:[18] 
	import org.eclipse.mylyn.gerrit.tests.AllGerritTests;
	       ^^^^^^^^^^^^^^^^^^^^^^^^^^^^^^^^^^^^^^^^^^^^^
Discouraged access: The type 'AllGerritTests' is not API (restriction on classpath entry '/jobs/genie.mylyn/mylyn-3.22.x-release/workspace/org.eclipse.mylyn.reviews/org.eclipse.mylyn.gerrit.tests/target/classes')
[WARNING] /jobs/genie.mylyn/mylyn-3.22.x-release/workspace/org.eclipse.mylyn/org.eclipse.mylyn.tests/src/org/eclipse/mylyn/tests/AllConnectorTests.java:[19] 
	import org.eclipse.mylyn.hudson.tests.AllHudsonTests;
	       ^^^^^^^^^^^^^^^^^^^^^^^^^^^^^^^^^^^^^^^^^^^^^
Discouraged access: The type 'AllHudsonTests' is not API (restriction on classpath entry '/jobs/genie.mylyn/mylyn-3.22.x-release/workspace/org.eclipse.mylyn.builds/org.eclipse.mylyn.hudson.tests/target/classes')
[WARNING] /jobs/genie.mylyn/mylyn-3.22.x-release/workspace/org.eclipse.mylyn/org.eclipse.mylyn.tests/src/org/eclipse/mylyn/tests/AllConnectorTests.java:[20] 
	import org.eclipse.mylyn.tests.util.TestFixture;
	       ^^^^^^^^^^^^^^^^^^^^^^^^^^^^^^^^^^^^^^^^
Discouraged access: The type 'TestFixture' is not API (restriction on classpath entry '/jobs/genie.mylyn/mylyn-3.22.x-release/workspace/org.eclipse.mylyn.tasks/org.eclipse.mylyn.tests.util/target/classes')
[WARNING] /jobs/genie.mylyn/mylyn-3.22.x-release/workspace/org.eclipse.mylyn/org.eclipse.mylyn.tests/src/org/eclipse/mylyn/tests/AllConnectorTests.java:[21] 
	import org.eclipse.mylyn.trac.tests.AllTracTests;
	       ^^^^^^^^^^^^^^^^^^^^^^^^^^^^^^^^^^^^^^^^^
Discouraged access: The type 'AllTracTests' is not API (restriction on classpath entry '/jobs/genie.mylyn/mylyn-3.22.x-release/workspace/org.eclipse.mylyn.tasks/org.eclipse.mylyn.trac.tests/target/classes')
[WARNING] /jobs/genie.mylyn/mylyn-3.22.x-release/workspace/org.eclipse.mylyn/org.eclipse.mylyn.tests/src/org/eclipse/mylyn/tests/AllConnectorTests.java:[30] 
	@RunWith(ManagedSuite.class)
	         ^^^^^^^^^^^^
Discouraged access: The type 'ManagedSuite' is not API (restriction on classpath entry '/jobs/genie.mylyn/mylyn-3.22.x-release/workspace/org.eclipse.mylyn.commons/org.eclipse.mylyn.commons.sdk.util/target/classes')
[WARNING] /jobs/genie.mylyn/mylyn-3.22.x-release/workspace/org.eclipse.mylyn/org.eclipse.mylyn.tests/src/org/eclipse/mylyn/tests/AllConnectorTests.java:[31] 
	@Suite.SuiteClasses({ AllBugzillaRestCoreTests.class, AllBugzillaTests.class, AllHudsonTests.class,
	                      ^^^^^^^^^^^^^^^^^^^^^^^^
Discouraged access: The type 'AllBugzillaRestCoreTests' is not API (restriction on classpath entry '/jobs/genie.mylyn/mylyn-3.22.x-release/workspace/org.eclipse.mylyn.tasks/connector-bugzilla-rest/org.eclipse.mylyn.bugzilla.rest.core.tests/target/classes')
[WARNING] /jobs/genie.mylyn/mylyn-3.22.x-release/workspace/org.eclipse.mylyn/org.eclipse.mylyn.tests/src/org/eclipse/mylyn/tests/AllConnectorTests.java:[31] 
	@Suite.SuiteClasses({ AllBugzillaRestCoreTests.class, AllBugzillaTests.class, AllHudsonTests.class,
	                                                      ^^^^^^^^^^^^^^^^
Discouraged access: The type 'AllBugzillaTests' is not API (restriction on classpath entry '/jobs/genie.mylyn/mylyn-3.22.x-release/workspace/org.eclipse.mylyn.tasks/org.eclipse.mylyn.bugzilla.tests/target/classes')
[WARNING] /jobs/genie.mylyn/mylyn-3.22.x-release/workspace/org.eclipse.mylyn/org.eclipse.mylyn.tests/src/org/eclipse/mylyn/tests/AllConnectorTests.java:[31] 
	@Suite.SuiteClasses({ AllBugzillaRestCoreTests.class, AllBugzillaTests.class, AllHudsonTests.class,
	                                                                              ^^^^^^^^^^^^^^
Discouraged access: The type 'AllHudsonTests' is not API (restriction on classpath entry '/jobs/genie.mylyn/mylyn-3.22.x-release/workspace/org.eclipse.mylyn.builds/org.eclipse.mylyn.hudson.tests/target/classes')
[WARNING] /jobs/genie.mylyn/mylyn-3.22.x-release/workspace/org.eclipse.mylyn/org.eclipse.mylyn.tests/src/org/eclipse/mylyn/tests/AllConnectorTests.java:[32] 
	AllGerritTests.class, AllTracTests.class })
	^^^^^^^^^^^^^^
Discouraged access: The type 'AllGerritTests' is not API (restriction on classpath entry '/jobs/genie.mylyn/mylyn-3.22.x-release/workspace/org.eclipse.mylyn.reviews/org.eclipse.mylyn.gerrit.tests/target/classes')
[WARNING] /jobs/genie.mylyn/mylyn-3.22.x-release/workspace/org.eclipse.mylyn/org.eclipse.mylyn.tests/src/org/eclipse/mylyn/tests/AllConnectorTests.java:[32] 
	AllGerritTests.class, AllTracTests.class })
	                      ^^^^^^^^^^^^
Discouraged access: The type 'AllTracTests' is not API (restriction on classpath entry '/jobs/genie.mylyn/mylyn-3.22.x-release/workspace/org.eclipse.mylyn.tasks/org.eclipse.mylyn.trac.tests/target/classes')
[WARNING] /jobs/genie.mylyn/mylyn-3.22.x-release/workspace/org.eclipse.mylyn/org.eclipse.mylyn.tests/src/org/eclipse/mylyn/tests/AllConnectorTests.java:[33] 
	@TestConfigurationProperty()
	 ^^^^^^^^^^^^^^^^^^^^^^^^^
Discouraged access: The type 'ManagedSuite.TestConfigurationProperty' is not API (restriction on classpath entry '/jobs/genie.mylyn/mylyn-3.22.x-release/workspace/org.eclipse.mylyn.commons/org.eclipse.mylyn.commons.sdk.util/target/classes')
[WARNING] /jobs/genie.mylyn/mylyn-3.22.x-release/workspace/org.eclipse.mylyn/org.eclipse.mylyn.tests/src/org/eclipse/mylyn/tests/AllConnectorTests.java:[36] 
	TestFixture.initializeTasksSettings();
	^^^^^^^^^^^
Discouraged access: The type 'TestFixture' is not API (restriction on classpath entry '/jobs/genie.mylyn/mylyn-3.22.x-release/workspace/org.eclipse.mylyn.tasks/org.eclipse.mylyn.tests.util/target/classes')
[WARNING] /jobs/genie.mylyn/mylyn-3.22.x-release/workspace/org.eclipse.mylyn/org.eclipse.mylyn.tests/src/org/eclipse/mylyn/tests/AllConnectorTests.java:[36] 
	TestFixture.initializeTasksSettings();
	^^^^^^^^^^^^^^^^^^^^^^^^^^^^^^^^^^^^^
Discouraged access: The method 'TestFixture.initializeTasksSettings()' is not API (restriction on classpath entry '/jobs/genie.mylyn/mylyn-3.22.x-release/workspace/org.eclipse.mylyn.tasks/org.eclipse.mylyn.tests.util/target/classes')
182 problems (182 warnings)
[INFO] 
[INFO] --- tycho-source-plugin:1.0.0:plugin-source (attach-source) @ org.eclipse.mylyn.tests ---
[WARNING] bundle localization file /jobs/genie.mylyn/mylyn-3.22.x-release/workspace/org.eclipse.mylyn/org.eclipse.mylyn.tests/plugin.properties not found
[INFO] Building jar: /jobs/genie.mylyn/mylyn-3.22.x-release/workspace/org.eclipse.mylyn/org.eclipse.mylyn.tests/target/org.eclipse.mylyn.tests-3.22.0-SNAPSHOT-sources.jar
[INFO] 
[INFO] --- maven-resources-plugin:2.4.1:testResources (default-testResources) @ org.eclipse.mylyn.tests ---
[INFO] Using 'ISO-8859-1' encoding to copy filtered resources.
[INFO] skip non existing resourceDirectory /jobs/genie.mylyn/mylyn-3.22.x-release/workspace/org.eclipse.mylyn/org.eclipse.mylyn.tests/src/test/resources
[INFO] 
[INFO] --- target-platform-configuration:1.0.0:target-platform (default-target-platform) @ org.eclipse.mylyn.tests ---
[INFO] 
[INFO] --- tycho-packaging-plugin:1.0.0:package-plugin (default-package-plugin) @ org.eclipse.mylyn.tests ---
[INFO] Building jar: /jobs/genie.mylyn/mylyn-3.22.x-release/workspace/org.eclipse.mylyn/org.eclipse.mylyn.tests/target/org.eclipse.mylyn.tests-3.22.0-SNAPSHOT.jar
[INFO] 
[INFO] --- tycho-p2-plugin:1.0.0:p2-metadata-default (default-p2-metadata-default) @ org.eclipse.mylyn.tests ---
[INFO]                                                                         
[INFO] ------------------------------------------------------------------------
[INFO] Building org.eclipse.mylyn.commons 3.22.0-SNAPSHOT
[INFO] ------------------------------------------------------------------------
[INFO] 
[INFO] --- maven-clean-plugin:2.4.1:clean (default-clean) @ org.eclipse.mylyn.commons ---
[INFO] 
[INFO] --- tycho-packaging-plugin:1.0.0:build-qualifier-aggregator (default-build-qualifier-aggregator) @ org.eclipse.mylyn.commons ---
[INFO] The project's OSGi version is 3.22.0.v20170213-1708
[INFO] 
[INFO] --- tycho-packaging-plugin:1.0.0:validate-id (default-validate-id) @ org.eclipse.mylyn.commons ---
[INFO] 
[INFO] --- tycho-packaging-plugin:1.0.0:validate-version (default-validate-version) @ org.eclipse.mylyn.commons ---
[INFO] 
[INFO] --- jacoco-maven-plugin:0.5.6.201201232323:prepare-agent (default) @ org.eclipse.mylyn.commons ---
[INFO] Skipping JaCoCo execution
[INFO] 
[INFO] --- target-platform-configuration:1.0.0:target-platform (default-target-platform) @ org.eclipse.mylyn.commons ---
[INFO] 
[INFO] --- tycho-packaging-plugin:1.0.0:package-feature (default-package-feature) @ org.eclipse.mylyn.commons ---
[INFO] Building jar: /jobs/genie.mylyn/mylyn-3.22.x-release/workspace/org.eclipse.mylyn.commons/org.eclipse.mylyn.commons-feature/target/org.eclipse.mylyn.commons-3.22.0-SNAPSHOT.jar
[INFO] 
[INFO] --- tycho-p2-plugin:1.0.0:p2-metadata-default (default-p2-metadata-default) @ org.eclipse.mylyn.commons ---
[INFO] 
[INFO] --- tycho-p2-plugin:1.0.0:feature-p2-metadata (default-feature-p2-metadata) @ org.eclipse.mylyn.commons ---
[INFO]                                                                         
[INFO] ------------------------------------------------------------------------
[INFO] Building org.eclipse.mylyn.commons.identity 1.14.0-SNAPSHOT
[INFO] ------------------------------------------------------------------------
[INFO] 
[INFO] --- maven-clean-plugin:2.4.1:clean (default-clean) @ org.eclipse.mylyn.commons.identity ---
[INFO] 
[INFO] --- tycho-packaging-plugin:1.0.0:build-qualifier-aggregator (default-build-qualifier-aggregator) @ org.eclipse.mylyn.commons.identity ---
[INFO] The project's OSGi version is 1.14.0.v20161024-1634
[INFO] 
[INFO] --- tycho-packaging-plugin:1.0.0:validate-id (default-validate-id) @ org.eclipse.mylyn.commons.identity ---
[INFO] 
[INFO] --- tycho-packaging-plugin:1.0.0:validate-version (default-validate-version) @ org.eclipse.mylyn.commons.identity ---
[INFO] 
[INFO] --- jacoco-maven-plugin:0.5.6.201201232323:prepare-agent (default) @ org.eclipse.mylyn.commons.identity ---
[INFO] Skipping JaCoCo execution
[INFO] 
[INFO] --- target-platform-configuration:1.0.0:target-platform (default-target-platform) @ org.eclipse.mylyn.commons.identity ---
[INFO] 
[INFO] --- tycho-packaging-plugin:1.0.0:package-feature (default-package-feature) @ org.eclipse.mylyn.commons.identity ---
[INFO] Building jar: /jobs/genie.mylyn/mylyn-3.22.x-release/workspace/org.eclipse.mylyn.commons/org.eclipse.mylyn.commons.identity-feature/target/org.eclipse.mylyn.commons.identity-1.14.0-SNAPSHOT.jar
[INFO] 
[INFO] --- tycho-p2-plugin:1.0.0:p2-metadata-default (default-p2-metadata-default) @ org.eclipse.mylyn.commons.identity ---
[INFO] 
[INFO] --- tycho-p2-plugin:1.0.0:feature-p2-metadata (default-feature-p2-metadata) @ org.eclipse.mylyn.commons.identity ---
[INFO]                                                                         
[INFO] ------------------------------------------------------------------------
[INFO] Building org.eclipse.mylyn.commons.notifications 1.14.0-SNAPSHOT
[INFO] ------------------------------------------------------------------------
[INFO] 
[INFO] --- maven-clean-plugin:2.4.1:clean (default-clean) @ org.eclipse.mylyn.commons.notifications ---
[INFO] 
[INFO] --- tycho-packaging-plugin:1.0.0:build-qualifier-aggregator (default-build-qualifier-aggregator) @ org.eclipse.mylyn.commons.notifications ---
[INFO] The project's OSGi version is 1.14.0.v20161024-1634
[INFO] 
[INFO] --- tycho-packaging-plugin:1.0.0:validate-id (default-validate-id) @ org.eclipse.mylyn.commons.notifications ---
[INFO] 
[INFO] --- tycho-packaging-plugin:1.0.0:validate-version (default-validate-version) @ org.eclipse.mylyn.commons.notifications ---
[INFO] 
[INFO] --- jacoco-maven-plugin:0.5.6.201201232323:prepare-agent (default) @ org.eclipse.mylyn.commons.notifications ---
[INFO] Skipping JaCoCo execution
[INFO] 
[INFO] --- target-platform-configuration:1.0.0:target-platform (default-target-platform) @ org.eclipse.mylyn.commons.notifications ---
[INFO] 
[INFO] --- tycho-packaging-plugin:1.0.0:package-feature (default-package-feature) @ org.eclipse.mylyn.commons.notifications ---
[INFO] Building jar: /jobs/genie.mylyn/mylyn-3.22.x-release/workspace/org.eclipse.mylyn.commons/org.eclipse.mylyn.commons.notifications-feature/target/org.eclipse.mylyn.commons.notifications-1.14.0-SNAPSHOT.jar
[INFO] 
[INFO] --- tycho-p2-plugin:1.0.0:p2-metadata-default (default-p2-metadata-default) @ org.eclipse.mylyn.commons.notifications ---
[INFO] 
[INFO] --- tycho-p2-plugin:1.0.0:feature-p2-metadata (default-feature-p2-metadata) @ org.eclipse.mylyn.commons.notifications ---
[INFO]                                                                         
[INFO] ------------------------------------------------------------------------
[INFO] Building org.eclipse.mylyn.commons.repositories 1.14.0-SNAPSHOT
[INFO] ------------------------------------------------------------------------
[INFO] 
[INFO] --- maven-clean-plugin:2.4.1:clean (default-clean) @ org.eclipse.mylyn.commons.repositories ---
[INFO] 
[INFO] --- tycho-packaging-plugin:1.0.0:build-qualifier-aggregator (default-build-qualifier-aggregator) @ org.eclipse.mylyn.commons.repositories ---
[INFO] The project's OSGi version is 1.14.0.v20161024-1634
[INFO] 
[INFO] --- tycho-packaging-plugin:1.0.0:validate-id (default-validate-id) @ org.eclipse.mylyn.commons.repositories ---
[INFO] 
[INFO] --- tycho-packaging-plugin:1.0.0:validate-version (default-validate-version) @ org.eclipse.mylyn.commons.repositories ---
[INFO] 
[INFO] --- jacoco-maven-plugin:0.5.6.201201232323:prepare-agent (default) @ org.eclipse.mylyn.commons.repositories ---
[INFO] Skipping JaCoCo execution
[INFO] 
[INFO] --- target-platform-configuration:1.0.0:target-platform (default-target-platform) @ org.eclipse.mylyn.commons.repositories ---
[INFO] 
[INFO] --- tycho-packaging-plugin:1.0.0:package-feature (default-package-feature) @ org.eclipse.mylyn.commons.repositories ---
[INFO] Building jar: /jobs/genie.mylyn/mylyn-3.22.x-release/workspace/org.eclipse.mylyn.commons/org.eclipse.mylyn.commons.repositories-feature/target/org.eclipse.mylyn.commons.repositories-1.14.0-SNAPSHOT.jar
[INFO] 
[INFO] --- tycho-p2-plugin:1.0.0:p2-metadata-default (default-p2-metadata-default) @ org.eclipse.mylyn.commons.repositories ---
[INFO] 
[INFO] --- tycho-p2-plugin:1.0.0:feature-p2-metadata (default-feature-p2-metadata) @ org.eclipse.mylyn.commons.repositories ---
[INFO]                                                                         
[INFO] ------------------------------------------------------------------------
[INFO] Building org.eclipse.mylyn.discovery 3.22.0-SNAPSHOT
[INFO] ------------------------------------------------------------------------
[INFO] 
[INFO] --- maven-clean-plugin:2.4.1:clean (default-clean) @ org.eclipse.mylyn.discovery ---
[INFO] 
[INFO] --- tycho-packaging-plugin:1.0.0:build-qualifier-aggregator (default-build-qualifier-aggregator) @ org.eclipse.mylyn.discovery ---
[INFO] The project's OSGi version is 3.22.0.v20161006-2037
[INFO] 
[INFO] --- tycho-packaging-plugin:1.0.0:validate-id (default-validate-id) @ org.eclipse.mylyn.discovery ---
[INFO] 
[INFO] --- tycho-packaging-plugin:1.0.0:validate-version (default-validate-version) @ org.eclipse.mylyn.discovery ---
[INFO] 
[INFO] --- jacoco-maven-plugin:0.5.6.201201232323:prepare-agent (default) @ org.eclipse.mylyn.discovery ---
[INFO] Skipping JaCoCo execution
[INFO] 
[INFO] --- target-platform-configuration:1.0.0:target-platform (default-target-platform) @ org.eclipse.mylyn.discovery ---
[INFO] 
[INFO] --- tycho-packaging-plugin:1.0.0:package-feature (default-package-feature) @ org.eclipse.mylyn.discovery ---
[INFO] Building jar: /jobs/genie.mylyn/mylyn-3.22.x-release/workspace/org.eclipse.mylyn.commons/org.eclipse.mylyn.discovery-feature/target/org.eclipse.mylyn.discovery-3.22.0-SNAPSHOT.jar
[INFO] 
[INFO] --- tycho-p2-plugin:1.0.0:p2-metadata-default (default-p2-metadata-default) @ org.eclipse.mylyn.discovery ---
[INFO] 
[INFO] --- tycho-p2-plugin:1.0.0:feature-p2-metadata (default-feature-p2-metadata) @ org.eclipse.mylyn.discovery ---
[INFO]                                                                         
[INFO] ------------------------------------------------------------------------
[INFO] Building org.eclipse.mylyn.monitor 3.22.0-SNAPSHOT
[INFO] ------------------------------------------------------------------------
[INFO] 
[INFO] --- maven-clean-plugin:2.4.1:clean (default-clean) @ org.eclipse.mylyn.monitor ---
[INFO] 
[INFO] --- tycho-packaging-plugin:1.0.0:build-qualifier-aggregator (default-build-qualifier-aggregator) @ org.eclipse.mylyn.monitor ---
[INFO] The project's OSGi version is 3.22.0.v20161006-2037
[INFO] 
[INFO] --- tycho-packaging-plugin:1.0.0:validate-id (default-validate-id) @ org.eclipse.mylyn.monitor ---
[INFO] 
[INFO] --- tycho-packaging-plugin:1.0.0:validate-version (default-validate-version) @ org.eclipse.mylyn.monitor ---
[INFO] 
[INFO] --- jacoco-maven-plugin:0.5.6.201201232323:prepare-agent (default) @ org.eclipse.mylyn.monitor ---
[INFO] Skipping JaCoCo execution
[INFO] 
[INFO] --- target-platform-configuration:1.0.0:target-platform (default-target-platform) @ org.eclipse.mylyn.monitor ---
[INFO] 
[INFO] --- tycho-packaging-plugin:1.0.0:package-feature (default-package-feature) @ org.eclipse.mylyn.monitor ---
[INFO] Building jar: /jobs/genie.mylyn/mylyn-3.22.x-release/workspace/org.eclipse.mylyn.commons/org.eclipse.mylyn.monitor-feature/target/org.eclipse.mylyn.monitor-3.22.0-SNAPSHOT.jar
[INFO] 
[INFO] --- tycho-p2-plugin:1.0.0:p2-metadata-default (default-p2-metadata-default) @ org.eclipse.mylyn.monitor ---
[INFO] 
[INFO] --- tycho-p2-plugin:1.0.0:feature-p2-metadata (default-feature-p2-metadata) @ org.eclipse.mylyn.monitor ---
[INFO]                                                                         
[INFO] ------------------------------------------------------------------------
[INFO] Building org.eclipse.mylyn_feature 3.22.0-SNAPSHOT
[INFO] ------------------------------------------------------------------------
[INFO] 
[INFO] --- maven-clean-plugin:2.4.1:clean (default-clean) @ org.eclipse.mylyn_feature ---
[INFO] 
[INFO] --- tycho-packaging-plugin:1.0.0:build-qualifier-aggregator (default-build-qualifier-aggregator) @ org.eclipse.mylyn_feature ---
[INFO] The project's OSGi version is 3.22.0.v20170214-1916
[INFO] 
[INFO] --- tycho-packaging-plugin:1.0.0:validate-id (default-validate-id) @ org.eclipse.mylyn_feature ---
[INFO] 
[INFO] --- tycho-packaging-plugin:1.0.0:validate-version (default-validate-version) @ org.eclipse.mylyn_feature ---
[INFO] 
[INFO] --- jacoco-maven-plugin:0.5.6.201201232323:prepare-agent (default) @ org.eclipse.mylyn_feature ---
[INFO] Skipping JaCoCo execution
[INFO] 
[INFO] --- target-platform-configuration:1.0.0:target-platform (default-target-platform) @ org.eclipse.mylyn_feature ---
[INFO] 
[INFO] --- tycho-packaging-plugin:1.0.0:package-feature (default-package-feature) @ org.eclipse.mylyn_feature ---
[INFO] Building jar: /jobs/genie.mylyn/mylyn-3.22.x-release/workspace/org.eclipse.mylyn.tasks/org.eclipse.mylyn-feature/target/org.eclipse.mylyn_feature-3.22.0-SNAPSHOT.jar
[INFO] 
[INFO] --- tycho-p2-plugin:1.0.0:p2-metadata-default (default-p2-metadata-default) @ org.eclipse.mylyn_feature ---
[INFO] 
[INFO] --- tycho-p2-plugin:1.0.0:feature-p2-metadata (default-feature-p2-metadata) @ org.eclipse.mylyn_feature ---
[INFO]                                                                         
[INFO] ------------------------------------------------------------------------
[INFO] Building org.eclipse.mylyn.context_feature 3.22.0-SNAPSHOT
[INFO] ------------------------------------------------------------------------
[INFO] 
[INFO] --- maven-clean-plugin:2.4.1:clean (default-clean) @ org.eclipse.mylyn.context_feature ---
[INFO] 
[INFO] --- tycho-packaging-plugin:1.0.0:build-qualifier-aggregator (default-build-qualifier-aggregator) @ org.eclipse.mylyn.context_feature ---
[INFO] The project's OSGi version is 3.22.0.v20170207-0918
[INFO] 
[INFO] --- tycho-packaging-plugin:1.0.0:validate-id (default-validate-id) @ org.eclipse.mylyn.context_feature ---
[INFO] 
[INFO] --- tycho-packaging-plugin:1.0.0:validate-version (default-validate-version) @ org.eclipse.mylyn.context_feature ---
[INFO] 
[INFO] --- jacoco-maven-plugin:0.5.6.201201232323:prepare-agent (default) @ org.eclipse.mylyn.context_feature ---
[INFO] Skipping JaCoCo execution
[INFO] 
[INFO] --- target-platform-configuration:1.0.0:target-platform (default-target-platform) @ org.eclipse.mylyn.context_feature ---
[INFO] 
[INFO] --- tycho-packaging-plugin:1.0.0:package-feature (default-package-feature) @ org.eclipse.mylyn.context_feature ---
[INFO] Building jar: /jobs/genie.mylyn/mylyn-3.22.x-release/workspace/org.eclipse.mylyn.context/org.eclipse.mylyn.context-feature/target/org.eclipse.mylyn.context_feature-3.22.0-SNAPSHOT.jar
[INFO] 
[INFO] --- tycho-p2-plugin:1.0.0:p2-metadata-default (default-p2-metadata-default) @ org.eclipse.mylyn.context_feature ---
[INFO] 
[INFO] --- tycho-p2-plugin:1.0.0:feature-p2-metadata (default-feature-p2-metadata) @ org.eclipse.mylyn.context_feature ---
[INFO]                                                                         
[INFO] ------------------------------------------------------------------------
[INFO] Building org.eclipse.cdt.mylyn 5.18.0-SNAPSHOT
[INFO] ------------------------------------------------------------------------
[INFO] 
[INFO] --- maven-clean-plugin:2.4.1:clean (default-clean) @ org.eclipse.cdt.mylyn ---
[INFO] 
[INFO] --- tycho-packaging-plugin:1.0.0:build-qualifier-aggregator (default-build-qualifier-aggregator) @ org.eclipse.cdt.mylyn ---
[INFO] The project's OSGi version is 5.18.0.v20161011-2234
[INFO] 
[INFO] --- tycho-packaging-plugin:1.0.0:validate-id (default-validate-id) @ org.eclipse.cdt.mylyn ---
[INFO] 
[INFO] --- tycho-packaging-plugin:1.0.0:validate-version (default-validate-version) @ org.eclipse.cdt.mylyn ---
[INFO] 
[INFO] --- jacoco-maven-plugin:0.5.6.201201232323:prepare-agent (default) @ org.eclipse.cdt.mylyn ---
[INFO] Skipping JaCoCo execution
[INFO] 
[INFO] --- target-platform-configuration:1.0.0:target-platform (default-target-platform) @ org.eclipse.cdt.mylyn ---
[INFO] 
[INFO] --- tycho-packaging-plugin:1.0.0:package-feature (default-package-feature) @ org.eclipse.cdt.mylyn ---
[INFO] Building jar: /jobs/genie.mylyn/mylyn-3.22.x-release/workspace/org.eclipse.mylyn.context/org.eclipse.mylyn.cdt-feature/target/org.eclipse.cdt.mylyn-5.18.0-SNAPSHOT.jar
[INFO] 
[INFO] --- tycho-p2-plugin:1.0.0:p2-metadata-default (default-p2-metadata-default) @ org.eclipse.cdt.mylyn ---
[INFO] 
[INFO] --- tycho-p2-plugin:1.0.0:feature-p2-metadata (default-feature-p2-metadata) @ org.eclipse.cdt.mylyn ---
[INFO]                                                                         
[INFO] ------------------------------------------------------------------------
[INFO] Building org.eclipse.mylyn.bugzilla_feature 3.22.0-SNAPSHOT
[INFO] ------------------------------------------------------------------------
[INFO] 
[INFO] --- maven-clean-plugin:2.4.1:clean (default-clean) @ org.eclipse.mylyn.bugzilla_feature ---
[INFO] 
[INFO] --- tycho-packaging-plugin:1.0.0:build-qualifier-aggregator (default-build-qualifier-aggregator) @ org.eclipse.mylyn.bugzilla_feature ---
[INFO] The project's OSGi version is 3.22.0.v20161122-1702
[INFO] 
[INFO] --- tycho-packaging-plugin:1.0.0:validate-id (default-validate-id) @ org.eclipse.mylyn.bugzilla_feature ---
[INFO] 
[INFO] --- tycho-packaging-plugin:1.0.0:validate-version (default-validate-version) @ org.eclipse.mylyn.bugzilla_feature ---
[INFO] 
[INFO] --- jacoco-maven-plugin:0.5.6.201201232323:prepare-agent (default) @ org.eclipse.mylyn.bugzilla_feature ---
[INFO] Skipping JaCoCo execution
[INFO] 
[INFO] --- target-platform-configuration:1.0.0:target-platform (default-target-platform) @ org.eclipse.mylyn.bugzilla_feature ---
[INFO] 
[INFO] --- tycho-packaging-plugin:1.0.0:package-feature (default-package-feature) @ org.eclipse.mylyn.bugzilla_feature ---
[INFO] Building jar: /jobs/genie.mylyn/mylyn-3.22.x-release/workspace/org.eclipse.mylyn.tasks/org.eclipse.mylyn.bugzilla-feature/target/org.eclipse.mylyn.bugzilla_feature-3.22.0-SNAPSHOT.jar
[INFO] 
[INFO] --- tycho-p2-plugin:1.0.0:p2-metadata-default (default-p2-metadata-default) @ org.eclipse.mylyn.bugzilla_feature ---
[INFO] 
[INFO] --- tycho-p2-plugin:1.0.0:feature-p2-metadata (default-feature-p2-metadata) @ org.eclipse.mylyn.bugzilla_feature ---
[INFO]                                                                         
[INFO] ------------------------------------------------------------------------
[INFO] Building org.eclipse.mylyn.cvs.core 1.14.0-SNAPSHOT
[INFO] ------------------------------------------------------------------------
[INFO] 
[INFO] --- maven-clean-plugin:2.4.1:clean (default-clean) @ org.eclipse.mylyn.cvs.core ---
[INFO] 
[INFO] --- tycho-packaging-plugin:1.0.0:build-qualifier (default-build-qualifier) @ org.eclipse.mylyn.cvs.core ---
[INFO] The project's OSGi version is 1.14.0.v20161011-2140
[INFO] 
[INFO] --- tycho-packaging-plugin:1.0.0:validate-id (default-validate-id) @ org.eclipse.mylyn.cvs.core ---
[INFO] 
[INFO] --- tycho-packaging-plugin:1.0.0:validate-version (default-validate-version) @ org.eclipse.mylyn.cvs.core ---
[INFO] 
[INFO] --- jacoco-maven-plugin:0.5.6.201201232323:prepare-agent (default) @ org.eclipse.mylyn.cvs.core ---
[INFO] Skipping JaCoCo execution
[INFO] 
[INFO] --- maven-resources-plugin:2.4.1:resources (default-resources) @ org.eclipse.mylyn.cvs.core ---
[INFO] Using 'ISO-8859-1' encoding to copy filtered resources.
[INFO] skip non existing resourceDirectory /jobs/genie.mylyn/mylyn-3.22.x-release/workspace/org.eclipse.mylyn.versions/org.eclipse.mylyn.cvs.core/src/main/resources
[INFO] 
[INFO] --- tycho-compiler-plugin:1.0.0:compile (default-compile) @ org.eclipse.mylyn.cvs.core ---
[INFO] Compiling 3 source files to /jobs/genie.mylyn/mylyn-3.22.x-release/workspace/org.eclipse.mylyn.versions/org.eclipse.mylyn.cvs.core/target/classes
[WARNING] /jobs/genie.mylyn/mylyn-3.22.x-release/workspace/org.eclipse.mylyn.versions/org.eclipse.mylyn.cvs.core/src/org/eclipse/mylyn/internal/ccvs/core/CvsArtifact.java:[15] 
	import org.eclipse.mylyn.versions.core.spi.ScmResourceArtifact;
	       ^^^^^^^^^^^^^^^^^^^^^^^^^^^^^^^^^^^^^^^^^^^^^^^^^^^^^^^
Discouraged access: The type 'ScmResourceArtifact' is not API (restriction on classpath entry '/jobs/genie.mylyn/mylyn-3.22.x-release/workspace/org.eclipse.mylyn.versions/org.eclipse.mylyn.versions.core/target/classes')
[WARNING] /jobs/genie.mylyn/mylyn-3.22.x-release/workspace/org.eclipse.mylyn.versions/org.eclipse.mylyn.cvs.core/src/org/eclipse/mylyn/internal/ccvs/core/CvsArtifact.java:[20] 
	public class CvsArtifact extends ScmResourceArtifact {
	                                 ^^^^^^^^^^^^^^^^^^^
Discouraged access: The type 'ScmResourceArtifact' is not API (restriction on classpath entry '/jobs/genie.mylyn/mylyn-3.22.x-release/workspace/org.eclipse.mylyn.versions/org.eclipse.mylyn.versions.core/target/classes')
[WARNING] /jobs/genie.mylyn/mylyn-3.22.x-release/workspace/org.eclipse.mylyn.versions/org.eclipse.mylyn.cvs.core/src/org/eclipse/mylyn/internal/ccvs/core/CvsArtifact.java:[23] 
	super(connector, resource, id);
	^^^^^^^^^^^^^^^^^^^^^^^^^^^^^^^
Discouraged access: The constructor 'ScmResourceArtifact(ScmConnector, IResource, String)' is not API (restriction on classpath entry '/jobs/genie.mylyn/mylyn-3.22.x-release/workspace/org.eclipse.mylyn.versions/org.eclipse.mylyn.versions.core/target/classes')
3 problems (3 warnings)
[INFO] 
[INFO] --- tycho-source-plugin:1.0.0:plugin-source (attach-source) @ org.eclipse.mylyn.cvs.core ---
[INFO] Building jar: /jobs/genie.mylyn/mylyn-3.22.x-release/workspace/org.eclipse.mylyn.versions/org.eclipse.mylyn.cvs.core/target/org.eclipse.mylyn.cvs.core-1.14.0-SNAPSHOT-sources.jar
[INFO] 
[INFO] --- maven-resources-plugin:2.4.1:testResources (default-testResources) @ org.eclipse.mylyn.cvs.core ---
[INFO] Using 'ISO-8859-1' encoding to copy filtered resources.
[INFO] skip non existing resourceDirectory /jobs/genie.mylyn/mylyn-3.22.x-release/workspace/org.eclipse.mylyn.versions/org.eclipse.mylyn.cvs.core/src/test/resources
[INFO] 
[INFO] --- target-platform-configuration:1.0.0:target-platform (default-target-platform) @ org.eclipse.mylyn.cvs.core ---
[INFO] 
[INFO] --- tycho-packaging-plugin:1.0.0:package-plugin (default-package-plugin) @ org.eclipse.mylyn.cvs.core ---
[INFO] Building jar: /jobs/genie.mylyn/mylyn-3.22.x-release/workspace/org.eclipse.mylyn.versions/org.eclipse.mylyn.cvs.core/target/org.eclipse.mylyn.cvs.core-1.14.0-SNAPSHOT.jar
[INFO] 
[INFO] --- tycho-p2-plugin:1.0.0:p2-metadata-default (default-p2-metadata-default) @ org.eclipse.mylyn.cvs.core ---
[INFO]                                                                         
[INFO] ------------------------------------------------------------------------
[INFO] Building org.eclipse.mylyn.versions 1.14.0-SNAPSHOT
[INFO] ------------------------------------------------------------------------
[INFO] 
[INFO] --- maven-clean-plugin:2.4.1:clean (default-clean) @ org.eclipse.mylyn.versions ---
[INFO] 
[INFO] --- tycho-packaging-plugin:1.0.0:build-qualifier-aggregator (default-build-qualifier-aggregator) @ org.eclipse.mylyn.versions ---
[INFO] The project's OSGi version is 1.14.0.v20161011-2140
[INFO] 
[INFO] --- tycho-packaging-plugin:1.0.0:validate-id (default-validate-id) @ org.eclipse.mylyn.versions ---
[INFO] 
[INFO] --- tycho-packaging-plugin:1.0.0:validate-version (default-validate-version) @ org.eclipse.mylyn.versions ---
[INFO] 
[INFO] --- jacoco-maven-plugin:0.5.6.201201232323:prepare-agent (default) @ org.eclipse.mylyn.versions ---
[INFO] Skipping JaCoCo execution
[INFO] 
[INFO] --- target-platform-configuration:1.0.0:target-platform (default-target-platform) @ org.eclipse.mylyn.versions ---
[INFO] 
[INFO] --- tycho-packaging-plugin:1.0.0:package-feature (default-package-feature) @ org.eclipse.mylyn.versions ---
[INFO] Building jar: /jobs/genie.mylyn/mylyn-3.22.x-release/workspace/org.eclipse.mylyn.versions/org.eclipse.mylyn.versions-feature/target/org.eclipse.mylyn.versions-1.14.0-SNAPSHOT.jar
[INFO] 
[INFO] --- tycho-p2-plugin:1.0.0:p2-metadata-default (default-p2-metadata-default) @ org.eclipse.mylyn.versions ---
[INFO] 
[INFO] --- tycho-p2-plugin:1.0.0:feature-p2-metadata (default-feature-p2-metadata) @ org.eclipse.mylyn.versions ---
[INFO]                                                                         
[INFO] ------------------------------------------------------------------------
[INFO] Building org.eclipse.mylyn.cvs 1.14.0-SNAPSHOT
[INFO] ------------------------------------------------------------------------
[INFO] 
[INFO] --- maven-clean-plugin:2.4.1:clean (default-clean) @ org.eclipse.mylyn.cvs ---
[INFO] 
[INFO] --- tycho-packaging-plugin:1.0.0:build-qualifier-aggregator (default-build-qualifier-aggregator) @ org.eclipse.mylyn.cvs ---
[INFO] The project's OSGi version is 1.14.0.v20161011-2140
[INFO] 
[INFO] --- tycho-packaging-plugin:1.0.0:validate-id (default-validate-id) @ org.eclipse.mylyn.cvs ---
[INFO] 
[INFO] --- tycho-packaging-plugin:1.0.0:validate-version (default-validate-version) @ org.eclipse.mylyn.cvs ---
[INFO] 
[INFO] --- jacoco-maven-plugin:0.5.6.201201232323:prepare-agent (default) @ org.eclipse.mylyn.cvs ---
[INFO] Skipping JaCoCo execution
[INFO] 
[INFO] --- target-platform-configuration:1.0.0:target-platform (default-target-platform) @ org.eclipse.mylyn.cvs ---
[INFO] 
[INFO] --- tycho-packaging-plugin:1.0.0:package-feature (default-package-feature) @ org.eclipse.mylyn.cvs ---
[INFO] Building jar: /jobs/genie.mylyn/mylyn-3.22.x-release/workspace/org.eclipse.mylyn.versions/org.eclipse.mylyn.cvs-feature/target/org.eclipse.mylyn.cvs-1.14.0-SNAPSHOT.jar
[INFO] 
[INFO] --- tycho-p2-plugin:1.0.0:p2-metadata-default (default-p2-metadata-default) @ org.eclipse.mylyn.cvs ---
[INFO] 
[INFO] --- tycho-p2-plugin:1.0.0:feature-p2-metadata (default-feature-p2-metadata) @ org.eclipse.mylyn.cvs ---
[INFO]                                                                         
[INFO] ------------------------------------------------------------------------
[INFO] Building org.eclipse.mylyn.reviews.feature 2.13.0-SNAPSHOT
[INFO] ------------------------------------------------------------------------
[INFO] 
[INFO] --- maven-clean-plugin:2.4.1:clean (default-clean) @ org.eclipse.mylyn.reviews.feature ---
[INFO] 
[INFO] --- tycho-packaging-plugin:1.0.0:build-qualifier-aggregator (default-build-qualifier-aggregator) @ org.eclipse.mylyn.reviews.feature ---
[INFO] The project's OSGi version is 2.13.0.v20170216-2314
[INFO] 
[INFO] --- tycho-packaging-plugin:1.0.0:validate-id (default-validate-id) @ org.eclipse.mylyn.reviews.feature ---
[INFO] 
[INFO] --- tycho-packaging-plugin:1.0.0:validate-version (default-validate-version) @ org.eclipse.mylyn.reviews.feature ---
[INFO] 
[INFO] --- jacoco-maven-plugin:0.5.6.201201232323:prepare-agent (default) @ org.eclipse.mylyn.reviews.feature ---
[INFO] Skipping JaCoCo execution
[INFO] 
[INFO] --- target-platform-configuration:1.0.0:target-platform (default-target-platform) @ org.eclipse.mylyn.reviews.feature ---
[INFO] 
[INFO] --- tycho-packaging-plugin:1.0.0:package-feature (default-package-feature) @ org.eclipse.mylyn.reviews.feature ---
[INFO] Building jar: /jobs/genie.mylyn/mylyn-3.22.x-release/workspace/org.eclipse.mylyn.reviews/org.eclipse.mylyn.reviews.feature/target/org.eclipse.mylyn.reviews.feature-2.13.0-SNAPSHOT.jar
[INFO] 
[INFO] --- tycho-p2-plugin:1.0.0:p2-metadata-default (default-p2-metadata-default) @ org.eclipse.mylyn.reviews.feature ---
[INFO] 
[INFO] --- tycho-p2-plugin:1.0.0:feature-p2-metadata (default-feature-p2-metadata) @ org.eclipse.mylyn.reviews.feature ---
[INFO]                                                                         
[INFO] ------------------------------------------------------------------------
[INFO] Building org.eclipse.mylyn.gerrit.feature 2.13.0-SNAPSHOT
[INFO] ------------------------------------------------------------------------
[INFO] 
[INFO] --- maven-clean-plugin:2.4.1:clean (default-clean) @ org.eclipse.mylyn.gerrit.feature ---
[INFO] 
[INFO] --- tycho-packaging-plugin:1.0.0:build-qualifier-aggregator (default-build-qualifier-aggregator) @ org.eclipse.mylyn.gerrit.feature ---
[INFO] The project's OSGi version is 2.13.0.v20170215-1904
[INFO] 
[INFO] --- tycho-packaging-plugin:1.0.0:validate-id (default-validate-id) @ org.eclipse.mylyn.gerrit.feature ---
[INFO] 
[INFO] --- tycho-packaging-plugin:1.0.0:validate-version (default-validate-version) @ org.eclipse.mylyn.gerrit.feature ---
[INFO] 
[INFO] --- jacoco-maven-plugin:0.5.6.201201232323:prepare-agent (default) @ org.eclipse.mylyn.gerrit.feature ---
[INFO] Skipping JaCoCo execution
[INFO] 
[INFO] --- target-platform-configuration:1.0.0:target-platform (default-target-platform) @ org.eclipse.mylyn.gerrit.feature ---
[INFO] 
[INFO] --- tycho-packaging-plugin:1.0.0:package-feature (default-package-feature) @ org.eclipse.mylyn.gerrit.feature ---
[INFO] ------------------------------------------------------------------------
[INFO] Reactor Summary:
[INFO] 
[INFO] org.eclipse.mylyn-parent .......................... SUCCESS [23.208s]
[INFO] Mylyn Releng ...................................... SUCCESS [0.008s]
[INFO] org.eclipse.mylyn.discovery ....................... SUCCESS [8.730s]
[INFO] Mylyn Commons ..................................... SUCCESS [0.045s]
[INFO] org.eclipse.mylyn.commons.core .................... SUCCESS [11.129s]
[INFO] org.eclipse.mylyn.monitor.core .................... SUCCESS [0.530s]
[INFO] Mylyn Context ..................................... SUCCESS [0.043s]
[INFO] org.eclipse.mylyn.context.core .................... SUCCESS [0.627s]
[INFO] org.eclipse.mylyn.commons.screenshots ............. SUCCESS [0.380s]
[INFO] org.eclipse.mylyn.commons.ui ...................... SUCCESS [0.825s]
[INFO] org.eclipse.mylyn.commons.workbench ............... SUCCESS [0.613s]
[INFO] org.eclipse.mylyn.monitor.ui ...................... SUCCESS [0.339s]
[INFO] org.eclipse.mylyn.context.ui ...................... SUCCESS [0.534s]
[INFO] org.eclipse.cdt.mylyn.ui .......................... SUCCESS [0.494s]
[INFO] org.eclipse.mylyn.commons.net ..................... SUCCESS [0.275s]
[INFO] org.eclipse.mylyn.commons.repositories.core ....... SUCCESS [0.230s]
[INFO] Mylyn Tasks ....................................... SUCCESS [0.041s]
[INFO] org.eclipse.mylyn.tasks.core ...................... SUCCESS [1.299s]
[INFO] org.eclipse.mylyn.commons.xmlrpc .................. SUCCESS [0.249s]
[INFO] org.eclipse.mylyn.bugzilla.core ................... SUCCESS [0.731s]
[INFO] org.eclipse.mylyn.commons.repositories.http.core .. SUCCESS [0.261s]
[INFO] org.eclipse.mylyn.tasks.connector-bugzilla-rest ... SUCCESS [0.043s]
[INFO] org.eclipse.mylyn.bugzilla.rest.core .............. SUCCESS [0.643s]
[INFO] org.eclipse.mylyn.commons.sdk.util ................ SUCCESS [0.422s]
[INFO] org.eclipse.mylyn.bugzilla.rest.core.tests ........ SUCCESS [0.529s]
[INFO] org.eclipse.mylyn.commons.identity.core ........... SUCCESS [0.209s]
[INFO] org.eclipse.mylyn.commons.notifications.core ...... SUCCESS [0.168s]
[INFO] org.eclipse.mylyn.commons.notifications.feed ...... SUCCESS [0.416s]
[INFO] org.eclipse.mylyn.commons.notifications.ui ........ SUCCESS [0.314s]
[INFO] org.eclipse.mylyn.commons.repositories.ui ......... SUCCESS [0.457s]
[INFO] org.eclipse.mylyn.discovery.core .................. SUCCESS [0.334s]
[INFO] org.eclipse.mylyn.discovery.ui .................... SUCCESS [0.399s]
[INFO] org.eclipse.mylyn.tasks.ui ........................ SUCCESS [2.510s]
[INFO] org.eclipse.mylyn.bugzilla.ui ..................... SUCCESS [0.731s]
[INFO] org.eclipse.mylyn.tests.util ...................... SUCCESS [0.403s]
[INFO] org.eclipse.mylyn.bugzilla.tests .................. SUCCESS [8.382s]
[INFO] Mylyn Builds ...................................... SUCCESS [0.044s]
[INFO] org.eclipse.mylyn.builds.core ..................... SUCCESS [0.573s]
[INFO] Mylyn Versions .................................... SUCCESS [0.045s]
[INFO] org.eclipse.mylyn.versions.core ................... SUCCESS [3.800s]
[INFO] org.eclipse.mylyn.resources.ui .................... SUCCESS [0.389s]
[INFO] org.eclipse.mylyn.team.ui ......................... SUCCESS [1.795s]
[INFO] org.eclipse.mylyn.versions.ui ..................... SUCCESS [0.431s]
[INFO] org.eclipse.mylyn.builds.ui ....................... SUCCESS [0.791s]
[INFO] org.eclipse.mylyn.builds.tests .................... SUCCESS [0.334s]
[INFO] org.eclipse.mylyn.context.tasks.ui ................ SUCCESS [2.243s]
[INFO] org.eclipse.mylyn.ide.ui .......................... SUCCESS [0.356s]
[INFO] org.eclipse.mylyn.context.sdk.util ................ SUCCESS [1.841s]
[INFO] org.eclipse.mylyn.cdt.tests ....................... SUCCESS [0.416s]
[INFO] org.eclipse.mylyn.commons.notifications.tests ..... SUCCESS [0.358s]
[INFO] org.eclipse.mylyn.commons.tests ................... SUCCESS [0.523s]
[INFO] org.eclipse.mylyn.java.ui ......................... SUCCESS [0.576s]
[INFO] org.eclipse.mylyn.context.sdk.java ................ SUCCESS [0.451s]
[INFO] org.eclipse.mylyn.tasks.bugs ...................... SUCCESS [2.435s]
[INFO] org.eclipse.mylyn.tasks.search .................... SUCCESS [0.620s]
[INFO] org.eclipse.mylyn.tasks.tests ..................... SUCCESS [1.020s]
[INFO] org.eclipse.mylyn.context.tasks.tests ............. SUCCESS [0.471s]
[INFO] org.eclipse.mylyn.context.tests ................... SUCCESS [0.330s]
[INFO] org.eclipse.mylyn.discovery.tests ................. SUCCESS [0.244s]
[INFO] Mylyn Reviews ..................................... SUCCESS [0.040s]
[INFO] org.eclipse.mylyn.reviews.core .................... SUCCESS [0.404s]
[INFO] org.eclipse.mylyn.reviews.edit .................... SUCCESS [1.663s]
[INFO] org.eclipse.mylyn.gerrit.core ..................... SUCCESS [0.471s]
[INFO] org.eclipse.mylyn.reviews.ui ...................... SUCCESS [0.639s]
[INFO] org.eclipse.mylyn.gerrit.ui ....................... SUCCESS [1.971s]
[INFO] org.eclipse.mylyn.gerrit.tests .................... SUCCESS [0.646s]
[INFO] org.eclipse.mylyn.hudson.core ..................... SUCCESS [0.258s]
[INFO] org.eclipse.mylyn.hudson.ui ....................... SUCCESS [1.723s]
[INFO] org.eclipse.mylyn.hudson.tests .................... SUCCESS [0.374s]
[INFO] org.eclipse.mylyn.ide.ant ......................... SUCCESS [0.341s]
[INFO] org.eclipse.mylyn.ide.tests ....................... SUCCESS [0.427s]
[INFO] org.eclipse.mylyn.java.tasks ...................... SUCCESS [0.692s]
[INFO] org.eclipse.mylyn.pde.ui .......................... SUCCESS [1.146s]
[INFO] org.eclipse.mylyn.java.tests ...................... SUCCESS [0.587s]
[INFO] org.eclipse.mylyn.monitor.tests ................... SUCCESS [0.337s]
[INFO] org.eclipse.mylyn.resources.tests ................. SUCCESS [0.593s]
[INFO] org.eclipse.mylyn.reviews.tests ................... SUCCESS [0.417s]
[INFO] org.eclipse.mylyn.tasks.index.core ................ SUCCESS [0.384s]
[INFO] org.eclipse.mylyn.tasks.index.ui .................. SUCCESS [0.980s]
[INFO] org.eclipse.mylyn.tasks.index.tests ............... SUCCESS [0.437s]
[INFO] org.eclipse.mylyn.team.cvs ........................ SUCCESS [0.905s]
[INFO] org.eclipse.mylyn.team.tests ...................... SUCCESS [0.950s]
[INFO] org.eclipse.mylyn.trac.core ....................... SUCCESS [0.459s]
[INFO] org.eclipse.mylyn.trac.ui ......................... SUCCESS [0.508s]
[INFO] org.eclipse.mylyn.trac.tests ...................... SUCCESS [0.574s]
[INFO] org.eclipse.mylyn.tests ........................... SUCCESS [2.054s]
[INFO] org.eclipse.mylyn.commons ......................... SUCCESS [0.186s]
[INFO] org.eclipse.mylyn.commons.identity ................ SUCCESS [0.108s]
[INFO] org.eclipse.mylyn.commons.notifications ........... SUCCESS [0.176s]
[INFO] org.eclipse.mylyn.commons.repositories ............ SUCCESS [0.861s]
[INFO] org.eclipse.mylyn.discovery ....................... SUCCESS [0.168s]
[INFO] org.eclipse.mylyn.monitor ......................... SUCCESS [0.155s]
[INFO] org.eclipse.mylyn_feature ......................... SUCCESS [1.316s]
[INFO] org.eclipse.mylyn.context_feature ................. SUCCESS [0.143s]
[INFO] org.eclipse.cdt.mylyn ............................. SUCCESS [0.836s]
[INFO] org.eclipse.mylyn.bugzilla_feature ................ SUCCESS [0.403s]
[INFO] org.eclipse.mylyn.cvs.core ........................ SUCCESS [0.170s]
[INFO] org.eclipse.mylyn.versions ........................ SUCCESS [0.101s]
[INFO] org.eclipse.mylyn.cvs ............................. SUCCESS [0.114s]
[INFO] org.eclipse.mylyn.reviews.feature ................. SUCCESS [0.118s]
[INFO] org.eclipse.mylyn.gerrit.feature .................. FAILURE [0.135s]
[INFO] org.eclipse.mylyn.gerrit.dashboard.core ........... SKIPPED
[INFO] org.eclipse.mylyn.gerrit.dashboard.ui ............. SKIPPED
[INFO] org.eclipse.mylyn.gerrit.dashboard.feature ........ SKIPPED
[INFO] org.eclipse.mylyn.git.core ........................ SKIPPED
[INFO] org.eclipse.mylyn.git.ui .......................... SKIPPED
[INFO] org.eclipse.mylyn.git ............................. SKIPPED
[INFO] org.eclipse.mylyn.team_feature .................... SKIPPED
[INFO] org.eclipse.mylyn.builds .......................... SKIPPED
[INFO] org.eclipse.mylyn.commons.repositories.http ....... SKIPPED
[INFO] org.eclipse.mylyn.hudson .......................... SKIPPED
[INFO] org.eclipse.mylyn.bugzilla.ide .................... SKIPPED
[INFO] org.eclipse.mylyn.help.ui ......................... SKIPPED
[INFO] org.eclipse.mylyn.tasks.ide ....................... SKIPPED
[INFO] org.eclipse.mylyn.ide_feature ..................... SKIPPED
[INFO] org.eclipse.mylyn.debug.ui ........................ SKIPPED
[INFO] org.eclipse.mylyn.java_feature .................... SKIPPED
[INFO] org.eclipse.mylyn.pde_feature ..................... SKIPPED
[INFO] org.eclipse.mylyn.team.cvs ........................ SKIPPED
[INFO] org.eclipse.mylyn.subclipse.core .................. SKIPPED
[INFO] org.eclipse.mylyn.subclipse.ui .................... SKIPPED
[INFO] org.eclipse.mylyn.subclipse ....................... SKIPPED
[INFO] org.eclipse.mylyn.trac_feature .................... SKIPPED
[INFO] org.eclipse.mylyn.builds.sdk ...................... SKIPPED
[INFO] org.eclipse.mylyn.commons.sdk ..................... SKIPPED
[INFO] org.eclipse.mylyn.context.sdk ..................... SKIPPED
[INFO] org.eclipse.mylyn.reviews.sdk.feature ............. SKIPPED
[INFO] org.eclipse.mylyn.sdk_feature ..................... SKIPPED
[INFO] org.eclipse.mylyn.tasks.core.tests ................ SKIPPED
[INFO] org.eclipse.mylyn.tasks.ui.tests .................. SKIPPED
[INFO] org.eclipse.mylyn.trac.core.tests ................. SKIPPED
[INFO] org.eclipse.mylyn.trac.ui.tests ................... SKIPPED
[INFO] org.eclipse.mylyn.test_feature .................... SKIPPED
[INFO] org.eclipse.mylyn.versions.sdk .................... SKIPPED
[INFO] Mylyn for Eclipse 4.x ............................. SKIPPED
[INFO] org.eclipse.mylyn-target .......................... SKIPPED
[INFO] org.eclipse.mylyn.commons.tck ..................... SKIPPED
[INFO] Mylyn Commons ..................................... SKIPPED
[INFO] org.eclipse.mylyn.commons-target .................. SKIPPED
[INFO] org.eclipse.mylyn.commons.ui.tests ................ SKIPPED
[INFO] org.eclipse.mylyn.commons.activity.ui ............. SKIPPED
[INFO] org.eclipse.mylyn.commons.activity ................ SKIPPED
[INFO] org.eclipse.mylyn.commons.activity.tests .......... SKIPPED
[INFO] org.eclipse.mylyn.commons.repositories.http.tests . SKIPPED
[INFO] org.eclipse.mylyn.commons.repositories.tests ...... SKIPPED
[INFO] org.eclipse.mylyn.commons.development ............. SKIPPED
[INFO] org.eclipse.mylyn.commons.identity.ui ............. SKIPPED
[INFO] Mylyn Versions .................................... SKIPPED
[INFO] org.eclipse.mylyn.versions.tests .................. SKIPPED
[INFO] org.eclipse.mylyn.versions.development ............ SKIPPED
[INFO] org.eclipse.mylyn.help.sdk ........................ SKIPPED
[INFO] org.eclipse.mylyn.tasks.index ..................... SKIPPED
[INFO] Mylyn Tasks ....................................... SKIPPED
[INFO] org.eclipse.mylyn.tasks-target .................... SKIPPED
[INFO] org.eclipse.mylyn.tasks.activity.core ............. SKIPPED
[INFO] org.eclipse.mylyn.tasks.activity.ui ............... SKIPPED
[INFO] org.eclipse.mylyn.tasks.activity.tests ............ SKIPPED
[INFO] org.eclipse.mylyn.bugzilla.rest.ui ................ SKIPPED
[INFO] org.eclipse.mylyn.bugzilla.rest ................... SKIPPED
[INFO] org.eclipse.mylyn.bugzilla.rest.tests ............. SKIPPED
[INFO] org.eclipse.mylyn.bugzilla.rest.ui.tests .......... SKIPPED
[INFO] Mylyn Context ..................................... SKIPPED
[INFO] org.eclipse.mylyn.context-target .................. SKIPPED
[INFO] org.eclipse.mylyn.debug.tests ..................... SKIPPED
[INFO] org.eclipse.mylyn.context.development ............. SKIPPED
[INFO] org.eclipse.mylyn.context.tasks.ui.tests .......... SKIPPED
[INFO] Mylyn Builds ...................................... SKIPPED
[INFO] org.eclipse.mylyn.builds.development .............. SKIPPED
[INFO] org.eclipse.mylyn.gerrit.core.tests ............... SKIPPED
[INFO] org.eclipse.mylyn.gerrit.target ................... SKIPPED
[INFO] org.eclipse.mylyn.gerrit.ui.tests ................. SKIPPED
[INFO] org.eclipse.mylyn.reviews.core.tests .............. SKIPPED
[INFO] org.eclipse.mylyn.reviews.development.feature ..... SKIPPED
[INFO] org.eclipse.mylyn.reviews.ui.tests ................ SKIPPED
[INFO] org.eclipse.mylyn.reviews.site .................... SKIPPED
[INFO] org.eclipse.mylyn.all ............................. SKIPPED
[INFO] ------------------------------------------------------------------------
[INFO] BUILD FAILURE
[INFO] ------------------------------------------------------------------------
[INFO] Total time: 6:53.480s
[INFO] Finished at: Wed Mar 15 08:18:36 EDT 2017
[INFO] Final Memory: 405M/9643M
[INFO] ------------------------------------------------------------------------
[INFO] o.h.m.e.h.MavenExecutionResultHandler - Build failed with exception(s)
[INFO] o.h.m.e.h.MavenExecutionResultHandler - [1] org.apache.maven.lifecycle.LifecycleExecutionException: Failed to execute goal org.eclipse.tycho:tycho-packaging-plugin:1.0.0:package-feature (default-package-feature) on project org.eclipse.mylyn.gerrit.feature: Execution default-package-feature of goal org.eclipse.tycho:tycho-packaging-plugin:1.0.0:package-feature failed: eclipse-plugin artifact with ID "javax.servlet" and version matching "3.0.0" was not found in the target platform
[DEBUG] Closing connection to remote
[ERROR] Failed to execute goal org.eclipse.tycho:tycho-packaging-plugin:1.0.0:package-feature (default-package-feature) on project org.eclipse.mylyn.gerrit.feature: Execution default-package-feature of goal org.eclipse.tycho:tycho-packaging-plugin:1.0.0:package-feature failed: eclipse-plugin artifact with ID "javax.servlet" and version matching "3.0.0" was not found in the target platform -> [Help 1]
[ERROR] 
[ERROR] To see the full stack trace of the errors, re-run Maven with the -e switch.
[ERROR] Re-run Maven using the -X switch to enable full debug logging.
[ERROR] 
[ERROR] For more information about the errors and possible solutions, please read the following articles:
[ERROR] [Help 1] http://cwiki.apache.org/confluence/display/MAVEN/PluginExecutionException
[ERROR] 
[ERROR] After correcting the problems, you can resume the build with the command
[ERROR]   mvn <goals> -rf :org.eclipse.mylyn.gerrit.feature
[DEBUG] Waiting for process to finish
[DEBUG] Result: 1
Recording fingerprints
Archiving artifacts
Finished: FAILURE