Console Output

Started by an SCM change
Checkout:workspace / /home/hudson/genie.mylyn/.hudson/jobs/mylyn-3.18.x-release/workspace - hudson.remoting.LocalChannel@44b7c2c1
Using strategy: Default
Last Built Revision: Revision 9f99a83851099233f8493889519266ffbf510b0b (origin/master)
Checkout:workspace / /home/hudson/genie.mylyn/.hudson/jobs/mylyn-3.18.x-release/workspace - hudson.remoting.LocalChannel@44b7c2c1
Wiping out workspace first.
Cloning the remote Git repository
Cloning repository origin
Fetching upstream changes from git://git.eclipse.org/gitroot/mylyn/org.eclipse.mylyn.all
Commencing build of Revision 7faac275ab7cacf1ed064a568ee1095b49bb755f (origin/master)
Checking out Revision 7faac275ab7cacf1ed064a568ee1095b49bb755f (origin/master)
The origin is non-bare.
[workspace] $ /bin/sh -xe /tmp/genie.mylyn/hudson8193304004791876711.sh
+ git submodule foreach git rev-parse HEAD
Entering 'org.eclipse.mylyn'
55101e8ddc19623fe696326f3da36001ed789c94
Entering 'org.eclipse.mylyn.builds'
59a1d12c8e10903affcf17eda46c42a9d5d65612
Entering 'org.eclipse.mylyn.commons'
1fb5209632d10fb024fb7e2bf3b99b563628403c
Entering 'org.eclipse.mylyn.context'
4aa0f081f35123ab326db46cde22554913ee57d6
Entering 'org.eclipse.mylyn.docs'
4a13b3a0ac358796a1a5b5e22f271ff7062ddd16
Entering 'org.eclipse.mylyn.reviews'
e0013a13afdb92c00776bdd85794caccf8c7eae7
Entering 'org.eclipse.mylyn.tasks'
ff319144e7d78418205f186ae571b94048d08c46
Entering 'org.eclipse.mylyn.versions'
5e9a8cc86210bb66b1e79e1d64add8e98fb85086
+ git rev-list HEAD
[INFO] Using Maven 3 installation: Maven 3.0.5
[INFO] Checking Maven 3 installation environment
[workspace] $ /shared/common/apache-maven-3.0.5/bin/mvn --help
[INFO] Checking Maven 3 installation version
[INFO] Detected Maven 3 installation version: 3.0.5
[workspace] $ /shared/common/apache-maven-3.0.5/bin/mvn -Pluna -Prelease clean package -V -B -DPUBLISH=true -Dmaven.test.skip=true -Dexplicit-target=true -Dmaven.ext.class.path=/home/hudson/genie.mylyn/.hudson/maven/slavebundle/resources:/home/hudson/genie.mylyn/.hudson/maven/slavebundle/lib/maven3-eventspy-3.0.jar:/home/hudson/genie.mylyn/.hudson/war/webapp/WEB-INF/lib/hudson-remoting-3.0.0.jar -Dhudson.eventspy.port=43627 -Dmaven.repo.local=/home/hudson/genie.mylyn/.hudson/jobs/mylyn-3.18.x-release/workspace/.maven/repo -f pom.xml
[DEBUG] Waiting for connection on port: 43627
Apache Maven 3.0.5 (r01de14724cdef164cd33c7c8c2fe155faf9602da; 2013-02-19 08:51:28-0500)
Maven home: /shared/common/apache-maven-3.0.5
Java version: 1.7.0_80, vendor: Oracle Corporation
Java home: /opt/public/common/jdk1.7.0_80/jre
Default locale: en_US, platform encoding: UTF-8
OS name: "linux", version: "3.0.101-0.46-default", arch: "amd64", family: "unix"
[DEBUG] Connected to remote
[INFO] Scanning for projects...
Downloading: http://repo.maven.apache.org/maven2/org/eclipse/tycho/tycho-maven-plugin/0.20.0/tycho-maven-plugin-0.20.0.pom
Downloaded: http://repo.maven.apache.org/maven2/org/eclipse/tycho/tycho-maven-plugin/0.20.0/tycho-maven-plugin-0.20.0.pom (3 KB at 6.4 KB/sec)
Downloading: http://repo.maven.apache.org/maven2/org/eclipse/tycho/tycho/0.20.0/tycho-0.20.0.pom
Downloaded: http://repo.maven.apache.org/maven2/org/eclipse/tycho/tycho/0.20.0/tycho-0.20.0.pom (19 KB at 108.1 KB/sec)
Downloading: http://repo.maven.apache.org/maven2/org/eclipse/tycho/tycho-core/0.20.0/tycho-core-0.20.0.pom
Downloaded: http://repo.maven.apache.org/maven2/org/eclipse/tycho/tycho-core/0.20.0/tycho-core-0.20.0.pom (5 KB at 31.3 KB/sec)
Downloading: http://repo.maven.apache.org/maven2/org/apache/maven/maven-core/3.0/maven-core-3.0.pom
Downloaded: http://repo.maven.apache.org/maven2/org/apache/maven/maven-core/3.0/maven-core-3.0.pom (7 KB at 45.3 KB/sec)
Downloading: http://repo.maven.apache.org/maven2/org/apache/maven/maven/3.0/maven-3.0.pom
Downloaded: http://repo.maven.apache.org/maven2/org/apache/maven/maven/3.0/maven-3.0.pom (22 KB at 125.0 KB/sec)
Downloading: http://repo.maven.apache.org/maven2/org/apache/maven/maven-parent/15/maven-parent-15.pom
Downloaded: http://repo.maven.apache.org/maven2/org/apache/maven/maven-parent/15/maven-parent-15.pom (24 KB at 135.5 KB/sec)
Downloading: http://repo.maven.apache.org/maven2/org/apache/apache/6/apache-6.pom
Downloaded: http://repo.maven.apache.org/maven2/org/apache/apache/6/apache-6.pom (13 KB at 86.8 KB/sec)
Downloading: http://repo.maven.apache.org/maven2/org/apache/maven/maven-model/3.0/maven-model-3.0.pom
Downloaded: http://repo.maven.apache.org/maven2/org/apache/maven/maven-model/3.0/maven-model-3.0.pom (4 KB at 26.8 KB/sec)
Downloading: http://repo.maven.apache.org/maven2/org/codehaus/plexus/plexus-utils/3.0.7/plexus-utils-3.0.7.pom
Downloaded: http://repo.maven.apache.org/maven2/org/codehaus/plexus/plexus-utils/3.0.7/plexus-utils-3.0.7.pom (3 KB at 16.9 KB/sec)
Downloading: http://repo.maven.apache.org/maven2/org/codehaus/plexus/plexus/3.1/plexus-3.1.pom
Downloaded: http://repo.maven.apache.org/maven2/org/codehaus/plexus/plexus/3.1/plexus-3.1.pom (19 KB at 103.9 KB/sec)
Downloading: http://repo.maven.apache.org/maven2/org/sonatype/spice/spice-parent/17/spice-parent-17.pom
Downloaded: http://repo.maven.apache.org/maven2/org/sonatype/spice/spice-parent/17/spice-parent-17.pom (7 KB at 46.8 KB/sec)
Downloading: http://repo.maven.apache.org/maven2/org/sonatype/forge/forge-parent/10/forge-parent-10.pom
Downloaded: http://repo.maven.apache.org/maven2/org/sonatype/forge/forge-parent/10/forge-parent-10.pom (14 KB at 90.7 KB/sec)
Downloading: http://repo.maven.apache.org/maven2/org/apache/maven/maven-settings/3.0/maven-settings-3.0.pom
Downloaded: http://repo.maven.apache.org/maven2/org/apache/maven/maven-settings/3.0/maven-settings-3.0.pom (2 KB at 12.3 KB/sec)
Downloading: http://repo.maven.apache.org/maven2/org/apache/maven/maven-settings-builder/3.0/maven-settings-builder-3.0.pom
Downloaded: http://repo.maven.apache.org/maven2/org/apache/maven/maven-settings-builder/3.0/maven-settings-builder-3.0.pom (3 KB at 13.6 KB/sec)
Downloading: http://repo.maven.apache.org/maven2/org/codehaus/plexus/plexus-interpolation/1.14/plexus-interpolation-1.14.pom
Downloaded: http://repo.maven.apache.org/maven2/org/codehaus/plexus/plexus-interpolation/1.14/plexus-interpolation-1.14.pom (910 B at 6.3 KB/sec)
Downloading: http://repo.maven.apache.org/maven2/org/codehaus/plexus/plexus-components/1.1.18/plexus-components-1.1.18.pom
Downloaded: http://repo.maven.apache.org/maven2/org/codehaus/plexus/plexus-components/1.1.18/plexus-components-1.1.18.pom (6 KB at 36.8 KB/sec)
Downloading: http://repo.maven.apache.org/maven2/org/codehaus/plexus/plexus/2.0.7/plexus-2.0.7.pom
Downloaded: http://repo.maven.apache.org/maven2/org/codehaus/plexus/plexus/2.0.7/plexus-2.0.7.pom (17 KB at 97.6 KB/sec)
Downloading: http://repo.maven.apache.org/maven2/org/codehaus/plexus/plexus-component-annotations/1.5.5/plexus-component-annotations-1.5.5.pom
Downloaded: http://repo.maven.apache.org/maven2/org/codehaus/plexus/plexus-component-annotations/1.5.5/plexus-component-annotations-1.5.5.pom (815 B at 5.7 KB/sec)
Downloading: http://repo.maven.apache.org/maven2/org/codehaus/plexus/plexus-containers/1.5.5/plexus-containers-1.5.5.pom
Downloaded: http://repo.maven.apache.org/maven2/org/codehaus/plexus/plexus-containers/1.5.5/plexus-containers-1.5.5.pom (5 KB at 29.6 KB/sec)
Downloading: http://repo.maven.apache.org/maven2/org/sonatype/plexus/plexus-sec-dispatcher/1.3/plexus-sec-dispatcher-1.3.pom
Downloaded: http://repo.maven.apache.org/maven2/org/sonatype/plexus/plexus-sec-dispatcher/1.3/plexus-sec-dispatcher-1.3.pom (3 KB at 15.1 KB/sec)
Downloading: http://repo.maven.apache.org/maven2/org/sonatype/spice/spice-parent/12/spice-parent-12.pom
Downloaded: http://repo.maven.apache.org/maven2/org/sonatype/spice/spice-parent/12/spice-parent-12.pom (7 KB at 33.0 KB/sec)
Downloading: http://repo.maven.apache.org/maven2/org/sonatype/forge/forge-parent/4/forge-parent-4.pom
Downloaded: http://repo.maven.apache.org/maven2/org/sonatype/forge/forge-parent/4/forge-parent-4.pom (9 KB at 55.0 KB/sec)
Downloading: http://repo.maven.apache.org/maven2/org/sonatype/plexus/plexus-cipher/1.7/plexus-cipher-1.7.pom
Downloaded: http://repo.maven.apache.org/maven2/org/sonatype/plexus/plexus-cipher/1.7/plexus-cipher-1.7.pom (5 KB at 28.3 KB/sec)
Downloading: http://repo.maven.apache.org/maven2/org/sonatype/spice/spice-parent/15/spice-parent-15.pom
Downloaded: http://repo.maven.apache.org/maven2/org/sonatype/spice/spice-parent/15/spice-parent-15.pom (9 KB at 57.5 KB/sec)
Downloading: http://repo.maven.apache.org/maven2/org/sonatype/forge/forge-parent/5/forge-parent-5.pom
Downloaded: http://repo.maven.apache.org/maven2/org/sonatype/forge/forge-parent/5/forge-parent-5.pom (9 KB at 55.9 KB/sec)
Downloading: http://repo.maven.apache.org/maven2/org/apache/maven/maven-repository-metadata/3.0/maven-repository-metadata-3.0.pom
Downloaded: http://repo.maven.apache.org/maven2/org/apache/maven/maven-repository-metadata/3.0/maven-repository-metadata-3.0.pom (2 KB at 12.7 KB/sec)
Downloading: http://repo.maven.apache.org/maven2/org/apache/maven/maven-artifact/3.0/maven-artifact-3.0.pom
Downloaded: http://repo.maven.apache.org/maven2/org/apache/maven/maven-artifact/3.0/maven-artifact-3.0.pom (2 KB at 13.7 KB/sec)
Downloading: http://repo.maven.apache.org/maven2/org/apache/maven/maven-plugin-api/3.0/maven-plugin-api-3.0.pom
Downloaded: http://repo.maven.apache.org/maven2/org/apache/maven/maven-plugin-api/3.0/maven-plugin-api-3.0.pom (3 KB at 15.8 KB/sec)
Downloading: http://repo.maven.apache.org/maven2/org/sonatype/sisu/sisu-inject-plexus/1.4.2/sisu-inject-plexus-1.4.2.pom
Downloaded: http://repo.maven.apache.org/maven2/org/sonatype/sisu/sisu-inject-plexus/1.4.2/sisu-inject-plexus-1.4.2.pom (6 KB at 35.4 KB/sec)
Downloading: http://repo.maven.apache.org/maven2/org/sonatype/sisu/inject/guice-plexus/1.4.2/guice-plexus-1.4.2.pom
Downloaded: http://repo.maven.apache.org/maven2/org/sonatype/sisu/inject/guice-plexus/1.4.2/guice-plexus-1.4.2.pom (4 KB at 20.6 KB/sec)
Downloading: http://repo.maven.apache.org/maven2/org/sonatype/sisu/inject/guice-bean/1.4.2/guice-bean-1.4.2.pom
Downloaded: http://repo.maven.apache.org/maven2/org/sonatype/sisu/inject/guice-bean/1.4.2/guice-bean-1.4.2.pom (3 KB at 17.8 KB/sec)
Downloading: http://repo.maven.apache.org/maven2/org/sonatype/sisu/sisu-inject/1.4.2/sisu-inject-1.4.2.pom
Downloaded: http://repo.maven.apache.org/maven2/org/sonatype/sisu/sisu-inject/1.4.2/sisu-inject-1.4.2.pom (2 KB at 7.4 KB/sec)
Downloading: http://repo.maven.apache.org/maven2/org/sonatype/sisu/sisu-parent/1.4.2/sisu-parent-1.4.2.pom
Downloaded: http://repo.maven.apache.org/maven2/org/sonatype/sisu/sisu-parent/1.4.2/sisu-parent-1.4.2.pom (8 KB at 51.3 KB/sec)
Downloading: http://repo.maven.apache.org/maven2/org/sonatype/forge/forge-parent/6/forge-parent-6.pom
Downloaded: http://repo.maven.apache.org/maven2/org/sonatype/forge/forge-parent/6/forge-parent-6.pom (11 KB at 74.5 KB/sec)
Downloading: http://repo.maven.apache.org/maven2/org/codehaus/plexus/plexus-classworlds/2.2.3/plexus-classworlds-2.2.3.pom
Downloaded: http://repo.maven.apache.org/maven2/org/codehaus/plexus/plexus-classworlds/2.2.3/plexus-classworlds-2.2.3.pom (4 KB at 27.9 KB/sec)
Downloading: http://repo.maven.apache.org/maven2/org/codehaus/plexus/plexus/2.0.6/plexus-2.0.6.pom
Downloaded: http://repo.maven.apache.org/maven2/org/codehaus/plexus/plexus/2.0.6/plexus-2.0.6.pom (17 KB at 96.3 KB/sec)
Downloading: http://repo.maven.apache.org/maven2/org/sonatype/sisu/sisu-inject-bean/1.4.2/sisu-inject-bean-1.4.2.pom
Downloaded: http://repo.maven.apache.org/maven2/org/sonatype/sisu/sisu-inject-bean/1.4.2/sisu-inject-bean-1.4.2.pom (6 KB at 3.0 KB/sec)
Downloading: http://repo.maven.apache.org/maven2/org/sonatype/sisu/sisu-guice/2.1.7/sisu-guice-2.1.7.pom
Downloaded: http://repo.maven.apache.org/maven2/org/sonatype/sisu/sisu-guice/2.1.7/sisu-guice-2.1.7.pom (11 KB at 76.1 KB/sec)
Downloading: http://repo.maven.apache.org/maven2/org/apache/maven/maven-model-builder/3.0/maven-model-builder-3.0.pom
Downloaded: http://repo.maven.apache.org/maven2/org/apache/maven/maven-model-builder/3.0/maven-model-builder-3.0.pom (3 KB at 15.8 KB/sec)
Downloading: http://repo.maven.apache.org/maven2/org/apache/maven/maven-aether-provider/3.0/maven-aether-provider-3.0.pom
Downloaded: http://repo.maven.apache.org/maven2/org/apache/maven/maven-aether-provider/3.0/maven-aether-provider-3.0.pom (3 KB at 16.8 KB/sec)
Downloading: http://repo.maven.apache.org/maven2/org/sonatype/aether/aether-api/1.7/aether-api-1.7.pom
Downloaded: http://repo.maven.apache.org/maven2/org/sonatype/aether/aether-api/1.7/aether-api-1.7.pom (2 KB at 11.7 KB/sec)
Downloading: http://repo.maven.apache.org/maven2/org/sonatype/aether/aether-parent/1.7/aether-parent-1.7.pom
Downloaded: http://repo.maven.apache.org/maven2/org/sonatype/aether/aether-parent/1.7/aether-parent-1.7.pom (8 KB at 49.3 KB/sec)
Downloading: http://repo.maven.apache.org/maven2/org/sonatype/aether/aether-util/1.7/aether-util-1.7.pom
Downloaded: http://repo.maven.apache.org/maven2/org/sonatype/aether/aether-util/1.7/aether-util-1.7.pom (3 KB at 14.1 KB/sec)
Downloading: http://repo.maven.apache.org/maven2/org/sonatype/aether/aether-impl/1.7/aether-impl-1.7.pom
Downloaded: http://repo.maven.apache.org/maven2/org/sonatype/aether/aether-impl/1.7/aether-impl-1.7.pom (4 KB at 25.0 KB/sec)
Downloading: http://repo.maven.apache.org/maven2/org/sonatype/aether/aether-spi/1.7/aether-spi-1.7.pom
Downloaded: http://repo.maven.apache.org/maven2/org/sonatype/aether/aether-spi/1.7/aether-spi-1.7.pom (2 KB at 12.2 KB/sec)
Downloading: http://repo.maven.apache.org/maven2/org/codehaus/plexus/plexus-archiver/2.2/plexus-archiver-2.2.pom
Downloaded: http://repo.maven.apache.org/maven2/org/codehaus/plexus/plexus-archiver/2.2/plexus-archiver-2.2.pom (4 KB at 23.2 KB/sec)
Downloading: http://repo.maven.apache.org/maven2/org/codehaus/plexus/plexus-components/1.1.20/plexus-components-1.1.20.pom
Downloaded: http://repo.maven.apache.org/maven2/org/codehaus/plexus/plexus-components/1.1.20/plexus-components-1.1.20.pom (3 KB at 22.3 KB/sec)
Downloading: http://repo.maven.apache.org/maven2/org/codehaus/plexus/plexus-io/2.0.5/plexus-io-2.0.5.pom
Downloaded: http://repo.maven.apache.org/maven2/org/codehaus/plexus/plexus-io/2.0.5/plexus-io-2.0.5.pom (3 KB at 16.0 KB/sec)
Downloading: http://repo.maven.apache.org/maven2/org/codehaus/plexus/plexus-components/1.2/plexus-components-1.2.pom
Downloaded: http://repo.maven.apache.org/maven2/org/codehaus/plexus/plexus-components/1.2/plexus-components-1.2.pom (3 KB at 22.1 KB/sec)
Downloading: http://repo.maven.apache.org/maven2/org/codehaus/plexus/plexus/3.2/plexus-3.2.pom
Downloaded: http://repo.maven.apache.org/maven2/org/codehaus/plexus/plexus/3.2/plexus-3.2.pom (19 KB at 114.4 KB/sec)
Downloading: http://repo.maven.apache.org/maven2/org/eclipse/tycho/org.eclipse.osgi/3.9.1.v20130814-1242/org.eclipse.osgi-3.9.1.v20130814-1242.pom
Downloaded: http://repo.maven.apache.org/maven2/org/eclipse/tycho/org.eclipse.osgi/3.9.1.v20130814-1242/org.eclipse.osgi-3.9.1.v20130814-1242.pom (2 KB at 10.9 KB/sec)
Downloading: http://repo.maven.apache.org/maven2/org/eclipse/tycho/sisu-equinox-embedder/0.20.0/sisu-equinox-embedder-0.20.0.pom
Downloaded: http://repo.maven.apache.org/maven2/org/eclipse/tycho/sisu-equinox-embedder/0.20.0/sisu-equinox-embedder-0.20.0.pom (2 KB at 13.4 KB/sec)
Downloading: http://repo.maven.apache.org/maven2/org/eclipse/tycho/sisu-equinox/0.20.0/sisu-equinox-0.20.0.pom
Downloaded: http://repo.maven.apache.org/maven2/org/eclipse/tycho/sisu-equinox/0.20.0/sisu-equinox-0.20.0.pom (2 KB at 7.7 KB/sec)
Downloading: http://repo.maven.apache.org/maven2/org/eclipse/tycho/sisu-equinox-api/0.20.0/sisu-equinox-api-0.20.0.pom
Downloaded: http://repo.maven.apache.org/maven2/org/eclipse/tycho/sisu-equinox-api/0.20.0/sisu-equinox-api-0.20.0.pom (2 KB at 11.7 KB/sec)
Downloading: http://repo.maven.apache.org/maven2/org/eclipse/tycho/tycho-metadata-model/0.20.0/tycho-metadata-model-0.20.0.pom
Downloaded: http://repo.maven.apache.org/maven2/org/eclipse/tycho/tycho-metadata-model/0.20.0/tycho-metadata-model-0.20.0.pom (2 KB at 9.0 KB/sec)
Downloading: http://repo.maven.apache.org/maven2/de/pdark/decentxml/1.3/decentxml-1.3.pom
Downloaded: http://repo.maven.apache.org/maven2/de/pdark/decentxml/1.3/decentxml-1.3.pom (7 KB at 41.1 KB/sec)
Downloading: http://repo.maven.apache.org/maven2/org/eclipse/tycho/tycho-embedder-api/0.20.0/tycho-embedder-api-0.20.0.pom
Downloaded: http://repo.maven.apache.org/maven2/org/eclipse/tycho/tycho-embedder-api/0.20.0/tycho-embedder-api-0.20.0.pom (3 KB at 7.1 KB/sec)
Downloading: http://repo.maven.apache.org/maven2/org/eclipse/tycho/org.eclipse.tycho.embedder.shared/0.20.0/org.eclipse.tycho.embedder.shared-0.20.0.pom
Downloaded: http://repo.maven.apache.org/maven2/org/eclipse/tycho/org.eclipse.tycho.embedder.shared/0.20.0/org.eclipse.tycho.embedder.shared-0.20.0.pom (2 KB at 7.8 KB/sec)
Downloading: http://repo.maven.apache.org/maven2/org/eclipse/tycho/tycho-bundles/0.20.0/tycho-bundles-0.20.0.pom
Downloaded: http://repo.maven.apache.org/maven2/org/eclipse/tycho/tycho-bundles/0.20.0/tycho-bundles-0.20.0.pom (3 KB at 16.9 KB/sec)
Downloading: http://repo.maven.apache.org/maven2/org/eclipse/tycho/org.eclipse.tycho.core.shared/0.20.0/org.eclipse.tycho.core.shared-0.20.0.pom
Downloaded: http://repo.maven.apache.org/maven2/org/eclipse/tycho/org.eclipse.tycho.core.shared/0.20.0/org.eclipse.tycho.core.shared-0.20.0.pom (2 KB at 7.6 KB/sec)
Downloading: http://repo.maven.apache.org/maven2/org/eclipse/tycho/tycho-p2-facade/0.20.0/tycho-p2-facade-0.20.0.pom
Downloaded: http://repo.maven.apache.org/maven2/org/eclipse/tycho/tycho-p2-facade/0.20.0/tycho-p2-facade-0.20.0.pom (3 KB at 16.6 KB/sec)
Downloading: http://repo.maven.apache.org/maven2/org/eclipse/tycho/tycho-p2/0.20.0/tycho-p2-0.20.0.pom
Downloaded: http://repo.maven.apache.org/maven2/org/eclipse/tycho/tycho-p2/0.20.0/tycho-p2-0.20.0.pom (2 KB at 6.2 KB/sec)
Downloading: http://repo.maven.apache.org/maven2/org/eclipse/tycho/org.eclipse.tycho.p2.resolver.shared/0.20.0/org.eclipse.tycho.p2.resolver.shared-0.20.0.pom
Downloaded: http://repo.maven.apache.org/maven2/org/eclipse/tycho/org.eclipse.tycho.p2.resolver.shared/0.20.0/org.eclipse.tycho.p2.resolver.shared-0.20.0.pom (2 KB at 5.8 KB/sec)
Downloading: http://repo.maven.apache.org/maven2/org/eclipse/tycho/org.eclipse.tycho.p2.tools.shared/0.20.0/org.eclipse.tycho.p2.tools.shared-0.20.0.pom
Downloaded: http://repo.maven.apache.org/maven2/org/eclipse/tycho/org.eclipse.tycho.p2.tools.shared/0.20.0/org.eclipse.tycho.p2.tools.shared-0.20.0.pom (2 KB at 7.8 KB/sec)
Downloading: http://repo.maven.apache.org/maven2/org/eclipse/tycho/tycho-maven-plugin/0.20.0/tycho-maven-plugin-0.20.0.jar
Downloading: http://repo.maven.apache.org/maven2/org/eclipse/tycho/tycho-core/0.20.0/tycho-core-0.20.0.jar
Downloading: http://repo.maven.apache.org/maven2/org/sonatype/aether/aether-util/1.7/aether-util-1.7.jar
Downloading: http://repo.maven.apache.org/maven2/org/sonatype/sisu/sisu-inject-bean/1.4.2/sisu-inject-bean-1.4.2.jar
Downloading: http://repo.maven.apache.org/maven2/org/sonatype/sisu/sisu-guice/2.1.7/sisu-guice-2.1.7-noaop.jar
Downloaded: http://repo.maven.apache.org/maven2/org/eclipse/tycho/tycho-maven-plugin/0.20.0/tycho-maven-plugin-0.20.0.jar (5 KB at 35.2 KB/sec)
Downloading: http://repo.maven.apache.org/maven2/org/codehaus/plexus/plexus-interpolation/1.14/plexus-interpolation-1.14.jar
Downloaded: http://repo.maven.apache.org/maven2/org/codehaus/plexus/plexus-interpolation/1.14/plexus-interpolation-1.14.jar (60 KB at 318.9 KB/sec)
Downloading: http://repo.maven.apache.org/maven2/org/sonatype/plexus/plexus-sec-dispatcher/1.3/plexus-sec-dispatcher-1.3.jar
Downloaded: http://repo.maven.apache.org/maven2/org/sonatype/aether/aether-util/1.7/aether-util-1.7.jar (106 KB at 311.9 KB/sec)
Downloading: http://repo.maven.apache.org/maven2/org/sonatype/plexus/plexus-cipher/1.7/plexus-cipher-1.7.jar
Downloaded: http://repo.maven.apache.org/maven2/org/sonatype/sisu/sisu-inject-bean/1.4.2/sisu-inject-bean-1.4.2.jar (150 KB at 393.2 KB/sec)
Downloading: http://repo.maven.apache.org/maven2/org/codehaus/plexus/plexus-utils/3.0.7/plexus-utils-3.0.7.jar
Downloaded: http://repo.maven.apache.org/maven2/org/eclipse/tycho/tycho-core/0.20.0/tycho-core-0.20.0.jar (177 KB at 459.9 KB/sec)
Downloading: http://repo.maven.apache.org/maven2/org/codehaus/plexus/plexus-archiver/2.2/plexus-archiver-2.2.jar
Downloaded: http://repo.maven.apache.org/maven2/org/sonatype/sisu/sisu-guice/2.1.7/sisu-guice-2.1.7-noaop.jar (461 KB at 1035.2 KB/sec)
Downloading: http://repo.maven.apache.org/maven2/org/codehaus/plexus/plexus-io/2.0.5/plexus-io-2.0.5.jar
Downloaded: http://repo.maven.apache.org/maven2/org/sonatype/plexus/plexus-sec-dispatcher/1.3/plexus-sec-dispatcher-1.3.jar (28 KB at 178.8 KB/sec)
Downloading: http://repo.maven.apache.org/maven2/org/eclipse/tycho/org.eclipse.osgi/3.9.1.v20130814-1242/org.eclipse.osgi-3.9.1.v20130814-1242.jar
Downloaded: http://repo.maven.apache.org/maven2/org/sonatype/plexus/plexus-cipher/1.7/plexus-cipher-1.7.jar (14 KB at 54.8 KB/sec)
Downloading: http://repo.maven.apache.org/maven2/org/eclipse/tycho/sisu-equinox-embedder/0.20.0/sisu-equinox-embedder-0.20.0.jar
Downloaded: http://repo.maven.apache.org/maven2/org/codehaus/plexus/plexus-io/2.0.5/plexus-io-2.0.5.jar (57 KB at 283.8 KB/sec)
Downloading: http://repo.maven.apache.org/maven2/org/eclipse/tycho/sisu-equinox-api/0.20.0/sisu-equinox-api-0.20.0.jar
Downloaded: http://repo.maven.apache.org/maven2/org/codehaus/plexus/plexus-archiver/2.2/plexus-archiver-2.2.jar (181 KB at 477.9 KB/sec)
Downloading: http://repo.maven.apache.org/maven2/org/eclipse/tycho/tycho-metadata-model/0.20.0/tycho-metadata-model-0.20.0.jar
Downloaded: http://repo.maven.apache.org/maven2/org/eclipse/tycho/sisu-equinox-embedder/0.20.0/sisu-equinox-embedder-0.20.0.jar (13 KB at 64.1 KB/sec)
Downloading: http://repo.maven.apache.org/maven2/de/pdark/decentxml/1.3/decentxml-1.3.jar
Downloaded: http://repo.maven.apache.org/maven2/org/codehaus/plexus/plexus-utils/3.0.7/plexus-utils-3.0.7.jar (226 KB at 534.6 KB/sec)
Downloading: http://repo.maven.apache.org/maven2/org/eclipse/tycho/tycho-embedder-api/0.20.0/tycho-embedder-api-0.20.0.jar
Downloaded: http://repo.maven.apache.org/maven2/org/eclipse/tycho/sisu-equinox-api/0.20.0/sisu-equinox-api-0.20.0.jar (4 KB at 18.2 KB/sec)
Downloading: http://repo.maven.apache.org/maven2/org/eclipse/tycho/org.eclipse.tycho.embedder.shared/0.20.0/org.eclipse.tycho.embedder.shared-0.20.0.jar
Downloaded: http://repo.maven.apache.org/maven2/org/eclipse/tycho/org.eclipse.tycho.embedder.shared/0.20.0/org.eclipse.tycho.embedder.shared-0.20.0.jar (7 KB at 42.0 KB/sec)
Downloading: http://repo.maven.apache.org/maven2/org/eclipse/tycho/org.eclipse.tycho.core.shared/0.20.0/org.eclipse.tycho.core.shared-0.20.0.jar
Downloaded: http://repo.maven.apache.org/maven2/org/eclipse/tycho/tycho-embedder-api/0.20.0/tycho-embedder-api-0.20.0.jar (7 KB at 35.0 KB/sec)
Downloading: http://repo.maven.apache.org/maven2/org/eclipse/tycho/tycho-p2-facade/0.20.0/tycho-p2-facade-0.20.0.jar
Downloaded: http://repo.maven.apache.org/maven2/org/eclipse/tycho/org.eclipse.osgi/3.9.1.v20130814-1242/org.eclipse.osgi-3.9.1.v20130814-1242.jar (1360 KB at 2575.0 KB/sec)
Downloading: http://repo.maven.apache.org/maven2/org/codehaus/plexus/plexus-component-annotations/1.5.5/plexus-component-annotations-1.5.5.jar
Downloaded: http://repo.maven.apache.org/maven2/org/eclipse/tycho/tycho-metadata-model/0.20.0/tycho-metadata-model-0.20.0.jar (31 KB at 124.6 KB/sec)
Downloading: http://repo.maven.apache.org/maven2/org/eclipse/tycho/org.eclipse.tycho.p2.resolver.shared/0.20.0/org.eclipse.tycho.p2.resolver.shared-0.20.0.jar
Downloaded: http://repo.maven.apache.org/maven2/de/pdark/decentxml/1.3/decentxml-1.3.jar (109 KB at 326.2 KB/sec)
Downloading: http://repo.maven.apache.org/maven2/org/eclipse/tycho/org.eclipse.tycho.p2.tools.shared/0.20.0/org.eclipse.tycho.p2.tools.shared-0.20.0.jar
Downloaded: http://repo.maven.apache.org/maven2/org/eclipse/tycho/org.eclipse.tycho.core.shared/0.20.0/org.eclipse.tycho.core.shared-0.20.0.jar (32 KB at 185.4 KB/sec)
Downloaded: http://repo.maven.apache.org/maven2/org/eclipse/tycho/org.eclipse.tycho.p2.resolver.shared/0.20.0/org.eclipse.tycho.p2.resolver.shared-0.20.0.jar (27 KB at 166.8 KB/sec)
Downloaded: http://repo.maven.apache.org/maven2/org/codehaus/plexus/plexus-component-annotations/1.5.5/plexus-component-annotations-1.5.5.jar (5 KB at 21.2 KB/sec)
Downloaded: http://repo.maven.apache.org/maven2/org/eclipse/tycho/tycho-p2-facade/0.20.0/tycho-p2-facade-0.20.0.jar (32 KB at 128.7 KB/sec)
Downloaded: http://repo.maven.apache.org/maven2/org/eclipse/tycho/org.eclipse.tycho.p2.tools.shared/0.20.0/org.eclipse.tycho.p2.tools.shared-0.20.0.jar (20 KB at 64.0 KB/sec)
Downloading: http://repo.maven.apache.org/maven2/org/eclipse/tycho/tycho-bundles-external/0.20.0/tycho-bundles-external-0.20.0.zip
Downloaded: http://repo.maven.apache.org/maven2/org/eclipse/tycho/tycho-bundles-external/0.20.0/tycho-bundles-external-0.20.0.zip (6139 KB at 5802.0 KB/sec)
Downloading: http://repo.maven.apache.org/maven2/org/eclipse/tycho/org.eclipse.tycho.p2.resolver.impl/0.20.0/org.eclipse.tycho.p2.resolver.impl-0.20.0.jar
Downloaded: http://repo.maven.apache.org/maven2/org/eclipse/tycho/org.eclipse.tycho.p2.resolver.impl/0.20.0/org.eclipse.tycho.p2.resolver.impl-0.20.0.jar (180 KB at 468.9 KB/sec)
Downloading: http://repo.maven.apache.org/maven2/org/eclipse/tycho/org.eclipse.tycho.p2.maven.repository/0.20.0/org.eclipse.tycho.p2.maven.repository-0.20.0.jar
Downloaded: http://repo.maven.apache.org/maven2/org/eclipse/tycho/org.eclipse.tycho.p2.maven.repository/0.20.0/org.eclipse.tycho.p2.maven.repository-0.20.0.jar (135 KB at 398.2 KB/sec)
Downloading: http://repo.maven.apache.org/maven2/org/eclipse/tycho/org.eclipse.tycho.p2.tools.impl/0.20.0/org.eclipse.tycho.p2.tools.impl-0.20.0.jar
Downloaded: http://repo.maven.apache.org/maven2/org/eclipse/tycho/org.eclipse.tycho.p2.tools.impl/0.20.0/org.eclipse.tycho.p2.tools.impl-0.20.0.jar (36 KB at 144.3 KB/sec)
Downloading: http://repo.maven.apache.org/maven2/org/jacoco/jacoco-maven-plugin/0.5.6.201201232323/jacoco-maven-plugin-0.5.6.201201232323.pom
Downloaded: http://repo.maven.apache.org/maven2/org/jacoco/jacoco-maven-plugin/0.5.6.201201232323/jacoco-maven-plugin-0.5.6.201201232323.pom (4 KB at 12.6 KB/sec)
Downloading: http://repo.maven.apache.org/maven2/org/jacoco/org.jacoco.build/0.5.6.201201232323/org.jacoco.build-0.5.6.201201232323.pom
Downloaded: http://repo.maven.apache.org/maven2/org/jacoco/org.jacoco.build/0.5.6.201201232323/org.jacoco.build-0.5.6.201201232323.pom (27 KB at 87.0 KB/sec)
Downloading: http://repo.maven.apache.org/maven2/org/jacoco/jacoco-maven-plugin/0.5.6.201201232323/jacoco-maven-plugin-0.5.6.201201232323.jar
Downloaded: http://repo.maven.apache.org/maven2/org/jacoco/jacoco-maven-plugin/0.5.6.201201232323/jacoco-maven-plugin-0.5.6.201201232323.jar (24 KB at 76.6 KB/sec)
Downloading: http://repo.maven.apache.org/maven2/org/eclipse/tycho/target-platform-configuration/0.20.0/target-platform-configuration-0.20.0.pom
Downloaded: http://repo.maven.apache.org/maven2/org/eclipse/tycho/target-platform-configuration/0.20.0/target-platform-configuration-0.20.0.pom (2 KB at 5.6 KB/sec)
Downloading: http://repo.maven.apache.org/maven2/org/eclipse/tycho/target-platform-configuration/0.20.0/target-platform-configuration-0.20.0.jar
Downloaded: http://repo.maven.apache.org/maven2/org/eclipse/tycho/target-platform-configuration/0.20.0/target-platform-configuration-0.20.0.jar (4 KB at 13.5 KB/sec)
Downloading: http://repo.maven.apache.org/maven2/org/apache/maven/plugins/maven-clean-plugin/2.4.1/maven-clean-plugin-2.4.1.pom
Downloaded: http://repo.maven.apache.org/maven2/org/apache/maven/plugins/maven-clean-plugin/2.4.1/maven-clean-plugin-2.4.1.pom (5 KB at 20.7 KB/sec)
Downloading: http://repo.maven.apache.org/maven2/org/apache/maven/plugins/maven-plugins/18/maven-plugins-18.pom
Downloaded: http://repo.maven.apache.org/maven2/org/apache/maven/plugins/maven-plugins/18/maven-plugins-18.pom (13 KB at 65.1 KB/sec)
Downloading: http://repo.maven.apache.org/maven2/org/apache/maven/maven-parent/16/maven-parent-16.pom
Downloaded: http://repo.maven.apache.org/maven2/org/apache/maven/maven-parent/16/maven-parent-16.pom (23 KB at 93.5 KB/sec)
Downloading: http://repo.maven.apache.org/maven2/org/apache/apache/7/apache-7.pom
Downloaded: http://repo.maven.apache.org/maven2/org/apache/apache/7/apache-7.pom (15 KB at 58.5 KB/sec)
Downloading: http://repo.maven.apache.org/maven2/org/apache/maven/plugins/maven-clean-plugin/2.4.1/maven-clean-plugin-2.4.1.jar
Downloaded: http://repo.maven.apache.org/maven2/org/apache/maven/plugins/maven-clean-plugin/2.4.1/maven-clean-plugin-2.4.1.jar (23 KB at 95.4 KB/sec)
Downloading: http://repo.maven.apache.org/maven2/org/apache/maven/plugins/maven-install-plugin/2.3.1/maven-install-plugin-2.3.1.pom
Downloaded: http://repo.maven.apache.org/maven2/org/apache/maven/plugins/maven-install-plugin/2.3.1/maven-install-plugin-2.3.1.pom (5 KB at 24.5 KB/sec)
Downloading: http://repo.maven.apache.org/maven2/org/apache/maven/plugins/maven-install-plugin/2.3.1/maven-install-plugin-2.3.1.jar
Downloaded: http://repo.maven.apache.org/maven2/org/apache/maven/plugins/maven-install-plugin/2.3.1/maven-install-plugin-2.3.1.jar (23 KB at 91.8 KB/sec)
Downloading: http://repo.maven.apache.org/maven2/org/eclipse/tycho/tycho-p2-plugin/0.20.0/tycho-p2-plugin-0.20.0.pom
Downloaded: http://repo.maven.apache.org/maven2/org/eclipse/tycho/tycho-p2-plugin/0.20.0/tycho-p2-plugin-0.20.0.pom (3 KB at 10.5 KB/sec)
Downloading: http://repo.maven.apache.org/maven2/org/eclipse/tycho/tycho-p2-plugin/0.20.0/tycho-p2-plugin-0.20.0.jar
Downloaded: http://repo.maven.apache.org/maven2/org/eclipse/tycho/tycho-p2-plugin/0.20.0/tycho-p2-plugin-0.20.0.jar (24 KB at 95.4 KB/sec)
Downloading: http://repo.maven.apache.org/maven2/org/eclipse/tycho/sisu-equinox-launching/0.20.0/sisu-equinox-launching-0.20.0.pom
Downloaded: http://repo.maven.apache.org/maven2/org/eclipse/tycho/sisu-equinox-launching/0.20.0/sisu-equinox-launching-0.20.0.pom (3 KB at 12.2 KB/sec)
Downloading: http://repo.maven.apache.org/maven2/org/apache/commons/commons-exec/1.2/commons-exec-1.2.pom
Downloaded: http://repo.maven.apache.org/maven2/org/apache/commons/commons-exec/1.2/commons-exec-1.2.pom (11 KB at 53.9 KB/sec)
Downloading: http://repo.maven.apache.org/maven2/org/apache/commons/commons-parent/32/commons-parent-32.pom
Downloaded: http://repo.maven.apache.org/maven2/org/apache/commons/commons-parent/32/commons-parent-32.pom (52 KB at 179.6 KB/sec)
Downloading: http://repo.maven.apache.org/maven2/org/apache/apache/13/apache-13.pom
Downloaded: http://repo.maven.apache.org/maven2/org/apache/apache/13/apache-13.pom (14 KB at 57.3 KB/sec)
Downloading: http://repo.maven.apache.org/maven2/org/eclipse/tycho/tycho-artifactcomparator/0.20.0/tycho-artifactcomparator-0.20.0.pom
Downloaded: http://repo.maven.apache.org/maven2/org/eclipse/tycho/tycho-artifactcomparator/0.20.0/tycho-artifactcomparator-0.20.0.pom (2 KB at 6.7 KB/sec)
Downloading: http://repo.maven.apache.org/maven2/org/ow2/asm/asm-debug-all/4.0/asm-debug-all-4.0.pom
Downloaded: http://repo.maven.apache.org/maven2/org/ow2/asm/asm-debug-all/4.0/asm-debug-all-4.0.pom (2 KB at 9.9 KB/sec)
Downloading: http://repo.maven.apache.org/maven2/org/ow2/asm/asm-parent/4.0/asm-parent-4.0.pom
Downloaded: http://repo.maven.apache.org/maven2/org/ow2/asm/asm-parent/4.0/asm-parent-4.0.pom (6 KB at 27.5 KB/sec)
Downloading: http://repo.maven.apache.org/maven2/org/ow2/ow2/1.3/ow2-1.3.pom
Downloaded: http://repo.maven.apache.org/maven2/org/ow2/ow2/1.3/ow2-1.3.pom (10 KB at 47.1 KB/sec)
Downloading: http://repo.maven.apache.org/maven2/org/eclipse/tycho/sisu-equinox-launching/0.20.0/sisu-equinox-launching-0.20.0.jar
Downloading: http://repo.maven.apache.org/maven2/org/apache/commons/commons-exec/1.2/commons-exec-1.2.jar
Downloading: http://repo.maven.apache.org/maven2/org/eclipse/tycho/tycho-artifactcomparator/0.20.0/tycho-artifactcomparator-0.20.0.jar
Downloading: http://repo.maven.apache.org/maven2/org/ow2/asm/asm-debug-all/4.0/asm-debug-all-4.0.jar
Downloaded: http://repo.maven.apache.org/maven2/org/eclipse/tycho/sisu-equinox-launching/0.20.0/sisu-equinox-launching-0.20.0.jar (26 KB at 106.0 KB/sec)
Downloaded: http://repo.maven.apache.org/maven2/org/apache/commons/commons-exec/1.2/commons-exec-1.2.jar (53 KB at 184.2 KB/sec)
Downloaded: http://repo.maven.apache.org/maven2/org/ow2/asm/asm-debug-all/4.0/asm-debug-all-4.0.jar (314 KB at 723.9 KB/sec)
Downloaded: http://repo.maven.apache.org/maven2/org/eclipse/tycho/tycho-artifactcomparator/0.20.0/tycho-artifactcomparator-0.20.0.jar (19 KB at 12.1 KB/sec)
Downloading: http://repo.maven.apache.org/maven2/org/apache/maven/plugins/maven-resources-plugin/2.4.1/maven-resources-plugin-2.4.1.pom
Downloaded: http://repo.maven.apache.org/maven2/org/apache/maven/plugins/maven-resources-plugin/2.4.1/maven-resources-plugin-2.4.1.pom (6 KB at 29.8 KB/sec)
Downloading: http://repo.maven.apache.org/maven2/org/apache/maven/plugins/maven-plugins/14/maven-plugins-14.pom
Downloaded: http://repo.maven.apache.org/maven2/org/apache/maven/plugins/maven-plugins/14/maven-plugins-14.pom (13 KB at 70.8 KB/sec)
Downloading: http://repo.maven.apache.org/maven2/org/apache/maven/maven-parent/13/maven-parent-13.pom
Downloaded: http://repo.maven.apache.org/maven2/org/apache/maven/maven-parent/13/maven-parent-13.pom (23 KB at 104.8 KB/sec)
Downloading: http://repo.maven.apache.org/maven2/org/apache/maven/plugins/maven-resources-plugin/2.4.1/maven-resources-plugin-2.4.1.jar
Downloaded: http://repo.maven.apache.org/maven2/org/apache/maven/plugins/maven-resources-plugin/2.4.1/maven-resources-plugin-2.4.1.jar (24 KB at 113.6 KB/sec)
Downloading: http://repo.maven.apache.org/maven2/org/eclipse/tycho/tycho-compiler-plugin/0.20.0/tycho-compiler-plugin-0.20.0.pom
Downloaded: http://repo.maven.apache.org/maven2/org/eclipse/tycho/tycho-compiler-plugin/0.20.0/tycho-compiler-plugin-0.20.0.pom (3 KB at 14.3 KB/sec)
Downloading: http://repo.maven.apache.org/maven2/org/eclipse/tycho/tycho-compiler-plugin/0.20.0/tycho-compiler-plugin-0.20.0.jar
Downloaded: http://repo.maven.apache.org/maven2/org/eclipse/tycho/tycho-compiler-plugin/0.20.0/tycho-compiler-plugin-0.20.0.jar (27 KB at 124.7 KB/sec)
Downloading: http://repo.maven.apache.org/maven2/org/eclipse/tycho/tycho-packaging-plugin/0.20.0/tycho-packaging-plugin-0.20.0.pom
Downloaded: http://repo.maven.apache.org/maven2/org/eclipse/tycho/tycho-packaging-plugin/0.20.0/tycho-packaging-plugin-0.20.0.pom (3 KB at 11.9 KB/sec)
Downloading: http://repo.maven.apache.org/maven2/org/eclipse/tycho/tycho-packaging-plugin/0.20.0/tycho-packaging-plugin-0.20.0.jar
Downloaded: http://repo.maven.apache.org/maven2/org/eclipse/tycho/tycho-packaging-plugin/0.20.0/tycho-packaging-plugin-0.20.0.jar (108 KB at 307.9 KB/sec)
Downloading: http://repo.maven.apache.org/maven2/org/apache/maven/plugins/maven-deploy-plugin/2.5/maven-deploy-plugin-2.5.pom
Downloaded: http://repo.maven.apache.org/maven2/org/apache/maven/plugins/maven-deploy-plugin/2.5/maven-deploy-plugin-2.5.pom (6 KB at 32.8 KB/sec)
Downloading: http://repo.maven.apache.org/maven2/org/apache/maven/plugins/maven-plugins/16/maven-plugins-16.pom
Downloaded: http://repo.maven.apache.org/maven2/org/apache/maven/plugins/maven-plugins/16/maven-plugins-16.pom (13 KB at 73.1 KB/sec)
Downloading: http://repo.maven.apache.org/maven2/org/apache/maven/plugins/maven-deploy-plugin/2.5/maven-deploy-plugin-2.5.jar
Downloaded: http://repo.maven.apache.org/maven2/org/apache/maven/plugins/maven-deploy-plugin/2.5/maven-deploy-plugin-2.5.jar (23 KB at 107.4 KB/sec)
Downloading: http://repo.maven.apache.org/maven2/org/apache/maven/plugins/maven-site-plugin/3.0/maven-site-plugin-3.0.pom
Downloaded: http://repo.maven.apache.org/maven2/org/apache/maven/plugins/maven-site-plugin/3.0/maven-site-plugin-3.0.pom (20 KB at 94.8 KB/sec)
Downloading: http://repo.maven.apache.org/maven2/org/apache/maven/plugins/maven-plugins/21/maven-plugins-21.pom
Downloaded: http://repo.maven.apache.org/maven2/org/apache/maven/plugins/maven-plugins/21/maven-plugins-21.pom (13 KB at 71.7 KB/sec)
Downloading: http://repo.maven.apache.org/maven2/org/apache/maven/maven-parent/20/maven-parent-20.pom
Downloaded: http://repo.maven.apache.org/maven2/org/apache/maven/maven-parent/20/maven-parent-20.pom (25 KB at 115.0 KB/sec)
Downloading: http://repo.maven.apache.org/maven2/org/apache/apache/9/apache-9.pom
Downloaded: http://repo.maven.apache.org/maven2/org/apache/apache/9/apache-9.pom (15 KB at 71.2 KB/sec)
Downloading: http://repo.maven.apache.org/maven2/org/apache/maven/plugins/maven-site-plugin/3.0/maven-site-plugin-3.0.jar
Downloaded: http://repo.maven.apache.org/maven2/org/apache/maven/plugins/maven-site-plugin/3.0/maven-site-plugin-3.0.jar (112 KB at 385.6 KB/sec)
Downloading: http://repo.maven.apache.org/maven2/org/eclipse/tycho/tycho-surefire-plugin/0.20.0/tycho-surefire-plugin-0.20.0.pom
Downloaded: http://repo.maven.apache.org/maven2/org/eclipse/tycho/tycho-surefire-plugin/0.20.0/tycho-surefire-plugin-0.20.0.pom (4 KB at 17.8 KB/sec)
Downloading: http://repo.maven.apache.org/maven2/org/eclipse/tycho/tycho-surefire/0.20.0/tycho-surefire-0.20.0.pom
Downloaded: http://repo.maven.apache.org/maven2/org/eclipse/tycho/tycho-surefire/0.20.0/tycho-surefire-0.20.0.pom (3 KB at 16.1 KB/sec)
Downloading: http://repo.maven.apache.org/maven2/org/eclipse/tycho/tycho-surefire-plugin/0.20.0/tycho-surefire-plugin-0.20.0.jar
Downloaded: http://repo.maven.apache.org/maven2/org/eclipse/tycho/tycho-surefire-plugin/0.20.0/tycho-surefire-plugin-0.20.0.jar (43 KB at 171.5 KB/sec)
Downloading: http://repo.maven.apache.org/maven2/org/eclipse/tycho/org.eclipse.tycho.surefire.osgibooter/0.20.0/org.eclipse.tycho.surefire.osgibooter-0.20.0.pom
Downloaded: http://repo.maven.apache.org/maven2/org/eclipse/tycho/org.eclipse.tycho.surefire.osgibooter/0.20.0/org.eclipse.tycho.surefire.osgibooter-0.20.0.pom (2 KB at 10.9 KB/sec)
Downloading: http://repo.maven.apache.org/maven2/org/eclipse/tycho/org.eclipse.tycho.surefire.junit/0.20.0/org.eclipse.tycho.surefire.junit-0.20.0.pom
Downloaded: http://repo.maven.apache.org/maven2/org/eclipse/tycho/org.eclipse.tycho.surefire.junit/0.20.0/org.eclipse.tycho.surefire.junit-0.20.0.pom (2 KB at 9.2 KB/sec)
Downloading: http://repo.maven.apache.org/maven2/org/eclipse/tycho/org.eclipse.tycho.surefire.junit4/0.20.0/org.eclipse.tycho.surefire.junit4-0.20.0.pom
Downloaded: http://repo.maven.apache.org/maven2/org/eclipse/tycho/org.eclipse.tycho.surefire.junit4/0.20.0/org.eclipse.tycho.surefire.junit4-0.20.0.pom (2 KB at 9.3 KB/sec)
Downloading: http://repo.maven.apache.org/maven2/org/eclipse/tycho/org.eclipse.tycho.surefire.junit47/0.20.0/org.eclipse.tycho.surefire.junit47-0.20.0.pom
Downloaded: http://repo.maven.apache.org/maven2/org/eclipse/tycho/org.eclipse.tycho.surefire.junit47/0.20.0/org.eclipse.tycho.surefire.junit47-0.20.0.pom (2 KB at 9.1 KB/sec)
Downloading: http://repo.maven.apache.org/maven2/org/apache/maven/surefire/surefire-api/2.10/surefire-api-2.10.pom
Downloaded: http://repo.maven.apache.org/maven2/org/apache/maven/surefire/surefire-api/2.10/surefire-api-2.10.pom (3 KB at 13.1 KB/sec)
Downloading: http://repo.maven.apache.org/maven2/org/apache/maven/surefire/surefire/2.10/surefire-2.10.pom
Downloaded: http://repo.maven.apache.org/maven2/org/apache/maven/surefire/surefire/2.10/surefire-2.10.pom (12 KB at 68.1 KB/sec)
Downloading: http://repo.maven.apache.org/maven2/org/eclipse/tycho/org.eclipse.tycho.surefire.osgibooter/0.20.0/org.eclipse.tycho.surefire.osgibooter-0.20.0.jar
Downloading: http://repo.maven.apache.org/maven2/org/eclipse/tycho/org.eclipse.tycho.surefire.junit/0.20.0/org.eclipse.tycho.surefire.junit-0.20.0.jar
Downloading: http://repo.maven.apache.org/maven2/org/eclipse/tycho/org.eclipse.tycho.surefire.junit4/0.20.0/org.eclipse.tycho.surefire.junit4-0.20.0.jar
Downloading: http://repo.maven.apache.org/maven2/org/eclipse/tycho/org.eclipse.tycho.surefire.junit47/0.20.0/org.eclipse.tycho.surefire.junit47-0.20.0.jar
Downloading: http://repo.maven.apache.org/maven2/org/apache/maven/surefire/surefire-api/2.10/surefire-api-2.10.jar
Downloaded: http://repo.maven.apache.org/maven2/org/eclipse/tycho/org.eclipse.tycho.surefire.junit/0.20.0/org.eclipse.tycho.surefire.junit-0.20.0.jar (25 KB at 105.0 KB/sec)
Downloaded: http://repo.maven.apache.org/maven2/org/eclipse/tycho/org.eclipse.tycho.surefire.junit47/0.20.0/org.eclipse.tycho.surefire.junit47-0.20.0.jar (49 KB at 168.2 KB/sec)
Downloaded: http://repo.maven.apache.org/maven2/org/apache/maven/surefire/surefire-api/2.10/surefire-api-2.10.jar (158 KB at 416.8 KB/sec)
Downloaded: http://repo.maven.apache.org/maven2/org/eclipse/tycho/org.eclipse.tycho.surefire.junit4/0.20.0/org.eclipse.tycho.surefire.junit4-0.20.0.jar (29 KB at 75.9 KB/sec)
Downloaded: http://repo.maven.apache.org/maven2/org/eclipse/tycho/org.eclipse.tycho.surefire.osgibooter/0.20.0/org.eclipse.tycho.surefire.osgibooter-0.20.0.jar (181 KB at 439.4 KB/sec)
Downloading: http://repo.maven.apache.org/maven2/org/codehaus/mojo/xml-maven-plugin/1.0-beta-3/xml-maven-plugin-1.0-beta-3.pom
Downloaded: http://repo.maven.apache.org/maven2/org/codehaus/mojo/xml-maven-plugin/1.0-beta-3/xml-maven-plugin-1.0-beta-3.pom (6 KB at 25.7 KB/sec)
Downloading: http://repo.maven.apache.org/maven2/org/codehaus/mojo/mojo-parent/21/mojo-parent-21.pom
Downloaded: http://repo.maven.apache.org/maven2/org/codehaus/mojo/mojo-parent/21/mojo-parent-21.pom (19 KB at 86.6 KB/sec)
Downloading: http://repo.maven.apache.org/maven2/org/codehaus/mojo/xml-maven-plugin/1.0-beta-3/xml-maven-plugin-1.0-beta-3.jar
Downloaded: http://repo.maven.apache.org/maven2/org/codehaus/mojo/xml-maven-plugin/1.0-beta-3/xml-maven-plugin-1.0-beta-3.jar (31 KB at 129.2 KB/sec)
Downloading: http://repo.maven.apache.org/maven2/org/eclipse/tycho/tycho-source-plugin/0.20.0/tycho-source-plugin-0.20.0.pom
Downloaded: http://repo.maven.apache.org/maven2/org/eclipse/tycho/tycho-source-plugin/0.20.0/tycho-source-plugin-0.20.0.pom (3 KB at 12.2 KB/sec)
Downloading: http://repo.maven.apache.org/maven2/org/eclipse/tycho/tycho-source-plugin/0.20.0/tycho-source-plugin-0.20.0.jar
Downloaded: http://repo.maven.apache.org/maven2/org/eclipse/tycho/tycho-source-plugin/0.20.0/tycho-source-plugin-0.20.0.jar (19 KB at 78.4 KB/sec)
Downloading: http://repo.maven.apache.org/maven2/org/apache/maven/plugins/maven-source-plugin/2.1/maven-source-plugin-2.1.pom
Downloaded: http://repo.maven.apache.org/maven2/org/apache/maven/plugins/maven-source-plugin/2.1/maven-source-plugin-2.1.pom (5 KB at 28.6 KB/sec)
Downloading: http://repo.maven.apache.org/maven2/org/apache/maven/plugins/maven-plugins/13/maven-plugins-13.pom
Downloaded: http://repo.maven.apache.org/maven2/org/apache/maven/plugins/maven-plugins/13/maven-plugins-13.pom (12 KB at 67.3 KB/sec)
Downloading: http://repo.maven.apache.org/maven2/org/apache/maven/maven-parent/11/maven-parent-11.pom
Downloaded: http://repo.maven.apache.org/maven2/org/apache/maven/maven-parent/11/maven-parent-11.pom (32 KB at 132.4 KB/sec)
Downloading: http://repo.maven.apache.org/maven2/org/apache/apache/5/apache-5.pom
Downloaded: http://repo.maven.apache.org/maven2/org/apache/apache/5/apache-5.pom (5 KB at 23.4 KB/sec)
Downloading: http://repo.maven.apache.org/maven2/org/apache/maven/maven-archiver/2.5/maven-archiver-2.5.pom
Downloaded: http://repo.maven.apache.org/maven2/org/apache/maven/maven-archiver/2.5/maven-archiver-2.5.pom (5 KB at 26.1 KB/sec)
Downloading: http://repo.maven.apache.org/maven2/org/apache/maven/shared/maven-shared-components/17/maven-shared-components-17.pom
Downloaded: http://repo.maven.apache.org/maven2/org/apache/maven/shared/maven-shared-components/17/maven-shared-components-17.pom (9 KB at 49.7 KB/sec)
Downloading: http://repo.maven.apache.org/maven2/org/apache/maven/maven-parent/21/maven-parent-21.pom
Downloaded: http://repo.maven.apache.org/maven2/org/apache/maven/maven-parent/21/maven-parent-21.pom (26 KB at 123.2 KB/sec)
Downloading: http://repo.maven.apache.org/maven2/org/apache/apache/10/apache-10.pom
Downloaded: http://repo.maven.apache.org/maven2/org/apache/apache/10/apache-10.pom (15 KB at 69.5 KB/sec)
Downloading: http://repo.maven.apache.org/maven2/org/codehaus/plexus/plexus-interpolation/1.15/plexus-interpolation-1.15.pom
Downloaded: http://repo.maven.apache.org/maven2/org/codehaus/plexus/plexus-interpolation/1.15/plexus-interpolation-1.15.pom (1018 B at 5.7 KB/sec)
Downloading: http://repo.maven.apache.org/maven2/org/codehaus/plexus/plexus/3.0.1/plexus-3.0.1.pom
Downloaded: http://repo.maven.apache.org/maven2/org/codehaus/plexus/plexus/3.0.1/plexus-3.0.1.pom (19 KB at 87.0 KB/sec)
Downloading: http://repo.maven.apache.org/maven2/org/apache/maven/plugins/maven-source-plugin/2.1/maven-source-plugin-2.1.jar
Downloading: http://repo.maven.apache.org/maven2/org/apache/maven/maven-archiver/2.5/maven-archiver-2.5.jar
Downloaded: http://repo.maven.apache.org/maven2/org/apache/maven/plugins/maven-source-plugin/2.1/maven-source-plugin-2.1.jar (24 KB at 111.4 KB/sec)
Downloaded: http://repo.maven.apache.org/maven2/org/apache/maven/maven-archiver/2.5/maven-archiver-2.5.jar (22 KB at 88.8 KB/sec)
Downloading: http://repo.maven.apache.org/maven2/org/apache/maven/plugins/maven-antrun-plugin/1.6/maven-antrun-plugin-1.6.pom
Downloaded: http://repo.maven.apache.org/maven2/org/apache/maven/plugins/maven-antrun-plugin/1.6/maven-antrun-plugin-1.6.pom (5 KB at 20.5 KB/sec)
Downloading: http://repo.maven.apache.org/maven2/org/apache/maven/plugins/maven-antrun-plugin/1.6/maven-antrun-plugin-1.6.jar
Downloaded: http://repo.maven.apache.org/maven2/org/apache/maven/plugins/maven-antrun-plugin/1.6/maven-antrun-plugin-1.6.jar (29 KB at 120.2 KB/sec)
Downloading: http://repo.maven.apache.org/maven2/org/codehaus/mojo/findbugs-maven-plugin/2.3.2/findbugs-maven-plugin-2.3.2.pom
Downloaded: http://repo.maven.apache.org/maven2/org/codehaus/mojo/findbugs-maven-plugin/2.3.2/findbugs-maven-plugin-2.3.2.pom (16 KB at 56.5 KB/sec)
Downloading: http://repo.maven.apache.org/maven2/org/codehaus/mojo/mojo-parent/28/mojo-parent-28.pom
Downloaded: http://repo.maven.apache.org/maven2/org/codehaus/mojo/mojo-parent/28/mojo-parent-28.pom (26 KB at 106.2 KB/sec)
Downloading: http://repo.maven.apache.org/maven2/org/codehaus/codehaus-parent/3/codehaus-parent-3.pom
Downloaded: http://repo.maven.apache.org/maven2/org/codehaus/codehaus-parent/3/codehaus-parent-3.pom (5 KB at 20.4 KB/sec)
Downloading: http://repo.maven.apache.org/maven2/org/codehaus/mojo/findbugs-maven-plugin/2.3.2/findbugs-maven-plugin-2.3.2.jar
Downloaded: http://repo.maven.apache.org/maven2/org/codehaus/mojo/findbugs-maven-plugin/2.3.2/findbugs-maven-plugin-2.3.2.jar (117 KB at 347.4 KB/sec)
Downloading: http://repo.maven.apache.org/maven2/org/apache/maven/plugins/maven-pmd-plugin/2.5/maven-pmd-plugin-2.5.pom
Downloaded: http://repo.maven.apache.org/maven2/org/apache/maven/plugins/maven-pmd-plugin/2.5/maven-pmd-plugin-2.5.pom (8 KB at 27.2 KB/sec)
Downloading: http://repo.maven.apache.org/maven2/org/apache/maven/plugins/maven-plugins/17/maven-plugins-17.pom
Downloaded: http://repo.maven.apache.org/maven2/org/apache/maven/plugins/maven-plugins/17/maven-plugins-17.pom (13 KB at 63.5 KB/sec)
Downloading: http://repo.maven.apache.org/maven2/org/apache/maven/plugins/maven-pmd-plugin/2.5/maven-pmd-plugin-2.5.jar
Downloaded: http://repo.maven.apache.org/maven2/org/apache/maven/plugins/maven-pmd-plugin/2.5/maven-pmd-plugin-2.5.jar (57 KB at 171.0 KB/sec)
Downloading: http://repo.maven.apache.org/maven2/org/eclipse/tycho/tycho-p2-publisher-plugin/0.20.0/tycho-p2-publisher-plugin-0.20.0.pom
Downloaded: http://repo.maven.apache.org/maven2/org/eclipse/tycho/tycho-p2-publisher-plugin/0.20.0/tycho-p2-publisher-plugin-0.20.0.pom (2 KB at 8.3 KB/sec)
Downloading: http://repo.maven.apache.org/maven2/org/eclipse/tycho/tycho-p2-publisher-plugin/0.20.0/tycho-p2-publisher-plugin-0.20.0.jar
Downloaded: http://repo.maven.apache.org/maven2/org/eclipse/tycho/tycho-p2-publisher-plugin/0.20.0/tycho-p2-publisher-plugin-0.20.0.jar (21 KB at 85.8 KB/sec)
Downloading: http://repo.maven.apache.org/maven2/org/eclipse/tycho/tycho-p2-repository-plugin/0.20.0/tycho-p2-repository-plugin-0.20.0.pom
Downloaded: http://repo.maven.apache.org/maven2/org/eclipse/tycho/tycho-p2-repository-plugin/0.20.0/tycho-p2-repository-plugin-0.20.0.pom (2 KB at 6.5 KB/sec)
Downloading: http://repo.maven.apache.org/maven2/org/eclipse/tycho/tycho-p2-repository-plugin/0.20.0/tycho-p2-repository-plugin-0.20.0.jar
Downloaded: http://repo.maven.apache.org/maven2/org/eclipse/tycho/tycho-p2-repository-plugin/0.20.0/tycho-p2-repository-plugin-0.20.0.jar (11 KB at 50.8 KB/sec)
[INFO] Computing target platform for MavenProject: org.eclipse.mylyn:org.eclipse.mylyn.discovery:3.7.0 @ /jobs/genie.mylyn/mylyn-3.18.x-release/workspace/org.eclipse.mylyn/org.eclipse.mylyn.discovery-directory/pom.xml
[INFO] Adding repository http://download.eclipse.org/tools/orbit/downloads/drops/R20150821153341/repository
[INFO] Fetching content.jar from http://download.eclipse.org/tools/orbit/downloads/drops/R20150821153341/repository/ (0B of 175.77kB at 0B/s)
[INFO] Adding repository http://download.eclipse.org/tools/orbit/downloads/drops/R20130517111416/repository
[INFO] Fetching content.jar from http://download.eclipse.org/tools/orbit/downloads/drops/R20130517111416/repository/ (0B of 172.36kB at 0B/s)
[INFO] Fetching p2.index from http://download.eclipse.org/releases/luna/ (0B of 128B at 0B/s)
[INFO] Adding repository http://download.eclipse.org/releases/luna
[INFO] Fetching compositeContent.jar from http://download.eclipse.org/releases/luna/ (0B of 518B at 0B/s)
[INFO] Fetching p2.index from http://download.eclipse.org/releases/luna/201406250900/ (0B of 365B at 0B/s)
[INFO] Fetching content.jar from http://download.eclipse.org/releases/luna/201406250900/ (0B of 2.5MB at 0B/s)
[INFO] Fetching p2.index from http://download.eclipse.org/releases/luna/201409261001/ (0B of 365B at 0B/s)
[INFO] Fetching content.jar from http://download.eclipse.org/releases/luna/201409261001/ (0B of 2.59MB at 0B/s)
[INFO] Fetching p2.index from http://download.eclipse.org/releases/luna/201501121000/ (0B of 365B at 0B/s)
[INFO] Fetching content.jar from http://download.eclipse.org/releases/luna/201501121000/ (0B of 2.59MB at 0B/s)
[INFO] Fetching p2.index from http://download.eclipse.org/releases/luna/201502271000/ (0B of 365B at 0B/s)
[INFO] Fetching content.jar from http://download.eclipse.org/releases/luna/201502271000/ (0B of 2.61MB at 0B/s)
[INFO] Fetching content.jar from http://download.eclipse.org/technology/epp/packages/luna/ (0B of 320.79kB at 0B/s)
Dec 01, 2015 8:04:16 PM org.apache.http.client.protocol.ResponseProcessCookies processCookies
WARNING: Cookie rejected: "[version: 0][name: JSESSIONID][value: 05BC438D6E8B77DD1847136D4CDBC998][domain: subclipse.tigris.org][path: /servlets][expiry: null]". Illegal path attribute "/servlets". Path of origin: "/archive/subclipse_1.8.10/p2.index"
[INFO] Adding repository http://subclipse.tigris.org/archive/subclipse_1.8.10
Dec 01, 2015 8:04:17 PM org.apache.http.client.protocol.ResponseProcessCookies processCookies
WARNING: Cookie rejected: "[version: 0][name: JSESSIONID][value: 84F2B2460A0DE9D2B3B9D74E283CCA85][domain: subclipse.tigris.org][path: /servlets][expiry: null]". Illegal path attribute "/servlets". Path of origin: "/archive/subclipse_1.8.10/content.jar"
Dec 01, 2015 8:04:17 PM org.apache.http.client.protocol.ResponseProcessCookies processCookies
WARNING: Cookie rejected: "[version: 0][name: JSESSIONID][value: BA3CA404C965FFD3C9CB0B7D4ED85162][domain: subclipse.tigris.org][path: /servlets][expiry: null]". Illegal path attribute "/servlets". Path of origin: "/archive/subclipse_1.8.10/content.xml"
Dec 01, 2015 8:04:17 PM org.apache.http.client.protocol.ResponseProcessCookies processCookies
WARNING: Cookie rejected: "[version: 0][name: JSESSIONID][value: 44FFBD70ABDBEEB8BDF0D367102E2F99][domain: subclipse.tigris.org][path: /servlets][expiry: null]". Illegal path attribute "/servlets". Path of origin: "/archive/subclipse_1.8.10/content.xml"
[INFO] Fetching content.xml from http://subclipse.tigris.org/archive/subclipse_1.8.10/ (0B at 0B/s)
[INFO] Adding repository http://download.eclipse.org/eclipse/updates/3.8/R-3.8.2-201301310800
[INFO] Fetching content.jar from http://download.eclipse.org/eclipse/updates/3.8/R-3.8.2-201301310800/ (0B of 335.64kB at 0B/s)
[INFO] Fetching p2.index from http://download.eclipse.org/cbi/updates/license/ (0B of 128B at 0B/s)
[INFO] Adding repository http://download.eclipse.org/cbi/updates/license
[INFO] Fetching compositeContent.jar from http://download.eclipse.org/cbi/updates/license/ (0B of 414B at 0B/s)
[INFO] Fetching content.jar from http://download.eclipse.org/cbi/updates/license/1.0.0.v20131003-1638/ (0B of 3.87kB at 0B/s)
[INFO] Fetching content.jar from http://download.eclipse.org/cbi/updates/license/1.0.1.v20140414-1359/ (0B of 3.83kB at 0B/s)
[INFO] Resolving dependencies of MavenProject: org.eclipse.mylyn:org.eclipse.mylyn.discovery:3.7.0 @ /jobs/genie.mylyn/mylyn-3.18.x-release/workspace/org.eclipse.mylyn/org.eclipse.mylyn.discovery-directory/pom.xml
[INFO] Resolving class path of MavenProject: org.eclipse.mylyn:org.eclipse.mylyn.discovery:3.7.0 @ /jobs/genie.mylyn/mylyn-3.18.x-release/workspace/org.eclipse.mylyn/org.eclipse.mylyn.discovery-directory/pom.xml
[INFO] Computing target platform for MavenProject: org.eclipse.mylyn:org.eclipse.mylyn.tests:3.18.0-SNAPSHOT @ /jobs/genie.mylyn/mylyn-3.18.x-release/workspace/org.eclipse.mylyn/org.eclipse.mylyn.tests/pom.xml
[INFO] Resolving dependencies of MavenProject: org.eclipse.mylyn:org.eclipse.mylyn.tests:3.18.0-SNAPSHOT @ /jobs/genie.mylyn/mylyn-3.18.x-release/workspace/org.eclipse.mylyn/org.eclipse.mylyn.tests/pom.xml
[INFO] o.h.m.e.h.MavenExecutionResultHandler - Build failed with exception(s)
[INFO] o.h.m.e.h.MavenExecutionResultHandler - [1] org.apache.maven.InternalErrorException: Internal error: java.lang.RuntimeException: org.eclipse.equinox.p2.core.ProvisionException: Unable to read repository at http://download.eclipse.org/releases/luna.
[DEBUG] Closing connection to remote
[ERROR] Internal error: java.lang.RuntimeException: org.eclipse.equinox.p2.core.ProvisionException: Unable to read repository at http://download.eclipse.org/releases/luna. HTTP Server 'Service Unavailable': http://download.eclipse.org/releases/luna/201406250900/artifacts.jar: HttpComponents connection error response code 503. -> [Help 1]
org.apache.maven.InternalErrorException: Internal error: java.lang.RuntimeException: org.eclipse.equinox.p2.core.ProvisionException: Unable to read repository at http://download.eclipse.org/releases/luna.
	at org.apache.maven.DefaultMaven.execute(DefaultMaven.java:168)
	at org.apache.maven.cli.MavenCli.execute(MavenCli.java:537)
	at org.apache.maven.cli.MavenCli.doMain(MavenCli.java:196)
	at org.apache.maven.cli.MavenCli.main(MavenCli.java:141)
	at sun.reflect.NativeMethodAccessorImpl.invoke0(Native Method)
	at sun.reflect.NativeMethodAccessorImpl.invoke(NativeMethodAccessorImpl.java:57)
	at sun.reflect.DelegatingMethodAccessorImpl.invoke(DelegatingMethodAccessorImpl.java:43)
	at java.lang.reflect.Method.invoke(Method.java:606)
	at org.codehaus.plexus.classworlds.launcher.Launcher.launchEnhanced(Launcher.java:290)
	at org.codehaus.plexus.classworlds.launcher.Launcher.launch(Launcher.java:230)
	at org.codehaus.plexus.classworlds.launcher.Launcher.mainWithExitCode(Launcher.java:409)
	at org.codehaus.plexus.classworlds.launcher.Launcher.main(Launcher.java:352)
Caused by: java.lang.RuntimeException: org.eclipse.equinox.p2.core.ProvisionException: Unable to read repository at http://download.eclipse.org/releases/luna.
	at org.eclipse.tycho.repository.p2base.artifact.repository.RepositoryArtifactProvider$RepositoryLoader.loadRepositories(RepositoryArtifactProvider.java:67)
	at org.eclipse.tycho.repository.p2base.artifact.repository.RepositoryArtifactProvider.init(RepositoryArtifactProvider.java:96)
	at org.eclipse.tycho.repository.p2base.artifact.repository.RepositoryArtifactProvider.contains(RepositoryArtifactProvider.java:101)
	at org.eclipse.tycho.repository.local.MirroringArtifactProvider.contains(MirroringArtifactProvider.java:106)
	at org.eclipse.tycho.repository.p2base.artifact.provider.CompositeArtifactProvider.getArtifactFile(CompositeArtifactProvider.java:69)
	at org.eclipse.tycho.p2.target.TargetPlatformImpl.getLocalArtifactFile(TargetPlatformImpl.java:146)
	at org.eclipse.tycho.p2.impl.resolver.P2ResolverImpl.addUnit(P2ResolverImpl.java:208)
	at org.eclipse.tycho.p2.impl.resolver.P2ResolverImpl.toResolutionResult(P2ResolverImpl.java:171)
	at org.eclipse.tycho.p2.impl.resolver.P2ResolverImpl.resolveDependencies(P2ResolverImpl.java:163)
	at org.eclipse.tycho.p2.impl.resolver.P2ResolverImpl.resolveDependencies(P2ResolverImpl.java:107)
	at org.eclipse.tycho.p2.resolver.P2TargetPlatformResolver.doResolveDependencies(P2TargetPlatformResolver.java:348)
	at org.eclipse.tycho.p2.resolver.P2TargetPlatformResolver.resolveDependencies(P2TargetPlatformResolver.java:321)
	at org.eclipse.tycho.core.resolver.DefaultTychoDependencyResolver.resolveProject(DefaultTychoDependencyResolver.java:109)
	at org.eclipse.tycho.core.maven.TychoMavenLifecycleParticipant.afterProjectsRead(TychoMavenLifecycleParticipant.java:75)
	at org.apache.maven.DefaultMaven.doExecute(DefaultMaven.java:274)
	at org.apache.maven.DefaultMaven.execute(DefaultMaven.java:156)
	... 11 more
Caused by: org.eclipse.equinox.p2.core.ProvisionException: Unable to read repository at http://download.eclipse.org/releases/luna.
	at org.eclipse.equinox.internal.p2.artifact.repository.CompositeArtifactRepository.addChild(CompositeArtifactRepository.java:182)
	at org.eclipse.equinox.internal.p2.artifact.repository.CompositeArtifactRepository.<init>(CompositeArtifactRepository.java:96)
	at org.eclipse.equinox.internal.p2.artifact.repository.CompositeArtifactRepositoryFactory.load(CompositeArtifactRepositoryFactory.java:116)
	at org.eclipse.equinox.internal.p2.artifact.repository.ArtifactRepositoryManager.factoryLoad(ArtifactRepositoryManager.java:73)
	at org.eclipse.equinox.internal.p2.repository.helpers.AbstractRepositoryManager.loadRepository(AbstractRepositoryManager.java:768)
	at org.eclipse.equinox.internal.p2.repository.helpers.AbstractRepositoryManager.loadRepository(AbstractRepositoryManager.java:668)
	at org.eclipse.equinox.internal.p2.artifact.repository.ArtifactRepositoryManager.loadRepository(ArtifactRepositoryManager.java:104)
	at org.eclipse.equinox.internal.p2.artifact.repository.ArtifactRepositoryManager.loadRepository(ArtifactRepositoryManager.java:100)
	at org.eclipse.tycho.p2.remote.RemoteArtifactRepositoryManager.loadRepository(RemoteArtifactRepositoryManager.java:92)
	at org.eclipse.tycho.repository.p2base.artifact.repository.RepositoryArtifactProvider$RepositoryLoader.loadRepositories(RepositoryArtifactProvider.java:63)
	... 26 more
Caused by: org.eclipse.equinox.p2.core.ProvisionException: HTTP Server 'Service Unavailable': http://download.eclipse.org/releases/luna/201406250900/artifacts.jar
	at org.eclipse.equinox.internal.p2.repository.CacheManager.updateCache(CacheManager.java:371)
	at org.eclipse.equinox.internal.p2.repository.CacheManager.createCache(CacheManager.java:208)
	at org.eclipse.tycho.p2.remote.RemoteRepositoryCacheManager.createCache(RemoteRepositoryCacheManager.java:66)
	at org.eclipse.equinox.internal.p2.artifact.repository.simple.SimpleArtifactRepositoryFactory.getLocalFile(SimpleArtifactRepositoryFactory.java:65)
	at org.eclipse.equinox.internal.p2.artifact.repository.simple.SimpleArtifactRepositoryFactory.load(SimpleArtifactRepositoryFactory.java:88)
	at org.eclipse.equinox.internal.p2.artifact.repository.simple.SimpleArtifactRepositoryFactory.load(SimpleArtifactRepositoryFactory.java:76)
	at org.eclipse.equinox.internal.p2.artifact.repository.ArtifactRepositoryManager.factoryLoad(ArtifactRepositoryManager.java:73)
	at org.eclipse.equinox.internal.p2.repository.helpers.AbstractRepositoryManager.loadRepository(AbstractRepositoryManager.java:768)
	at org.eclipse.equinox.internal.p2.repository.helpers.AbstractRepositoryManager.loadRepository(AbstractRepositoryManager.java:668)
	at org.eclipse.equinox.internal.p2.artifact.repository.ArtifactRepositoryManager.loadRepository(ArtifactRepositoryManager.java:104)
	at org.eclipse.equinox.internal.p2.artifact.repository.ArtifactRepositoryManager.loadRepository(ArtifactRepositoryManager.java:100)
	at org.eclipse.tycho.p2.remote.RemoteArtifactRepositoryManager.loadRepository(RemoteArtifactRepositoryManager.java:92)
	at org.eclipse.equinox.internal.p2.artifact.repository.CompositeArtifactRepository.load(CompositeArtifactRepository.java:474)
	at org.eclipse.equinox.internal.p2.artifact.repository.CompositeArtifactRepository.addChild(CompositeArtifactRepository.java:172)
	... 35 more
Caused by: org.eclipse.ecf.filetransfer.IncomingFileTransferException: HttpComponents connection error response code 503.
	at org.eclipse.ecf.provider.filetransfer.httpclient4.HttpClientRetrieveFileTransfer.openStreams(HttpClientRetrieveFileTransfer.java:665)
	at org.eclipse.ecf.provider.filetransfer.retrieve.AbstractRetrieveFileTransfer.sendRetrieveRequest(AbstractRetrieveFileTransfer.java:879)
	at org.eclipse.ecf.provider.filetransfer.retrieve.AbstractRetrieveFileTransfer.sendRetrieveRequest(AbstractRetrieveFileTransfer.java:570)
	at org.eclipse.ecf.provider.filetransfer.retrieve.MultiProtocolRetrieveAdapter.sendRetrieveRequest(MultiProtocolRetrieveAdapter.java:106)
	at org.eclipse.equinox.internal.p2.transport.ecf.FileReader.sendRetrieveRequest(FileReader.java:422)
	at org.eclipse.equinox.internal.p2.transport.ecf.FileReader.readInto(FileReader.java:355)
	at org.eclipse.equinox.internal.p2.transport.ecf.RepositoryTransport.download(RepositoryTransport.java:101)
	at org.eclipse.equinox.internal.p2.transport.ecf.RepositoryTransport.download(RepositoryTransport.java:156)
	at org.eclipse.equinox.internal.p2.repository.CacheManager.updateCache(CacheManager.java:345)
	... 48 more
[ERROR] 
[ERROR] To see the full stack trace of the errors, re-run Maven with the -e switch.
[ERROR] Re-run Maven using the -X switch to enable full debug logging.
[ERROR] 
[ERROR] For more information about the errors and possible solutions, please read the following articles:
[ERROR] [Help 1] http://cwiki.apache.org/confluence/display/MAVEN/InternalErrorException
[DEBUG] Waiting for process to finish
[DEBUG] Result: 1
Recording fingerprints
Archiving artifacts
Finished: FAILURE