Console Output

Started by an SCM change
Checkout:workspace / /home/hudson/genie.mylyn/.hudson/jobs/mylyn-3.17.x-release/workspace - hudson.remoting.LocalChannel@7791209b
Using strategy: Default
Last Built Revision: Revision e52dcf852fb77d0be40c3849a3173c2bb67a9190 (origin/master)
Checkout:workspace / /home/hudson/genie.mylyn/.hudson/jobs/mylyn-3.17.x-release/workspace - hudson.remoting.LocalChannel@7791209b
Wiping out workspace first.
Cloning the remote Git repository
Cloning repository origin
Fetching upstream changes from git://git.eclipse.org/gitroot/mylyn/org.eclipse.mylyn.all
Commencing build of Revision af425aed2a623bbd04c25b7038507d1c08d8d361 (origin/master)
Checking out Revision af425aed2a623bbd04c25b7038507d1c08d8d361 (origin/master)
The origin is non-bare.
[workspace] $ /bin/sh -xe /tmp/genie.mylyn/hudson6850925253070069080.sh
+ git submodule foreach git rev-parse HEAD
Entering 'org.eclipse.mylyn'
8d2193d5c3c42cd767e77b2234b431e7d82da845
Entering 'org.eclipse.mylyn.builds'
9f340e1a15d35ae2998e5e6df134d9254cc06c99
Entering 'org.eclipse.mylyn.commons'
6316bc82fc0f0d2a9a996eb09d90d17ce343945b
Entering 'org.eclipse.mylyn.context'
96046c818b0b175fc054db7c53b360669d379d76
Entering 'org.eclipse.mylyn.docs'
85ffc8b6358b88a5db6dce596df287277abf6432
Entering 'org.eclipse.mylyn.reviews'
972968bad01aa8640a321ef24f5f2fc452d38c2b
Entering 'org.eclipse.mylyn.tasks'
eff1cccfaa7d3a6dca543d273e094ba3464bffbc
Entering 'org.eclipse.mylyn.versions'
40dc3e4f2fab4393711a9dd6f7713467e7ff1e1b
+ git rev-list HEAD
[INFO] Using Maven 3 installation: Maven 3.0.5
[INFO] Checking Maven 3 installation environment
[workspace] $ /shared/common/apache-maven-3.0.5/bin/mvn --help
[INFO] Checking Maven 3 installation version
[INFO] Detected Maven 3 installation version: 3.0.5
[workspace] $ /shared/common/apache-maven-3.0.5/bin/mvn -Pluna -Prelease clean package -V -B -DPUBLISH=true -Dmaven.test.skip=true -Dexplicit-target=true -Dmaven.ext.class.path=/home/hudson/genie.mylyn/.hudson/maven/slavebundle/resources:/home/hudson/genie.mylyn/.hudson/maven/slavebundle/lib/maven3-eventspy-3.0.jar:/home/hudson/genie.mylyn/.hudson/war/webapp/WEB-INF/lib/hudson-remoting-3.0.0.jar -Dhudson.eventspy.port=33109 -Dmaven.repo.local=/home/hudson/genie.mylyn/.hudson/jobs/mylyn-3.17.x-release/workspace/.maven/repo -f pom.xml
[DEBUG] Waiting for connection on port: 33109
Apache Maven 3.0.5 (r01de14724cdef164cd33c7c8c2fe155faf9602da; 2013-02-19 08:51:28-0500)
Maven home: /shared/common/apache-maven-3.0.5
Java version: 1.7.0_80, vendor: Oracle Corporation
Java home: /opt/public/common/jdk1.7.0_80/jre
Default locale: en_US, platform encoding: UTF-8
OS name: "linux", version: "3.0.101-0.46-default", arch: "amd64", family: "unix"
[DEBUG] Connected to remote
[INFO] Scanning for projects...
Downloading: http://repo.maven.apache.org/maven2/org/eclipse/tycho/tycho-maven-plugin/0.20.0/tycho-maven-plugin-0.20.0.pom
Downloaded: http://repo.maven.apache.org/maven2/org/eclipse/tycho/tycho-maven-plugin/0.20.0/tycho-maven-plugin-0.20.0.pom (3 KB at 5.2 KB/sec)
Downloading: http://repo.maven.apache.org/maven2/org/eclipse/tycho/tycho/0.20.0/tycho-0.20.0.pom
Downloaded: http://repo.maven.apache.org/maven2/org/eclipse/tycho/tycho/0.20.0/tycho-0.20.0.pom (19 KB at 75.1 KB/sec)
Downloading: http://repo.maven.apache.org/maven2/org/eclipse/tycho/tycho-core/0.20.0/tycho-core-0.20.0.pom
Downloaded: http://repo.maven.apache.org/maven2/org/eclipse/tycho/tycho-core/0.20.0/tycho-core-0.20.0.pom (5 KB at 22.2 KB/sec)
Downloading: http://repo.maven.apache.org/maven2/org/apache/maven/maven-core/3.0/maven-core-3.0.pom
Downloaded: http://repo.maven.apache.org/maven2/org/apache/maven/maven-core/3.0/maven-core-3.0.pom (7 KB at 30.4 KB/sec)
Downloading: http://repo.maven.apache.org/maven2/org/apache/maven/maven/3.0/maven-3.0.pom
Downloaded: http://repo.maven.apache.org/maven2/org/apache/maven/maven/3.0/maven-3.0.pom (22 KB at 82.8 KB/sec)
Downloading: http://repo.maven.apache.org/maven2/org/apache/maven/maven-parent/15/maven-parent-15.pom
Downloaded: http://repo.maven.apache.org/maven2/org/apache/maven/maven-parent/15/maven-parent-15.pom (24 KB at 89.1 KB/sec)
Downloading: http://repo.maven.apache.org/maven2/org/apache/apache/6/apache-6.pom
Downloaded: http://repo.maven.apache.org/maven2/org/apache/apache/6/apache-6.pom (13 KB at 59.2 KB/sec)
Downloading: http://repo.maven.apache.org/maven2/org/apache/maven/maven-model/3.0/maven-model-3.0.pom
Downloaded: http://repo.maven.apache.org/maven2/org/apache/maven/maven-model/3.0/maven-model-3.0.pom (4 KB at 18.0 KB/sec)
Downloading: http://repo.maven.apache.org/maven2/org/codehaus/plexus/plexus-utils/3.0.7/plexus-utils-3.0.7.pom
Downloaded: http://repo.maven.apache.org/maven2/org/codehaus/plexus/plexus-utils/3.0.7/plexus-utils-3.0.7.pom (3 KB at 11.9 KB/sec)
Downloading: http://repo.maven.apache.org/maven2/org/codehaus/plexus/plexus/3.1/plexus-3.1.pom
Downloaded: http://repo.maven.apache.org/maven2/org/codehaus/plexus/plexus/3.1/plexus-3.1.pom (19 KB at 70.7 KB/sec)
Downloading: http://repo.maven.apache.org/maven2/org/sonatype/spice/spice-parent/17/spice-parent-17.pom
Downloaded: http://repo.maven.apache.org/maven2/org/sonatype/spice/spice-parent/17/spice-parent-17.pom (7 KB at 31.1 KB/sec)
Downloading: http://repo.maven.apache.org/maven2/org/sonatype/forge/forge-parent/10/forge-parent-10.pom
Downloaded: http://repo.maven.apache.org/maven2/org/sonatype/forge/forge-parent/10/forge-parent-10.pom (14 KB at 64.9 KB/sec)
Downloading: http://repo.maven.apache.org/maven2/org/apache/maven/maven-settings/3.0/maven-settings-3.0.pom
Downloaded: http://repo.maven.apache.org/maven2/org/apache/maven/maven-settings/3.0/maven-settings-3.0.pom (2 KB at 8.9 KB/sec)
Downloading: http://repo.maven.apache.org/maven2/org/apache/maven/maven-settings-builder/3.0/maven-settings-builder-3.0.pom
Downloaded: http://repo.maven.apache.org/maven2/org/apache/maven/maven-settings-builder/3.0/maven-settings-builder-3.0.pom (3 KB at 10.3 KB/sec)
Downloading: http://repo.maven.apache.org/maven2/org/codehaus/plexus/plexus-interpolation/1.14/plexus-interpolation-1.14.pom
Downloaded: http://repo.maven.apache.org/maven2/org/codehaus/plexus/plexus-interpolation/1.14/plexus-interpolation-1.14.pom (910 B at 4.3 KB/sec)
Downloading: http://repo.maven.apache.org/maven2/org/codehaus/plexus/plexus-components/1.1.18/plexus-components-1.1.18.pom
Downloaded: http://repo.maven.apache.org/maven2/org/codehaus/plexus/plexus-components/1.1.18/plexus-components-1.1.18.pom (6 KB at 24.8 KB/sec)
Downloading: http://repo.maven.apache.org/maven2/org/codehaus/plexus/plexus/2.0.7/plexus-2.0.7.pom
Downloaded: http://repo.maven.apache.org/maven2/org/codehaus/plexus/plexus/2.0.7/plexus-2.0.7.pom (17 KB at 67.3 KB/sec)
Downloading: http://repo.maven.apache.org/maven2/org/codehaus/plexus/plexus-component-annotations/1.5.5/plexus-component-annotations-1.5.5.pom
Downloaded: http://repo.maven.apache.org/maven2/org/codehaus/plexus/plexus-component-annotations/1.5.5/plexus-component-annotations-1.5.5.pom (815 B at 3.9 KB/sec)
Downloading: http://repo.maven.apache.org/maven2/org/codehaus/plexus/plexus-containers/1.5.5/plexus-containers-1.5.5.pom
Downloaded: http://repo.maven.apache.org/maven2/org/codehaus/plexus/plexus-containers/1.5.5/plexus-containers-1.5.5.pom (5 KB at 20.2 KB/sec)
Downloading: http://repo.maven.apache.org/maven2/org/sonatype/plexus/plexus-sec-dispatcher/1.3/plexus-sec-dispatcher-1.3.pom
Downloaded: http://repo.maven.apache.org/maven2/org/sonatype/plexus/plexus-sec-dispatcher/1.3/plexus-sec-dispatcher-1.3.pom (3 KB at 1.1 KB/sec)
Downloading: http://repo.maven.apache.org/maven2/org/sonatype/spice/spice-parent/12/spice-parent-12.pom
Downloaded: http://repo.maven.apache.org/maven2/org/sonatype/spice/spice-parent/12/spice-parent-12.pom (7 KB at 31.9 KB/sec)
Downloading: http://repo.maven.apache.org/maven2/org/sonatype/forge/forge-parent/4/forge-parent-4.pom
Downloaded: http://repo.maven.apache.org/maven2/org/sonatype/forge/forge-parent/4/forge-parent-4.pom (9 KB at 39.4 KB/sec)
Downloading: http://repo.maven.apache.org/maven2/org/sonatype/plexus/plexus-cipher/1.7/plexus-cipher-1.7.pom
Downloaded: http://repo.maven.apache.org/maven2/org/sonatype/plexus/plexus-cipher/1.7/plexus-cipher-1.7.pom (5 KB at 19.5 KB/sec)
Downloading: http://repo.maven.apache.org/maven2/org/sonatype/spice/spice-parent/15/spice-parent-15.pom
Downloaded: http://repo.maven.apache.org/maven2/org/sonatype/spice/spice-parent/15/spice-parent-15.pom (9 KB at 39.8 KB/sec)
Downloading: http://repo.maven.apache.org/maven2/org/sonatype/forge/forge-parent/5/forge-parent-5.pom
Downloaded: http://repo.maven.apache.org/maven2/org/sonatype/forge/forge-parent/5/forge-parent-5.pom (9 KB at 38.9 KB/sec)
Downloading: http://repo.maven.apache.org/maven2/org/apache/maven/maven-repository-metadata/3.0/maven-repository-metadata-3.0.pom
Downloaded: http://repo.maven.apache.org/maven2/org/apache/maven/maven-repository-metadata/3.0/maven-repository-metadata-3.0.pom (2 KB at 11.6 KB/sec)
Downloading: http://repo.maven.apache.org/maven2/org/apache/maven/maven-artifact/3.0/maven-artifact-3.0.pom
Downloaded: http://repo.maven.apache.org/maven2/org/apache/maven/maven-artifact/3.0/maven-artifact-3.0.pom (2 KB at 15.8 KB/sec)
Downloading: http://repo.maven.apache.org/maven2/org/apache/maven/maven-plugin-api/3.0/maven-plugin-api-3.0.pom
Downloaded: http://repo.maven.apache.org/maven2/org/apache/maven/maven-plugin-api/3.0/maven-plugin-api-3.0.pom (3 KB at 19.1 KB/sec)
Downloading: http://repo.maven.apache.org/maven2/org/sonatype/sisu/sisu-inject-plexus/1.4.2/sisu-inject-plexus-1.4.2.pom
Downloaded: http://repo.maven.apache.org/maven2/org/sonatype/sisu/sisu-inject-plexus/1.4.2/sisu-inject-plexus-1.4.2.pom (6 KB at 43.7 KB/sec)
Downloading: http://repo.maven.apache.org/maven2/org/sonatype/sisu/inject/guice-plexus/1.4.2/guice-plexus-1.4.2.pom
Downloaded: http://repo.maven.apache.org/maven2/org/sonatype/sisu/inject/guice-plexus/1.4.2/guice-plexus-1.4.2.pom (4 KB at 25.5 KB/sec)
Downloading: http://repo.maven.apache.org/maven2/org/sonatype/sisu/inject/guice-bean/1.4.2/guice-bean-1.4.2.pom
Downloaded: http://repo.maven.apache.org/maven2/org/sonatype/sisu/inject/guice-bean/1.4.2/guice-bean-1.4.2.pom (3 KB at 21.4 KB/sec)
Downloading: http://repo.maven.apache.org/maven2/org/sonatype/sisu/sisu-inject/1.4.2/sisu-inject-1.4.2.pom
Downloaded: http://repo.maven.apache.org/maven2/org/sonatype/sisu/sisu-inject/1.4.2/sisu-inject-1.4.2.pom (2 KB at 10.6 KB/sec)
Downloading: http://repo.maven.apache.org/maven2/org/sonatype/sisu/sisu-parent/1.4.2/sisu-parent-1.4.2.pom
Downloaded: http://repo.maven.apache.org/maven2/org/sonatype/sisu/sisu-parent/1.4.2/sisu-parent-1.4.2.pom (8 KB at 49.6 KB/sec)
Downloading: http://repo.maven.apache.org/maven2/org/sonatype/forge/forge-parent/6/forge-parent-6.pom
Downloaded: http://repo.maven.apache.org/maven2/org/sonatype/forge/forge-parent/6/forge-parent-6.pom (11 KB at 89.0 KB/sec)
Downloading: http://repo.maven.apache.org/maven2/org/codehaus/plexus/plexus-classworlds/2.2.3/plexus-classworlds-2.2.3.pom
Downloaded: http://repo.maven.apache.org/maven2/org/codehaus/plexus/plexus-classworlds/2.2.3/plexus-classworlds-2.2.3.pom (4 KB at 31.7 KB/sec)
Downloading: http://repo.maven.apache.org/maven2/org/codehaus/plexus/plexus/2.0.6/plexus-2.0.6.pom
Downloaded: http://repo.maven.apache.org/maven2/org/codehaus/plexus/plexus/2.0.6/plexus-2.0.6.pom (17 KB at 115.3 KB/sec)
Downloading: http://repo.maven.apache.org/maven2/org/sonatype/sisu/sisu-inject-bean/1.4.2/sisu-inject-bean-1.4.2.pom
Downloaded: http://repo.maven.apache.org/maven2/org/sonatype/sisu/sisu-inject-bean/1.4.2/sisu-inject-bean-1.4.2.pom (6 KB at 45.2 KB/sec)
Downloading: http://repo.maven.apache.org/maven2/org/sonatype/sisu/sisu-guice/2.1.7/sisu-guice-2.1.7.pom
Downloaded: http://repo.maven.apache.org/maven2/org/sonatype/sisu/sisu-guice/2.1.7/sisu-guice-2.1.7.pom (11 KB at 88.5 KB/sec)
Downloading: http://repo.maven.apache.org/maven2/org/apache/maven/maven-model-builder/3.0/maven-model-builder-3.0.pom
Downloaded: http://repo.maven.apache.org/maven2/org/apache/maven/maven-model-builder/3.0/maven-model-builder-3.0.pom (3 KB at 17.8 KB/sec)
Downloading: http://repo.maven.apache.org/maven2/org/apache/maven/maven-aether-provider/3.0/maven-aether-provider-3.0.pom
Downloaded: http://repo.maven.apache.org/maven2/org/apache/maven/maven-aether-provider/3.0/maven-aether-provider-3.0.pom (3 KB at 19.9 KB/sec)
Downloading: http://repo.maven.apache.org/maven2/org/sonatype/aether/aether-api/1.7/aether-api-1.7.pom
Downloaded: http://repo.maven.apache.org/maven2/org/sonatype/aether/aether-api/1.7/aether-api-1.7.pom (2 KB at 13.7 KB/sec)
Downloading: http://repo.maven.apache.org/maven2/org/sonatype/aether/aether-parent/1.7/aether-parent-1.7.pom
Downloaded: http://repo.maven.apache.org/maven2/org/sonatype/aether/aether-parent/1.7/aether-parent-1.7.pom (8 KB at 61.3 KB/sec)
Downloading: http://repo.maven.apache.org/maven2/org/sonatype/aether/aether-util/1.7/aether-util-1.7.pom
Downloaded: http://repo.maven.apache.org/maven2/org/sonatype/aether/aether-util/1.7/aether-util-1.7.pom (3 KB at 16.8 KB/sec)
Downloading: http://repo.maven.apache.org/maven2/org/sonatype/aether/aether-impl/1.7/aether-impl-1.7.pom
Downloaded: http://repo.maven.apache.org/maven2/org/sonatype/aether/aether-impl/1.7/aether-impl-1.7.pom (4 KB at 29.8 KB/sec)
Downloading: http://repo.maven.apache.org/maven2/org/sonatype/aether/aether-spi/1.7/aether-spi-1.7.pom
Downloaded: http://repo.maven.apache.org/maven2/org/sonatype/aether/aether-spi/1.7/aether-spi-1.7.pom (2 KB at 14.2 KB/sec)
Downloading: http://repo.maven.apache.org/maven2/org/codehaus/plexus/plexus-archiver/2.2/plexus-archiver-2.2.pom
Downloaded: http://repo.maven.apache.org/maven2/org/codehaus/plexus/plexus-archiver/2.2/plexus-archiver-2.2.pom (4 KB at 16.9 KB/sec)
Downloading: http://repo.maven.apache.org/maven2/org/codehaus/plexus/plexus-components/1.1.20/plexus-components-1.1.20.pom
Downloaded: http://repo.maven.apache.org/maven2/org/codehaus/plexus/plexus-components/1.1.20/plexus-components-1.1.20.pom (3 KB at 25.2 KB/sec)
Downloading: http://repo.maven.apache.org/maven2/org/codehaus/plexus/plexus-io/2.0.5/plexus-io-2.0.5.pom
Downloaded: http://repo.maven.apache.org/maven2/org/codehaus/plexus/plexus-io/2.0.5/plexus-io-2.0.5.pom (3 KB at 18.9 KB/sec)
Downloading: http://repo.maven.apache.org/maven2/org/codehaus/plexus/plexus-components/1.2/plexus-components-1.2.pom
Downloaded: http://repo.maven.apache.org/maven2/org/codehaus/plexus/plexus-components/1.2/plexus-components-1.2.pom (3 KB at 24.7 KB/sec)
Downloading: http://repo.maven.apache.org/maven2/org/codehaus/plexus/plexus/3.2/plexus-3.2.pom
Downloaded: http://repo.maven.apache.org/maven2/org/codehaus/plexus/plexus/3.2/plexus-3.2.pom (19 KB at 128.0 KB/sec)
Downloading: http://repo.maven.apache.org/maven2/org/eclipse/tycho/org.eclipse.osgi/3.9.1.v20130814-1242/org.eclipse.osgi-3.9.1.v20130814-1242.pom
Downloaded: http://repo.maven.apache.org/maven2/org/eclipse/tycho/org.eclipse.osgi/3.9.1.v20130814-1242/org.eclipse.osgi-3.9.1.v20130814-1242.pom (2 KB at 8.9 KB/sec)
Downloading: http://repo.maven.apache.org/maven2/org/eclipse/tycho/sisu-equinox-embedder/0.20.0/sisu-equinox-embedder-0.20.0.pom
Downloaded: http://repo.maven.apache.org/maven2/org/eclipse/tycho/sisu-equinox-embedder/0.20.0/sisu-equinox-embedder-0.20.0.pom (2 KB at 8.5 KB/sec)
Downloading: http://repo.maven.apache.org/maven2/org/eclipse/tycho/sisu-equinox/0.20.0/sisu-equinox-0.20.0.pom
Downloaded: http://repo.maven.apache.org/maven2/org/eclipse/tycho/sisu-equinox/0.20.0/sisu-equinox-0.20.0.pom (2 KB at 4.9 KB/sec)
Downloading: http://repo.maven.apache.org/maven2/org/eclipse/tycho/sisu-equinox-api/0.20.0/sisu-equinox-api-0.20.0.pom
Downloaded: http://repo.maven.apache.org/maven2/org/eclipse/tycho/sisu-equinox-api/0.20.0/sisu-equinox-api-0.20.0.pom (2 KB at 8.3 KB/sec)
Downloading: http://repo.maven.apache.org/maven2/org/eclipse/tycho/tycho-metadata-model/0.20.0/tycho-metadata-model-0.20.0.pom
Downloaded: http://repo.maven.apache.org/maven2/org/eclipse/tycho/tycho-metadata-model/0.20.0/tycho-metadata-model-0.20.0.pom (2 KB at 6.1 KB/sec)
Downloading: http://repo.maven.apache.org/maven2/de/pdark/decentxml/1.3/decentxml-1.3.pom
Downloaded: http://repo.maven.apache.org/maven2/de/pdark/decentxml/1.3/decentxml-1.3.pom (7 KB at 29.7 KB/sec)
Downloading: http://repo.maven.apache.org/maven2/org/eclipse/tycho/tycho-embedder-api/0.20.0/tycho-embedder-api-0.20.0.pom
Downloaded: http://repo.maven.apache.org/maven2/org/eclipse/tycho/tycho-embedder-api/0.20.0/tycho-embedder-api-0.20.0.pom (3 KB at 9.7 KB/sec)
Downloading: http://repo.maven.apache.org/maven2/org/eclipse/tycho/org.eclipse.tycho.embedder.shared/0.20.0/org.eclipse.tycho.embedder.shared-0.20.0.pom
Downloaded: http://repo.maven.apache.org/maven2/org/eclipse/tycho/org.eclipse.tycho.embedder.shared/0.20.0/org.eclipse.tycho.embedder.shared-0.20.0.pom (2 KB at 5.0 KB/sec)
Downloading: http://repo.maven.apache.org/maven2/org/eclipse/tycho/tycho-bundles/0.20.0/tycho-bundles-0.20.0.pom
Downloaded: http://repo.maven.apache.org/maven2/org/eclipse/tycho/tycho-bundles/0.20.0/tycho-bundles-0.20.0.pom (3 KB at 12.5 KB/sec)
Downloading: http://repo.maven.apache.org/maven2/org/eclipse/tycho/org.eclipse.tycho.core.shared/0.20.0/org.eclipse.tycho.core.shared-0.20.0.pom
Downloaded: http://repo.maven.apache.org/maven2/org/eclipse/tycho/org.eclipse.tycho.core.shared/0.20.0/org.eclipse.tycho.core.shared-0.20.0.pom (2 KB at 4.8 KB/sec)
Downloading: http://repo.maven.apache.org/maven2/org/eclipse/tycho/tycho-p2-facade/0.20.0/tycho-p2-facade-0.20.0.pom
Downloaded: http://repo.maven.apache.org/maven2/org/eclipse/tycho/tycho-p2-facade/0.20.0/tycho-p2-facade-0.20.0.pom (3 KB at 10.9 KB/sec)
Downloading: http://repo.maven.apache.org/maven2/org/eclipse/tycho/tycho-p2/0.20.0/tycho-p2-0.20.0.pom
Downloaded: http://repo.maven.apache.org/maven2/org/eclipse/tycho/tycho-p2/0.20.0/tycho-p2-0.20.0.pom (2 KB at 5.2 KB/sec)
Downloading: http://repo.maven.apache.org/maven2/org/eclipse/tycho/org.eclipse.tycho.p2.resolver.shared/0.20.0/org.eclipse.tycho.p2.resolver.shared-0.20.0.pom
Downloaded: http://repo.maven.apache.org/maven2/org/eclipse/tycho/org.eclipse.tycho.p2.resolver.shared/0.20.0/org.eclipse.tycho.p2.resolver.shared-0.20.0.pom (2 KB at 5.2 KB/sec)
Downloading: http://repo.maven.apache.org/maven2/org/eclipse/tycho/org.eclipse.tycho.p2.tools.shared/0.20.0/org.eclipse.tycho.p2.tools.shared-0.20.0.pom
Downloaded: http://repo.maven.apache.org/maven2/org/eclipse/tycho/org.eclipse.tycho.p2.tools.shared/0.20.0/org.eclipse.tycho.p2.tools.shared-0.20.0.pom (2 KB at 5.2 KB/sec)
Downloading: http://repo.maven.apache.org/maven2/org/eclipse/tycho/tycho-maven-plugin/0.20.0/tycho-maven-plugin-0.20.0.jar
Downloading: http://repo.maven.apache.org/maven2/org/eclipse/tycho/tycho-core/0.20.0/tycho-core-0.20.0.jar
Downloading: http://repo.maven.apache.org/maven2/org/sonatype/aether/aether-util/1.7/aether-util-1.7.jar
Downloading: http://repo.maven.apache.org/maven2/org/sonatype/sisu/sisu-inject-bean/1.4.2/sisu-inject-bean-1.4.2.jar
Downloading: http://repo.maven.apache.org/maven2/org/sonatype/sisu/sisu-guice/2.1.7/sisu-guice-2.1.7-noaop.jar
Downloaded: http://repo.maven.apache.org/maven2/org/sonatype/aether/aether-util/1.7/aether-util-1.7.jar (106 KB at 527.1 KB/sec)
Downloading: http://repo.maven.apache.org/maven2/org/codehaus/plexus/plexus-interpolation/1.14/plexus-interpolation-1.14.jar
Downloaded: http://repo.maven.apache.org/maven2/org/eclipse/tycho/tycho-maven-plugin/0.20.0/tycho-maven-plugin-0.20.0.jar (5 KB at 22.7 KB/sec)
Downloading: http://repo.maven.apache.org/maven2/org/sonatype/plexus/plexus-sec-dispatcher/1.3/plexus-sec-dispatcher-1.3.jar
Downloaded: http://repo.maven.apache.org/maven2/org/eclipse/tycho/tycho-core/0.20.0/tycho-core-0.20.0.jar (177 KB at 740.1 KB/sec)
Downloading: http://repo.maven.apache.org/maven2/org/sonatype/plexus/plexus-cipher/1.7/plexus-cipher-1.7.jar
Downloaded: http://repo.maven.apache.org/maven2/org/sonatype/plexus/plexus-cipher/1.7/plexus-cipher-1.7.jar (14 KB at 112.4 KB/sec)
Downloading: http://repo.maven.apache.org/maven2/org/codehaus/plexus/plexus-utils/3.0.7/plexus-utils-3.0.7.jar
Downloaded: http://repo.maven.apache.org/maven2/org/codehaus/plexus/plexus-interpolation/1.14/plexus-interpolation-1.14.jar (60 KB at 363.7 KB/sec)
Downloading: http://repo.maven.apache.org/maven2/org/codehaus/plexus/plexus-archiver/2.2/plexus-archiver-2.2.jar
Downloaded: http://repo.maven.apache.org/maven2/org/sonatype/plexus/plexus-sec-dispatcher/1.3/plexus-sec-dispatcher-1.3.jar (28 KB at 138.0 KB/sec)
Downloading: http://repo.maven.apache.org/maven2/org/codehaus/plexus/plexus-io/2.0.5/plexus-io-2.0.5.jar
Downloaded: http://repo.maven.apache.org/maven2/org/sonatype/sisu/sisu-inject-bean/1.4.2/sisu-inject-bean-1.4.2.jar (150 KB at 354.0 KB/sec)
Downloading: http://repo.maven.apache.org/maven2/org/eclipse/tycho/org.eclipse.osgi/3.9.1.v20130814-1242/org.eclipse.osgi-3.9.1.v20130814-1242.jar
Downloaded: http://repo.maven.apache.org/maven2/org/sonatype/sisu/sisu-guice/2.1.7/sisu-guice-2.1.7-noaop.jar (461 KB at 919.5 KB/sec)
Downloading: http://repo.maven.apache.org/maven2/org/eclipse/tycho/sisu-equinox-embedder/0.20.0/sisu-equinox-embedder-0.20.0.jar
Downloaded: http://repo.maven.apache.org/maven2/org/codehaus/plexus/plexus-archiver/2.2/plexus-archiver-2.2.jar (181 KB at 848.1 KB/sec)
Downloading: http://repo.maven.apache.org/maven2/org/eclipse/tycho/sisu-equinox-api/0.20.0/sisu-equinox-api-0.20.0.jar
Downloaded: http://repo.maven.apache.org/maven2/org/codehaus/plexus/plexus-io/2.0.5/plexus-io-2.0.5.jar (57 KB at 332.5 KB/sec)
Downloading: http://repo.maven.apache.org/maven2/org/eclipse/tycho/tycho-metadata-model/0.20.0/tycho-metadata-model-0.20.0.jar
Downloaded: http://repo.maven.apache.org/maven2/org/eclipse/tycho/sisu-equinox-api/0.20.0/sisu-equinox-api-0.20.0.jar (4 KB at 25.8 KB/sec)
Downloading: http://repo.maven.apache.org/maven2/de/pdark/decentxml/1.3/decentxml-1.3.jar
Downloaded: http://repo.maven.apache.org/maven2/org/eclipse/tycho/sisu-equinox-embedder/0.20.0/sisu-equinox-embedder-0.20.0.jar (13 KB at 62.9 KB/sec)
Downloading: http://repo.maven.apache.org/maven2/org/eclipse/tycho/tycho-embedder-api/0.20.0/tycho-embedder-api-0.20.0.jar
Downloaded: http://repo.maven.apache.org/maven2/org/eclipse/tycho/tycho-metadata-model/0.20.0/tycho-metadata-model-0.20.0.jar (31 KB at 201.3 KB/sec)
Downloading: http://repo.maven.apache.org/maven2/org/eclipse/tycho/org.eclipse.tycho.embedder.shared/0.20.0/org.eclipse.tycho.embedder.shared-0.20.0.jar
Downloaded: http://repo.maven.apache.org/maven2/org/codehaus/plexus/plexus-utils/3.0.7/plexus-utils-3.0.7.jar (226 KB at 562.7 KB/sec)
Downloading: http://repo.maven.apache.org/maven2/org/eclipse/tycho/org.eclipse.tycho.core.shared/0.20.0/org.eclipse.tycho.core.shared-0.20.0.jar
Downloaded: http://repo.maven.apache.org/maven2/org/eclipse/tycho/org.eclipse.tycho.embedder.shared/0.20.0/org.eclipse.tycho.embedder.shared-0.20.0.jar (7 KB at 53.5 KB/sec)
Downloading: http://repo.maven.apache.org/maven2/org/eclipse/tycho/tycho-p2-facade/0.20.0/tycho-p2-facade-0.20.0.jar
Downloaded: http://repo.maven.apache.org/maven2/org/eclipse/tycho/tycho-embedder-api/0.20.0/tycho-embedder-api-0.20.0.jar (7 KB at 34.3 KB/sec)
Downloading: http://repo.maven.apache.org/maven2/org/codehaus/plexus/plexus-component-annotations/1.5.5/plexus-component-annotations-1.5.5.jar
Downloaded: http://repo.maven.apache.org/maven2/org/eclipse/tycho/org.eclipse.tycho.core.shared/0.20.0/org.eclipse.tycho.core.shared-0.20.0.jar (32 KB at 196.9 KB/sec)
Downloading: http://repo.maven.apache.org/maven2/org/eclipse/tycho/org.eclipse.tycho.p2.resolver.shared/0.20.0/org.eclipse.tycho.p2.resolver.shared-0.20.0.jar
Downloaded: http://repo.maven.apache.org/maven2/org/eclipse/tycho/tycho-p2-facade/0.20.0/tycho-p2-facade-0.20.0.jar (32 KB at 216.3 KB/sec)
Downloading: http://repo.maven.apache.org/maven2/org/eclipse/tycho/org.eclipse.tycho.p2.tools.shared/0.20.0/org.eclipse.tycho.p2.tools.shared-0.20.0.jar
Downloaded: http://repo.maven.apache.org/maven2/org/eclipse/tycho/org.eclipse.tycho.p2.resolver.shared/0.20.0/org.eclipse.tycho.p2.resolver.shared-0.20.0.jar (27 KB at 170.0 KB/sec)
Downloaded: http://repo.maven.apache.org/maven2/de/pdark/decentxml/1.3/decentxml-1.3.jar (109 KB at 280.1 KB/sec)
Downloaded: http://repo.maven.apache.org/maven2/org/codehaus/plexus/plexus-component-annotations/1.5.5/plexus-component-annotations-1.5.5.jar (5 KB at 20.9 KB/sec)
Downloaded: http://repo.maven.apache.org/maven2/org/eclipse/tycho/org.eclipse.tycho.p2.tools.shared/0.20.0/org.eclipse.tycho.p2.tools.shared-0.20.0.jar (20 KB at 134.3 KB/sec)
Downloaded: http://repo.maven.apache.org/maven2/org/eclipse/tycho/org.eclipse.osgi/3.9.1.v20130814-1242/org.eclipse.osgi-3.9.1.v20130814-1242.jar (1360 KB at 1561.0 KB/sec)
Downloading: http://repo.maven.apache.org/maven2/org/eclipse/tycho/tycho-bundles-external/0.20.0/tycho-bundles-external-0.20.0.zip
Downloaded: http://repo.maven.apache.org/maven2/org/eclipse/tycho/tycho-bundles-external/0.20.0/tycho-bundles-external-0.20.0.zip (6139 KB at 4622.3 KB/sec)
Downloading: http://repo.maven.apache.org/maven2/org/eclipse/tycho/org.eclipse.tycho.p2.resolver.impl/0.20.0/org.eclipse.tycho.p2.resolver.impl-0.20.0.jar
Downloaded: http://repo.maven.apache.org/maven2/org/eclipse/tycho/org.eclipse.tycho.p2.resolver.impl/0.20.0/org.eclipse.tycho.p2.resolver.impl-0.20.0.jar (180 KB at 458.2 KB/sec)
Downloading: http://repo.maven.apache.org/maven2/org/eclipse/tycho/org.eclipse.tycho.p2.maven.repository/0.20.0/org.eclipse.tycho.p2.maven.repository-0.20.0.jar
Downloaded: http://repo.maven.apache.org/maven2/org/eclipse/tycho/org.eclipse.tycho.p2.maven.repository/0.20.0/org.eclipse.tycho.p2.maven.repository-0.20.0.jar (135 KB at 335.5 KB/sec)
Downloading: http://repo.maven.apache.org/maven2/org/eclipse/tycho/org.eclipse.tycho.p2.tools.impl/0.20.0/org.eclipse.tycho.p2.tools.impl-0.20.0.jar
Downloaded: http://repo.maven.apache.org/maven2/org/eclipse/tycho/org.eclipse.tycho.p2.tools.impl/0.20.0/org.eclipse.tycho.p2.tools.impl-0.20.0.jar (36 KB at 119.0 KB/sec)
Downloading: http://repo.maven.apache.org/maven2/org/jacoco/jacoco-maven-plugin/0.5.6.201201232323/jacoco-maven-plugin-0.5.6.201201232323.pom
Downloaded: http://repo.maven.apache.org/maven2/org/jacoco/jacoco-maven-plugin/0.5.6.201201232323/jacoco-maven-plugin-0.5.6.201201232323.pom (4 KB at 28.3 KB/sec)
Downloading: http://repo.maven.apache.org/maven2/org/jacoco/org.jacoco.build/0.5.6.201201232323/org.jacoco.build-0.5.6.201201232323.pom
Downloaded: http://repo.maven.apache.org/maven2/org/jacoco/org.jacoco.build/0.5.6.201201232323/org.jacoco.build-0.5.6.201201232323.pom (27 KB at 160.5 KB/sec)
Downloading: http://repo.maven.apache.org/maven2/org/jacoco/jacoco-maven-plugin/0.5.6.201201232323/jacoco-maven-plugin-0.5.6.201201232323.jar
Downloaded: http://repo.maven.apache.org/maven2/org/jacoco/jacoco-maven-plugin/0.5.6.201201232323/jacoco-maven-plugin-0.5.6.201201232323.jar (24 KB at 118.2 KB/sec)
Downloading: http://repo.maven.apache.org/maven2/org/eclipse/tycho/target-platform-configuration/0.20.0/target-platform-configuration-0.20.0.pom
Downloaded: http://repo.maven.apache.org/maven2/org/eclipse/tycho/target-platform-configuration/0.20.0/target-platform-configuration-0.20.0.pom (2 KB at 9.3 KB/sec)
Downloading: http://repo.maven.apache.org/maven2/org/eclipse/tycho/target-platform-configuration/0.20.0/target-platform-configuration-0.20.0.jar
Downloaded: http://repo.maven.apache.org/maven2/org/eclipse/tycho/target-platform-configuration/0.20.0/target-platform-configuration-0.20.0.jar (4 KB at 26.9 KB/sec)
Downloading: http://repo.maven.apache.org/maven2/org/apache/maven/plugins/maven-clean-plugin/2.4.1/maven-clean-plugin-2.4.1.pom
Downloaded: http://repo.maven.apache.org/maven2/org/apache/maven/plugins/maven-clean-plugin/2.4.1/maven-clean-plugin-2.4.1.pom (5 KB at 36.2 KB/sec)
Downloading: http://repo.maven.apache.org/maven2/org/apache/maven/plugins/maven-plugins/18/maven-plugins-18.pom
Downloaded: http://repo.maven.apache.org/maven2/org/apache/maven/plugins/maven-plugins/18/maven-plugins-18.pom (13 KB at 110.4 KB/sec)
Downloading: http://repo.maven.apache.org/maven2/org/apache/maven/maven-parent/16/maven-parent-16.pom
Downloaded: http://repo.maven.apache.org/maven2/org/apache/maven/maven-parent/16/maven-parent-16.pom (23 KB at 167.1 KB/sec)
Downloading: http://repo.maven.apache.org/maven2/org/apache/apache/7/apache-7.pom
Downloaded: http://repo.maven.apache.org/maven2/org/apache/apache/7/apache-7.pom (15 KB at 103.6 KB/sec)
Downloading: http://repo.maven.apache.org/maven2/org/apache/maven/plugins/maven-clean-plugin/2.4.1/maven-clean-plugin-2.4.1.jar
Downloaded: http://repo.maven.apache.org/maven2/org/apache/maven/plugins/maven-clean-plugin/2.4.1/maven-clean-plugin-2.4.1.jar (23 KB at 160.8 KB/sec)
Downloading: http://repo.maven.apache.org/maven2/org/apache/maven/plugins/maven-install-plugin/2.3.1/maven-install-plugin-2.3.1.pom
Downloaded: http://repo.maven.apache.org/maven2/org/apache/maven/plugins/maven-install-plugin/2.3.1/maven-install-plugin-2.3.1.pom (5 KB at 40.4 KB/sec)
Downloading: http://repo.maven.apache.org/maven2/org/apache/maven/plugins/maven-install-plugin/2.3.1/maven-install-plugin-2.3.1.jar
Downloaded: http://repo.maven.apache.org/maven2/org/apache/maven/plugins/maven-install-plugin/2.3.1/maven-install-plugin-2.3.1.jar (23 KB at 154.4 KB/sec)
Downloading: http://repo.maven.apache.org/maven2/org/eclipse/tycho/tycho-p2-plugin/0.20.0/tycho-p2-plugin-0.20.0.pom
Downloaded: http://repo.maven.apache.org/maven2/org/eclipse/tycho/tycho-p2-plugin/0.20.0/tycho-p2-plugin-0.20.0.pom (3 KB at 18.4 KB/sec)
Downloading: http://repo.maven.apache.org/maven2/org/eclipse/tycho/tycho-p2-plugin/0.20.0/tycho-p2-plugin-0.20.0.jar
Downloaded: http://repo.maven.apache.org/maven2/org/eclipse/tycho/tycho-p2-plugin/0.20.0/tycho-p2-plugin-0.20.0.jar (24 KB at 167.3 KB/sec)
Downloading: http://repo.maven.apache.org/maven2/org/eclipse/tycho/sisu-equinox-launching/0.20.0/sisu-equinox-launching-0.20.0.pom
Downloaded: http://repo.maven.apache.org/maven2/org/eclipse/tycho/sisu-equinox-launching/0.20.0/sisu-equinox-launching-0.20.0.pom (3 KB at 20.9 KB/sec)
Downloading: http://repo.maven.apache.org/maven2/org/apache/commons/commons-exec/1.2/commons-exec-1.2.pom
Downloaded: http://repo.maven.apache.org/maven2/org/apache/commons/commons-exec/1.2/commons-exec-1.2.pom (11 KB at 93.6 KB/sec)
Downloading: http://repo.maven.apache.org/maven2/org/apache/commons/commons-parent/32/commons-parent-32.pom
Downloaded: http://repo.maven.apache.org/maven2/org/apache/commons/commons-parent/32/commons-parent-32.pom (52 KB at 318.2 KB/sec)
Downloading: http://repo.maven.apache.org/maven2/org/apache/apache/13/apache-13.pom
Downloaded: http://repo.maven.apache.org/maven2/org/apache/apache/13/apache-13.pom (14 KB at 117.6 KB/sec)
Downloading: http://repo.maven.apache.org/maven2/org/eclipse/tycho/tycho-artifactcomparator/0.20.0/tycho-artifactcomparator-0.20.0.pom
Downloaded: http://repo.maven.apache.org/maven2/org/eclipse/tycho/tycho-artifactcomparator/0.20.0/tycho-artifactcomparator-0.20.0.pom (2 KB at 14.8 KB/sec)
Downloading: http://repo.maven.apache.org/maven2/org/ow2/asm/asm-debug-all/4.0/asm-debug-all-4.0.pom
Downloaded: http://repo.maven.apache.org/maven2/org/ow2/asm/asm-debug-all/4.0/asm-debug-all-4.0.pom (2 KB at 17.1 KB/sec)
Downloading: http://repo.maven.apache.org/maven2/org/ow2/asm/asm-parent/4.0/asm-parent-4.0.pom
Downloaded: http://repo.maven.apache.org/maven2/org/ow2/asm/asm-parent/4.0/asm-parent-4.0.pom (6 KB at 45.8 KB/sec)
Downloading: http://repo.maven.apache.org/maven2/org/ow2/ow2/1.3/ow2-1.3.pom
Downloaded: http://repo.maven.apache.org/maven2/org/ow2/ow2/1.3/ow2-1.3.pom (10 KB at 80.1 KB/sec)
Downloading: http://repo.maven.apache.org/maven2/org/eclipse/tycho/sisu-equinox-launching/0.20.0/sisu-equinox-launching-0.20.0.jar
Downloading: http://repo.maven.apache.org/maven2/org/apache/commons/commons-exec/1.2/commons-exec-1.2.jar
Downloading: http://repo.maven.apache.org/maven2/org/eclipse/tycho/tycho-artifactcomparator/0.20.0/tycho-artifactcomparator-0.20.0.jar
Downloading: http://repo.maven.apache.org/maven2/org/ow2/asm/asm-debug-all/4.0/asm-debug-all-4.0.jar
Downloaded: http://repo.maven.apache.org/maven2/org/eclipse/tycho/tycho-artifactcomparator/0.20.0/tycho-artifactcomparator-0.20.0.jar (19 KB at 133.1 KB/sec)
Downloaded: http://repo.maven.apache.org/maven2/org/eclipse/tycho/sisu-equinox-launching/0.20.0/sisu-equinox-launching-0.20.0.jar (26 KB at 178.4 KB/sec)
Downloaded: http://repo.maven.apache.org/maven2/org/apache/commons/commons-exec/1.2/commons-exec-1.2.jar (53 KB at 299.3 KB/sec)
Downloaded: http://repo.maven.apache.org/maven2/org/ow2/asm/asm-debug-all/4.0/asm-debug-all-4.0.jar (314 KB at 1187.3 KB/sec)
Downloading: http://repo.maven.apache.org/maven2/org/apache/maven/plugins/maven-resources-plugin/2.4.1/maven-resources-plugin-2.4.1.pom
Downloaded: http://repo.maven.apache.org/maven2/org/apache/maven/plugins/maven-resources-plugin/2.4.1/maven-resources-plugin-2.4.1.pom (6 KB at 37.7 KB/sec)
Downloading: http://repo.maven.apache.org/maven2/org/apache/maven/plugins/maven-plugins/14/maven-plugins-14.pom
Downloaded: http://repo.maven.apache.org/maven2/org/apache/maven/plugins/maven-plugins/14/maven-plugins-14.pom (13 KB at 109.3 KB/sec)
Downloading: http://repo.maven.apache.org/maven2/org/apache/maven/maven-parent/13/maven-parent-13.pom
Downloaded: http://repo.maven.apache.org/maven2/org/apache/maven/maven-parent/13/maven-parent-13.pom (23 KB at 156.8 KB/sec)
Downloading: http://repo.maven.apache.org/maven2/org/apache/maven/plugins/maven-resources-plugin/2.4.1/maven-resources-plugin-2.4.1.jar
Downloaded: http://repo.maven.apache.org/maven2/org/apache/maven/plugins/maven-resources-plugin/2.4.1/maven-resources-plugin-2.4.1.jar (24 KB at 141.2 KB/sec)
Downloading: http://repo.maven.apache.org/maven2/org/eclipse/tycho/tycho-compiler-plugin/0.20.0/tycho-compiler-plugin-0.20.0.pom
Downloaded: http://repo.maven.apache.org/maven2/org/eclipse/tycho/tycho-compiler-plugin/0.20.0/tycho-compiler-plugin-0.20.0.pom (3 KB at 21.1 KB/sec)
Downloading: http://repo.maven.apache.org/maven2/org/eclipse/tycho/tycho-compiler-plugin/0.20.0/tycho-compiler-plugin-0.20.0.jar
Downloaded: http://repo.maven.apache.org/maven2/org/eclipse/tycho/tycho-compiler-plugin/0.20.0/tycho-compiler-plugin-0.20.0.jar (27 KB at 190.7 KB/sec)
Downloading: http://repo.maven.apache.org/maven2/org/eclipse/tycho/tycho-packaging-plugin/0.20.0/tycho-packaging-plugin-0.20.0.pom
Downloaded: http://repo.maven.apache.org/maven2/org/eclipse/tycho/tycho-packaging-plugin/0.20.0/tycho-packaging-plugin-0.20.0.pom (3 KB at 21.9 KB/sec)
Downloading: http://repo.maven.apache.org/maven2/org/eclipse/tycho/tycho-packaging-plugin/0.20.0/tycho-packaging-plugin-0.20.0.jar
Downloaded: http://repo.maven.apache.org/maven2/org/eclipse/tycho/tycho-packaging-plugin/0.20.0/tycho-packaging-plugin-0.20.0.jar (108 KB at 476.2 KB/sec)
Downloading: http://repo.maven.apache.org/maven2/org/apache/maven/plugins/maven-deploy-plugin/2.5/maven-deploy-plugin-2.5.pom
Downloaded: http://repo.maven.apache.org/maven2/org/apache/maven/plugins/maven-deploy-plugin/2.5/maven-deploy-plugin-2.5.pom (6 KB at 46.1 KB/sec)
Downloading: http://repo.maven.apache.org/maven2/org/apache/maven/plugins/maven-plugins/16/maven-plugins-16.pom
Downloaded: http://repo.maven.apache.org/maven2/org/apache/maven/plugins/maven-plugins/16/maven-plugins-16.pom (13 KB at 109.0 KB/sec)
Downloading: http://repo.maven.apache.org/maven2/org/apache/maven/plugins/maven-deploy-plugin/2.5/maven-deploy-plugin-2.5.jar
Downloaded: http://repo.maven.apache.org/maven2/org/apache/maven/plugins/maven-deploy-plugin/2.5/maven-deploy-plugin-2.5.jar (23 KB at 150.3 KB/sec)
Downloading: http://repo.maven.apache.org/maven2/org/apache/maven/plugins/maven-site-plugin/3.0/maven-site-plugin-3.0.pom
Downloaded: http://repo.maven.apache.org/maven2/org/apache/maven/plugins/maven-site-plugin/3.0/maven-site-plugin-3.0.pom (20 KB at 137.7 KB/sec)
Downloading: http://repo.maven.apache.org/maven2/org/apache/maven/plugins/maven-plugins/21/maven-plugins-21.pom
Downloaded: http://repo.maven.apache.org/maven2/org/apache/maven/plugins/maven-plugins/21/maven-plugins-21.pom (13 KB at 102.4 KB/sec)
Downloading: http://repo.maven.apache.org/maven2/org/apache/maven/maven-parent/20/maven-parent-20.pom
Downloaded: http://repo.maven.apache.org/maven2/org/apache/maven/maven-parent/20/maven-parent-20.pom (25 KB at 172.9 KB/sec)
Downloading: http://repo.maven.apache.org/maven2/org/apache/apache/9/apache-9.pom
Downloaded: http://repo.maven.apache.org/maven2/org/apache/apache/9/apache-9.pom (15 KB at 105.0 KB/sec)
Downloading: http://repo.maven.apache.org/maven2/org/apache/maven/plugins/maven-site-plugin/3.0/maven-site-plugin-3.0.jar
Downloaded: http://repo.maven.apache.org/maven2/org/apache/maven/plugins/maven-site-plugin/3.0/maven-site-plugin-3.0.jar (112 KB at 453.0 KB/sec)
Downloading: http://repo.maven.apache.org/maven2/org/eclipse/tycho/tycho-surefire-plugin/0.20.0/tycho-surefire-plugin-0.20.0.pom
Downloaded: http://repo.maven.apache.org/maven2/org/eclipse/tycho/tycho-surefire-plugin/0.20.0/tycho-surefire-plugin-0.20.0.pom (4 KB at 25.7 KB/sec)
Downloading: http://repo.maven.apache.org/maven2/org/eclipse/tycho/tycho-surefire/0.20.0/tycho-surefire-0.20.0.pom
Downloaded: http://repo.maven.apache.org/maven2/org/eclipse/tycho/tycho-surefire/0.20.0/tycho-surefire-0.20.0.pom (3 KB at 23.6 KB/sec)
Downloading: http://repo.maven.apache.org/maven2/org/eclipse/tycho/tycho-surefire-plugin/0.20.0/tycho-surefire-plugin-0.20.0.jar
Downloaded: http://repo.maven.apache.org/maven2/org/eclipse/tycho/tycho-surefire-plugin/0.20.0/tycho-surefire-plugin-0.20.0.jar (43 KB at 252.7 KB/sec)
Downloading: http://repo.maven.apache.org/maven2/org/eclipse/tycho/org.eclipse.tycho.surefire.osgibooter/0.20.0/org.eclipse.tycho.surefire.osgibooter-0.20.0.pom
Downloaded: http://repo.maven.apache.org/maven2/org/eclipse/tycho/org.eclipse.tycho.surefire.osgibooter/0.20.0/org.eclipse.tycho.surefire.osgibooter-0.20.0.pom (2 KB at 13.7 KB/sec)
Downloading: http://repo.maven.apache.org/maven2/org/eclipse/tycho/org.eclipse.tycho.surefire.junit/0.20.0/org.eclipse.tycho.surefire.junit-0.20.0.pom
Downloaded: http://repo.maven.apache.org/maven2/org/eclipse/tycho/org.eclipse.tycho.surefire.junit/0.20.0/org.eclipse.tycho.surefire.junit-0.20.0.pom (2 KB at 13.5 KB/sec)
Downloading: http://repo.maven.apache.org/maven2/org/eclipse/tycho/org.eclipse.tycho.surefire.junit4/0.20.0/org.eclipse.tycho.surefire.junit4-0.20.0.pom
Downloaded: http://repo.maven.apache.org/maven2/org/eclipse/tycho/org.eclipse.tycho.surefire.junit4/0.20.0/org.eclipse.tycho.surefire.junit4-0.20.0.pom (2 KB at 12.9 KB/sec)
Downloading: http://repo.maven.apache.org/maven2/org/eclipse/tycho/org.eclipse.tycho.surefire.junit47/0.20.0/org.eclipse.tycho.surefire.junit47-0.20.0.pom
Downloaded: http://repo.maven.apache.org/maven2/org/eclipse/tycho/org.eclipse.tycho.surefire.junit47/0.20.0/org.eclipse.tycho.surefire.junit47-0.20.0.pom (2 KB at 13.2 KB/sec)
Downloading: http://repo.maven.apache.org/maven2/org/apache/maven/surefire/surefire-api/2.10/surefire-api-2.10.pom
Downloaded: http://repo.maven.apache.org/maven2/org/apache/maven/surefire/surefire-api/2.10/surefire-api-2.10.pom (3 KB at 18.1 KB/sec)
Downloading: http://repo.maven.apache.org/maven2/org/apache/maven/surefire/surefire/2.10/surefire-2.10.pom
Downloaded: http://repo.maven.apache.org/maven2/org/apache/maven/surefire/surefire/2.10/surefire-2.10.pom (12 KB at 100.4 KB/sec)
Downloading: http://repo.maven.apache.org/maven2/org/eclipse/tycho/org.eclipse.tycho.surefire.osgibooter/0.20.0/org.eclipse.tycho.surefire.osgibooter-0.20.0.jar
Downloading: http://repo.maven.apache.org/maven2/org/eclipse/tycho/org.eclipse.tycho.surefire.junit/0.20.0/org.eclipse.tycho.surefire.junit-0.20.0.jar
Downloading: http://repo.maven.apache.org/maven2/org/eclipse/tycho/org.eclipse.tycho.surefire.junit4/0.20.0/org.eclipse.tycho.surefire.junit4-0.20.0.jar
Downloading: http://repo.maven.apache.org/maven2/org/eclipse/tycho/org.eclipse.tycho.surefire.junit47/0.20.0/org.eclipse.tycho.surefire.junit47-0.20.0.jar
Downloading: http://repo.maven.apache.org/maven2/org/apache/maven/surefire/surefire-api/2.10/surefire-api-2.10.jar
Downloaded: http://repo.maven.apache.org/maven2/org/eclipse/tycho/org.eclipse.tycho.surefire.junit4/0.20.0/org.eclipse.tycho.surefire.junit4-0.20.0.jar (29 KB at 202.7 KB/sec)
Downloaded: http://repo.maven.apache.org/maven2/org/eclipse/tycho/org.eclipse.tycho.surefire.junit/0.20.0/org.eclipse.tycho.surefire.junit-0.20.0.jar (25 KB at 143.8 KB/sec)
Downloaded: http://repo.maven.apache.org/maven2/org/eclipse/tycho/org.eclipse.tycho.surefire.junit47/0.20.0/org.eclipse.tycho.surefire.junit47-0.20.0.jar (49 KB at 287.7 KB/sec)
Downloaded: http://repo.maven.apache.org/maven2/org/apache/maven/surefire/surefire-api/2.10/surefire-api-2.10.jar (158 KB at 729.4 KB/sec)
Downloaded: http://repo.maven.apache.org/maven2/org/eclipse/tycho/org.eclipse.tycho.surefire.osgibooter/0.20.0/org.eclipse.tycho.surefire.osgibooter-0.20.0.jar (181 KB at 703.7 KB/sec)
Downloading: http://repo.maven.apache.org/maven2/org/codehaus/mojo/xml-maven-plugin/1.0-beta-3/xml-maven-plugin-1.0-beta-3.pom
[INFO] o.h.m.e.h.MavenExecutionResultHandler - Build failed with exception(s)
[INFO] o.h.m.e.h.MavenExecutionResultHandler - [1] org.apache.maven.InternalErrorException: Internal error: java.lang.RuntimeException: org.apache.maven.MavenExecutionException: Could not setup plugin ClassRealm
[DEBUG] Closing connection to remote
[ERROR] Internal error: java.lang.RuntimeException: org.apache.maven.MavenExecutionException: Could not setup plugin ClassRealm: Plugin org.codehaus.mojo:xml-maven-plugin:1.0-beta-3 or one of its dependencies could not be resolved: Failed to read artifact descriptor for org.codehaus.mojo:xml-maven-plugin:jar:1.0-beta-3: Could not transfer artifact org.codehaus.mojo:xml-maven-plugin:pom:1.0-beta-3 from/to central (http://repo.maven.apache.org/maven2): Failed to transfer file: http://repo.maven.apache.org/maven2/org/codehaus/mojo/xml-maven-plugin/1.0-beta-3/xml-maven-plugin-1.0-beta-3.pom. Return code is: 502 , ReasonPhrase:Proxy Error. -> [Help 1]
org.apache.maven.InternalErrorException: Internal error: java.lang.RuntimeException: org.apache.maven.MavenExecutionException: Could not setup plugin ClassRealm
	at org.apache.maven.DefaultMaven.execute(DefaultMaven.java:168)
	at org.apache.maven.cli.MavenCli.execute(MavenCli.java:537)
	at org.apache.maven.cli.MavenCli.doMain(MavenCli.java:196)
	at org.apache.maven.cli.MavenCli.main(MavenCli.java:141)
	at sun.reflect.NativeMethodAccessorImpl.invoke0(Native Method)
	at sun.reflect.NativeMethodAccessorImpl.invoke(NativeMethodAccessorImpl.java:57)
	at sun.reflect.DelegatingMethodAccessorImpl.invoke(DelegatingMethodAccessorImpl.java:43)
	at java.lang.reflect.Method.invoke(Method.java:606)
	at org.codehaus.plexus.classworlds.launcher.Launcher.launchEnhanced(Launcher.java:290)
	at org.codehaus.plexus.classworlds.launcher.Launcher.launch(Launcher.java:230)
	at org.codehaus.plexus.classworlds.launcher.Launcher.mainWithExitCode(Launcher.java:409)
	at org.codehaus.plexus.classworlds.launcher.Launcher.main(Launcher.java:352)
Caused by: java.lang.RuntimeException: org.apache.maven.MavenExecutionException: Could not setup plugin ClassRealm
	at org.eclipse.tycho.p2.resolver.P2TargetPlatformResolver.getDependencyMetadata(P2TargetPlatformResolver.java:166)
	at org.eclipse.tycho.p2.resolver.P2TargetPlatformResolver.setupProjects(P2TargetPlatformResolver.java:124)
	at org.eclipse.tycho.core.resolver.DefaultTychoDependencyResolver.setupProject(DefaultTychoDependencyResolver.java:87)
	at org.eclipse.tycho.core.maven.TychoMavenLifecycleParticipant.afterProjectsRead(TychoMavenLifecycleParticipant.java:70)
	at org.apache.maven.DefaultMaven.doExecute(DefaultMaven.java:274)
	at org.apache.maven.DefaultMaven.execute(DefaultMaven.java:156)
	... 11 more
Caused by: org.apache.maven.MavenExecutionException: Could not setup plugin ClassRealm
	at org.eclipse.tycho.core.maven.utils.PluginRealmHelper.newMavenExecutionException(PluginRealmHelper.java:143)
	at org.eclipse.tycho.core.maven.utils.PluginRealmHelper.execute(PluginRealmHelper.java:130)
	at org.eclipse.tycho.p2.resolver.P2TargetPlatformResolver.getDependencyMetadata(P2TargetPlatformResolver.java:146)
	... 16 more
Caused by: org.apache.maven.plugin.PluginResolutionException: Plugin org.codehaus.mojo:xml-maven-plugin:1.0-beta-3 or one of its dependencies could not be resolved: Failed to read artifact descriptor for org.codehaus.mojo:xml-maven-plugin:jar:1.0-beta-3
	at org.apache.maven.plugin.internal.DefaultPluginDependenciesResolver.resolve(DefaultPluginDependenciesResolver.java:129)
	at org.apache.maven.plugin.internal.DefaultMavenPluginManager.getPluginDescriptor(DefaultMavenPluginManager.java:142)
	at sun.reflect.NativeMethodAccessorImpl.invoke0(Native Method)
	at sun.reflect.NativeMethodAccessorImpl.invoke(NativeMethodAccessorImpl.java:57)
	at sun.reflect.DelegatingMethodAccessorImpl.invoke(DelegatingMethodAccessorImpl.java:43)
	at java.lang.reflect.Method.invoke(Method.java:606)
	at org.eclipse.tycho.core.maven.utils.MavenCompatiblityHelper.getPluginDescriptor(MavenCompatiblityHelper.java:68)
	at org.eclipse.tycho.core.maven.utils.PluginRealmHelper.execute(PluginRealmHelper.java:95)
	... 17 more
Caused by: org.sonatype.aether.resolution.ArtifactDescriptorException: Failed to read artifact descriptor for org.codehaus.mojo:xml-maven-plugin:jar:1.0-beta-3
	at org.apache.maven.repository.internal.DefaultArtifactDescriptorReader.loadPom(DefaultArtifactDescriptorReader.java:296)
	at org.apache.maven.repository.internal.DefaultArtifactDescriptorReader.readArtifactDescriptor(DefaultArtifactDescriptorReader.java:186)
	at org.sonatype.aether.impl.internal.DefaultRepositorySystem.readArtifactDescriptor(DefaultRepositorySystem.java:279)
	at org.apache.maven.plugin.internal.DefaultPluginDependenciesResolver.resolve(DefaultPluginDependenciesResolver.java:115)
	... 24 more
Caused by: org.sonatype.aether.resolution.ArtifactResolutionException: Could not transfer artifact org.codehaus.mojo:xml-maven-plugin:pom:1.0-beta-3 from/to central (http://repo.maven.apache.org/maven2): Failed to transfer file: http://repo.maven.apache.org/maven2/org/codehaus/mojo/xml-maven-plugin/1.0-beta-3/xml-maven-plugin-1.0-beta-3.pom. Return code is: 502 , ReasonPhrase:Proxy Error.
	at org.sonatype.aether.impl.internal.DefaultArtifactResolver.resolve(DefaultArtifactResolver.java:538)
	at org.sonatype.aether.impl.internal.DefaultArtifactResolver.resolveArtifacts(DefaultArtifactResolver.java:216)
	at org.sonatype.aether.impl.internal.DefaultArtifactResolver.resolveArtifact(DefaultArtifactResolver.java:193)
	at org.apache.maven.repository.internal.DefaultArtifactDescriptorReader.loadPom(DefaultArtifactDescriptorReader.java:281)
	... 27 more
Caused by: org.sonatype.aether.transfer.ArtifactTransferException: Could not transfer artifact org.codehaus.mojo:xml-maven-plugin:pom:1.0-beta-3 from/to central (http://repo.maven.apache.org/maven2): Failed to transfer file: http://repo.maven.apache.org/maven2/org/codehaus/mojo/xml-maven-plugin/1.0-beta-3/xml-maven-plugin-1.0-beta-3.pom. Return code is: 502 , ReasonPhrase:Proxy Error.
	at org.sonatype.aether.connector.wagon.WagonRepositoryConnector$4.wrap(WagonRepositoryConnector.java:951)
	at org.sonatype.aether.connector.wagon.WagonRepositoryConnector$4.wrap(WagonRepositoryConnector.java:941)
	at org.sonatype.aether.connector.wagon.WagonRepositoryConnector$GetTask.run(WagonRepositoryConnector.java:669)
	at org.sonatype.aether.util.concurrency.RunnableErrorForwarder$1.run(RunnableErrorForwarder.java:60)
	at java.util.concurrent.ThreadPoolExecutor.runWorker(ThreadPoolExecutor.java:1145)
	at java.util.concurrent.ThreadPoolExecutor$Worker.run(ThreadPoolExecutor.java:615)
	at java.lang.Thread.run(Thread.java:745)
Caused by: org.apache.maven.wagon.TransferFailedException: Failed to transfer file: http://repo.maven.apache.org/maven2/org/codehaus/mojo/xml-maven-plugin/1.0-beta-3/xml-maven-plugin-1.0-beta-3.pom. Return code is: 502 , ReasonPhrase:Proxy Error.
	at org.apache.maven.wagon.shared.http4.AbstractHttpClientWagon.fillInputData(AbstractHttpClientWagon.java:945)
	at org.apache.maven.wagon.StreamWagon.getInputStream(StreamWagon.java:116)
	at org.apache.maven.wagon.StreamWagon.getIfNewer(StreamWagon.java:88)
	at org.apache.maven.wagon.StreamWagon.get(StreamWagon.java:61)
	at org.sonatype.aether.connector.wagon.WagonRepositoryConnector$GetTask.run(WagonRepositoryConnector.java:601)
	... 4 more
[ERROR] 
[ERROR] To see the full stack trace of the errors, re-run Maven with the -e switch.
[ERROR] Re-run Maven using the -X switch to enable full debug logging.
[ERROR] 
[ERROR] For more information about the errors and possible solutions, please read the following articles:
[ERROR] [Help 1] http://cwiki.apache.org/confluence/display/MAVEN/InternalErrorException
[DEBUG] Waiting for process to finish
[DEBUG] Result: 1
Recording fingerprints
Archiving artifacts
Finished: FAILURE