UnstableConsole Output

Skipping 2,570 KB.. Full Log
lipse.epp.mpc.tests.util.TransportFactoryTest)
Starting test testSampleCatalog(org.eclipse.epp.mpc.tests.service.CatalogServiceTest)
Finished test testSampleCatalog(org.eclipse.epp.mpc.tests.service.CatalogServiceTest)
Starting test listCatalogs(org.eclipse.epp.mpc.tests.service.CatalogServiceTest)
Finished test listCatalogs(org.eclipse.epp.mpc.tests.service.CatalogServiceTest)
Starting test search_bug448453(org.eclipse.epp.mpc.tests.service.DefaultMarketplaceServiceTest)
Finished test search_bug448453(org.eclipse.epp.mpc.tests.service.DefaultMarketplaceServiceTest)
Skipped test favorites(org.eclipse.epp.mpc.tests.service.DefaultMarketplaceServiceTest)
Starting test recent(org.eclipse.epp.mpc.tests.service.DefaultMarketplaceServiceTest)
Finished test recent(org.eclipse.epp.mpc.tests.service.DefaultMarketplaceServiceTest)
Starting test search(org.eclipse.epp.mpc.tests.service.DefaultMarketplaceServiceTest)
Finished test search(org.eclipse.epp.mpc.tests.service.DefaultMarketplaceServiceTest)
Starting test popular(org.eclipse.epp.mpc.tests.service.DefaultMarketplaceServiceTest)
Finished test popular(org.eclipse.epp.mpc.tests.service.DefaultMarketplaceServiceTest)
Starting test featured(org.eclipse.epp.mpc.tests.service.DefaultMarketplaceServiceTest)
Finished test featured(org.eclipse.epp.mpc.tests.service.DefaultMarketplaceServiceTest)
Starting test news(org.eclipse.epp.mpc.tests.service.DefaultMarketplaceServiceTest)
Finished test news(org.eclipse.epp.mpc.tests.service.DefaultMarketplaceServiceTest)
Starting test relatedEmpty(org.eclipse.epp.mpc.tests.service.DefaultMarketplaceServiceTest)
Finished test relatedEmpty(org.eclipse.epp.mpc.tests.service.DefaultMarketplaceServiceTest)
Starting test related(org.eclipse.epp.mpc.tests.service.DefaultMarketplaceServiceTest)
Finished test related(org.eclipse.epp.mpc.tests.service.DefaultMarketplaceServiceTest)
Starting test relatedNull(org.eclipse.epp.mpc.tests.service.DefaultMarketplaceServiceTest)
Finished test relatedNull(org.eclipse.epp.mpc.tests.service.DefaultMarketplaceServiceTest)
Starting test listMarkets(org.eclipse.epp.mpc.tests.service.DefaultMarketplaceServiceTest)
Finished test listMarkets(org.eclipse.epp.mpc.tests.service.DefaultMarketplaceServiceTest)
Starting test testGetMarket(org.eclipse.epp.mpc.tests.service.DefaultMarketplaceServiceTest)
Finished test testGetMarket(org.eclipse.epp.mpc.tests.service.DefaultMarketplaceServiceTest)
Starting test getNodes(org.eclipse.epp.mpc.tests.service.DefaultMarketplaceServiceTest)
Finished test getNodes(org.eclipse.epp.mpc.tests.service.DefaultMarketplaceServiceTest)
Starting test computeRelativeSearchUrl(org.eclipse.epp.mpc.tests.service.DefaultMarketplaceServiceTest)
Finished test computeRelativeSearchUrl(org.eclipse.epp.mpc.tests.service.DefaultMarketplaceServiceTest)
Starting test getCategory(org.eclipse.epp.mpc.tests.service.DefaultMarketplaceServiceTest)
Finished test getCategory(org.eclipse.epp.mpc.tests.service.DefaultMarketplaceServiceTest)
Skipped test org.eclipse.epp.mpc.tests.service.SolutionCompatibilityFilterTest
Starting test testSerialize(org.eclipse.epp.mpc.tests.ui.wizard.SelectionModelStateSerializerTest)
Finished test testSerialize(org.eclipse.epp.mpc.tests.ui.wizard.SelectionModelStateSerializerTest)
Starting test testGetInstallationInfoWithState(org.eclipse.epp.mpc.tests.ui.wizard.MarketplaceUrlHandlerTest)
Finished test testGetInstallationInfoWithState(org.eclipse.epp.mpc.tests.ui.wizard.MarketplaceUrlHandlerTest)
Starting test testPotentialUrls(org.eclipse.epp.mpc.tests.ui.wizard.MarketplaceUrlHandlerTest)
Finished test testPotentialUrls(org.eclipse.epp.mpc.tests.ui.wizard.MarketplaceUrlHandlerTest)
Starting test testGetInstallationInfo(org.eclipse.epp.mpc.tests.ui.wizard.MarketplaceUrlHandlerTest)
Finished test testGetInstallationInfo(org.eclipse.epp.mpc.tests.ui.wizard.MarketplaceUrlHandlerTest)
Starting test testNodeUrls(org.eclipse.epp.mpc.tests.ui.wizard.MarketplaceUrlHandlerTest)
Finished test testNodeUrls(org.eclipse.epp.mpc.tests.ui.wizard.MarketplaceUrlHandlerTest)
Starting test testGetInstallationInfoNoValidUrl(org.eclipse.epp.mpc.tests.ui.wizard.MarketplaceUrlHandlerTest)
Finished test testGetInstallationInfoNoValidUrl(org.eclipse.epp.mpc.tests.ui.wizard.MarketplaceUrlHandlerTest)
Starting test testHttpsVariants(org.eclipse.epp.mpc.tests.ui.wizard.MarketplaceUrlHandlerTest)
Finished test testHttpsVariants(org.eclipse.epp.mpc.tests.ui.wizard.MarketplaceUrlHandlerTest)
Starting test computeInstalled(org.eclipse.epp.mpc.tests.ui.catalog.MarketplaceInfoTest)
Finished test computeInstalled(org.eclipse.epp.mpc.tests.ui.catalog.MarketplaceInfoTest)
Starting test addMapCatalogNode(org.eclipse.epp.mpc.tests.ui.catalog.MarketplaceInfoTest)
Finished test addMapCatalogNode(org.eclipse.epp.mpc.tests.ui.catalog.MarketplaceInfoTest)
Starting test computeInstalledCatalogNodeIdsNoMarketplaceInfo(org.eclipse.epp.mpc.tests.ui.catalog.MarketplaceInfoTest)
Finished test computeInstalledCatalogNodeIdsNoMarketplaceInfo(org.eclipse.epp.mpc.tests.ui.catalog.MarketplaceInfoTest)
Starting test computeInstalledCatalogNodeIds(org.eclipse.epp.mpc.tests.ui.catalog.MarketplaceInfoTest)
Finished test computeInstalledCatalogNodeIds(org.eclipse.epp.mpc.tests.ui.catalog.MarketplaceInfoTest)
Starting test computeInstalledLegacy(org.eclipse.epp.mpc.tests.ui.catalog.MarketplaceInfoTest)
Finished test computeInstalledLegacy(org.eclipse.epp.mpc.tests.ui.catalog.MarketplaceInfoTest)
Starting test saveToUserHomeRegistryFileWithCurrentAndLegacy(org.eclipse.epp.mpc.tests.ui.catalog.MarketplaceInfoSerializationTest)
Finished test saveToUserHomeRegistryFileWithCurrentAndLegacy(org.eclipse.epp.mpc.tests.ui.catalog.MarketplaceInfoSerializationTest)
Starting test testResolveNonFileConfigurationArea(org.eclipse.epp.mpc.tests.ui.catalog.MarketplaceInfoSerializationTest)
Finished test testResolveNonFileConfigurationArea(org.eclipse.epp.mpc.tests.ui.catalog.MarketplaceInfoSerializationTest)
Starting test loadFromUserHomeRegistryFile(org.eclipse.epp.mpc.tests.ui.catalog.MarketplaceInfoSerializationTest)
Finished test loadFromUserHomeRegistryFile(org.eclipse.epp.mpc.tests.ui.catalog.MarketplaceInfoSerializationTest)
Starting test loadNonExisting(org.eclipse.epp.mpc.tests.ui.catalog.MarketplaceInfoSerializationTest)
Finished test loadNonExisting(org.eclipse.epp.mpc.tests.ui.catalog.MarketplaceInfoSerializationTest)
Starting test loadFromBundleLocation(org.eclipse.epp.mpc.tests.ui.catalog.MarketplaceInfoSerializationTest)
Finished test loadFromBundleLocation(org.eclipse.epp.mpc.tests.ui.catalog.MarketplaceInfoSerializationTest)
Starting test testResolveUrlEncodedConfigurationArea(org.eclipse.epp.mpc.tests.ui.catalog.MarketplaceInfoSerializationTest)
Finished test testResolveUrlEncodedConfigurationArea(org.eclipse.epp.mpc.tests.ui.catalog.MarketplaceInfoSerializationTest)
Starting test loadGarbage(org.eclipse.epp.mpc.tests.ui.catalog.MarketplaceInfoSerializationTest)
com.sun.org.apache.xerces.internal.impl.io.MalformedByteSequenceException: Invalid byte 2 of 2-byte UTF-8 sequence.
Continuing ...
Finished test loadGarbage(org.eclipse.epp.mpc.tests.ui.catalog.MarketplaceInfoSerializationTest)
Starting test testResolveNullConfigurationArea(org.eclipse.epp.mpc.tests.ui.catalog.MarketplaceInfoSerializationTest)
Finished test testResolveNullConfigurationArea(org.eclipse.epp.mpc.tests.ui.catalog.MarketplaceInfoSerializationTest)
Starting test loadFromLegacyUserHomeRegistryFile(org.eclipse.epp.mpc.tests.ui.catalog.MarketplaceInfoSerializationTest)
Finished test loadFromLegacyUserHomeRegistryFile(org.eclipse.epp.mpc.tests.ui.catalog.MarketplaceInfoSerializationTest)
Starting test saveAndLoad(org.eclipse.epp.mpc.tests.ui.catalog.MarketplaceInfoSerializationTest)
Finished test saveAndLoad(org.eclipse.epp.mpc.tests.ui.catalog.MarketplaceInfoSerializationTest)
Starting test load(org.eclipse.epp.mpc.tests.ui.catalog.MarketplaceInfoSerializationTest)
Finished test load(org.eclipse.epp.mpc.tests.ui.catalog.MarketplaceInfoSerializationTest)
Starting test loadIncomplete(org.eclipse.epp.mpc.tests.ui.catalog.MarketplaceInfoSerializationTest)
org.xml.sax.SAXParseException; lineNumber: 5; columnNumber: 9; XML document structures must start and end within the same entity.
Continuing ...
Finished test loadIncomplete(org.eclipse.epp.mpc.tests.ui.catalog.MarketplaceInfoSerializationTest)
Starting test testResolveNullConfigurationAreaRegistryFile(org.eclipse.epp.mpc.tests.ui.catalog.MarketplaceInfoSerializationTest)
Finished test testResolveNullConfigurationAreaRegistryFile(org.eclipse.epp.mpc.tests.ui.catalog.MarketplaceInfoSerializationTest)
Starting test testResolveConfigurationAreaRegistryFile(org.eclipse.epp.mpc.tests.ui.catalog.MarketplaceInfoSerializationTest)
Finished test testResolveConfigurationAreaRegistryFile(org.eclipse.epp.mpc.tests.ui.catalog.MarketplaceInfoSerializationTest)
Starting test loadFromUserHomeRegistryFileWithLegacy(org.eclipse.epp.mpc.tests.ui.catalog.MarketplaceInfoSerializationTest)
Finished test loadFromUserHomeRegistryFileWithLegacy(org.eclipse.epp.mpc.tests.ui.catalog.MarketplaceInfoSerializationTest)
Starting test loadFromConfigurationArea(org.eclipse.epp.mpc.tests.ui.catalog.MarketplaceInfoSerializationTest)
Finished test loadFromConfigurationArea(org.eclipse.epp.mpc.tests.ui.catalog.MarketplaceInfoSerializationTest)
Starting test loadEmpty(org.eclipse.epp.mpc.tests.ui.catalog.MarketplaceInfoSerializationTest)
org.xml.sax.SAXParseException; lineNumber: 1; columnNumber: 1; Premature end of file.
Continuing ...
Finished test loadEmpty(org.eclipse.epp.mpc.tests.ui.catalog.MarketplaceInfoSerializationTest)
Starting test saveToUserHomeRegistryFileWithLegacy(org.eclipse.epp.mpc.tests.ui.catalog.MarketplaceInfoSerializationTest)
Finished test saveToUserHomeRegistryFileWithLegacy(org.eclipse.epp.mpc.tests.ui.catalog.MarketplaceInfoSerializationTest)
Starting test testResolveConfigurationArea(org.eclipse.epp.mpc.tests.ui.catalog.MarketplaceInfoSerializationTest)
Finished test testResolveConfigurationArea(org.eclipse.epp.mpc.tests.ui.catalog.MarketplaceInfoSerializationTest)
Starting test saveToUserHomeForReadOnlyConfigurationArea(org.eclipse.epp.mpc.tests.ui.catalog.MarketplaceInfoSerializationTest)
Finished test saveToUserHomeForReadOnlyConfigurationArea(org.eclipse.epp.mpc.tests.ui.catalog.MarketplaceInfoSerializationTest)
Starting test testCatalogDescriptor(org.eclipse.epp.mpc.tests.ui.catalog.CatalogDescriptorTest)
Finished test testCatalogDescriptor(org.eclipse.epp.mpc.tests.ui.catalog.CatalogDescriptorTest)
Starting test testCopyCtorNull(org.eclipse.epp.mpc.tests.ui.catalog.CatalogDescriptorTest)
Finished test testCopyCtorNull(org.eclipse.epp.mpc.tests.ui.catalog.CatalogDescriptorTest)
Starting test testFindCatalogDescriptorWithCommonPrefix(org.eclipse.epp.mpc.tests.ui.catalog.CatalogDescriptorTest)
Finished test testFindCatalogDescriptorWithCommonPrefix(org.eclipse.epp.mpc.tests.ui.catalog.CatalogDescriptorTest)
Starting test testFindCatalogDescriptorWithCommonPrefixDifferentProtocol1(org.eclipse.epp.mpc.tests.ui.catalog.CatalogDescriptorTest)
Finished test testFindCatalogDescriptorWithCommonPrefixDifferentProtocol1(org.eclipse.epp.mpc.tests.ui.catalog.CatalogDescriptorTest)
Starting test testFindCatalogDescriptorWithCommonPrefixDifferentProtocol2(org.eclipse.epp.mpc.tests.ui.catalog.CatalogDescriptorTest)
Finished test testFindCatalogDescriptorWithCommonPrefixDifferentProtocol2(org.eclipse.epp.mpc.tests.ui.catalog.CatalogDescriptorTest)
Starting test testFindCatalogDescriptorMatchingProtocol(org.eclipse.epp.mpc.tests.ui.catalog.CatalogDescriptorTest)
Finished test testFindCatalogDescriptorMatchingProtocol(org.eclipse.epp.mpc.tests.ui.catalog.CatalogDescriptorTest)
Starting test testCatalogDescriptorURLString(org.eclipse.epp.mpc.tests.ui.catalog.CatalogDescriptorTest)
Finished test testCatalogDescriptorURLString(org.eclipse.epp.mpc.tests.ui.catalog.CatalogDescriptorTest)
Starting test testIgnoreCatalogDescriptorWithDedicatedHostingSuffix(org.eclipse.epp.mpc.tests.ui.catalog.CatalogDescriptorTest)
Finished test testIgnoreCatalogDescriptorWithDedicatedHostingSuffix(org.eclipse.epp.mpc.tests.ui.catalog.CatalogDescriptorTest)
Starting test testOpenNodes(org.eclipse.epp.mpc.tests.ui.wizard.MarketplaceClientServiceTest)
Test testOpenNodes(org.eclipse.epp.mpc.tests.ui.wizard.MarketplaceClientServiceTest)failed: Timeout after: 10000 ms.: The shell 'Eclipse Marketplace' did not activate
org.eclipse.swtbot.swt.finder.widgets.TimeoutException: Timeout after: 10000 ms.: The shell 'Eclipse Marketplace' did not activate
	at org.eclipse.swtbot.swt.finder.SWTBotFactory.waitUntil(SWTBotFactory.java:522)
	at org.eclipse.swtbot.swt.finder.SWTBot.waitUntil(SWTBot.java:1)
	at org.eclipse.swtbot.swt.finder.SWTBotFactory.waitUntil(SWTBotFactory.java:496)
	at org.eclipse.swtbot.swt.finder.SWTBot.waitUntil(SWTBot.java:1)
	at org.eclipse.epp.mpc.tests.ui.wizard.AbstractMarketplaceWizardBotTest.initWizardBot(AbstractMarketplaceWizardBotTest.java:196)
	at org.eclipse.epp.mpc.tests.ui.wizard.MarketplaceClientServiceTest.testOpenNodes(MarketplaceClientServiceTest.java:96)
	at sun.reflect.NativeMethodAccessorImpl.invoke0(Native Method)
	at sun.reflect.NativeMethodAccessorImpl.invoke(NativeMethodAccessorImpl.java:62)
	at sun.reflect.DelegatingMethodAccessorImpl.invoke(DelegatingMethodAccessorImpl.java:43)
	at java.lang.reflect.Method.invoke(Method.java:498)
	at org.junit.runners.model.FrameworkMethod$1.runReflectiveCall(FrameworkMethod.java:50)
	at org.junit.internal.runners.model.ReflectiveCallable.run(ReflectiveCallable.java:12)
	at org.junit.runners.model.FrameworkMethod.invokeExplosively(FrameworkMethod.java:47)
	at org.junit.internal.runners.statements.InvokeMethod.evaluate(InvokeMethod.java:17)
	at org.junit.internal.runners.statements.RunBefores.evaluate(RunBefores.java:26)
	at org.eclipse.epp.mpc.tests.ui.wizard.AbstractMarketplaceWizardBotTest$1.evaluate(AbstractMarketplaceWizardBotTest.java:151)
	at org.junit.rules.RunRules.evaluate(RunRules.java:20)
	at org.junit.runners.ParentRunner.runLeaf(ParentRunner.java:325)
	at org.junit.runners.BlockJUnit4ClassRunner.runChild(BlockJUnit4ClassRunner.java:78)
	at org.junit.runners.BlockJUnit4ClassRunner.runChild(BlockJUnit4ClassRunner.java:57)
	at org.junit.runners.ParentRunner$3.run(ParentRunner.java:290)
	at org.junit.runners.ParentRunner$1.schedule(ParentRunner.java:71)
	at org.junit.runners.ParentRunner.runChildren(ParentRunner.java:288)
	at org.junit.runners.ParentRunner.access$000(ParentRunner.java:58)
	at org.junit.runners.ParentRunner$2.evaluate(ParentRunner.java:268)
	at org.junit.runners.ParentRunner.run(ParentRunner.java:363)
	at org.junit.runners.Suite.runChild(Suite.java:128)
	at org.junit.runners.Suite.runChild(Suite.java:27)
	at org.junit.runners.ParentRunner$3.run(ParentRunner.java:290)
	at org.junit.runners.ParentRunner$1.schedule(ParentRunner.java:71)
	at org.junit.runners.ParentRunner.runChildren(ParentRunner.java:288)
	at org.junit.runners.ParentRunner.access$000(ParentRunner.java:58)
	at org.junit.runners.ParentRunner$2.evaluate(ParentRunner.java:268)
	at org.junit.runners.ParentRunner.run(ParentRunner.java:363)
	at org.eclipse.epp.mpc.tests.LoggingSuite.run(LoggingSuite.java:76)
	at org.junit.runners.Suite.runChild(Suite.java:128)
	at org.junit.runners.Suite.runChild(Suite.java:27)
	at org.junit.runners.ParentRunner$3.run(ParentRunner.java:290)
	at org.junit.runners.ParentRunner$1.schedule(ParentRunner.java:71)
	at org.junit.runners.ParentRunner.runChildren(ParentRunner.java:288)
	at org.junit.runners.ParentRunner.access$000(ParentRunner.java:58)
	at org.junit.runners.ParentRunner$2.evaluate(ParentRunner.java:268)
	at org.junit.runners.ParentRunner.run(ParentRunner.java:363)
	at org.eclipse.epp.mpc.tests.LoggingSuite.run(LoggingSuite.java:76)
	at org.apache.maven.surefire.junit4.JUnit4Provider.execute(JUnit4Provider.java:367)
	at org.apache.maven.surefire.junit4.JUnit4Provider.executeWithRerun(JUnit4Provider.java:274)
	at org.apache.maven.surefire.junit4.JUnit4Provider.executeTestSet(JUnit4Provider.java:238)
	at org.apache.maven.surefire.junit4.JUnit4Provider.invoke(JUnit4Provider.java:161)
	at sun.reflect.NativeMethodAccessorImpl.invoke0(Native Method)
	at sun.reflect.NativeMethodAccessorImpl.invoke(NativeMethodAccessorImpl.java:62)
	at sun.reflect.DelegatingMethodAccessorImpl.invoke(DelegatingMethodAccessorImpl.java:43)
	at java.lang.reflect.Method.invoke(Method.java:498)
	at org.apache.maven.surefire.util.ReflectionUtils.invokeMethodWithArray2(ReflectionUtils.java:202)
	at org.apache.maven.surefire.booter.ProviderFactory$ProviderProxy.invoke(ProviderFactory.java:155)
	at org.apache.maven.surefire.booter.ProviderFactory.invokeProvider(ProviderFactory.java:81)
	at org.eclipse.tycho.surefire.osgibooter.OsgiSurefireBooter.run(OsgiSurefireBooter.java:107)
	at org.eclipse.tycho.surefire.osgibooter.AbstractUITestApplication.runTests(AbstractUITestApplication.java:44)
	at org.eclipse.e4.ui.internal.workbench.swt.E4Testable.lambda$0(E4Testable.java:76)
	at java.lang.Thread.run(Thread.java:748)
Finished test testOpenNodes(org.eclipse.epp.mpc.tests.ui.wizard.MarketplaceClientServiceTest)
Starting test testOpenProvisioning(org.eclipse.epp.mpc.tests.ui.wizard.MarketplaceClientServiceTest)
Test testOpenProvisioning(org.eclipse.epp.mpc.tests.ui.wizard.MarketplaceClientServiceTest)failed: expected:<1> but was:<0>
java.lang.AssertionError: expected:<1> but was:<0>
	at org.junit.Assert.fail(Assert.java:88)
	at org.junit.Assert.failNotEquals(Assert.java:834)
	at org.junit.Assert.assertEquals(Assert.java:645)
	at org.junit.Assert.assertEquals(Assert.java:631)
	at org.eclipse.epp.mpc.tests.ui.wizard.MarketplaceClientServiceTest.testOpenProvisioning(MarketplaceClientServiceTest.java:164)
	at sun.reflect.NativeMethodAccessorImpl.invoke0(Native Method)
	at sun.reflect.NativeMethodAccessorImpl.invoke(NativeMethodAccessorImpl.java:62)
	at sun.reflect.DelegatingMethodAccessorImpl.invoke(DelegatingMethodAccessorImpl.java:43)
	at java.lang.reflect.Method.invoke(Method.java:498)
	at org.junit.runners.model.FrameworkMethod$1.runReflectiveCall(FrameworkMethod.java:50)
	at org.junit.internal.runners.model.ReflectiveCallable.run(ReflectiveCallable.java:12)
	at org.junit.runners.model.FrameworkMethod.invokeExplosively(FrameworkMethod.java:47)
	at org.junit.internal.runners.statements.InvokeMethod.evaluate(InvokeMethod.java:17)
	at org.junit.internal.runners.statements.RunBefores.evaluate(RunBefores.java:26)
	at org.eclipse.epp.mpc.tests.ui.wizard.AbstractMarketplaceWizardBotTest$1.evaluate(AbstractMarketplaceWizardBotTest.java:151)
	at org.junit.rules.RunRules.evaluate(RunRules.java:20)
	at org.junit.runners.ParentRunner.runLeaf(ParentRunner.java:325)
	at org.junit.runners.BlockJUnit4ClassRunner.runChild(BlockJUnit4ClassRunner.java:78)
	at org.junit.runners.BlockJUnit4ClassRunner.runChild(BlockJUnit4ClassRunner.java:57)
	at org.junit.runners.ParentRunner$3.run(ParentRunner.java:290)
	at org.junit.runners.ParentRunner$1.schedule(ParentRunner.java:71)
	at org.junit.runners.ParentRunner.runChildren(ParentRunner.java:288)
	at org.junit.runners.ParentRunner.access$000(ParentRunner.java:58)
	at org.junit.runners.ParentRunner$2.evaluate(ParentRunner.java:268)
	at org.junit.runners.ParentRunner.run(ParentRunner.java:363)
	at org.junit.runners.Suite.runChild(Suite.java:128)
	at org.junit.runners.Suite.runChild(Suite.java:27)
	at org.junit.runners.ParentRunner$3.run(ParentRunner.java:290)
	at org.junit.runners.ParentRunner$1.schedule(ParentRunner.java:71)
	at org.junit.runners.ParentRunner.runChildren(ParentRunner.java:288)
	at org.junit.runners.ParentRunner.access$000(ParentRunner.java:58)
	at org.junit.runners.ParentRunner$2.evaluate(ParentRunner.java:268)
	at org.junit.runners.ParentRunner.run(ParentRunner.java:363)
	at org.eclipse.epp.mpc.tests.LoggingSuite.run(LoggingSuite.java:76)
	at org.junit.runners.Suite.runChild(Suite.java:128)
	at org.junit.runners.Suite.runChild(Suite.java:27)
	at org.junit.runners.ParentRunner$3.run(ParentRunner.java:290)
	at org.junit.runners.ParentRunner$1.schedule(ParentRunner.java:71)
	at org.junit.runners.ParentRunner.runChildren(ParentRunner.java:288)
	at org.junit.runners.ParentRunner.access$000(ParentRunner.java:58)
	at org.junit.runners.ParentRunner$2.evaluate(ParentRunner.java:268)
	at org.junit.runners.ParentRunner.run(ParentRunner.java:363)
	at org.eclipse.epp.mpc.tests.LoggingSuite.run(LoggingSuite.java:76)
	at org.apache.maven.surefire.junit4.JUnit4Provider.execute(JUnit4Provider.java:367)
	at org.apache.maven.surefire.junit4.JUnit4Provider.executeWithRerun(JUnit4Provider.java:274)
	at org.apache.maven.surefire.junit4.JUnit4Provider.executeTestSet(JUnit4Provider.java:238)
	at org.apache.maven.surefire.junit4.JUnit4Provider.invoke(JUnit4Provider.java:161)
	at sun.reflect.NativeMethodAccessorImpl.invoke0(Native Method)
	at sun.reflect.NativeMethodAccessorImpl.invoke(NativeMethodAccessorImpl.java:62)
	at sun.reflect.DelegatingMethodAccessorImpl.invoke(DelegatingMethodAccessorImpl.java:43)
	at java.lang.reflect.Method.invoke(Method.java:498)
	at org.apache.maven.surefire.util.ReflectionUtils.invokeMethodWithArray2(ReflectionUtils.java:202)
	at org.apache.maven.surefire.booter.ProviderFactory$ProviderProxy.invoke(ProviderFactory.java:155)
	at org.apache.maven.surefire.booter.ProviderFactory.invokeProvider(ProviderFactory.java:81)
	at org.eclipse.tycho.surefire.osgibooter.OsgiSurefireBooter.run(OsgiSurefireBooter.java:107)
	at org.eclipse.tycho.surefire.osgibooter.AbstractUITestApplication.runTests(AbstractUITestApplication.java:44)
	at org.eclipse.e4.ui.internal.workbench.swt.E4Testable.lambda$0(E4Testable.java:76)
	at java.lang.Thread.run(Thread.java:748)
Finished test testOpenProvisioning(org.eclipse.epp.mpc.tests.ui.wizard.MarketplaceClientServiceTest)
Starting test testOpenWithSelection(org.eclipse.epp.mpc.tests.ui.wizard.MarketplaceClientServiceTest)
Test testOpenWithSelection(org.eclipse.epp.mpc.tests.ui.wizard.MarketplaceClientServiceTest)failed: Timeout after: 10000 ms.: The shell 'Eclipse Marketplace' did not activate
org.eclipse.swtbot.swt.finder.widgets.TimeoutException: Timeout after: 10000 ms.: The shell 'Eclipse Marketplace' did not activate
	at org.eclipse.swtbot.swt.finder.SWTBotFactory.waitUntil(SWTBotFactory.java:522)
	at org.eclipse.swtbot.swt.finder.SWTBot.waitUntil(SWTBot.java:1)
	at org.eclipse.swtbot.swt.finder.SWTBotFactory.waitUntil(SWTBotFactory.java:496)
	at org.eclipse.swtbot.swt.finder.SWTBot.waitUntil(SWTBot.java:1)
	at org.eclipse.epp.mpc.tests.ui.wizard.AbstractMarketplaceWizardBotTest.initWizardBot(AbstractMarketplaceWizardBotTest.java:196)
	at org.eclipse.epp.mpc.tests.ui.wizard.MarketplaceClientServiceTest.testOpenWithSelection(MarketplaceClientServiceTest.java:129)
	at sun.reflect.NativeMethodAccessorImpl.invoke0(Native Method)
	at sun.reflect.NativeMethodAccessorImpl.invoke(NativeMethodAccessorImpl.java:62)
	at sun.reflect.DelegatingMethodAccessorImpl.invoke(DelegatingMethodAccessorImpl.java:43)
	at java.lang.reflect.Method.invoke(Method.java:498)
	at org.junit.runners.model.FrameworkMethod$1.runReflectiveCall(FrameworkMethod.java:50)
	at org.junit.internal.runners.model.ReflectiveCallable.run(ReflectiveCallable.java:12)
	at org.junit.runners.model.FrameworkMethod.invokeExplosively(FrameworkMethod.java:47)
	at org.junit.internal.runners.statements.InvokeMethod.evaluate(InvokeMethod.java:17)
	at org.junit.internal.runners.statements.RunBefores.evaluate(RunBefores.java:26)
	at org.eclipse.epp.mpc.tests.ui.wizard.AbstractMarketplaceWizardBotTest$1.evaluate(AbstractMarketplaceWizardBotTest.java:151)
	at org.junit.rules.RunRules.evaluate(RunRules.java:20)
	at org.junit.runners.ParentRunner.runLeaf(ParentRunner.java:325)
	at org.junit.runners.BlockJUnit4ClassRunner.runChild(BlockJUnit4ClassRunner.java:78)
	at org.junit.runners.BlockJUnit4ClassRunner.runChild(BlockJUnit4ClassRunner.java:57)
	at org.junit.runners.ParentRunner$3.run(ParentRunner.java:290)
	at org.junit.runners.ParentRunner$1.schedule(ParentRunner.java:71)
	at org.junit.runners.ParentRunner.runChildren(ParentRunner.java:288)
	at org.junit.runners.ParentRunner.access$000(ParentRunner.java:58)
	at org.junit.runners.ParentRunner$2.evaluate(ParentRunner.java:268)
	at org.junit.runners.ParentRunner.run(ParentRunner.java:363)
	at org.junit.runners.Suite.runChild(Suite.java:128)
	at org.junit.runners.Suite.runChild(Suite.java:27)
	at org.junit.runners.ParentRunner$3.run(ParentRunner.java:290)
	at org.junit.runners.ParentRunner$1.schedule(ParentRunner.java:71)
	at org.junit.runners.ParentRunner.runChildren(ParentRunner.java:288)
	at org.junit.runners.ParentRunner.access$000(ParentRunner.java:58)
	at org.junit.runners.ParentRunner$2.evaluate(ParentRunner.java:268)
	at org.junit.runners.ParentRunner.run(ParentRunner.java:363)
	at org.eclipse.epp.mpc.tests.LoggingSuite.run(LoggingSuite.java:76)
	at org.junit.runners.Suite.runChild(Suite.java:128)
	at org.junit.runners.Suite.runChild(Suite.java:27)
	at org.junit.runners.ParentRunner$3.run(ParentRunner.java:290)
	at org.junit.runners.ParentRunner$1.schedule(ParentRunner.java:71)
	at org.junit.runners.ParentRunner.runChildren(ParentRunner.java:288)
	at org.junit.runners.ParentRunner.access$000(ParentRunner.java:58)
	at org.junit.runners.ParentRunner$2.evaluate(ParentRunner.java:268)
	at org.junit.runners.ParentRunner.run(ParentRunner.java:363)
	at org.eclipse.epp.mpc.tests.LoggingSuite.run(LoggingSuite.java:76)
	at org.apache.maven.surefire.junit4.JUnit4Provider.execute(JUnit4Provider.java:367)
	at org.apache.maven.surefire.junit4.JUnit4Provider.executeWithRerun(JUnit4Provider.java:274)
	at org.apache.maven.surefire.junit4.JUnit4Provider.executeTestSet(JUnit4Provider.java:238)
	at org.apache.maven.surefire.junit4.JUnit4Provider.invoke(JUnit4Provider.java:161)
	at sun.reflect.NativeMethodAccessorImpl.invoke0(Native Method)
	at sun.reflect.NativeMethodAccessorImpl.invoke(NativeMethodAccessorImpl.java:62)
	at sun.reflect.DelegatingMethodAccessorImpl.invoke(DelegatingMethodAccessorImpl.java:43)
	at java.lang.reflect.Method.invoke(Method.java:498)
	at org.apache.maven.surefire.util.ReflectionUtils.invokeMethodWithArray2(ReflectionUtils.java:202)
	at org.apache.maven.surefire.booter.ProviderFactory$ProviderProxy.invoke(ProviderFactory.java:155)
	at org.apache.maven.surefire.booter.ProviderFactory.invokeProvider(ProviderFactory.java:81)
	at org.eclipse.tycho.surefire.osgibooter.OsgiSurefireBooter.run(OsgiSurefireBooter.java:107)
	at org.eclipse.tycho.surefire.osgibooter.AbstractUITestApplication.runTests(AbstractUITestApplication.java:44)
	at org.eclipse.e4.ui.internal.workbench.swt.E4Testable.lambda$0(E4Testable.java:76)
	at java.lang.Thread.run(Thread.java:748)
Finished test testOpenWithSelection(org.eclipse.epp.mpc.tests.ui.wizard.MarketplaceClientServiceTest)
Starting test testOpenSearch(org.eclipse.epp.mpc.tests.ui.wizard.MarketplaceClientServiceTest)
Test testOpenSearch(org.eclipse.epp.mpc.tests.ui.wizard.MarketplaceClientServiceTest)failed: Timeout after: 10000 ms.: The shell 'Eclipse Marketplace' did not activate
org.eclipse.swtbot.swt.finder.widgets.TimeoutException: Timeout after: 10000 ms.: The shell 'Eclipse Marketplace' did not activate
	at org.eclipse.swtbot.swt.finder.SWTBotFactory.waitUntil(SWTBotFactory.java:522)
	at org.eclipse.swtbot.swt.finder.SWTBot.waitUntil(SWTBot.java:1)
	at org.eclipse.swtbot.swt.finder.SWTBotFactory.waitUntil(SWTBotFactory.java:496)
	at org.eclipse.swtbot.swt.finder.SWTBot.waitUntil(SWTBot.java:1)
	at org.eclipse.epp.mpc.tests.ui.wizard.AbstractMarketplaceWizardBotTest.initWizardBot(AbstractMarketplaceWizardBotTest.java:196)
	at org.eclipse.epp.mpc.tests.ui.wizard.MarketplaceClientServiceTest.testOpenSearch(MarketplaceClientServiceTest.java:108)
	at sun.reflect.NativeMethodAccessorImpl.invoke0(Native Method)
	at sun.reflect.NativeMethodAccessorImpl.invoke(NativeMethodAccessorImpl.java:62)
	at sun.reflect.DelegatingMethodAccessorImpl.invoke(DelegatingMethodAccessorImpl.java:43)
	at java.lang.reflect.Method.invoke(Method.java:498)
	at org.junit.runners.model.FrameworkMethod$1.runReflectiveCall(FrameworkMethod.java:50)
	at org.junit.internal.runners.model.ReflectiveCallable.run(ReflectiveCallable.java:12)
	at org.junit.runners.model.FrameworkMethod.invokeExplosively(FrameworkMethod.java:47)
	at org.junit.internal.runners.statements.InvokeMethod.evaluate(InvokeMethod.java:17)
	at org.junit.internal.runners.statements.RunBefores.evaluate(RunBefores.java:26)
	at org.eclipse.epp.mpc.tests.ui.wizard.AbstractMarketplaceWizardBotTest$1.evaluate(AbstractMarketplaceWizardBotTest.java:151)
	at org.junit.rules.RunRules.evaluate(RunRules.java:20)
	at org.junit.runners.ParentRunner.runLeaf(ParentRunner.java:325)
	at org.junit.runners.BlockJUnit4ClassRunner.runChild(BlockJUnit4ClassRunner.java:78)
	at org.junit.runners.BlockJUnit4ClassRunner.runChild(BlockJUnit4ClassRunner.java:57)
	at org.junit.runners.ParentRunner$3.run(ParentRunner.java:290)
	at org.junit.runners.ParentRunner$1.schedule(ParentRunner.java:71)
	at org.junit.runners.ParentRunner.runChildren(ParentRunner.java:288)
	at org.junit.runners.ParentRunner.access$000(ParentRunner.java:58)
	at org.junit.runners.ParentRunner$2.evaluate(ParentRunner.java:268)
	at org.junit.runners.ParentRunner.run(ParentRunner.java:363)
	at org.junit.runners.Suite.runChild(Suite.java:128)
	at org.junit.runners.Suite.runChild(Suite.java:27)
	at org.junit.runners.ParentRunner$3.run(ParentRunner.java:290)
	at org.junit.runners.ParentRunner$1.schedule(ParentRunner.java:71)
	at org.junit.runners.ParentRunner.runChildren(ParentRunner.java:288)
	at org.junit.runners.ParentRunner.access$000(ParentRunner.java:58)
	at org.junit.runners.ParentRunner$2.evaluate(ParentRunner.java:268)
	at org.junit.runners.ParentRunner.run(ParentRunner.java:363)
	at org.eclipse.epp.mpc.tests.LoggingSuite.run(LoggingSuite.java:76)
	at org.junit.runners.Suite.runChild(Suite.java:128)
	at org.junit.runners.Suite.runChild(Suite.java:27)
	at org.junit.runners.ParentRunner$3.run(ParentRunner.java:290)
	at org.junit.runners.ParentRunner$1.schedule(ParentRunner.java:71)
	at org.junit.runners.ParentRunner.runChildren(ParentRunner.java:288)
	at org.junit.runners.ParentRunner.access$000(ParentRunner.java:58)
	at org.junit.runners.ParentRunner$2.evaluate(ParentRunner.java:268)
	at org.junit.runners.ParentRunner.run(ParentRunner.java:363)
	at org.eclipse.epp.mpc.tests.LoggingSuite.run(LoggingSuite.java:76)
	at org.apache.maven.surefire.junit4.JUnit4Provider.execute(JUnit4Provider.java:367)
	at org.apache.maven.surefire.junit4.JUnit4Provider.executeWithRerun(JUnit4Provider.java:274)
	at org.apache.maven.surefire.junit4.JUnit4Provider.executeTestSet(JUnit4Provider.java:238)
	at org.apache.maven.surefire.junit4.JUnit4Provider.invoke(JUnit4Provider.java:161)
	at sun.reflect.NativeMethodAccessorImpl.invoke0(Native Method)
	at sun.reflect.NativeMethodAccessorImpl.invoke(NativeMethodAccessorImpl.java:62)
	at sun.reflect.DelegatingMethodAccessorImpl.invoke(DelegatingMethodAccessorImpl.java:43)
	at java.lang.reflect.Method.invoke(Method.java:498)
	at org.apache.maven.surefire.util.ReflectionUtils.invokeMethodWithArray2(ReflectionUtils.java:202)
	at org.apache.maven.surefire.booter.ProviderFactory$ProviderProxy.invoke(ProviderFactory.java:155)
	at org.apache.maven.surefire.booter.ProviderFactory.invokeProvider(ProviderFactory.java:81)
	at org.eclipse.tycho.surefire.osgibooter.OsgiSurefireBooter.run(OsgiSurefireBooter.java:107)
	at org.eclipse.tycho.surefire.osgibooter.AbstractUITestApplication.runTests(AbstractUITestApplication.java:44)
	at org.eclipse.e4.ui.internal.workbench.swt.E4Testable.lambda$0(E4Testable.java:76)
	at java.lang.Thread.run(Thread.java:748)
Finished test testOpenSearch(org.eclipse.epp.mpc.tests.ui.wizard.MarketplaceClientServiceTest)
Starting test testOpenFavorites(org.eclipse.epp.mpc.tests.ui.wizard.MarketplaceClientServiceTest)
Test testOpenFavorites(org.eclipse.epp.mpc.tests.ui.wizard.MarketplaceClientServiceTest)failed: Timeout after: 10000 ms.: The shorg.eclipse.swtbot.swt.finder.widgets.TimeoutException: Timeout after: 10000 ms.: The shell 'Eclipse Marketplace' did not activate
ell 'Eclipse Marketplace' did not activate
	at org.eclipse.swtbot.swt.finder.SWTBotFactory.waitUntil(SWTBotFactory.java:522)
	at org.eclipse.swtbot.swt.finder.SWTBot.waitUntil(SWTBot.java:1)
	at org.eclipse.swtbot.swt.finder.SWTBotFactory.waitUntil(SWTBotFactory.java:496)
	at org.eclipse.swtbot.swt.finder.SWTBot.waitUntil(SWTBot.java:1)
	at org.eclipse.epp.mpc.tests.ui.wizard.AbstractMarketplaceWizardBotTest.initWizardBot(AbstractMarketplaceWizardBotTest.java:196)
	at org.eclipse.epp.mpc.tests.ui.wizard.MarketplaceClientServiceTest.testOpenFavorites(MarketplaceClientServiceTest.java:173)
	at sun.reflect.NativeMethodAccessorImpl.invoke0(Native Method)
	at sun.reflect.NativeMethodAccessorImpl.invoke(NativeMethodAccessorImpl.java:62)
	at sun.reflect.DelegatingMethodAccessorImpl.invoke(DelegatingMethodAccessorImpl.java:43)
	at java.lang.reflect.Method.invoke(Method.java:498)
	at org.junit.runners.model.FrameworkMethod$1.runReflectiveCall(FrameworkMethod.java:50)
	at org.junit.internal.runners.model.ReflectiveCallable.run(ReflectiveCallable.java:12)
	at org.junit.runners.model.FrameworkMethod.invokeExplosively(FrameworkMethod.java:47)
	at org.junit.internal.runners.statements.InvokeMethod.evaluate(InvokeMethod.java:17)
	at org.junit.internal.runners.statements.RunBefores.evaluate(RunBefores.java:26)
	at org.eclipse.epp.mpc.tests.ui.wizard.AbstractMarketplaceWizardBotTest$1.evaluate(AbstractMarketplaceWizardBotTest.java:151)
	at org.junit.rules.RunRules.evaluate(RunRules.java:20)
	at org.junit.runners.ParentRunner.runLeaf(ParentRunner.java:325)
	at org.junit.runners.BlockJUnit4ClassRunner.runChild(BlockJUnit4ClassRunner.java:78)
	at org.junit.runners.BlockJUnit4ClassRunner.runChild(BlockJUnit4ClassRunner.java:57)
	at org.junit.runners.ParentRunner$3.run(ParentRunner.java:290)
	at org.junit.runners.ParentRunner$1.schedule(ParentRunner.java:71)
	at org.junit.runners.ParentRunner.runChildren(ParentRunner.java:288)
	at org.junit.runners.ParentRunner.access$000(ParentRunner.java:58)
	at org.junit.runners.ParentRunner$2.evaluate(ParentRunner.java:268)
	at org.junit.runners.ParentRunner.run(ParentRunner.java:363)
	at org.junit.runners.Suite.runChild(Suite.java:128)
	at org.junit.runners.Suite.runChild(Suite.java:27)
	at org.junit.runners.ParentRunner$3.run(ParentRunner.java:290)
	at org.junit.runners.ParentRunner$1.schedule(ParentRunner.java:71)
	at org.junit.runners.ParentRunner.runChildren(ParentRunner.java:288)
	at org.junit.runners.ParentRunner.access$000(ParentRunner.java:58)
	at org.junit.runners.ParentRunner$2.evaluate(ParentRunner.java:268)
	at org.junit.runners.ParentRunner.run(ParentRunner.java:363)
	at org.eclipse.epp.mpc.tests.LoggingSuite.run(LoggingSuite.java:76)
	at org.junit.runners.Suite.runChild(Suite.java:128)
	at org.junit.runners.Suite.runChild(Suite.java:27)
	at org.junit.runners.ParentRunner$3.run(ParentRunner.java:290)
	at org.junit.runners.ParentRunner$1.schedule(ParentRunner.java:71)
	at org.junit.runners.ParentRunner.runChildren(ParentRunner.java:288)
	at org.junit.runners.ParentRunner.access$000(ParentRunner.java:58)
	at org.junit.runners.ParentRunner$2.evaluate(ParentRunner.java:268)
	at org.junit.runners.ParentRunner.run(ParentRunner.java:363)
	at org.eclipse.epp.mpc.tests.LoggingSuite.run(LoggingSuite.java:76)
	at org.apache.maven.surefire.junit4.JUnit4Provider.execute(JUnit4Provider.java:367)
	at org.apache.maven.surefire.junit4.JUnit4Provider.executeWithRerun(JUnit4Provider.java:274)
	at org.apache.maven.surefire.junit4.JUnit4Provider.executeTestSet(JUnit4Provider.java:238)
	at org.apache.maven.surefire.junit4.JUnit4Provider.invoke(JUnit4Provider.java:161)
	at sun.reflect.NativeMethodAccessorImpl.invoke0(Native Method)
	at sun.reflect.NativeMethodAccessorImpl.invoke(NativeMethodAccessorImpl.java:62)
	at sun.reflect.DelegatingMethodAccessorImpl.invoke(DelegatingMethodAccessorImpl.java:43)
	at java.lang.reflect.Method.invoke(Method.java:498)
	at org.apache.maven.surefire.util.ReflectionUtils.invokeMethodWithArray2(ReflectionUtils.java:202)
	at org.apache.maven.surefire.booter.ProviderFactory$ProviderProxy.invoke(ProviderFactory.java:155)
	at org.apache.maven.surefire.booter.ProviderFactory.invokeProvider(ProviderFactory.java:81)
	at org.eclipse.tycho.surefire.osgibooter.OsgiSurefireBooter.run(OsgiSurefireBooter.java:107)
	at org.eclipse.tycho.surefire.osgibooter.AbstractUITestApplication.runTests(AbstractUITestApplication.java:44)
	at org.eclipse.e4.ui.internal.workbench.swt.E4Testable.lambda$0(E4Testable.java:76)
	at java.lang.Thread.run(Thread.java:748)
Finished test testOpenFavorites(org.eclipse.epp.mpc.tests.ui.wizard.MarketplaceClientServiceTest)
Starting test testClientServiceAvailable(org.eclipse.epp.mpc.tests.ui.wizard.MarketplaceClientServiceTest)
Finished test testClientServiceAvailable(org.eclipse.epp.mpc.tests.ui.wizard.MarketplaceClientServiceTest)
Starting test testOpenSelected(org.eclipse.epp.mpc.tests.ui.wizard.MarketplaceClientServiceTest)
Test testOpenSelected(org.eclipse.epp.mpc.tests.ui.wizard.MarketplaceClientServiceTest)failed: Timeout after: 10000 ms.: The shell 'Eclipse Marketplace' did not activate
org.eclipse.swtbot.swt.finder.widgets.TimeoutException: Timeout after: 10000 ms.: The shell 'Eclipse Marketplace' did not activate
	at org.eclipse.swtbot.swt.finder.SWTBotFactory.waitUntil(SWTBotFactory.java:522)
	at org.eclipse.swtbot.swt.finder.SWTBot.waitUntil(SWTBot.java:1)
	at org.eclipse.swtbot.swt.finder.SWTBotFactory.waitUntil(SWTBotFactory.java:496)
	at org.eclipse.swtbot.swt.finder.SWTBot.waitUntil(SWTBot.java:1)
	at org.eclipse.epp.mpc.tests.ui.wizard.AbstractMarketplaceWizardBotTest.initWizardBot(AbstractMarketplaceWizardBotTest.java:196)
	at org.eclipse.epp.mpc.tests.ui.wizard.MarketplaceClientServiceTest.testOpenSelected(MarketplaceClientServiceTest.java:142)
	at sun.reflect.NativeMethodAccessorImpl.invoke0(Native Method)
	at sun.reflect.NativeMethodAccessorImpl.invoke(NativeMethodAccessorImpl.java:62)
	at sun.reflect.DelegatingMethodAccessorImpl.invoke(DelegatingMethodAccessorImpl.java:43)
	at java.lang.reflect.Method.invoke(Method.java:498)
	at org.junit.runners.model.FrameworkMethod$1.runReflectiveCall(FrameworkMethod.java:50)
	at org.junit.internal.runners.model.ReflectiveCallable.run(ReflectiveCallable.java:12)
	at org.junit.runners.model.FrameworkMethod.invokeExplosively(FrameworkMethod.java:47)
	at org.junit.internal.runners.statements.InvokeMethod.evaluate(InvokeMethod.java:17)
	at org.junit.internal.runners.statements.RunBefores.evaluate(RunBefores.java:26)
	at org.eclipse.epp.mpc.tests.ui.wizard.AbstractMarketplaceWizardBotTest$1.evaluate(AbstractMarketplaceWizardBotTest.java:151)
	at org.junit.rules.RunRules.evaluate(RunRules.java:20)
	at org.junit.runners.ParentRunner.runLeaf(ParentRunner.java:325)
	at org.junit.runners.BlockJUnit4ClassRunner.runChild(BlockJUnit4ClassRunner.java:78)
	at org.junit.runners.BlockJUnit4ClassRunner.runChild(BlockJUnit4ClassRunner.java:57)
	at org.junit.runners.ParentRunner$3.run(ParentRunner.java:290)
	at org.junit.runners.ParentRunner$1.schedule(ParentRunner.java:71)
	at org.junit.runners.ParentRunner.runChildren(ParentRunner.java:288)
	at org.junit.runners.ParentRunner.access$000(ParentRunner.java:58)
	at org.junit.runners.ParentRunner$2.evaluate(ParentRunner.java:268)
	at org.junit.runners.ParentRunner.run(ParentRunner.java:363)
	at org.junit.runners.Suite.runChild(Suite.java:128)
	at org.junit.runners.Suite.runChild(Suite.java:27)
	at org.junit.runners.ParentRunner$3.run(ParentRunner.java:290)
	at org.junit.runners.ParentRunner$1.schedule(ParentRunner.java:71)
	at org.junit.runners.ParentRunner.runChildren(ParentRunner.java:288)
	at org.junit.runners.ParentRunner.access$000(ParentRunner.java:58)
	at org.junit.runners.ParentRunner$2.evaluate(ParentRunner.java:268)
	at org.junit.runners.ParentRunner.run(ParentRunner.java:363)
	at org.eclipse.epp.mpc.tests.LoggingSuite.run(LoggingSuite.java:76)
	at org.junit.runners.Suite.runChild(Suite.java:128)
	at org.junit.runners.Suite.runChild(Suite.java:27)
	at org.junit.runners.ParentRunner$3.run(ParentRunner.java:290)
	at org.junit.runners.ParentRunner$1.schedule(ParentRunner.java:71)
	at org.junit.runners.ParentRunner.runChildren(ParentRunner.java:288)
	at org.junit.runners.ParentRunner.access$000(ParentRunner.java:58)
	at org.junit.runners.ParentRunner$2.evaluate(ParentRunner.java:268)
	at org.junit.runners.ParentRunner.run(ParentRunner.java:363)
	at org.eclipse.epp.mpc.tests.LoggingSuite.run(LoggingSuite.java:76)
	at org.apache.maven.surefire.junit4.JUnit4Provider.execute(JUnit4Provider.java:367)
	at org.apache.maven.surefire.junit4.JUnit4Provider.executeWithRerun(JUnit4Provider.java:274)
	at org.apache.maven.surefire.junit4.JUnit4Provider.executeTestSet(JUnit4Provider.java:238)
	at org.apache.maven.surefire.junit4.JUnit4Provider.invoke(JUnit4Provider.java:161)
	at sun.reflect.NativeMethodAccessorImpl.invoke0(Native Method)
	at sun.reflect.NativeMethodAccessorImpl.invoke(NativeMethodAccessorImpl.java:62)
	at sun.reflect.DelegatingMethodAccessorImpl.invoke(DelegatingMethodAccessorImpl.java:43)
	at java.lang.reflect.Method.invoke(Method.java:498)
	at org.apache.maven.surefire.util.ReflectionUtils.invokeMethodWithArray2(ReflectionUtils.java:202)
	at org.apache.maven.surefire.booter.ProviderFactory$ProviderProxy.invoke(ProviderFactory.java:155)
	at org.apache.maven.surefire.booter.ProviderFactory.invokeProvider(ProviderFactory.java:81)
	at org.eclipse.tycho.surefire.osgibooter.OsgiSurefireBooter.run(OsgiSurefireBooter.java:107)
	at org.eclipse.tycho.surefire.osgibooter.AbstractUITestApplication.runTests(AbstractUITestApplication.java:44)
	at org.eclipse.e4.ui.internal.workbench.swt.E4Testable.lambda$0(E4Testable.java:76)
	at java.lang.Thread.run(Thread.java:748)
Finished test testOpenSelected(org.eclipse.epp.mpc.tests.ui.wizard.MarketplaceClientServiceTest)
Starting test testOpenDefault(org.eclipse.epp.mpc.tests.ui.wizard.MarketplaceClientServiceTest)
Test testOpenDefault(org.eclipse.epp.mpc.tests.ui.wizard.MarketplaceClientServiceTest)failed: Timeout after: 10000 ms.: The shelorg.eclipse.swtbot.swt.finder.widgets.TimeoutException: Timeout after: 10000 ms.: The shell 'Eclipse Marketplace' did not activate
l 'Eclipse Marketplace' did not activate
	at org.eclipse.swtbot.swt.finder.SWTBotFactory.waitUntil(SWTBotFactory.java:522)
	at org.eclipse.swtbot.swt.finder.SWTBot.waitUntil(SWTBot.java:1)
	at org.eclipse.swtbot.swt.finder.SWTBotFactory.waitUntil(SWTBotFactory.java:496)
	at org.eclipse.swtbot.swt.finder.SWTBot.waitUntil(SWTBot.java:1)
	at org.eclipse.epp.mpc.tests.ui.wizard.AbstractMarketplaceWizardBotTest.initWizardBot(AbstractMarketplaceWizardBotTest.java:196)
	at org.eclipse.epp.mpc.tests.ui.wizard.MarketplaceClientServiceTest.testOpenDefault(MarketplaceClientServiceTest.java:79)
	at sun.reflect.NativeMethodAccessorImpl.invoke0(Native Method)
	at sun.reflect.NativeMethodAccessorImpl.invoke(NativeMethodAccessorImpl.java:62)
	at sun.reflect.DelegatingMethodAccessorImpl.invoke(DelegatingMethodAccessorImpl.java:43)
	at java.lang.reflect.Method.invoke(Method.java:498)
	at org.junit.runners.model.FrameworkMethod$1.runReflectiveCall(FrameworkMethod.java:50)
	at org.junit.internal.runners.model.ReflectiveCallable.run(ReflectiveCallable.java:12)
	at org.junit.runners.model.FrameworkMethod.invokeExplosively(FrameworkMethod.java:47)
	at org.junit.internal.runners.statements.InvokeMethod.evaluate(InvokeMethod.java:17)
	at org.junit.internal.runners.statements.RunBefores.evaluate(RunBefores.java:26)
	at org.eclipse.epp.mpc.tests.ui.wizard.AbstractMarketplaceWizardBotTest$1.evaluate(AbstractMarketplaceWizardBotTest.java:151)
	at org.junit.rules.RunRules.evaluate(RunRules.java:20)
	at org.junit.runners.ParentRunner.runLeaf(ParentRunner.java:325)
	at org.junit.runners.BlockJUnit4ClassRunner.runChild(BlockJUnit4ClassRunner.java:78)
	at org.junit.runners.BlockJUnit4ClassRunner.runChild(BlockJUnit4ClassRunner.java:57)
	at org.junit.runners.ParentRunner$3.run(ParentRunner.java:290)
	at org.junit.runners.ParentRunner$1.schedule(ParentRunner.java:71)
	at org.junit.runners.ParentRunner.runChildren(ParentRunner.java:288)
	at org.junit.runners.ParentRunner.access$000(ParentRunner.java:58)
	at org.junit.runners.ParentRunner$2.evaluate(ParentRunner.java:268)
	at org.junit.runners.ParentRunner.run(ParentRunner.java:363)
	at org.junit.runners.Suite.runChild(Suite.java:128)
	at org.junit.runners.Suite.runChild(Suite.java:27)
	at org.junit.runners.ParentRunner$3.run(ParentRunner.java:290)
	at org.junit.runners.ParentRunner$1.schedule(ParentRunner.java:71)
	at org.junit.runners.ParentRunner.runChildren(ParentRunner.java:288)
	at org.junit.runners.ParentRunner.access$000(ParentRunner.java:58)
	at org.junit.runners.ParentRunner$2.evaluate(ParentRunner.java:268)
	at org.junit.runners.ParentRunner.run(ParentRunner.java:363)
	at org.eclipse.epp.mpc.tests.LoggingSuite.run(LoggingSuite.java:76)
	at org.junit.runners.Suite.runChild(Suite.java:128)
	at org.junit.runners.Suite.runChild(Suite.java:27)
	at org.junit.runners.ParentRunner$3.run(ParentRunner.java:290)
	at org.junit.runners.ParentRunner$1.schedule(ParentRunner.java:71)
	at org.junit.runners.ParentRunner.runChildren(ParentRunner.java:288)
	at org.junit.runners.ParentRunner.access$000(ParentRunner.java:58)
	at org.junit.runners.ParentRunner$2.evaluate(ParentRunner.java:268)
	at org.junit.runners.ParentRunner.run(ParentRunner.java:363)
	at org.eclipse.epp.mpc.tests.LoggingSuite.run(LoggingSuite.java:76)
	at org.apache.maven.surefire.junit4.JUnit4Provider.execute(JUnit4Provider.java:367)
	at org.apache.maven.surefire.junit4.JUnit4Provider.executeWithRerun(JUnit4Provider.java:274)
	at org.apache.maven.surefire.junit4.JUnit4Provider.executeTestSet(JUnit4Provider.java:238)
	at org.apache.maven.surefire.junit4.JUnit4Provider.invoke(JUnit4Provider.java:161)
	at sun.reflect.NativeMethodAccessorImpl.invoke0(Native Method)
	at sun.reflect.NativeMethodAccessorImpl.invoke(NativeMethodAccessorImpl.java:62)
	at sun.reflect.DelegatingMethodAccessorImpl.invoke(DelegatingMethodAccessorImpl.java:43)
	at java.lang.reflect.Method.invoke(Method.java:498)
	at org.apache.maven.surefire.util.ReflectionUtils.invokeMethodWithArray2(ReflectionUtils.java:202)
	at org.apache.maven.surefire.booter.ProviderFactory$ProviderProxy.invoke(ProviderFactory.java:155)
	at org.apache.maven.surefire.booter.ProviderFactory.invokeProvider(ProviderFactory.java:81)
	at org.eclipse.tycho.surefire.osgibooter.OsgiSurefireBooter.run(OsgiSurefireBooter.java:107)
	at org.eclipse.tycho.surefire.osgibooter.AbstractUITestApplication.runTests(AbstractUITestApplication.java:44)
	at org.eclipse.e4.ui.internal.workbench.swt.E4Testable.lambda$0(E4Testable.java:76)
	at java.lang.Thread.run(Thread.java:748)
Finished test testOpenDefault(org.eclipse.epp.mpc.tests.ui.wizard.MarketplaceClientServiceTest)
Starting test testOpenInstalled(org.eclipse.epp.mpc.tests.ui.wizard.MarketplaceClientServiceTest)
Test testOpenInstalled(org.eclipse.epp.mpc.tests.ui.wizard.MarketplaceClientServiceTest)failed: Timeout after: 10000 ms.: The shell 'Eclipse Marketplace' did not activate
org.eclipse.swtbot.swt.finder.widgets.TimeoutException: Timeout after: 10000 ms.: The shell 'Eclipse Marketplace' did not activate
	at org.eclipse.swtbot.swt.finder.SWTBotFactory.waitUntil(SWTBotFactory.java:522)
	at org.eclipse.swtbot.swt.finder.SWTBot.waitUntil(SWTBot.java:1)
	at org.eclipse.swtbot.swt.finder.SWTBotFactory.waitUntil(SWTBotFactory.java:496)
	at org.eclipse.swtbot.swt.finder.SWTBot.waitUntil(SWTBot.java:1)
	at org.eclipse.epp.mpc.tests.ui.wizard.AbstractMarketplaceWizardBotTest.initWizardBot(AbstractMarketplaceWizardBotTest.java:196)
	at org.eclipse.epp.mpc.tests.ui.wizard.MarketplaceClientServiceTest.testOpenInstalled(MarketplaceClientServiceTest.java:87)
	at sun.reflect.NativeMethodAccessorImpl.invoke0(Native Method)
	at sun.reflect.NativeMethodAccessorImpl.invoke(NativeMethodAccessorImpl.java:62)
	at sun.reflect.DelegatingMethodAccessorImpl.invoke(DelegatingMethodAccessorImpl.java:43)
	at java.lang.reflect.Method.invoke(Method.java:498)
	at org.junit.runners.model.FrameworkMethod$1.runReflectiveCall(FrameworkMethod.java:50)
	at org.junit.internal.runners.model.ReflectiveCallable.run(ReflectiveCallable.java:12)
	at org.junit.runners.model.FrameworkMethod.invokeExplosively(FrameworkMethod.java:47)
	at org.junit.internal.runners.statements.InvokeMethod.evaluate(InvokeMethod.java:17)
	at org.junit.internal.runners.statements.RunBefores.evaluate(RunBefores.java:26)
	at org.eclipse.epp.mpc.tests.ui.wizard.AbstractMarketplaceWizardBotTest$1.evaluate(AbstractMarketplaceWizardBotTest.java:151)
	at org.junit.rules.RunRules.evaluate(RunRules.java:20)
	at org.junit.runners.ParentRunner.runLeaf(ParentRunner.java:325)
	at org.junit.runners.BlockJUnit4ClassRunner.runChild(BlockJUnit4ClassRunner.java:78)
	at org.junit.runners.BlockJUnit4ClassRunner.runChild(BlockJUnit4ClassRunner.java:57)
	at org.junit.runners.ParentRunner$3.run(ParentRunner.java:290)
	at org.junit.runners.ParentRunner$1.schedule(ParentRunner.java:71)
	at org.junit.runners.ParentRunner.runChildren(ParentRunner.java:288)
	at org.junit.runners.ParentRunner.access$000(ParentRunner.java:58)
	at org.junit.runners.ParentRunner$2.evaluate(ParentRunner.java:268)
	at org.junit.runners.ParentRunner.run(ParentRunner.java:363)
	at org.junit.runners.Suite.runChild(Suite.java:128)
	at org.junit.runners.Suite.runChild(Suite.java:27)
	at org.junit.runners.ParentRunner$3.run(ParentRunner.java:290)
	at org.junit.runners.ParentRunner$1.schedule(ParentRunner.java:71)
	at org.junit.runners.ParentRunner.runChildren(ParentRunner.java:288)
	at org.junit.runners.ParentRunner.access$000(ParentRunner.java:58)
	at org.junit.runners.ParentRunner$2.evaluate(ParentRunner.java:268)
	at org.junit.runners.ParentRunner.run(ParentRunner.java:363)
	at org.eclipse.epp.mpc.tests.LoggingSuite.run(LoggingSuite.java:76)
	at org.junit.runners.Suite.runChild(Suite.java:128)
	at org.junit.runners.Suite.runChild(Suite.java:27)
	at org.junit.runners.ParentRunner$3.run(ParentRunner.java:290)
	at org.junit.runners.ParentRunner$1.schedule(ParentRunner.java:71)
	at org.junit.runners.ParentRunner.runChildren(ParentRunner.java:288)
	at org.junit.runners.ParentRunner.access$000(ParentRunner.java:58)
	at org.junit.runners.ParentRunner$2.evaluate(ParentRunner.java:268)
	at org.junit.runners.ParentRunner.run(ParentRunner.java:363)
	at org.eclipse.epp.mpc.tests.LoggingSuite.run(LoggingSuite.java:76)
	at org.apache.maven.surefire.junit4.JUnit4Provider.execute(JUnit4Provider.java:367)
	at org.apache.maven.surefire.junit4.JUnit4Provider.executeWithRerun(JUnit4Provider.java:274)
	at org.apache.maven.surefire.junit4.JUnit4Provider.executeTestSet(JUnit4Provider.java:238)
	at org.apache.maven.surefire.junit4.JUnit4Provider.invoke(JUnit4Provider.java:161)
	at sun.reflect.NativeMethodAccessorImpl.invoke0(Native Method)
	at sun.reflect.NativeMethodAccessorImpl.invoke(NativeMethodAccessorImpl.java:62)
	at sun.reflect.DelegatingMethodAccessorImpl.invoke(DelegatingMethodAccessorImpl.java:43)
	at java.lang.reflect.Method.invoke(Method.java:498)
	at org.apache.maven.surefire.util.ReflectionUtils.invokeMethodWithArray2(ReflectionUtils.java:202)
	at org.apache.maven.surefire.booter.ProviderFactory$ProviderProxy.invoke(ProviderFactory.java:155)
	at org.apache.maven.surefire.booter.ProviderFactory.invokeProvider(ProviderFactory.java:81)
	at org.eclipse.tycho.surefire.osgibooter.OsgiSurefireBooter.run(OsgiSurefireBooter.java:107)
	at org.eclipse.tycho.surefire.osgibooter.AbstractUITestApplication.runTests(AbstractUITestApplication.java:44)
	at org.eclipse.e4.ui.internal.workbench.swt.E4Testable.lambda$0(E4Testable.java:76)
	at java.lang.Thread.run(Thread.java:748)
Finished test testOpenInstalled(org.eclipse.epp.mpc.tests.ui.wizard.MarketplaceClientServiceTest)
Starting test testSearchTag(org.eclipse.epp.mpc.tests.ui.wizard.MarketplaceWizardTest)
Test testSearchTag(org.eclipse.epp.mpc.tests.ui.wizard.MarketplaceWizardTest)failed: Timeout after: 10000 ms.: The shell 'Eclipse Marketplace' did not activate
org.eclipse.swtbot.swt.finder.widgets.TimeoutException: Timeout after: 10000 ms.: The shell 'Eclipse Marketplace' did not activate
	at org.eclipse.swtbot.swt.finder.SWTBotFactory.waitUntil(SWTBotFactory.java:522)
	at org.eclipse.swtbot.swt.finder.SWTBot.waitUntil(SWTBot.java:1)
	at org.eclipse.swtbot.swt.finder.SWTBotFactory.waitUntil(SWTBotFactory.java:496)
	at org.eclipse.swtbot.swt.finder.SWTBot.waitUntil(SWTBot.java:1)
	at org.eclipse.epp.mpc.tests.ui.wizard.AbstractMarketplaceWizardBotTest.initWizardBot(AbstractMarketplaceWizardBotTest.java:196)
	at org.eclipse.epp.mpc.tests.ui.wizard.AbstractMarketplaceWizardBotTest.setUp(AbstractMarketplaceWizardBotTest.java:166)
	at sun.reflect.NativeMethodAccessorImpl.invoke0(Native Method)
	at sun.reflect.NativeMethodAccessorImpl.invoke(NativeMethodAccessorImpl.java:62)
	at sun.reflect.DelegatingMethodAccessorImpl.invoke(DelegatingMethodAccessorImpl.java:43)
	at java.lang.reflect.Method.invoke(Method.java:498)
	at org.junit.runners.model.FrameworkMethod$1.runReflectiveCall(FrameworkMethod.java:50)
	at org.junit.internal.runners.model.ReflectiveCallable.run(ReflectiveCallable.java:12)
	at org.junit.runners.model.FrameworkMethod.invokeExplosively(FrameworkMethod.java:47)
	at org.junit.internal.runners.statements.RunBefores.evaluate(RunBefores.java:24)
	at org.eclipse.epp.mpc.tests.ui.wizard.AbstractMarketplaceWizardBotTest$1.evaluate(AbstractMarketplaceWizardBotTest.java:151)
	at org.junit.rules.RunRules.evaluate(RunRules.java:20)
	at org.junit.runners.ParentRunner.runLeaf(ParentRunner.java:325)
	at org.junit.runners.BlockJUnit4ClassRunner.runChild(BlockJUnit4ClassRunner.java:78)
	at org.junit.runners.BlockJUnit4ClassRunner.runChild(BlockJUnit4ClassRunner.java:57)
	at org.junit.runners.ParentRunner$3.run(ParentRunner.java:290)
	at org.junit.runners.ParentRunner$1.schedule(ParentRunner.java:71)
	at org.junit.runners.ParentRunner.runChildren(ParentRunner.java:288)
	at org.junit.runners.ParentRunner.access$000(ParentRunner.java:58)
	at org.junit.runners.ParentRunner$2.evaluate(ParentRunner.java:268)
	at org.junit.runners.ParentRunner.run(ParentRunner.java:363)
	at org.junit.runners.Suite.runChild(Suite.java:128)
	at org.junit.runners.Suite.runChild(Suite.java:27)
	at org.junit.runners.ParentRunner$3.run(ParentRunner.java:290)
	at org.junit.runners.ParentRunner$1.schedule(ParentRunner.java:71)
	at org.junit.runners.ParentRunner.runChildren(ParentRunner.java:288)
	at org.junit.runners.ParentRunner.access$000(ParentRunner.java:58)
	at org.junit.runners.ParentRunner$2.evaluate(ParentRunner.java:268)
	at org.junit.runners.ParentRunner.run(ParentRunner.java:363)
	at org.eclipse.epp.mpc.tests.LoggingSuite.run(LoggingSuite.java:76)
	at org.junit.runners.Suite.runChild(Suite.java:128)
	at org.junit.runners.Suite.runChild(Suite.java:27)
	at org.junit.runners.ParentRunner$3.run(ParentRunner.java:290)
	at org.junit.runners.ParentRunner$1.schedule(ParentRunner.java:71)
	at org.junit.runners.ParentRunner.runChildren(ParentRunner.java:288)
	at org.junit.runners.ParentRunner.access$000(ParentRunner.java:58)
	at org.junit.runners.ParentRunner$2.evaluate(ParentRunner.java:268)
	at org.junit.runners.ParentRunner.run(ParentRunner.java:363)
	at org.eclipse.epp.mpc.tests.LoggingSuite.run(LoggingSuite.java:76)
	at org.apache.maven.surefire.junit4.JUnit4Provider.execute(JUnit4Provider.java:367)
	at org.apache.maven.surefire.junit4.JUnit4Provider.executeWithRerun(JUnit4Provider.java:274)
	at org.apache.maven.surefire.junit4.JUnit4Provider.executeTestSet(JUnit4Provider.java:238)
	at org.apache.maven.surefire.junit4.JUnit4Provider.invoke(JUnit4Provider.java:161)
	at sun.reflect.NativeMethodAccessorImpl.invoke0(Native Method)
	at sun.reflect.NativeMethodAccessorImpl.invoke(NativeMethodAccessorImpl.java:62)
	at sun.reflect.DelegatingMethodAccessorImpl.invoke(DelegatingMethodAccessorImpl.java:43)
	at java.lang.reflect.Method.invoke(Method.java:498)
	at org.apache.maven.surefire.util.ReflectionUtils.invokeMethodWithArray2(ReflectionUtils.java:202)
	at org.apache.maven.surefire.booter.ProviderFactory$ProviderProxy.invoke(ProviderFactory.java:155)
	at org.apache.maven.surefire.booter.ProviderFactory.invokeProvider(ProviderFactory.java:81)
	at org.eclipse.tycho.surefire.osgibooter.OsgiSurefireBooter.run(OsgiSurefireBooter.java:107)
	at org.eclipse.tycho.surefire.osgibooter.AbstractUITestApplication.runTests(AbstractUITestApplication.java:44)
	at org.eclipse.e4.ui.internal.workbench.swt.E4Testable.lambda$0(E4Testable.java:76)
	at java.lang.Thread.run(Thread.java:748)
Finished test testSearchTag(org.eclipse.epp.mpc.tests.ui.wizard.MarketplaceWizardTest)
Starting test testSelectMarket(org.eclipse.epp.mpc.tests.ui.wizard.MarketplaceWizardTest)
Test testSelectMarket(org.eclipse.epp.mpc.tests.ui.wizard.MarketplaceWizardTest)failed: Timeout after: 10000 ms.: The shell 'Eclipse Marketplace' did not activate
org.eclipse.swtbot.swt.finder.widgets.TimeoutException: Timeout after: 10000 ms.: The shell 'Eclipse Marketplace' did not activate
	at org.eclipse.swtbot.swt.finder.SWTBotFactory.waitUntil(SWTBotFactory.java:522)
	at org.eclipse.swtbot.swt.finder.SWTBot.waitUntil(SWTBot.java:1)
	at org.eclipse.swtbot.swt.finder.SWTBotFactory.waitUntil(SWTBotFactory.java:496)
	at org.eclipse.swtbot.swt.finder.SWTBot.waitUntil(SWTBot.java:1)
	at org.eclipse.epp.mpc.tests.ui.wizard.AbstractMarketplaceWizardBotTest.initWizardBot(AbstractMarketplaceWizardBotTest.java:196)
	at org.eclipse.epp.mpc.tests.ui.wizard.AbstractMarketplaceWizardBotTest.setUp(AbstractMarketplaceWizardBotTest.java:166)
	at sun.reflect.NativeMethodAccessorImpl.invoke0(Native Method)
	at sun.reflect.NativeMethodAccessorImpl.invoke(NativeMethodAccessorImpl.java:62)
	at sun.reflect.DelegatingMethodAccessorImpl.invoke(DelegatingMethodAccessorImpl.java:43)
	at java.lang.reflect.Method.invoke(Method.java:498)
	at org.junit.runners.model.FrameworkMethod$1.runReflectiveCall(FrameworkMethod.java:50)
	at org.junit.internal.runners.model.ReflectiveCallable.run(ReflectiveCallable.java:12)
	at org.junit.runners.model.FrameworkMethod.invokeExplosively(FrameworkMethod.java:47)
	at org.junit.internal.runners.statements.RunBefores.evaluate(RunBefores.java:24)
	at org.eclipse.epp.mpc.tests.ui.wizard.AbstractMarketplaceWizardBotTest$1.evaluate(AbstractMarketplaceWizardBotTest.java:151)
	at org.junit.rules.RunRules.evaluate(RunRules.java:20)
	at org.junit.runners.ParentRunner.runLeaf(ParentRunner.java:325)
	at org.junit.runners.BlockJUnit4ClassRunner.runChild(BlockJUnit4ClassRunner.java:78)
	at org.junit.runners.BlockJUnit4ClassRunner.runChild(BlockJUnit4ClassRunner.java:57)
	at org.junit.runners.ParentRunner$3.run(ParentRunner.java:290)
	at org.junit.runners.ParentRunner$1.schedule(ParentRunner.java:71)
	at org.junit.runners.ParentRunner.runChildren(ParentRunner.java:288)
	at org.junit.runners.ParentRunner.access$000(ParentRunner.java:58)
	at org.junit.runners.ParentRunner$2.evaluate(ParentRunner.java:268)
	at org.junit.runners.ParentRunner.run(ParentRunner.java:363)
	at org.junit.runners.Suite.runChild(Suite.java:128)
	at org.junit.runners.Suite.runChild(Suite.java:27)
	at org.junit.runners.ParentRunner$3.run(ParentRunner.java:290)
	at org.junit.runners.ParentRunner$1.schedule(ParentRunner.java:71)
	at org.junit.runners.ParentRunner.runChildren(ParentRunner.java:288)
	at org.junit.runners.ParentRunner.access$000(ParentRunner.java:58)
	at org.junit.runners.ParentRunner$2.evaluate(ParentRunner.java:268)
	at org.junit.runners.ParentRunner.run(ParentRunner.java:363)
	at org.eclipse.epp.mpc.tests.LoggingSuite.run(LoggingSuite.java:76)
	at org.junit.runners.Suite.runChild(Suite.java:128)
	at org.junit.runners.Suite.runChild(Suite.java:27)
	at org.junit.runners.ParentRunner$3.run(ParentRunner.java:290)
	at org.junit.runners.ParentRunner$1.schedule(ParentRunner.java:71)
	at org.junit.runners.ParentRunner.runChildren(ParentRunner.java:288)
	at org.junit.runners.ParentRunner.access$000(ParentRunner.java:58)
	at org.junit.runners.ParentRunner$2.evaluate(ParentRunner.java:268)
	at org.junit.runners.ParentRunner.run(ParentRunner.java:363)
	at org.eclipse.epp.mpc.tests.LoggingSuite.run(LoggingSuite.java:76)
	at org.apache.maven.surefire.junit4.JUnit4Provider.execute(JUnit4Provider.java:367)
	at org.apache.maven.surefire.junit4.JUnit4Provider.executeWithRerun(JUnit4Provider.java:274)
	at org.apache.maven.surefire.junit4.JUnit4Provider.executeTestSet(JUnit4Provider.java:238)
	at org.apache.maven.surefire.junit4.JUnit4Provider.invoke(JUnit4Provider.java:161)
	at sun.reflect.NativeMethodAccessorImpl.invoke0(Native Method)
	at sun.reflect.NativeMethodAccessorImpl.invoke(NativeMethodAccessorImpl.java:62)
	at sun.reflect.DelegatingMethodAccessorImpl.invoke(DelegatingMethodAccessorImpl.java:43)
	at java.lang.reflect.Method.invoke(Method.java:498)
	at org.apache.maven.surefire.util.ReflectionUtils.invokeMethodWithArray2(ReflectionUtils.java:202)
	at org.apache.maven.surefire.booter.ProviderFactory$ProviderProxy.invoke(ProviderFactory.java:155)
	at org.apache.maven.surefire.booter.ProviderFactory.invokeProvider(ProviderFactory.java:81)
	at org.eclipse.tycho.surefire.osgibooter.OsgiSurefireBooter.run(OsgiSurefireBooter.java:107)
	at org.eclipse.tycho.surefire.osgibooter.AbstractUITestApplication.runTests(AbstractUITestApplication.java:44)
	at org.eclipse.e4.ui.internal.workbench.swt.E4Testable.lambda$0(E4Testable.java:76)
	at java.lang.Thread.run(Thread.java:748)
Finished test testSelectMarket(org.eclipse.epp.mpc.tests.ui.wizard.MarketplaceWizardTest)
Starting test testShare(org.eclipse.epp.mpc.tests.ui.wizard.MarketplaceWizardTest)
Test testShare(org.eclipse.epp.mpc.tests.ui.wizard.MarketplaceWizardTest)failed: Timeout after: 10000 ms.: The shell 'Eclipse Marketplace' did not activate
org.eclipse.swtbot.swt.finder.widgets.TimeoutException: Timeout after: 10000 ms.: The shell 'Eclipse Marketplace' did not activate
	at org.eclipse.swtbot.swt.finder.SWTBotFactory.waitUntil(SWTBotFactory.java:522)
	at org.eclipse.swtbot.swt.finder.SWTBot.waitUntil(SWTBot.java:1)
	at org.eclipse.swtbot.swt.finder.SWTBotFactory.waitUntil(SWTBotFactory.java:496)
	at org.eclipse.swtbot.swt.finder.SWTBot.waitUntil(SWTBot.java:1)
	at org.eclipse.epp.mpc.tests.ui.wizard.AbstractMarketplaceWizardBotTest.initWizardBot(AbstractMarketplaceWizardBotTest.java:196)
	at org.eclipse.epp.mpc.tests.ui.wizard.AbstractMarketplaceWizardBotTest.setUp(AbstractMarketplaceWizardBotTest.java:166)
	at sun.reflect.NativeMethodAccessorImpl.invoke0(Native Method)
	at sun.reflect.NativeMethodAccessorImpl.invoke(NativeMethodAccessorImpl.java:62)
	at sun.reflect.DelegatingMethodAccessorImpl.invoke(DelegatingMethodAccessorImpl.java:43)
	at java.lang.reflect.Method.invoke(Method.java:498)
	at org.junit.runners.model.FrameworkMethod$1.runReflectiveCall(FrameworkMethod.java:50)
	at org.junit.internal.runners.model.ReflectiveCallable.run(ReflectiveCallable.java:12)
	at org.junit.runners.model.FrameworkMethod.invokeExplosively(FrameworkMethod.java:47)
	at org.junit.internal.runners.statements.RunBefores.evaluate(RunBefores.java:24)
	at org.eclipse.epp.mpc.tests.ui.wizard.AbstractMarketplaceWizardBotTest$1.evaluate(AbstractMarketplaceWizardBotTest.java:151)
	at org.junit.rules.RunRules.evaluate(RunRules.java:20)
	at org.junit.runners.ParentRunner.runLeaf(ParentRunner.java:325)
	at org.junit.runners.BlockJUnit4ClassRunner.runChild(BlockJUnit4ClassRunner.java:78)
	at org.junit.runners.BlockJUnit4ClassRunner.runChild(BlockJUnit4ClassRunner.java:57)
	at org.junit.runners.ParentRunner$3.run(ParentRunner.java:290)
	at org.junit.runners.ParentRunner$1.schedule(ParentRunner.java:71)
	at org.junit.runners.ParentRunner.runChildren(ParentRunner.java:288)
	at org.junit.runners.ParentRunner.access$000(ParentRunner.java:58)
	at org.junit.runners.ParentRunner$2.evaluate(ParentRunner.java:268)
	at org.junit.runners.ParentRunner.run(ParentRunner.java:363)
	at org.junit.runners.Suite.runChild(Suite.java:128)
	at org.junit.runners.Suite.runChild(Suite.java:27)
	at org.junit.runners.ParentRunner$3.run(ParentRunner.java:290)
	at org.junit.runners.ParentRunner$1.schedule(ParentRunner.java:71)
	at org.junit.runners.ParentRunner.runChildren(ParentRunner.java:288)
	at org.junit.runners.ParentRunner.access$000(ParentRunner.java:58)
	at org.junit.runners.ParentRunner$2.evaluate(ParentRunner.java:268)
	at org.junit.runners.ParentRunner.run(ParentRunner.java:363)
	at org.eclipse.epp.mpc.tests.LoggingSuite.run(LoggingSuite.java:76)
	at org.junit.runners.Suite.runChild(Suite.java:128)
	at org.junit.runners.Suite.runChild(Suite.java:27)
	at org.junit.runners.ParentRunner$3.run(ParentRunner.java:290)
	at org.junit.runners.ParentRunner$1.schedule(ParentRunner.java:71)
	at org.junit.runners.ParentRunner.runChildren(ParentRunner.java:288)
	at org.junit.runners.ParentRunner.access$000(ParentRunner.java:58)
	at org.junit.runners.ParentRunner$2.evaluate(ParentRunner.java:268)
	at org.junit.runners.ParentRunner.run(ParentRunner.java:363)
	at org.eclipse.epp.mpc.tests.LoggingSuite.run(LoggingSuite.java:76)
	at org.apache.maven.surefire.junit4.JUnit4Provider.execute(JUnit4Provider.java:367)
	at org.apache.maven.surefire.junit4.JUnit4Provider.executeWithRerun(JUnit4Provider.java:274)
	at org.apache.maven.surefire.junit4.JUnit4Provider.executeTestSet(JUnit4Provider.java:238)
	at org.apache.maven.surefire.junit4.JUnit4Provider.invoke(JUnit4Provider.java:161)
	at sun.reflect.NativeMethodAccessorImpl.invoke0(Native Method)
	at sun.reflect.NativeMethodAccessorImpl.invoke(NativeMethodAccessorImpl.java:62)
	at sun.reflect.DelegatingMethodAccessorImpl.invoke(DelegatingMethodAccessorImpl.java:43)
	at java.lang.reflect.Method.invoke(Method.java:498)
	at org.apache.maven.surefire.util.ReflectionUtils.invokeMethodWithArray2(ReflectionUtils.java:202)
	at org.apache.maven.surefire.booter.ProviderFactory$ProviderProxy.invoke(ProviderFactory.java:155)
	at org.apache.maven.surefire.booter.ProviderFactory.invokeProvider(ProviderFactory.java:81)
	at org.eclipse.tycho.surefire.osgibooter.OsgiSurefireBooter.run(OsgiSurefireBooter.java:107)
	at org.eclipse.tycho.surefire.osgibooter.AbstractUITestApplication.runTests(AbstractUITestApplication.java:44)
	at org.eclipse.e4.ui.internal.workbench.swt.E4Testable.lambda$0(E4Testable.java:76)
	at java.lang.Thread.run(Thread.java:748)
Finished test testShare(org.eclipse.epp.mpc.tests.ui.wizard.MarketplaceWizardTest)
Starting test testNews(org.eclipse.epp.mpc.tests.ui.wizard.MarketplaceWizardTest)
Test testNews(org.eclipse.epp.mpc.tests.ui.wizard.MarketplaceWizardTest)failed: Timeout after: 10000 ms.: The shell 'Eclipse Marketplace' did not activate
org.eclipse.swtbot.swt.finder.widgets.TimeoutException: Timeout after: 10000 ms.: The shell 'Eclipse Marketplace' did not activate
	at org.eclipse.swtbot.swt.finder.SWTBotFactory.waitUntil(SWTBotFactory.java:522)
	at org.eclipse.swtbot.swt.finder.SWTBot.waitUntil(SWTBot.java:1)
	at org.eclipse.swtbot.swt.finder.SWTBotFactory.waitUntil(SWTBotFactory.java:496)
	at org.eclipse.swtbot.swt.finder.SWTBot.waitUntil(SWTBot.java:1)
	at org.eclipse.epp.mpc.tests.ui.wizard.AbstractMarketplaceWizardBotTest.initWizardBot(AbstractMarketplaceWizardBotTest.java:196)
	at org.eclipse.epp.mpc.tests.ui.wizard.AbstractMarketplaceWizardBotTest.setUp(AbstractMarketplaceWizardBotTest.java:166)
	at sun.reflect.NativeMethodAccessorImpl.invoke0(Native Method)
	at sun.reflect.NativeMethodAccessorImpl.invoke(NativeMethodAccessorImpl.java:62)
	at sun.reflect.DelegatingMethodAccessorImpl.invoke(DelegatingMethodAccessorImpl.java:43)
	at java.lang.reflect.Method.invoke(Method.java:498)
	at org.junit.runners.model.FrameworkMethod$1.runReflectiveCall(FrameworkMethod.java:50)
	at org.junit.internal.runners.model.ReflectiveCallable.run(ReflectiveCallable.java:12)
	at org.junit.runners.model.FrameworkMethod.invokeExplosively(FrameworkMethod.java:47)
	at org.junit.internal.runners.statements.RunBefores.evaluate(RunBefores.java:24)
	at org.eclipse.epp.mpc.tests.ui.wizard.AbstractMarketplaceWizardBotTest$1.evaluate(AbstractMarketplaceWizardBotTest.java:151)
	at org.junit.rules.RunRules.evaluate(RunRules.java:20)
	at org.junit.runners.ParentRunner.runLeaf(ParentRunner.java:325)
	at org.junit.runners.BlockJUnit4ClassRunner.runChild(BlockJUnit4ClassRunner.java:78)
	at org.junit.runners.BlockJUnit4ClassRunner.runChild(BlockJUnit4ClassRunner.java:57)
	at org.junit.runners.ParentRunner$3.run(ParentRunner.java:290)
	at org.junit.runners.ParentRunner$1.schedule(ParentRunner.java:71)
	at org.junit.runners.ParentRunner.runChildren(ParentRunner.java:288)
	at org.junit.runners.ParentRunner.access$000(ParentRunner.java:58)
	at org.junit.runners.ParentRunner$2.evaluate(ParentRunner.java:268)
	at org.junit.runners.ParentRunner.run(ParentRunner.java:363)
	at org.junit.runners.Suite.runChild(Suite.java:128)
	at org.junit.runners.Suite.runChild(Suite.java:27)
	at org.junit.runners.ParentRunner$3.run(ParentRunner.java:290)
	at org.junit.runners.ParentRunner$1.schedule(ParentRunner.java:71)
	at org.junit.runners.ParentRunner.runChildren(ParentRunner.java:288)
	at org.junit.runners.ParentRunner.access$000(ParentRunner.java:58)
	at org.junit.runners.ParentRunner$2.evaluate(ParentRunner.java:268)
	at org.junit.runners.ParentRunner.run(ParentRunner.java:363)
	at org.eclipse.epp.mpc.tests.LoggingSuite.run(LoggingSuite.java:76)
	at org.junit.runners.Suite.runChild(Suite.java:128)
	at org.junit.runners.Suite.runChild(Suite.java:27)
	at org.junit.runners.ParentRunner$3.run(ParentRunner.java:290)
	at org.junit.runners.ParentRunner$1.schedule(ParentRunner.java:71)
	at org.junit.runners.ParentRunner.runChildren(ParentRunner.java:288)
	at org.junit.runners.ParentRunner.access$000(ParentRunner.java:58)
	at org.junit.runners.ParentRunner$2.evaluate(ParentRunner.java:268)
	at org.junit.runners.ParentRunner.run(ParentRunner.java:363)
	at org.eclipse.epp.mpc.tests.LoggingSuite.run(LoggingSuite.java:76)
	at org.apache.maven.surefire.junit4.JUnit4Provider.execute(JUnit4Provider.java:367)
	at org.apache.maven.surefire.junit4.JUnit4Provider.executeWithRerun(JUnit4Provider.java:274)
	at org.apache.maven.surefire.junit4.JUnit4Provider.executeTestSet(JUnit4Provider.java:238)
	at org.apache.maven.surefire.junit4.JUnit4Provider.invoke(JUnit4Provider.java:161)
	at sun.reflect.NativeMethodAccessorImpl.invoke0(Native Method)
	at sun.reflect.NativeMethodAccessorImpl.invoke(NativeMethodAccessorImpl.java:62)
	at sun.reflect.DelegatingMethodAccessorImpl.invoke(DelegatingMethodAccessorImpl.java:43)
	at java.lang.reflect.Method.invoke(Method.java:498)
	at org.apache.maven.surefire.util.ReflectionUtils.invokeMethodWithArray2(ReflectionUtils.java:202)
	at org.apache.maven.surefire.booter.ProviderFactory$ProviderProxy.invoke(ProviderFactory.java:155)
	at org.apache.maven.surefire.booter.ProviderFactory.invokeProvider(ProviderFactory.java:81)
	at org.eclipse.tycho.surefire.osgibooter.OsgiSurefireBooter.run(OsgiSurefireBooter.java:107)
	at org.eclipse.tycho.surefire.osgibooter.AbstractUITestApplication.runTests(AbstractUITestApplication.java:44)
	at org.eclipse.e4.ui.internal.workbench.swt.E4Testable.lambda$0(E4Testable.java:76)
	at java.lang.Thread.run(Thread.java:748)
Finished test testNews(org.eclipse.epp.mpc.tests.ui.wizard.MarketplaceWizardTest)
Starting test testPopular(org.eclipse.epp.mpc.tests.ui.wizard.MarketplaceWizardTest)
Test testPopular(org.eclipse.epp.mpc.tests.ui.wizard.MarketplaceWizardTest)failed: Timeout after: 10000 ms.: The shell 'Eclipse Marketplace' did not activate
org.eclipse.swtbot.swt.finder.widgets.TimeoutException: Timeout after: 10000 ms.: The shell 'Eclipse Marketplace' did not activate
	at org.eclipse.swtbot.swt.finder.SWTBotFactory.waitUntil(SWTBotFactory.java:522)
	at org.eclipse.swtbot.swt.finder.SWTBot.waitUntil(SWTBot.java:1)
	at org.eclipse.swtbot.swt.finder.SWTBotFactory.waitUntil(SWTBotFactory.java:496)
	at org.eclipse.swtbot.swt.finder.SWTBot.waitUntil(SWTBot.java:1)
	at org.eclipse.epp.mpc.tests.ui.wizard.AbstractMarketplaceWizardBotTest.initWizardBot(AbstractMarketplaceWizardBotTest.java:196)
	at org.eclipse.epp.mpc.tests.ui.wizard.AbstractMarketplaceWizardBotTest.setUp(AbstractMarketplaceWizardBotTest.java:166)
	at sun.reflect.NativeMethodAccessorImpl.invoke0(Native Method)
	at sun.reflect.NativeMethodAccessorImpl.invoke(NativeMethodAccessorImpl.java:62)
	at sun.reflect.DelegatingMethodAccessorImpl.invoke(DelegatingMethodAccessorImpl.java:43)
	at java.lang.reflect.Method.invoke(Method.java:498)
	at org.junit.runners.model.FrameworkMethod$1.runReflectiveCall(FrameworkMethod.java:50)
	at org.junit.internal.runners.model.ReflectiveCallable.run(ReflectiveCallable.java:12)
	at org.junit.runners.model.FrameworkMethod.invokeExplosively(FrameworkMethod.java:47)
	at org.junit.internal.runners.statements.RunBefores.evaluate(RunBefores.java:24)
	at org.eclipse.epp.mpc.tests.ui.wizard.AbstractMarketplaceWizardBotTest$1.evaluate(AbstractMarketplaceWizardBotTest.java:151)
	at org.junit.rules.RunRules.evaluate(RunRules.java:20)
	at org.junit.runners.ParentRunner.runLeaf(ParentRunner.java:325)
	at org.junit.runners.BlockJUnit4ClassRunner.runChild(BlockJUnit4ClassRunner.java:78)
	at org.junit.runners.BlockJUnit4ClassRunner.runChild(BlockJUnit4ClassRunner.java:57)
	at org.junit.runners.ParentRunner$3.run(ParentRunner.java:290)
	at org.junit.runners.ParentRunner$1.schedule(ParentRunner.java:71)
	at org.junit.runners.ParentRunner.runChildren(ParentRunner.java:288)
	at org.junit.runners.ParentRunner.access$000(ParentRunner.java:58)
	at org.junit.runners.ParentRunner$2.evaluate(ParentRunner.java:268)
	at org.junit.runners.ParentRunner.run(ParentRunner.java:363)
	at org.junit.runners.Suite.runChild(Suite.java:128)
	at org.junit.runners.Suite.runChild(Suite.java:27)
	at org.junit.runners.ParentRunner$3.run(ParentRunner.java:290)
	at org.junit.runners.ParentRunner$1.schedule(ParentRunner.java:71)
	at org.junit.runners.ParentRunner.runChildren(ParentRunner.java:288)
	at org.junit.runners.ParentRunner.access$000(ParentRunner.java:58)
	at org.junit.runners.ParentRunner$2.evaluate(ParentRunner.java:268)
	at org.junit.runners.ParentRunner.run(ParentRunner.java:363)
	at org.eclipse.epp.mpc.tests.LoggingSuite.run(LoggingSuite.java:76)
	at org.junit.runners.Suite.runChild(Suite.java:128)
	at org.junit.runners.Suite.runChild(Suite.java:27)
	at org.junit.runners.ParentRunner$3.run(ParentRunner.java:290)
	at org.junit.runners.ParentRunner$1.schedule(ParentRunner.java:71)
	at org.junit.runners.ParentRunner.runChildren(ParentRunner.java:288)
	at org.junit.runners.ParentRunner.access$000(ParentRunner.java:58)
	at org.junit.runners.ParentRunner$2.evaluate(ParentRunner.java:268)
	at org.junit.runners.ParentRunner.run(ParentRunner.java:363)
	at org.eclipse.epp.mpc.tests.LoggingSuite.run(LoggingSuite.java:76)
	at org.apache.maven.surefire.junit4.JUnit4Provider.execute(JUnit4Provider.java:367)
	at org.apache.maven.surefire.junit4.JUnit4Provider.executeWithRerun(JUnit4Provider.java:274)
	at org.apache.maven.surefire.junit4.JUnit4Provider.executeTestSet(JUnit4Provider.java:238)
	at org.apache.maven.surefire.junit4.JUnit4Provider.invoke(JUnit4Provider.java:161)
	at sun.reflect.NativeMethodAccessorImpl.invoke0(Native Method)
	at sun.reflect.NativeMethodAccessorImpl.invoke(NativeMethodAccessorImpl.java:62)
	at sun.reflect.DelegatingMethodAccessorImpl.invoke(DelegatingMethodAccessorImpl.java:43)
	at java.lang.reflect.Method.invoke(Method.java:498)
	at org.apache.maven.surefire.util.ReflectionUtils.invokeMethodWithArray2(ReflectionUtils.java:202)
	at org.apache.maven.surefire.booter.ProviderFactory$ProviderProxy.invoke(ProviderFactory.java:155)
	at org.apache.maven.surefire.booter.ProviderFactory.invokeProvider(ProviderFactory.java:81)
	at org.eclipse.tycho.surefire.osgibooter.OsgiSurefireBooter.run(OsgiSurefireBooter.java:107)
	at org.eclipse.tycho.surefire.osgibooter.AbstractUITestApplication.runTests(AbstractUITestApplication.java:44)
	at org.eclipse.e4.ui.internal.workbench.swt.E4Testable.lambda$0(E4Testable.java:76)
	at java.lang.Thread.run(Thread.java:748)
Finished test testPopular(org.eclipse.epp.mpc.tests.ui.wizard.MarketplaceWizardTest)
Starting test testNoninstallableLearnMore(org.eclipse.epp.mpc.tests.ui.wizard.MarketplaceWizardTest)
Test testNoninstallableLearnMore(org.eclipse.epp.mpc.tests.ui.wizard.MarketplaceWizardTest)failed: Timeout after: 10000 ms.: The shell 'Eclipse Marketplace' did not activate
org.eclipse.swtbot.swt.finder.widgets.TimeoutException: Timeout after: 10000 ms.: The shell 'Eclipse Marketplace' did not activate
	at org.eclipse.swtbot.swt.finder.SWTBotFactory.waitUntil(SWTBotFactory.java:522)
	at org.eclipse.swtbot.swt.finder.SWTBot.waitUntil(SWTBot.java:1)
	at org.eclipse.swtbot.swt.finder.SWTBotFactory.waitUntil(SWTBotFactory.java:496)
	at org.eclipse.swtbot.swt.finder.SWTBot.waitUntil(SWTBot.java:1)
	at org.eclipse.epp.mpc.tests.ui.wizard.AbstractMarketplaceWizardBotTest.initWizardBot(AbstractMarketplaceWizardBotTest.java:196)
	at org.eclipse.epp.mpc.tests.ui.wizard.AbstractMarketplaceWizardBotTest.setUp(AbstractMarketplaceWizardBotTest.java:166)
	at sun.reflect.NativeMethodAccessorImpl.invoke0(Native Method)
	at sun.reflect.NativeMethodAccessorImpl.invoke(NativeMethodAccessorImpl.java:62)
	at sun.reflect.DelegatingMethodAccessorImpl.invoke(DelegatingMethodAccessorImpl.java:43)
	at java.lang.reflect.Method.invoke(Method.java:498)
	at org.junit.runners.model.FrameworkMethod$1.runReflectiveCall(FrameworkMethod.java:50)
	at org.junit.internal.runners.model.ReflectiveCallable.run(ReflectiveCallable.java:12)
	at org.junit.runners.model.FrameworkMethod.invokeExplosively(FrameworkMethod.java:47)
	at org.junit.internal.runners.statements.RunBefores.evaluate(RunBefores.java:24)
	at org.eclipse.epp.mpc.tests.ui.wizard.AbstractMarketplaceWizardBotTest$1.evaluate(AbstractMarketplaceWizardBotTest.java:151)
	at org.junit.rules.RunRules.evaluate(RunRules.java:20)
	at org.junit.runners.ParentRunner.runLeaf(ParentRunner.java:325)
	at org.junit.runners.BlockJUnit4ClassRunner.runChild(BlockJUnit4ClassRunner.java:78)
	at org.junit.runners.BlockJUnit4ClassRunner.runChild(BlockJUnit4ClassRunner.java:57)
	at org.junit.runners.ParentRunner$3.run(ParentRunner.java:290)
	at org.junit.runners.ParentRunner$1.schedule(ParentRunner.java:71)
	at org.junit.runners.ParentRunner.runChildren(ParentRunner.java:288)
	at org.junit.runners.ParentRunner.access$000(ParentRunner.java:58)
	at org.junit.runners.ParentRunner$2.evaluate(ParentRunner.java:268)
	at org.junit.runners.ParentRunner.run(ParentRunner.java:363)
	at org.junit.runners.Suite.runChild(Suite.java:128)
	at org.junit.runners.Suite.runChild(Suite.java:27)
	at org.junit.runners.ParentRunner$3.run(ParentRunner.java:290)
	at org.junit.runners.ParentRunner$1.schedule(ParentRunner.java:71)
	at org.junit.runners.ParentRunner.runChildren(ParentRunner.java:288)
	at org.junit.runners.ParentRunner.access$000(ParentRunner.java:58)
	at org.junit.runners.ParentRunner$2.evaluate(ParentRunner.java:268)
	at org.junit.runners.ParentRunner.run(ParentRunner.java:363)
	at org.eclipse.epp.mpc.tests.LoggingSuite.run(LoggingSuite.java:76)
	at org.junit.runners.Suite.runChild(Suite.java:128)
	at org.junit.runners.Suite.runChild(Suite.java:27)
	at org.junit.runners.ParentRunner$3.run(ParentRunner.java:290)
	at org.junit.runners.ParentRunner$1.schedule(ParentRunner.java:71)
	at org.junit.runners.ParentRunner.runChildren(ParentRunner.java:288)
	at org.junit.runners.ParentRunner.access$000(ParentRunner.java:58)
	at org.junit.runners.ParentRunner$2.evaluate(ParentRunner.java:268)
	at org.junit.runners.ParentRunner.run(ParentRunner.java:363)
	at org.eclipse.epp.mpc.tests.LoggingSuite.run(LoggingSuite.java:76)
	at org.apache.maven.surefire.junit4.JUnit4Provider.execute(JUnit4Provider.java:367)
	at org.apache.maven.surefire.junit4.JUnit4Provider.executeWithRerun(JUnit4Provider.java:274)
	at org.apache.maven.surefire.junit4.JUnit4Provider.executeTestSet(JUnit4Provider.java:238)
	at org.apache.maven.surefire.junit4.JUnit4Provider.invoke(JUnit4Provider.java:161)
	at sun.reflect.NativeMethodAccessorImpl.invoke0(Native Method)
	at sun.reflect.NativeMethodAccessorImpl.invoke(NativeMethodAccessorImpl.java:62)
	at sun.reflect.DelegatingMethodAccessorImpl.invoke(DelegatingMethodAccessorImpl.java:43)
	at java.lang.reflect.Method.invoke(Method.java:498)
	at org.apache.maven.surefire.util.ReflectionUtils.invokeMethodWithArray2(ReflectionUtils.java:202)
	at org.apache.maven.surefire.booter.ProviderFactory$ProviderProxy.invoke(ProviderFactory.java:155)
	at org.apache.maven.surefire.booter.ProviderFactory.invokeProvider(ProviderFactory.java:81)
	at org.eclipse.tycho.surefire.osgibooter.OsgiSurefireBooter.run(OsgiSurefireBooter.java:107)
	at org.eclipse.tycho.surefire.osgibooter.AbstractUITestApplication.runTests(AbstractUITestApplication.java:44)
	at org.eclipse.e4.ui.internal.workbench.swt.E4Testable.lambda$0(E4Testable.java:76)
	at java.lang.Thread.run(Thread.java:748)
Finished test testNoninstallableLearnMore(org.eclipse.epp.mpc.tests.ui.wizard.MarketplaceWizardTest)
Starting test testSelectToInstall(org.eclipse.epp.mpc.tests.ui.wizard.MarketplaceWizardTest)
Test testSelectToInstall(org.eclipse.epp.mpc.tests.ui.wizard.MarketplaceWizardTest)failed: Timeout after: 10000 ms.: The shell 'Eclipse Marketplace' did not activate
org.eclipse.swtbot.swt.finder.widgets.TimeoutException: Timeout after: 10000 ms.: The shell 'Eclipse Marketplace' did not activate
	at org.eclipse.swtbot.swt.finder.SWTBotFactory.waitUntil(SWTBotFactory.java:522)
	at org.eclipse.swtbot.swt.finder.SWTBot.waitUntil(SWTBot.java:1)
	at org.eclipse.swtbot.swt.finder.SWTBotFactory.waitUntil(SWTBotFactory.java:496)
	at org.eclipse.swtbot.swt.finder.SWTBot.waitUntil(SWTBot.java:1)
	at org.eclipse.epp.mpc.tests.ui.wizard.AbstractMarketplaceWizardBotTest.initWizardBot(AbstractMarketplaceWizardBotTest.java:196)
	at org.eclipse.epp.mpc.tests.ui.wizard.AbstractMarketplaceWizardBotTest.setUp(AbstractMarketplaceWizardBotTest.java:166)
	at sun.reflect.NativeMethodAccessorImpl.invoke0(Native Method)
	at sun.reflect.NativeMethodAccessorImpl.invoke(NativeMethodAccessorImpl.java:62)
	at sun.reflect.DelegatingMethodAccessorImpl.invoke(DelegatingMethodAccessorImpl.java:43)
	at java.lang.reflect.Method.invoke(Method.java:498)
	at org.junit.runners.model.FrameworkMethod$1.runReflectiveCall(FrameworkMethod.java:50)
	at org.junit.internal.runners.model.ReflectiveCallable.run(ReflectiveCallable.java:12)
	at org.junit.runners.model.FrameworkMethod.invokeExplosively(FrameworkMethod.java:47)
	at org.junit.internal.runners.statements.RunBefores.evaluate(RunBefores.java:24)
	at org.eclipse.epp.mpc.tests.ui.wizard.AbstractMarketplaceWizardBotTest$1.evaluate(AbstractMarketplaceWizardBotTest.java:151)
	at org.junit.rules.RunRules.evaluate(RunRules.java:20)
	at org.junit.runners.ParentRunner.runLeaf(ParentRunner.java:325)
	at org.junit.runners.BlockJUnit4ClassRunner.runChild(BlockJUnit4ClassRunner.java:78)
	at org.junit.runners.BlockJUnit4ClassRunner.runChild(BlockJUnit4ClassRunner.java:57)
	at org.junit.runners.ParentRunner$3.run(ParentRunner.java:290)
	at org.junit.runners.ParentRunner$1.schedule(ParentRunner.java:71)
	at org.junit.runners.ParentRunner.runChildren(ParentRunner.java:288)
	at org.junit.runners.ParentRunner.access$000(ParentRunner.java:58)
	at org.junit.runners.ParentRunner$2.evaluate(ParentRunner.java:268)
	at org.junit.runners.ParentRunner.run(ParentRunner.java:363)
	at org.junit.runners.Suite.runChild(Suite.java:128)
	at org.junit.runners.Suite.runChild(Suite.java:27)
	at org.junit.runners.ParentRunner$3.run(ParentRunner.java:290)
	at org.junit.runners.ParentRunner$1.schedule(ParentRunner.java:71)
	at org.junit.runners.ParentRunner.runChildren(ParentRunner.java:288)
	at org.junit.runners.ParentRunner.access$000(ParentRunner.java:58)
	at org.junit.runners.ParentRunner$2.evaluate(ParentRunner.java:268)
	at org.junit.runners.ParentRunner.run(ParentRunner.java:363)
	at org.eclipse.epp.mpc.tests.LoggingSuite.run(LoggingSuite.java:76)
	at org.junit.runners.Suite.runChild(Suite.java:128)
	at org.junit.runners.Suite.runChild(Suite.java:27)
	at org.junit.runners.ParentRunner$3.run(ParentRunner.java:290)
	at org.junit.runners.ParentRunner$1.schedule(ParentRunner.java:71)
	at org.junit.runners.ParentRunner.runChildren(ParentRunner.java:288)
	at org.junit.runners.ParentRunner.access$000(ParentRunner.java:58)
	at org.junit.runners.ParentRunner$2.evaluate(ParentRunner.java:268)
	at org.junit.runners.ParentRunner.run(ParentRunner.java:363)
	at org.eclipse.epp.mpc.tests.LoggingSuite.run(LoggingSuite.java:76)
	at org.apache.maven.surefire.junit4.JUnit4Provider.execute(JUnit4Provider.java:367)
	at org.apache.maven.surefire.junit4.JUnit4Provider.executeWithRerun(JUnit4Provider.java:274)
	at org.apache.maven.surefire.junit4.JUnit4Provider.executeTestSet(JUnit4Provider.java:238)
	at org.apache.maven.surefire.junit4.JUnit4Provider.invoke(JUnit4Provider.java:161)
	at sun.reflect.NativeMethodAccessorImpl.invoke0(Native Method)
	at sun.reflect.NativeMethodAccessorImpl.invoke(NativeMethodAccessorImpl.java:62)
	at sun.reflect.DelegatingMethodAccessorImpl.invoke(DelegatingMethodAccessorImpl.java:43)
	at java.lang.reflect.Method.invoke(Method.java:498)
	at org.apache.maven.surefire.util.ReflectionUtils.invokeMethodWithArray2(ReflectionUtils.java:202)
	at org.apache.maven.surefire.booter.ProviderFactory$ProviderProxy.invoke(ProviderFactory.java:155)
	at org.apache.maven.surefire.booter.ProviderFactory.invokeProvider(ProviderFactory.java:81)
	at org.eclipse.tycho.surefire.osgibooter.OsgiSurefireBooter.run(OsgiSurefireBooter.java:107)
	at org.eclipse.tycho.surefire.osgibooter.AbstractUITestApplication.runTests(AbstractUITestApplication.java:44)
	at org.eclipse.e4.ui.internal.workbench.swt.E4Testable.lambda$0(E4Testable.java:76)
	at java.lang.Thread.run(Thread.java:748)
Finished test testSelectToInstall(org.eclipse.epp.mpc.tests.ui.wizard.MarketplaceWizardTest)
Starting test testSelectCategory(org.eclipse.epp.mpc.tests.ui.wizard.MarketplaceWizardTest)
Test testSelectCategory(org.eclipse.epp.mpc.tests.ui.wizard.MarketplaceWizardTest)failed: Timeout after: 10000 ms.: The shell 'Eclipse Marketplace' did not activate
org.eclipse.swtbot.swt.finder.widgets.TimeoutException: Timeout after: 10000 ms.: The shell 'Eclipse Marketplace' did not activate
	at org.eclipse.swtbot.swt.finder.SWTBotFactory.waitUntil(SWTBotFactory.java:522)
	at org.eclipse.swtbot.swt.finder.SWTBot.waitUntil(SWTBot.java:1)
	at org.eclipse.swtbot.swt.finder.SWTBotFactory.waitUntil(SWTBotFactory.java:496)
	at org.eclipse.swtbot.swt.finder.SWTBot.waitUntil(SWTBot.java:1)
	at org.eclipse.epp.mpc.tests.ui.wizard.AbstractMarketplaceWizardBotTest.initWizardBot(AbstractMarketplaceWizardBotTest.java:196)
	at org.eclipse.epp.mpc.tests.ui.wizard.AbstractMarketplaceWizardBotTest.setUp(AbstractMarketplaceWizardBotTest.java:166)
	at sun.reflect.NativeMethodAccessorImpl.invoke0(Native Method)
	at sun.reflect.NativeMethodAccessorImpl.invoke(NativeMethodAccessorImpl.java:62)
	at sun.reflect.DelegatingMethodAccessorImpl.invoke(DelegatingMethodAccessorImpl.java:43)
	at java.lang.reflect.Method.invoke(Method.java:498)
	at org.junit.runners.model.FrameworkMethod$1.runReflectiveCall(FrameworkMethod.java:50)
	at org.junit.internal.runners.model.ReflectiveCallable.run(ReflectiveCallable.java:12)
	at org.junit.runners.model.FrameworkMethod.invokeExplosively(FrameworkMethod.java:47)
	at org.junit.internal.runners.statements.RunBefores.evaluate(RunBefores.java:24)
	at org.eclipse.epp.mpc.tests.ui.wizard.AbstractMarketplaceWizardBotTest$1.evaluate(AbstractMarketplaceWizardBotTest.java:151)
	at org.junit.rules.RunRules.evaluate(RunRules.java:20)
	at org.junit.runners.ParentRunner.runLeaf(ParentRunner.java:325)
	at org.junit.runners.BlockJUnit4ClassRunner.runChild(BlockJUnit4ClassRunner.java:78)
	at org.junit.runners.BlockJUnit4ClassRunner.runChild(BlockJUnit4ClassRunner.java:57)
	at org.junit.runners.ParentRunner$3.run(ParentRunner.java:290)
	at org.junit.runners.ParentRunner$1.schedule(ParentRunner.java:71)
	at org.junit.runners.ParentRunner.runChildren(ParentRunner.java:288)
	at org.junit.runners.ParentRunner.access$000(ParentRunner.java:58)
	at org.junit.runners.ParentRunner$2.evaluate(ParentRunner.java:268)
	at org.junit.runners.ParentRunner.run(ParentRunner.java:363)
	at org.junit.runners.Suite.runChild(Suite.java:128)
	at org.junit.runners.Suite.runChild(Suite.java:27)
	at org.junit.runners.ParentRunner$3.run(ParentRunner.java:290)
	at org.junit.runners.ParentRunner$1.schedule(ParentRunner.java:71)
	at org.junit.runners.ParentRunner.runChildren(ParentRunner.java:288)
	at org.junit.runners.ParentRunner.access$000(ParentRunner.java:58)
	at org.junit.runners.ParentRunner$2.evaluate(ParentRunner.java:268)
	at org.junit.runners.ParentRunner.run(ParentRunner.java:363)
	at org.eclipse.epp.mpc.tests.LoggingSuite.run(LoggingSuite.java:76)
	at org.junit.runners.Suite.runChild(Suite.java:128)
	at org.junit.runners.Suite.runChild(Suite.java:27)
	at org.junit.runners.ParentRunner$3.run(ParentRunner.java:290)
	at org.junit.runners.ParentRunner$1.schedule(ParentRunner.java:71)
	at org.junit.runners.ParentRunner.runChildren(ParentRunner.java:288)
	at org.junit.runners.ParentRunner.access$000(ParentRunner.java:58)
	at org.junit.runners.ParentRunner$2.evaluate(ParentRunner.java:268)
	at org.junit.runners.ParentRunner.run(ParentRunner.java:363)
	at org.eclipse.epp.mpc.tests.LoggingSuite.run(LoggingSuite.java:76)
	at org.apache.maven.surefire.junit4.JUnit4Provider.execute(JUnit4Provider.java:367)
	at org.apache.maven.surefire.junit4.JUnit4Provider.executeWithRerun(JUnit4Provider.java:274)
	at org.apache.maven.surefire.junit4.JUnit4Provider.executeTestSet(JUnit4Provider.java:238)
	at org.apache.maven.surefire.junit4.JUnit4Provider.invoke(JUnit4Provider.java:161)
	at sun.reflect.NativeMethodAccessorImpl.invoke0(Native Method)
	at sun.reflect.NativeMethodAccessorImpl.invoke(NativeMethodAccessorImpl.java:62)
	at sun.reflect.DelegatingMethodAccessorImpl.invoke(DelegatingMethodAccessorImpl.java:43)
	at java.lang.reflect.Method.invoke(Method.java:498)
	at org.apache.maven.surefire.util.ReflectionUtils.invokeMethodWithArray2(ReflectionUtils.java:202)
	at org.apache.maven.surefire.booter.ProviderFactory$ProviderProxy.invoke(ProviderFactory.java:155)
	at org.apache.maven.surefire.booter.ProviderFactory.invokeProvider(ProviderFactory.java:81)
	at org.eclipse.tycho.surefire.osgibooter.OsgiSurefireBooter.run(OsgiSurefireBooter.java:107)
	at org.eclipse.tycho.surefire.osgibooter.AbstractUITestApplication.runTests(AbstractUITestApplication.java:44)
	at org.eclipse.e4.ui.internal.workbench.swt.E4Testable.lambda$0(E4Testable.java:76)
	at java.lang.Thread.run(Thread.java:748)
Finished test testSelectCategory(org.eclipse.epp.mpc.tests.ui.wizard.MarketplaceWizardTest)
Starting test testSearchMarketplaceUrl(org.eclipse.epp.mpc.tests.ui.wizard.MarketplaceWizardTest)
Test testSearchMarketplaceUrl(org.eclipse.epp.mpc.tests.ui.wizard.MarketplaceWizardTest)failed: Timeout after: 10000 ms.: The shell 'Eclipse Marketplace' did not activate
org.eclipse.swtbot.swt.finder.widgets.TimeoutException: Timeout after: 10000 ms.: The shell 'Eclipse Marketplace' did not activate
	at org.eclipse.swtbot.swt.finder.SWTBotFactory.waitUntil(SWTBotFactory.java:522)
	at org.eclipse.swtbot.swt.finder.SWTBot.waitUntil(SWTBot.java:1)
	at org.eclipse.swtbot.swt.finder.SWTBotFactory.waitUntil(SWTBotFactory.java:496)
	at org.eclipse.swtbot.swt.finder.SWTBot.waitUntil(SWTBot.java:1)
	at org.eclipse.epp.mpc.tests.ui.wizard.AbstractMarketplaceWizardBotTest.initWizardBot(AbstractMarketplaceWizardBotTest.java:196)
	at org.eclipse.epp.mpc.tests.ui.wizard.AbstractMarketplaceWizardBotTest.setUp(AbstractMarketplaceWizardBotTest.java:166)
	at sun.reflect.NativeMethodAccessorImpl.invoke0(Native Method)
	at sun.reflect.NativeMethodAccessorImpl.invoke(NativeMethodAccessorImpl.java:62)
	at sun.reflect.DelegatingMethodAccessorImpl.invoke(DelegatingMethodAccessorImpl.java:43)
	at java.lang.reflect.Method.invoke(Method.java:498)
	at org.junit.runners.model.FrameworkMethod$1.runReflectiveCall(FrameworkMethod.java:50)
	at org.junit.internal.runners.model.ReflectiveCallable.run(ReflectiveCallable.java:12)
	at org.junit.runners.model.FrameworkMethod.invokeExplosively(FrameworkMethod.java:47)
	at org.junit.internal.runners.statements.RunBefores.evaluate(RunBefores.java:24)
	at org.eclipse.epp.mpc.tests.ui.wizard.AbstractMarketplaceWizardBotTest$1.evaluate(AbstractMarketplaceWizardBotTest.java:151)
	at org.junit.rules.RunRules.evaluate(RunRules.java:20)
	at org.junit.runners.ParentRunner.runLeaf(ParentRunner.java:325)
	at org.junit.runners.BlockJUnit4ClassRunner.runChild(BlockJUnit4ClassRunner.java:78)
	at org.junit.runners.BlockJUnit4ClassRunner.runChild(BlockJUnit4ClassRunner.java:57)
	at org.junit.runners.ParentRunner$3.run(ParentRunner.java:290)
	at org.junit.runners.ParentRunner$1.schedule(ParentRunner.java:71)
	at org.junit.runners.ParentRunner.runChildren(ParentRunner.java:288)
	at org.junit.runners.ParentRunner.access$000(ParentRunner.java:58)
	at org.junit.runners.ParentRunner$2.evaluate(ParentRunner.java:268)
	at org.junit.runners.ParentRunner.run(ParentRunner.java:363)
	at org.junit.runners.Suite.runChild(Suite.java:128)
	at org.junit.runners.Suite.runChild(Suite.java:27)
	at org.junit.runners.ParentRunner$3.run(ParentRunner.java:290)
	at org.junit.runners.ParentRunner$1.schedule(ParentRunner.java:71)
	at org.junit.runners.ParentRunner.runChildren(ParentRunner.java:288)
	at org.junit.runners.ParentRunner.access$000(ParentRunner.java:58)
	at org.junit.runners.ParentRunner$2.evaluate(ParentRunner.java:268)
	at org.junit.runners.ParentRunner.run(ParentRunner.java:363)
	at org.eclipse.epp.mpc.tests.LoggingSuite.run(LoggingSuite.java:76)
	at org.junit.runners.Suite.runChild(Suite.java:128)
	at org.junit.runners.Suite.runChild(Suite.java:27)
	at org.junit.runners.ParentRunner$3.run(ParentRunner.java:290)
	at org.junit.runners.ParentRunner$1.schedule(ParentRunner.java:71)
	at org.junit.runners.ParentRunner.runChildren(ParentRunner.java:288)
	at org.junit.runners.ParentRunner.access$000(ParentRunner.java:58)
	at org.junit.runners.ParentRunner$2.evaluate(ParentRunner.java:268)
	at org.junit.runners.ParentRunner.run(ParentRunner.java:363)
	at org.eclipse.epp.mpc.tests.LoggingSuite.run(LoggingSuite.java:76)
	at org.apache.maven.surefire.junit4.JUnit4Provider.execute(JUnit4Provider.java:367)
	at org.apache.maven.surefire.junit4.JUnit4Provider.executeWithRerun(JUnit4Provider.java:274)
	at org.apache.maven.surefire.junit4.JUnit4Provider.executeTestSet(JUnit4Provider.java:238)
	at org.apache.maven.surefire.junit4.JUnit4Provider.invoke(JUnit4Provider.java:161)
	at sun.reflect.NativeMethodAccessorImpl.invoke0(Native Method)
	at sun.reflect.NativeMethodAccessorImpl.invoke(NativeMethodAccessorImpl.java:62)
	at sun.reflect.DelegatingMethodAccessorImpl.invoke(DelegatingMethodAccessorImpl.java:43)
	at java.lang.reflect.Method.invoke(Method.java:498)
	at org.apache.maven.surefire.util.ReflectionUtils.invokeMethodWithArray2(ReflectionUtils.java:202)
	at org.apache.maven.surefire.booter.ProviderFactory$ProviderProxy.invoke(ProviderFactory.java:155)
	at org.apache.maven.surefire.booter.ProviderFactory.invokeProvider(ProviderFactory.java:81)
	at org.eclipse.tycho.surefire.osgibooter.OsgiSurefireBooter.run(OsgiSurefireBooter.java:107)
	at org.eclipse.tycho.surefire.osgibooter.AbstractUITestApplication.runTests(AbstractUITestApplication.java:44)
	at org.eclipse.e4.ui.internal.workbench.swt.E4Testable.lambda$0(E4Testable.java:76)
	at java.lang.Thread.run(Thread.java:748)
Finished test testSearchMarketplaceUrl(org.eclipse.epp.mpc.tests.ui.wizard.MarketplaceWizardTest)
Skipped test testMoreInfoLearnMore(org.eclipse.epp.mpc.tests.ui.wizard.MarketplaceWizardTest)
Starting test testRecentBackToSearch(org.eclipse.epp.mpc.tests.ui.wizard.MarketplaceWizardTest)
Test testRecentBackToSearch(org.eclipse.epp.mpc.tests.ui.wizard.MarketplaceWizardTest)failed: Timeout after: 10000 ms.: The shell 'Eclipse Marketplace' did not activate
org.eclipse.swtbot.swt.finder.widgets.TimeoutException: Timeout after: 10000 ms.: The shell 'Eclipse Marketplace' did not activate
	at org.eclipse.swtbot.swt.finder.SWTBotFactory.waitUntil(SWTBotFactory.java:522)
	at org.eclipse.swtbot.swt.finder.SWTBot.waitUntil(SWTBot.java:1)
	at org.eclipse.swtbot.swt.finder.SWTBotFactory.waitUntil(SWTBotFactory.java:496)
	at org.eclipse.swtbot.swt.finder.SWTBot.waitUntil(SWTBot.java:1)
	at org.eclipse.epp.mpc.tests.ui.wizard.AbstractMarketplaceWizardBotTest.initWizardBot(AbstractMarketplaceWizardBotTest.java:196)
	at org.eclipse.epp.mpc.tests.ui.wizard.AbstractMarketplaceWizardBotTest.setUp(AbstractMarketplaceWizardBotTest.java:166)
	at sun.reflect.NativeMethodAccessorImpl.invoke0(Native Method)
	at sun.reflect.NativeMethodAccessorImpl.invoke(NativeMethodAccessorImpl.java:62)
	at sun.reflect.DelegatingMethodAccessorImpl.invoke(DelegatingMethodAccessorImpl.java:43)
	at java.lang.reflect.Method.invoke(Method.java:498)
	at org.junit.runners.model.FrameworkMethod$1.runReflectiveCall(FrameworkMethod.java:50)
	at org.junit.internal.runners.model.ReflectiveCallable.run(ReflectiveCallable.java:12)
	at org.junit.runners.model.FrameworkMethod.invokeExplosively(FrameworkMethod.java:47)
	at org.junit.internal.runners.statements.RunBefores.evaluate(RunBefores.java:24)
	at org.eclipse.epp.mpc.tests.ui.wizard.AbstractMarketplaceWizardBotTest$1.evaluate(AbstractMarketplaceWizardBotTest.java:151)
	at org.junit.rules.RunRules.evaluate(RunRules.java:20)
	at org.junit.runners.ParentRunner.runLeaf(ParentRunner.java:325)
	at org.junit.runners.BlockJUnit4ClassRunner.runChild(BlockJUnit4ClassRunner.java:78)
	at org.junit.runners.BlockJUnit4ClassRunner.runChild(BlockJUnit4ClassRunner.java:57)
	at org.junit.runners.ParentRunner$3.run(ParentRunner.java:290)
	at org.junit.runners.ParentRunner$1.schedule(ParentRunner.java:71)
	at org.junit.runners.ParentRunner.runChildren(ParentRunner.java:288)
	at org.junit.runners.ParentRunner.access$000(ParentRunner.java:58)
	at org.junit.runners.ParentRunner$2.evaluate(ParentRunner.java:268)
	at org.junit.runners.ParentRunner.run(ParentRunner.java:363)
	at org.junit.runners.Suite.runChild(Suite.java:128)
	at org.junit.runners.Suite.runChild(Suite.java:27)
	at org.junit.runners.ParentRunner$3.run(ParentRunner.java:290)
	at org.junit.runners.ParentRunner$1.schedule(ParentRunner.java:71)
	at org.junit.runners.ParentRunner.runChildren(ParentRunner.java:288)
	at org.junit.runners.ParentRunner.access$000(ParentRunner.java:58)
	at org.junit.runners.ParentRunner$2.evaluate(ParentRunner.java:268)
	at org.junit.runners.ParentRunner.run(ParentRunner.java:363)
	at org.eclipse.epp.mpc.tests.LoggingSuite.run(LoggingSuite.java:76)
	at org.junit.runners.Suite.runChild(Suite.java:128)
	at org.junit.runners.Suite.runChild(Suite.java:27)
	at org.junit.runners.ParentRunner$3.run(ParentRunner.java:290)
	at org.junit.runners.ParentRunner$1.schedule(ParentRunner.java:71)
	at org.junit.runners.ParentRunner.runChildren(ParentRunner.java:288)
	at org.junit.runners.ParentRunner.access$000(ParentRunner.java:58)
	at org.junit.runners.ParentRunner$2.evaluate(ParentRunner.java:268)
	at org.junit.runners.ParentRunner.run(ParentRunner.java:363)
	at org.eclipse.epp.mpc.tests.LoggingSuite.run(LoggingSuite.java:76)
	at org.apache.maven.surefire.junit4.JUnit4Provider.execute(JUnit4Provider.java:367)
	at org.apache.maven.surefire.junit4.JUnit4Provider.executeWithRerun(JUnit4Provider.java:274)
	at org.apache.maven.surefire.junit4.JUnit4Provider.executeTestSet(JUnit4Provider.java:238)
	at org.apache.maven.surefire.junit4.JUnit4Provider.invoke(JUnit4Provider.java:161)
	at sun.reflect.NativeMethodAccessorImpl.invoke0(Native Method)
	at sun.reflect.NativeMethodAccessorImpl.invoke(NativeMethodAccessorImpl.java:62)
	at sun.reflect.DelegatingMethodAccessorImpl.invoke(DelegatingMethodAccessorImpl.java:43)
	at java.lang.reflect.Method.invoke(Method.java:498)
	at org.apache.maven.surefire.util.ReflectionUtils.invokeMethodWithArray2(ReflectionUtils.java:202)
	at org.apache.maven.surefire.booter.ProviderFactory$ProviderProxy.invoke(ProviderFactory.java:155)
	at org.apache.maven.surefire.booter.ProviderFactory.invokeProvider(ProviderFactory.java:81)
	at org.eclipse.tycho.surefire.osgibooter.OsgiSurefireBooter.run(OsgiSurefireBooter.java:107)
	at org.eclipse.tycho.surefire.osgibooter.AbstractUITestApplication.runTests(AbstractUITestApplication.java:44)
	at org.eclipse.e4.ui.internal.workbench.swt.E4Testable.lambda$0(E4Testable.java:76)
	at java.lang.Thread.run(Thread.java:748)
Finished test testRecentBackToSearch(org.eclipse.epp.mpc.tests.ui.wizard.MarketplaceWizardTest)
Starting test testShowSelected(org.eclipse.epp.mpc.tests.ui.wizard.MarketplaceWizardTest)
Test testShowSelected(org.eclipse.epp.mpc.tests.ui.wizard.MarketplaceWizardTest)failed: Timeout after: 10000 ms.: The shell 'Eclipse Marketplace' did not activate
org.eclipse.swtbot.swt.finder.widgets.TimeoutException: Timeout after: 10000 ms.: The shell 'Eclipse Marketplace' did not activate
	at org.eclipse.swtbot.swt.finder.SWTBotFactory.waitUntil(SWTBotFactory.java:522)
	at org.eclipse.swtbot.swt.finder.SWTBot.waitUntil(SWTBot.java:1)
	at org.eclipse.swtbot.swt.finder.SWTBotFactory.waitUntil(SWTBotFactory.java:496)
	at org.eclipse.swtbot.swt.finder.SWTBot.waitUntil(SWTBot.java:1)
	at org.eclipse.epp.mpc.tests.ui.wizard.AbstractMarketplaceWizardBotTest.initWizardBot(AbstractMarketplaceWizardBotTest.java:196)
	at org.eclipse.epp.mpc.tests.ui.wizard.AbstractMarketplaceWizardBotTest.setUp(AbstractMarketplaceWizardBotTest.java:166)
	at sun.reflect.NativeMethodAccessorImpl.invoke0(Native Method)
	at sun.reflect.NativeMethodAccessorImpl.invoke(NativeMethodAccessorImpl.java:62)
	at sun.reflect.DelegatingMethodAccessorImpl.invoke(DelegatingMethodAccessorImpl.java:43)
	at java.lang.reflect.Method.invoke(Method.java:498)
	at org.junit.runners.model.FrameworkMethod$1.runReflectiveCall(FrameworkMethod.java:50)
	at org.junit.internal.runners.model.ReflectiveCallable.run(ReflectiveCallable.java:12)
	at org.junit.runners.model.FrameworkMethod.invokeExplosively(FrameworkMethod.java:47)
	at org.junit.internal.runners.statements.RunBefores.evaluate(RunBefores.java:24)
	at org.eclipse.epp.mpc.tests.ui.wizard.AbstractMarketplaceWizardBotTest$1.evaluate(AbstractMarketplaceWizardBotTest.java:151)
	at org.junit.rules.RunRules.evaluate(RunRules.java:20)
	at org.junit.runners.ParentRunner.runLeaf(ParentRunner.java:325)
	at org.junit.runners.BlockJUnit4ClassRunner.runChild(BlockJUnit4ClassRunner.java:78)
	at org.junit.runners.BlockJUnit4ClassRunner.runChild(BlockJUnit4ClassRunner.java:57)
	at org.junit.runners.ParentRunner$3.run(ParentRunner.java:290)
	at org.junit.runners.ParentRunner$1.schedule(ParentRunner.java:71)
	at org.junit.runners.ParentRunner.runChildren(ParentRunner.java:288)
	at org.junit.runners.ParentRunner.access$000(ParentRunner.java:58)
	at org.junit.runners.ParentRunner$2.evaluate(ParentRunner.java:268)
	at org.junit.runners.ParentRunner.run(ParentRunner.java:363)
	at org.junit.runners.Suite.runChild(Suite.java:128)
	at org.junit.runners.Suite.runChild(Suite.java:27)
	at org.junit.runners.ParentRunner$3.run(ParentRunner.java:290)
	at org.junit.runners.ParentRunner$1.schedule(ParentRunner.java:71)
	at org.junit.runners.ParentRunner.runChildren(ParentRunner.java:288)
	at org.junit.runners.ParentRunner.access$000(ParentRunner.java:58)
	at org.junit.runners.ParentRunner$2.evaluate(ParentRunner.java:268)
	at org.junit.runners.ParentRunner.run(ParentRunner.java:363)
	at org.eclipse.epp.mpc.tests.LoggingSuite.run(LoggingSuite.java:76)
	at org.junit.runners.Suite.runChild(Suite.java:128)
	at org.junit.runners.Suite.runChild(Suite.java:27)
	at org.junit.runners.ParentRunner$3.run(ParentRunner.java:290)
	at org.junit.runners.ParentRunner$1.schedule(ParentRunner.java:71)
	at org.junit.runners.ParentRunner.runChildren(ParentRunner.java:288)
	at org.junit.runners.ParentRunner.access$000(ParentRunner.java:58)
	at org.junit.runners.ParentRunner$2.evaluate(ParentRunner.java:268)
	at org.junit.runners.ParentRunner.run(ParentRunner.java:363)
	at org.eclipse.epp.mpc.tests.LoggingSuite.run(LoggingSuite.java:76)
	at org.apache.maven.surefire.junit4.JUnit4Provider.execute(JUnit4Provider.java:367)
	at org.apache.maven.surefire.junit4.JUnit4Provider.executeWithRerun(JUnit4Provider.java:274)
	at org.apache.maven.surefire.junit4.JUnit4Provider.executeTestSet(JUnit4Provider.java:238)
	at org.apache.maven.surefire.junit4.JUnit4Provider.invoke(JUnit4Provider.java:161)
	at sun.reflect.NativeMethodAccessorImpl.invoke0(Native Method)
	at sun.reflect.NativeMethodAccessorImpl.invoke(NativeMethodAccessorImpl.java:62)
	at sun.reflect.DelegatingMethodAccessorImpl.invoke(DelegatingMethodAccessorImpl.java:43)
	at java.lang.reflect.Method.invoke(Method.java:498)
	at org.apache.maven.surefire.util.ReflectionUtils.invokeMethodWithArray2(ReflectionUtils.java:202)
	at org.apache.maven.surefire.booter.ProviderFactory$ProviderProxy.invoke(ProviderFactory.java:155)
	at org.apache.maven.surefire.booter.ProviderFactory.invokeProvider(ProviderFactory.java:81)
	at org.eclipse.tycho.surefire.osgibooter.OsgiSurefireBooter.run(OsgiSurefireBooter.java:107)
	at org.eclipse.tycho.surefire.osgibooter.AbstractUITestApplication.runTests(AbstractUITestApplication.java:44)
	at org.eclipse.e4.ui.internal.workbench.swt.E4Testable.lambda$0(E4Testable.java:76)
	at java.lang.Thread.run(Thread.java:748)
Finished test testShowSelected(org.eclipse.epp.mpc.tests.ui.wizard.MarketplaceWizardTest)
Starting test testRecent(org.eclipse.epp.mpc.tests.ui.wizard.MarketplaceWizardTest)
Test testRecent(org.eclipse.epp.mpc.tests.ui.wizard.MarketplaceWizardTest)failed: Timeout after: 10000 ms.: The shell 'Eclipse Marketplace' did not activate
org.eclipse.swtbot.swt.finder.widgets.TimeoutException: Timeout after: 10000 ms.: The shell 'Eclipse Marketplace' did not activate
	at org.eclipse.swtbot.swt.finder.SWTBotFactory.waitUntil(SWTBotFactory.java:522)
	at org.eclipse.swtbot.swt.finder.SWTBot.waitUntil(SWTBot.java:1)
	at org.eclipse.swtbot.swt.finder.SWTBotFactory.waitUntil(SWTBotFactory.java:496)
	at org.eclipse.swtbot.swt.finder.SWTBot.waitUntil(SWTBot.java:1)
	at org.eclipse.epp.mpc.tests.ui.wizard.AbstractMarketplaceWizardBotTest.initWizardBot(AbstractMarketplaceWizardBotTest.java:196)
	at org.eclipse.epp.mpc.tests.ui.wizard.AbstractMarketplaceWizardBotTest.setUp(AbstractMarketplaceWizardBotTest.java:166)
	at sun.reflect.NativeMethodAccessorImpl.invoke0(Native Method)
	at sun.reflect.NativeMethodAccessorImpl.invoke(NativeMethodAccessorImpl.java:62)
	at sun.reflect.DelegatingMethodAccessorImpl.invoke(DelegatingMethodAccessorImpl.java:43)
	at java.lang.reflect.Method.invoke(Method.java:498)
	at org.junit.runners.model.FrameworkMethod$1.runReflectiveCall(FrameworkMethod.java:50)
	at org.junit.internal.runners.model.ReflectiveCallable.run(ReflectiveCallable.java:12)
	at org.junit.runners.model.FrameworkMethod.invokeExplosively(FrameworkMethod.java:47)
	at org.junit.internal.runners.statements.RunBefores.evaluate(RunBefores.java:24)
	at org.eclipse.epp.mpc.tests.ui.wizard.AbstractMarketplaceWizardBotTest$1.evaluate(AbstractMarketplaceWizardBotTest.java:151)
	at org.junit.rules.RunRules.evaluate(RunRules.java:20)
	at org.junit.runners.ParentRunner.runLeaf(ParentRunner.java:325)
	at org.junit.runners.BlockJUnit4ClassRunner.runChild(BlockJUnit4ClassRunner.java:78)
	at org.junit.runners.BlockJUnit4ClassRunner.runChild(BlockJUnit4ClassRunner.java:57)
	at org.junit.runners.ParentRunner$3.run(ParentRunner.java:290)
	at org.junit.runners.ParentRunner$1.schedule(ParentRunner.java:71)
	at org.junit.runners.ParentRunner.runChildren(ParentRunner.java:288)
	at org.junit.runners.ParentRunner.access$000(ParentRunner.java:58)
	at org.junit.runners.ParentRunner$2.evaluate(ParentRunner.java:268)
	at org.junit.runners.ParentRunner.run(ParentRunner.java:363)
	at org.junit.runners.Suite.runChild(Suite.java:128)
	at org.junit.runners.Suite.runChild(Suite.java:27)
	at org.junit.runners.ParentRunner$3.run(ParentRunner.java:290)
	at org.junit.runners.ParentRunner$1.schedule(ParentRunner.java:71)
	at org.junit.runners.ParentRunner.runChildren(ParentRunner.java:288)
	at org.junit.runners.ParentRunner.access$000(ParentRunner.java:58)
	at org.junit.runners.ParentRunner$2.evaluate(ParentRunner.java:268)
	at org.junit.runners.ParentRunner.run(ParentRunner.java:363)
	at org.eclipse.epp.mpc.tests.LoggingSuite.run(LoggingSuite.java:76)
	at org.junit.runners.Suite.runChild(Suite.java:128)
	at org.junit.runners.Suite.runChild(Suite.java:27)
	at org.junit.runners.ParentRunner$3.run(ParentRunner.java:290)
	at org.junit.runners.ParentRunner$1.schedule(ParentRunner.java:71)
	at org.junit.runners.ParentRunner.runChildren(ParentRunner.java:288)
	at org.junit.runners.ParentRunner.access$000(ParentRunner.java:58)
	at org.junit.runners.ParentRunner$2.evaluate(ParentRunner.java:268)
	at org.junit.runners.ParentRunner.run(ParentRunner.java:363)
	at org.eclipse.epp.mpc.tests.LoggingSuite.run(LoggingSuite.java:76)
	at org.apache.maven.surefire.junit4.JUnit4Provider.execute(JUnit4Provider.java:367)
	at org.apache.maven.surefire.junit4.JUnit4Provider.executeWithRerun(JUnit4Provider.java:274)
	at org.apache.maven.surefire.junit4.JUnit4Provider.executeTestSet(JUnit4Provider.java:238)
	at org.apache.maven.surefire.junit4.JUnit4Provider.invoke(JUnit4Provider.java:161)
	at sun.reflect.NativeMethodAccessorImpl.invoke0(Native Method)
	at sun.reflect.NativeMethodAccessorImpl.invoke(NativeMethodAccessorImpl.java:62)
	at sun.reflect.DelegatingMethodAccessorImpl.invoke(DelegatingMethodAccessorImpl.java:43)
	at java.lang.reflect.Method.invoke(Method.java:498)
	at org.apache.maven.surefire.util.ReflectionUtils.invokeMethodWithArray2(ReflectionUtils.java:202)
	at org.apache.maven.surefire.booter.ProviderFactory$ProviderProxy.invoke(ProviderFactory.java:155)
	at org.apache.maven.surefire.booter.ProviderFactory.invokeProvider(ProviderFactory.java:81)
	at org.eclipse.tycho.surefire.osgibooter.OsgiSurefireBooter.run(OsgiSurefireBooter.java:107)
	at org.eclipse.tycho.surefire.osgibooter.AbstractUITestApplication.runTests(AbstractUITestApplication.java:44)
	at org.eclipse.e4.ui.internal.workbench.swt.E4Testable.lambda$0(E4Testable.java:76)
	at java.lang.Thread.run(Thread.java:748)
Finished test testRecent(org.eclipse.epp.mpc.tests.ui.wizard.MarketplaceWizardTest)
Starting test testSearch(org.eclipse.epp.mpc.tests.ui.wizard.MarketplaceWizardTest)
Test testSearch(org.eclipse.epp.mpc.tests.ui.wizard.MarketplaceWizardTest)failed: Timeout after: 10000 ms.: The shell 'Eclipse Marketplace' did not activate
org.eclipse.swtbot.swt.finder.widgets.TimeoutException: Timeout after: 10000 ms.: The shell 'Eclipse Marketplace' did not activate
	at org.eclipse.swtbot.swt.finder.SWTBotFactory.waitUntil(SWTBotFactory.java:522)
	at org.eclipse.swtbot.swt.finder.SWTBot.waitUntil(SWTBot.java:1)
	at org.eclipse.swtbot.swt.finder.SWTBotFactory.waitUntil(SWTBotFactory.java:496)
	at org.eclipse.swtbot.swt.finder.SWTBot.waitUntil(SWTBot.java:1)
	at org.eclipse.epp.mpc.tests.ui.wizard.AbstractMarketplaceWizardBotTest.initWizardBot(AbstractMarketplaceWizardBotTest.java:196)
	at org.eclipse.epp.mpc.tests.ui.wizard.AbstractMarketplaceWizardBotTest.setUp(AbstractMarketplaceWizardBotTest.java:166)
	at sun.reflect.NativeMethodAccessorImpl.invoke0(Native Method)
	at sun.reflect.NativeMethodAccessorImpl.invoke(NativeMethodAccessorImpl.java:62)
	at sun.reflect.DelegatingMethodAccessorImpl.invoke(DelegatingMethodAccessorImpl.java:43)
	at java.lang.reflect.Method.invoke(Method.java:498)
	at org.junit.runners.model.FrameworkMethod$1.runReflectiveCall(FrameworkMethod.java:50)
	at org.junit.internal.runners.model.ReflectiveCallable.run(ReflectiveCallable.java:12)
	at org.junit.runners.model.FrameworkMethod.invokeExplosively(FrameworkMethod.java:47)
	at org.junit.internal.runners.statements.RunBefores.evaluate(RunBefores.java:24)
	at org.eclipse.epp.mpc.tests.ui.wizard.AbstractMarketplaceWizardBotTest$1.evaluate(AbstractMarketplaceWizardBotTest.java:151)
	at org.junit.rules.RunRules.evaluate(RunRules.java:20)
	at org.junit.runners.ParentRunner.runLeaf(ParentRunner.java:325)
	at org.junit.runners.BlockJUnit4ClassRunner.runChild(BlockJUnit4ClassRunner.java:78)
	at org.junit.runners.BlockJUnit4ClassRunner.runChild(BlockJUnit4ClassRunner.java:57)
	at org.junit.runners.ParentRunner$3.run(ParentRunner.java:290)
	at org.junit.runners.ParentRunner$1.schedule(ParentRunner.java:71)
	at org.junit.runners.ParentRunner.runChildren(ParentRunner.java:288)
	at org.junit.runners.ParentRunner.access$000(ParentRunner.java:58)
	at org.junit.runners.ParentRunner$2.evaluate(ParentRunner.java:268)
	at org.junit.runners.ParentRunner.run(ParentRunner.java:363)
	at org.junit.runners.Suite.runChild(Suite.java:128)
	at org.junit.runners.Suite.runChild(Suite.java:27)
	at org.junit.runners.ParentRunner$3.run(ParentRunner.java:290)
	at org.junit.runners.ParentRunner$1.schedule(ParentRunner.java:71)
	at org.junit.runners.ParentRunner.runChildren(ParentRunner.java:288)
	at org.junit.runners.ParentRunner.access$000(ParentRunner.java:58)
	at org.junit.runners.ParentRunner$2.evaluate(ParentRunner.java:268)
	at org.junit.runners.ParentRunner.run(ParentRunner.java:363)
	at org.eclipse.epp.mpc.tests.LoggingSuite.run(LoggingSuite.java:76)
	at org.junit.runners.Suite.runChild(Suite.java:128)
	at org.junit.runners.Suite.runChild(Suite.java:27)
	at org.junit.runners.ParentRunner$3.run(ParentRunner.java:290)
	at org.junit.runners.ParentRunner$1.schedule(ParentRunner.java:71)
	at org.junit.runners.ParentRunner.runChildren(ParentRunner.java:288)
	at org.junit.runners.ParentRunner.access$000(ParentRunner.java:58)
	at org.junit.runners.ParentRunner$2.evaluate(ParentRunner.java:268)
	at org.junit.runners.ParentRunner.run(ParentRunner.java:363)
	at org.eclipse.epp.mpc.tests.LoggingSuite.run(LoggingSuite.java:76)
	at org.apache.maven.surefire.junit4.JUnit4Provider.execute(JUnit4Provider.java:367)
	at org.apache.maven.surefire.junit4.JUnit4Provider.executeWithRerun(JUnit4Provider.java:274)
	at org.apache.maven.surefire.junit4.JUnit4Provider.executeTestSet(JUnit4Provider.java:238)
	at org.apache.maven.surefire.junit4.JUnit4Provider.invoke(JUnit4Provider.java:161)
	at sun.reflect.NativeMethodAccessorImpl.invoke0(Native Method)
	at sun.reflect.NativeMethodAccessorImpl.invoke(NativeMethodAccessorImpl.java:62)
	at sun.reflect.DelegatingMethodAccessorImpl.invoke(DelegatingMethodAccessorImpl.java:43)
	at java.lang.reflect.Method.invoke(Method.java:498)
	at org.apache.maven.surefire.util.ReflectionUtils.invokeMethodWithArray2(ReflectionUtils.java:202)
	at org.apache.maven.surefire.booter.ProviderFactory$ProviderProxy.invoke(ProviderFactory.java:155)
	at org.apache.maven.surefire.booter.ProviderFactory.invokeProvider(ProviderFactory.java:81)
	at org.eclipse.tycho.surefire.osgibooter.OsgiSurefireBooter.run(OsgiSurefireBooter.java:107)
	at org.eclipse.tycho.surefire.osgibooter.AbstractUITestApplication.runTests(AbstractUITestApplication.java:44)
	at org.eclipse.e4.ui.internal.workbench.swt.E4Testable.lambda$0(E4Testable.java:76)
	at java.lang.Thread.run(Thread.java:748)
Finished test testSearch(org.eclipse.epp.mpc.tests.ui.wizard.MarketplaceWizardTest)
Starting test testFavorite(org.eclipse.epp.mpc.tests.ui.wizard.MarketplaceWizardTest)
org.eclipse.swtbot.swt.finder.widgets.TimeoutException: Timeout after: 10000 ms.: The shell 'Eclipse Marketplace' did not activaTest testFavorite(org.eclipse.epp.mpc.tests.ui.wizard.MarketplaceWizardTest)failed: Timeout after: 10000 ms.: The shell 'Eclipsete
 Marketplace' did not activate
	at org.eclipse.swtbot.swt.finder.SWTBotFactory.waitUntil(SWTBotFactory.java:522)
	at org.eclipse.swtbot.swt.finder.SWTBot.waitUntil(SWTBot.java:1)
	at org.eclipse.swtbot.swt.finder.SWTBotFactory.waitUntil(SWTBotFactory.java:496)
	at org.eclipse.swtbot.swt.finder.SWTBot.waitUntil(SWTBot.java:1)
	at org.eclipse.epp.mpc.tests.ui.wizard.AbstractMarketplaceWizardBotTest.initWizardBot(AbstractMarketplaceWizardBotTest.java:196)
	at org.eclipse.epp.mpc.tests.ui.wizard.AbstractMarketplaceWizardBotTest.setUp(AbstractMarketplaceWizardBotTest.java:166)
	at sun.reflect.NativeMethodAccessorImpl.invoke0(Native Method)
	at sun.reflect.NativeMethodAccessorImpl.invoke(NativeMethodAccessorImpl.java:62)
	at sun.reflect.DelegatingMethodAccessorImpl.invoke(DelegatingMethodAccessorImpl.java:43)
	at java.lang.reflect.Method.invoke(Method.java:498)
	at org.junit.runners.model.FrameworkMethod$1.runReflectiveCall(FrameworkMethod.java:50)
	at org.junit.internal.runners.model.ReflectiveCallable.run(ReflectiveCallable.java:12)
	at org.junit.runners.model.FrameworkMethod.invokeExplosively(FrameworkMethod.java:47)
	at org.junit.internal.runners.statements.RunBefores.evaluate(RunBefores.java:24)
	at org.eclipse.epp.mpc.tests.ui.wizard.AbstractMarketplaceWizardBotTest$1.evaluate(AbstractMarketplaceWizardBotTest.java:151)
	at org.junit.rules.RunRules.evaluate(RunRules.java:20)
	at org.junit.runners.ParentRunner.runLeaf(ParentRunner.java:325)
	at org.junit.runners.BlockJUnit4ClassRunner.runChild(BlockJUnit4ClassRunner.java:78)
	at org.junit.runners.BlockJUnit4ClassRunner.runChild(BlockJUnit4ClassRunner.java:57)
	at org.junit.runners.ParentRunner$3.run(ParentRunner.java:290)
	at org.junit.runners.ParentRunner$1.schedule(ParentRunner.java:71)
	at org.junit.runners.ParentRunner.runChildren(ParentRunner.java:288)
	at org.junit.runners.ParentRunner.access$000(ParentRunner.java:58)
	at org.junit.runners.ParentRunner$2.evaluate(ParentRunner.java:268)
	at org.junit.runners.ParentRunner.run(ParentRunner.java:363)
	at org.junit.runners.Suite.runChild(Suite.java:128)
	at org.junit.runners.Suite.runChild(Suite.java:27)
	at org.junit.runners.ParentRunner$3.run(ParentRunner.java:290)
	at org.junit.runners.ParentRunner$1.schedule(ParentRunner.java:71)
	at org.junit.runners.ParentRunner.runChildren(ParentRunner.java:288)
	at org.junit.runners.ParentRunner.access$000(ParentRunner.java:58)
	at org.junit.runners.ParentRunner$2.evaluate(ParentRunner.java:268)
	at org.junit.runners.ParentRunner.run(ParentRunner.java:363)
	at org.eclipse.epp.mpc.tests.LoggingSuite.run(LoggingSuite.java:76)
	at org.junit.runners.Suite.runChild(Suite.java:128)
	at org.junit.runners.Suite.runChild(Suite.java:27)
	at org.junit.runners.ParentRunner$3.run(ParentRunner.java:290)
	at org.junit.runners.ParentRunner$1.schedule(ParentRunner.java:71)
	at org.junit.runners.ParentRunner.runChildren(ParentRunner.java:288)
	at org.junit.runners.ParentRunner.access$000(ParentRunner.java:58)
	at org.junit.runners.ParentRunner$2.evaluate(ParentRunner.java:268)
	at org.junit.runners.ParentRunner.run(ParentRunner.java:363)
	at org.eclipse.epp.mpc.tests.LoggingSuite.run(LoggingSuite.java:76)
	at org.apache.maven.surefire.junit4.JUnit4Provider.execute(JUnit4Provider.java:367)
	at org.apache.maven.surefire.junit4.JUnit4Provider.executeWithRerun(JUnit4Provider.java:274)
	at org.apache.maven.surefire.junit4.JUnit4Provider.executeTestSet(JUnit4Provider.java:238)
	at org.apache.maven.surefire.junit4.JUnit4Provider.invoke(JUnit4Provider.java:161)
	at sun.reflect.NativeMethodAccessorImpl.invoke0(Native Method)
	at sun.reflect.NativeMethodAccessorImpl.invoke(NativeMethodAccessorImpl.java:62)
	at sun.reflect.DelegatingMethodAccessorImpl.invoke(DelegatingMethodAccessorImpl.java:43)
	at java.lang.reflect.Method.invoke(Method.java:498)
	at org.apache.maven.surefire.util.ReflectionUtils.invokeMethodWithArray2(ReflectionUtils.java:202)
	at org.apache.maven.surefire.booter.ProviderFactory$ProviderProxy.invoke(ProviderFactory.java:155)
	at org.apache.maven.surefire.booter.ProviderFactory.invokeProvider(ProviderFactory.java:81)
	at org.eclipse.tycho.surefire.osgibooter.OsgiSurefireBooter.run(OsgiSurefireBooter.java:107)
	at org.eclipse.tycho.surefire.osgibooter.AbstractUITestApplication.runTests(AbstractUITestApplication.java:44)
	at org.eclipse.e4.ui.internal.workbench.swt.E4Testable.lambda$0(E4Testable.java:76)
	at java.lang.Thread.run(Thread.java:748)
Finished test testFavorite(org.eclipse.epp.mpc.tests.ui.wizard.MarketplaceWizardTest)
Tests run: 138, Failures: 1, Errors: 21, Skipped: 6, Time elapsed: 359.292 sec <<< FAILURE! - in org.eclipse.epp.mpc.tests.AllTests
testConsistentHttpsProxyConfiguration(org.eclipse.epp.mpc.tests.util.ProxyConfigurationTest) skipped
testConsistentHttpProxyConfiguration(org.eclipse.epp.mpc.tests.util.ProxyConfigurationTest) skipped
favorites(org.eclipse.epp.mpc.tests.service.xml.UnmarshallerTest)  Time elapsed: 0.026 sec
invalidBytesErrorMessage(org.eclipse.epp.mpc.tests.service.xml.UnmarshallerTest)  Time elapsed: 0.012 sec
invalidLeadingBytes(org.eclipse.epp.mpc.tests.service.xml.UnmarshallerTest)  Time elapsed: 0.001 sec
invalidLeadingSpace(org.eclipse.epp.mpc.tests.service.xml.UnmarshallerTest)  Time elapsed: 0.001 sec
recent(org.eclipse.epp.mpc.tests.service.xml.UnmarshallerTest)  Time elapsed: 0.007 sec
search(org.eclipse.epp.mpc.tests.service.xml.UnmarshallerTest)  Time elapsed: 0.004 sec
invalidLeadingBytesErrorMessage(org.eclipse.epp.mpc.tests.service.xml.UnmarshallerTest)  Time elapsed: 0.002 sec
featured(org.eclipse.epp.mpc.tests.service.xml.UnmarshallerTest)  Time elapsed: 0.002 sec
news(org.eclipse.epp.mpc.tests.service.xml.UnmarshallerTest)  Time elapsed: 0.001 sec
node(org.eclipse.epp.mpc.tests.service.xml.UnmarshallerTest)  Time elapsed: 0.003 sec
tags(org.eclipse.epp.mpc.tests.service.xml.UnmarshallerTest)  Time elapsed: 0.002 sec
marketplaceCatalogs(org.eclipse.epp.mpc.tests.service.xml.UnmarshallerTest)  Time elapsed: 0.003 sec
invalidContentErrorMessage(org.eclipse.epp.mpc.tests.service.xml.UnmarshallerTest)  Time elapsed: 0.001 sec
invalidBytes(org.eclipse.epp.mpc.tests.service.xml.UnmarshallerTest)  Time elapsed: 0.001 sec
marketplaceRoot(org.eclipse.epp.mpc.tests.service.xml.UnmarshallerTest)  Time elapsed: 0.004 sec
invalidContent(org.eclipse.epp.mpc.tests.service.xml.UnmarshallerTest)  Time elapsed: 0.001 sec
categoryTaxonomy(org.eclipse.epp.mpc.tests.service.xml.UnmarshallerTest)  Time elapsed: 0.001 sec
emptyStream(org.eclipse.epp.mpc.tests.service.xml.UnmarshallerTest)  Time elapsed: 0.001 sec
testCleanInformalHtmlMarkup_NaturalParaFollowedByTag(org.eclipse.epp.mpc.tests.util.TextUtilTest)  Time elapsed: 0.002 sec
testStripHtmlMarkup_TagWithUnquotedAttributes(org.eclipse.epp.mpc.tests.util.TextUtilTest)  Time elapsed: 0 sec
testStripHtmlMarkup_TagWithMultipleAttributes(org.eclipse.epp.mpc.tests.util.TextUtilTest)  Time elapsed: 0 sec
testStripHtmlMarkup_NoMarkup(org.eclipse.epp.mpc.tests.util.TextUtilTest)  Time elapsed: 0 sec
testStripHtmlMarkup_TagOpen(org.eclipse.epp.mpc.tests.util.TextUtilTest)  Time elapsed: 0.001 sec
testEscapeAmpersandDouble(org.eclipse.epp.mpc.tests.util.TextUtilTest)  Time elapsed: 0 sec
testCleanInformalHtmlMarkup_NaturalParaPrecededByTag(org.eclipse.epp.mpc.tests.util.TextUtilTest)  Time elapsed: 0 sec
testCleanInformalHtmlMarkup_Null(org.eclipse.epp.mpc.tests.util.TextUtilTest)  Time elapsed: 0 sec
testStripHtmlMarkup_TagOpenSpaces(org.eclipse.epp.mpc.tests.util.TextUtilTest)  Time elapsed: 0 sec
testStripHtmlMarkup_TagAtStart(org.eclipse.epp.mpc.tests.util.TextUtilTest)  Time elapsed: 0.001 sec
testStripHtmlMarkup_TagSpanningLines(org.eclipse.epp.mpc.tests.util.TextUtilTest)  Time elapsed: 0.001 sec
testEscapeAmpersandNull(org.eclipse.epp.mpc.tests.util.TextUtilTest)  Time elapsed: 0 sec
testCleanInformalHtmlMarkup_NaturalParaBetweenTags(org.eclipse.epp.mpc.tests.util.TextUtilTest)  Time elapsed: 0 sec
testStripHtmlMarkup_TagWithAttributes(org.eclipse.epp.mpc.tests.util.TextUtilTest)  Time elapsed: 0.001 sec
testStripHtmlMarkup_EmptyString(org.eclipse.epp.mpc.tests.util.TextUtilTest)  Time elapsed: 0 sec
testEscapeAmpersand(org.eclipse.epp.mpc.tests.util.TextUtilTest)  Time elapsed: 0 sec
testCleanInformalHtmlMarkup_EmptyString(org.eclipse.epp.mpc.tests.util.TextUtilTest)  Time elapsed: 0 sec
testStripHtmlMarkup_TagWithAttributesApos(org.eclipse.epp.mpc.tests.util.TextUtilTest)  Time elapsed: 0 sec
testEscapeAmpersandEmpty(org.eclipse.epp.mpc.tests.util.TextUtilTest)  Time elapsed: 0.001 sec
testStripHtmlMarkup_Null(org.eclipse.epp.mpc.tests.util.TextUtilTest)  Time elapsed: 0 sec
testStripHtmlMarkup_TagClosed(org.eclipse.epp.mpc.tests.util.TextUtilTest)  Time elapsed: 0 sec
testStripHtmlMarkup_TagAtEnd(org.eclipse.epp.mpc.tests.util.TextUtilTest)  Time elapsed: 0.001 sec
testCleanInformalHtmlMarkup_NaturalPara(org.eclipse.epp.mpc.tests.util.TextUtilTest)  Time elapsed: 0 sec
testHttpWrapperDefaultService(org.eclipse.epp.mpc.tests.util.TransportFactoryTest)  Time elapsed: 0.001 sec
testHttpClientTransportErrorHandling(org.eclipse.epp.mpc.tests.util.TransportFactoryTest)  Time elapsed: 0.49 sec
testECFContributorPropertiesUnchanged(org.eclipse.epp.mpc.tests.util.TransportFactoryTest)  Time elapsed: 0 sec
testDisableTransports(org.eclipse.epp.mpc.tests.util.TransportFactoryTest)  Time elapsed: 0.001 sec
testHttpClientCustomizer(org.eclipse.epp.mpc.tests.util.TransportFactoryTest)  Time elapsed: 0.377 sec
testHttpClientTransportFallback(org.eclipse.epp.mpc.tests.util.TransportFactoryTest)  Time elapsed: 0.037 sec
testHttpClientTransportWin32Support(org.eclipse.epp.mpc.tests.util.TransportFactoryTest) skipped
testRegisteredFactories(org.eclipse.epp.mpc.tests.util.TransportFactoryTest)  Time elapsed: 0.002 sec
testLegacyTansportFactoryInstance(org.eclipse.epp.mpc.tests.util.TransportFactoryTest)  Time elapsed: 0.001 sec
testStream(org.eclipse.epp.mpc.tests.util.TransportFactoryTest)  Time elapsed: 0.083 sec
testDisableHttpClientTransportsThroughECF(org.eclipse.epp.mpc.tests.util.TransportFactoryTest)  Time elapsed: 0 sec
testTransportFactoryInstance(org.eclipse.epp.mpc.tests.util.TransportFactoryTest)  Time elapsed: 0 sec
testLegacyServices(org.eclipse.epp.mpc.tests.util.TransportFactoryTest)  Time elapsed: 0.002 sec
testSampleCatalog(org.eclipse.epp.mpc.tests.service.CatalogServiceTest)  Time elapsed: 0.002 sec
listCatalogs(org.eclipse.epp.mpc.tests.service.CatalogServiceTest)  Time elapsed: 0.036 sec
search_bug448453(org.eclipse.epp.mpc.tests.service.DefaultMarketplaceServiceTest)  Time elapsed: 0.979 sec
favorites(org.eclipse.epp.mpc.tests.service.DefaultMarketplaceServiceTest) skipped
recent(org.eclipse.epp.mpc.tests.service.DefaultMarketplaceServiceTest)  Time elapsed: 1.497 sec
search(org.eclipse.epp.mpc.tests.service.DefaultMarketplaceServiceTest)  Time elapsed: 1.774 sec
popular(org.eclipse.epp.mpc.tests.service.DefaultMarketplaceServiceTest)  Time elapsed: 2.291 sec
featured(org.eclipse.epp.mpc.tests.service.DefaultMarketplaceServiceTest)  Time elapsed: 1.244 sec
news(org.eclipse.epp.mpc.tests.service.DefaultMarketplaceServiceTest)  Time elapsed: 0.545 sec
relatedEmpty(org.eclipse.epp.mpc.tests.service.DefaultMarketplaceServiceTest)  Time elapsed: 0.069 sec
related(org.eclipse.epp.mpc.tests.service.DefaultMarketplaceServiceTest)  Time elapsed: 0.009 sec
relatedNull(org.eclipse.epp.mpc.tests.service.DefaultMarketplaceServiceTest)  Time elapsed: 0.008 sec
listMarkets(org.eclipse.epp.mpc.tests.service.DefaultMarketplaceServiceTest)  Time elapsed: 0.005 sec
testGetMarket(org.eclipse.epp.mpc.tests.service.DefaultMarketplaceServiceTest)  Time elapsed: 0.008 sec
getNodes(org.eclipse.epp.mpc.tests.service.DefaultMarketplaceServiceTest)  Time elapsed: 1.929 sec
computeRelativeSearchUrl(org.eclipse.epp.mpc.tests.service.DefaultMarketplaceServiceTest)  Time elapsed: 0.001 sec
getCategory(org.eclipse.epp.mpc.tests.service.DefaultMarketplaceServiceTest)  Time elapsed: 1.616 sec
org.eclipse.epp.mpc.tests.service.SolutionCompatibilityFilterTest skipped
testSerialize(org.eclipse.epp.mpc.tests.ui.wizard.SelectionModelStateSerializerTest)  Time elapsed: 1.128 sec
testGetInstallationInfoWithState(org.eclipse.epp.mpc.tests.ui.wizard.MarketplaceUrlHandlerTest)  Time elapsed: 0.003 sec
testPotentialUrls(org.eclipse.epp.mpc.tests.ui.wizard.MarketplaceUrlHandlerTest)  Time elapsed: 0.001 sec
testGetInstallationInfo(org.eclipse.epp.mpc.tests.ui.wizard.MarketplaceUrlHandlerTest)  Time elapsed: 0.001 sec
testNodeUrls(org.eclipse.epp.mpc.tests.ui.wizard.MarketplaceUrlHandlerTest)  Time elapsed: 0.001 sec
testGetInstallationInfoNoValidUrl(org.eclipse.epp.mpc.tests.ui.wizard.MarketplaceUrlHandlerTest)  Time elapsed: 0.001 sec
testHttpsVariants(org.eclipse.epp.mpc.tests.ui.wizard.MarketplaceUrlHandlerTest)  Time elapsed: 0.001 sec
computeInstalled(org.eclipse.epp.mpc.tests.ui.catalog.MarketplaceInfoTest)  Time elapsed: 0.001 sec
addMapCatalogNode(org.eclipse.epp.mpc.tests.ui.catalog.MarketplaceInfoTest)  Time elapsed: 0.001 sec
computeInstalledCatalogNodeIdsNoMarketplaceInfo(org.eclipse.epp.mpc.tests.ui.catalog.MarketplaceInfoTest)  Time elapsed: 0.005 sec
computeInstalledCatalogNodeIds(org.eclipse.epp.mpc.tests.ui.catalog.MarketplaceInfoTest)  Time elapsed: 0 sec
computeInstalledLegacy(org.eclipse.epp.mpc.tests.ui.catalog.MarketplaceInfoTest)  Time elapsed: 0 sec
saveToUserHomeRegistryFileWithCurrentAndLegacy(org.eclipse.epp.mpc.tests.ui.catalog.MarketplaceInfoSerializationTest)  Time elapsed: 0.183 sec
testResolveNonFileConfigurationArea(org.eclipse.epp.mpc.tests.ui.catalog.MarketplaceInfoSerializationTest)  Time elapsed: 0.002 sec
loadFromUserHomeRegistryFile(org.eclipse.epp.mpc.tests.ui.catalog.MarketplaceInfoSerializationTest)  Time elapsed: 0.002 sec
loadNonExisting(org.eclipse.epp.mpc.tests.ui.catalog.MarketplaceInfoSerializationTest)  Time elapsed: 0.002 sec
loadFromBundleLocation(org.eclipse.epp.mpc.tests.ui.catalog.MarketplaceInfoSerializationTest)  Time elapsed: 0.002 sec
testResolveUrlEncodedConfigurationArea(org.eclipse.epp.mpc.tests.ui.catalog.MarketplaceInfoSerializationTest)  Time elapsed: 0.001 sec
loadGarbage(org.eclipse.epp.mpc.tests.ui.catalog.MarketplaceInfoSerializationTest)  Time elapsed: 0.007 sec
testResolveNullConfigurationArea(org.eclipse.epp.mpc.tests.ui.catalog.MarketplaceInfoSerializationTest)  Time elapsed: 0.002 sec
loadFromLegacyUserHomeRegistryFile(org.eclipse.epp.mpc.tests.ui.catalog.MarketplaceInfoSerializationTest)  Time elapsed: 0.003 sec
saveAndLoad(org.eclipse.epp.mpc.tests.ui.catalog.MarketplaceInfoSerializationTest)  Time elapsed: 0.01 sec
load(org.eclipse.epp.mpc.tests.ui.catalog.MarketplaceInfoSerializationTest)  Time elapsed: 0.006 sec
loadIncomplete(org.eclipse.epp.mpc.tests.ui.catalog.MarketplaceInfoSerializationTest)  Time elapsed: 0.006 sec
testResolveNullConfigurationAreaRegistryFile(org.eclipse.epp.mpc.tests.ui.catalog.MarketplaceInfoSerializationTest)  Time elapsed: 0.002 sec
testResolveConfigurationAreaRegistryFile(org.eclipse.epp.mpc.tests.ui.catalog.MarketplaceInfoSerializationTest)  Time elapsed: 0.002 sec
loadFromUserHomeRegistryFileWithLegacy(org.eclipse.epp.mpc.tests.ui.catalog.MarketplaceInfoSerializationTest)  Time elapsed: 0.002 sec
loadFromConfigurationArea(org.eclipse.epp.mpc.tests.ui.catalog.MarketplaceInfoSerializationTest)  Time elapsed: 0.003 sec
loadEmpty(org.eclipse.epp.mpc.tests.ui.catalog.MarketplaceInfoSerializationTest)  Time elapsed: 0.005 sec
saveToUserHomeRegistryFileWithLegacy(org.eclipse.epp.mpc.tests.ui.catalog.MarketplaceInfoSerializationTest)  Time elapsed: 0.004 sec
testResolveConfigurationArea(org.eclipse.epp.mpc.tests.ui.catalog.MarketplaceInfoSerializationTest)  Time elapsed: 0.002 sec
saveToUserHomeForReadOnlyConfigurationArea(org.eclipse.epp.mpc.tests.ui.catalog.MarketplaceInfoSerializationTest)  Time elapsed: 0.004 sec
testCatalogDescriptor(org.eclipse.epp.mpc.tests.ui.catalog.CatalogDescriptorTest)  Time elapsed: 0.001 sec
testCopyCtorNull(org.eclipse.epp.mpc.tests.ui.catalog.CatalogDescriptorTest)  Time elapsed: 0.001 sec
testFindCatalogDescriptorWithCommonPrefix(org.eclipse.epp.mpc.tests.ui.catalog.CatalogDescriptorTest)  Time elapsed: 0 sec
testFindCatalogDescriptorWithCommonPrefixDifferentProtocol1(org.eclipse.epp.mpc.tests.ui.catalog.CatalogDescriptorTest)  Time elapsed: 0 sec
testFindCatalogDescriptorWithCommonPrefixDifferentProtocol2(org.eclipse.epp.mpc.tests.ui.catalog.CatalogDescriptorTest)  Time elapsed: 0.001 sec
testFindCatalogDescriptorMatchingProtocol(org.eclipse.epp.mpc.tests.ui.catalog.CatalogDescriptorTest)  Time elapsed: 0 sec
testCatalogDescriptorURLString(org.eclipse.epp.mpc.tests.ui.catalog.CatalogDescriptorTest)  Time elapsed: 0 sec
testIgnoreCatalogDescriptorWithDedicatedHostingSuffix(org.eclipse.epp.mpc.tests.ui.catalog.CatalogDescriptorTest)  Time elapsed: 0.001 sec
testOpenNodes(org.eclipse.epp.mpc.tests.ui.wizard.MarketplaceClientServiceTest)  Time elapsed: 17.133 sec  <<< ERROR!
org.eclipse.swtbot.swt.finder.widgets.TimeoutException: Timeout after: 10000 ms.: The shell 'Eclipse Marketplace' did not activate
	at org.eclipse.epp.mpc.tests.ui.wizard.MarketplaceClientServiceTest.testOpenNodes(MarketplaceClientServiceTest.java:96)

testOpenProvisioning(org.eclipse.epp.mpc.tests.ui.wizard.MarketplaceClientServiceTest)  Time elapsed: 0.978 sec  <<< FAILURE!
java.lang.AssertionError: expected:<1> but was:<0>
	at org.eclipse.epp.mpc.tests.ui.wizard.MarketplaceClientServiceTest.testOpenProvisioning(MarketplaceClientServiceTest.java:164)

testOpenWithSelection(org.eclipse.epp.mpc.tests.ui.wizard.MarketplaceClientServiceTest)  Time elapsed: 16.259 sec  <<< ERROR!
org.eclipse.swtbot.swt.finder.widgets.TimeoutException: Timeout after: 10000 ms.: The shell 'Eclipse Marketplace' did not activate
	at org.eclipse.epp.mpc.tests.ui.wizard.MarketplaceClientServiceTest.testOpenWithSelection(MarketplaceClientServiceTest.java:129)

testOpenSearch(org.eclipse.epp.mpc.tests.ui.wizard.MarketplaceClientServiceTest)  Time elapsed: 16.631 sec  <<< ERROR!
org.eclipse.swtbot.swt.finder.widgets.TimeoutException: Timeout after: 10000 ms.: The shell 'Eclipse Marketplace' did not activate
	at org.eclipse.epp.mpc.tests.ui.wizard.MarketplaceClientServiceTest.testOpenSearch(MarketplaceClientServiceTest.java:108)

testOpenFavorites(org.eclipse.epp.mpc.tests.ui.wizard.MarketplaceClientServiceTest)  Time elapsed: 16.301 sec  <<< ERROR!
org.eclipse.swtbot.swt.finder.widgets.TimeoutException: Timeout after: 10000 ms.: The shell 'Eclipse Marketplace' did not activate
	at org.eclipse.epp.mpc.tests.ui.wizard.MarketplaceClientServiceTest.testOpenFavorites(MarketplaceClientServiceTest.java:173)

testClientServiceAvailable(org.eclipse.epp.mpc.tests.ui.wizard.MarketplaceClientServiceTest)  Time elapsed: 0.001 sec
testOpenSelected(org.eclipse.epp.mpc.tests.ui.wizard.MarketplaceClientServiceTest)  Time elapsed: 16.299 sec  <<< ERROR!
org.eclipse.swtbot.swt.finder.widgets.TimeoutException: Timeout after: 10000 ms.: The shell 'Eclipse Marketplace' did not activate
	at org.eclipse.epp.mpc.tests.ui.wizard.MarketplaceClientServiceTest.testOpenSelected(MarketplaceClientServiceTest.java:142)

testOpenDefault(org.eclipse.epp.mpc.tests.ui.wizard.MarketplaceClientServiceTest)  Time elapsed: 16.29 sec  <<< ERROR!
org.eclipse.swtbot.swt.finder.widgets.TimeoutException: Timeout after: 10000 ms.: The shell 'Eclipse Marketplace' did not activate
	at org.eclipse.epp.mpc.tests.ui.wizard.MarketplaceClientServiceTest.testOpenDefault(MarketplaceClientServiceTest.java:79)

testOpenInstalled(org.eclipse.epp.mpc.tests.ui.wizard.MarketplaceClientServiceTest)  Time elapsed: 16.274 sec  <<< ERROR!
org.eclipse.swtbot.swt.finder.widgets.TimeoutException: Timeout after: 10000 ms.: The shell 'Eclipse Marketplace' did not activate
	at org.eclipse.epp.mpc.tests.ui.wizard.MarketplaceClientServiceTest.testOpenInstalled(MarketplaceClientServiceTest.java:87)

testSearchTag(org.eclipse.epp.mpc.tests.ui.wizard.MarketplaceWizardTest)  Time elapsed: 16.283 sec  <<< ERROR!
org.eclipse.swtbot.swt.finder.widgets.TimeoutException: Timeout after: 10000 ms.: The shell 'Eclipse Marketplace' did not activate

testSelectMarket(org.eclipse.epp.mpc.tests.ui.wizard.MarketplaceWizardTest)  Time elapsed: 16.288 sec  <<< ERROR!
org.eclipse.swtbot.swt.finder.widgets.TimeoutException: Timeout after: 10000 ms.: The shell 'Eclipse Marketplace' did not activate

testShare(org.eclipse.epp.mpc.tests.ui.wizard.MarketplaceWizardTest)  Time elapsed: 16.312 sec  <<< ERROR!
org.eclipse.swtbot.swt.finder.widgets.TimeoutException: Timeout after: 10000 ms.: The shell 'Eclipse Marketplace' did not activate

testNews(org.eclipse.epp.mpc.tests.ui.wizard.MarketplaceWizardTest)  Time elapsed: 16.276 sec  <<< ERROR!
org.eclipse.swtbot.swt.finder.widgets.TimeoutException: Timeout after: 10000 ms.: The shell 'Eclipse Marketplace' did not activate

testPopular(org.eclipse.epp.mpc.tests.ui.wizard.MarketplaceWizardTest)  Time elapsed: 16.149 sec  <<< ERROR!
org.eclipse.swtbot.swt.finder.widgets.TimeoutException: Timeout after: 10000 ms.: The shell 'Eclipse Marketplace' did not activate

testNoninstallableLearnMore(org.eclipse.epp.mpc.tests.ui.wizard.MarketplaceWizardTest)  Time elapsed: 16.307 sec  <<< ERROR!
org.eclipse.swtbot.swt.finder.widgets.TimeoutException: Timeout after: 10000 ms.: The shell 'Eclipse Marketplace' did not activate

testSelectToInstall(org.eclipse.epp.mpc.tests.ui.wizard.MarketplaceWizardTest)  Time elapsed: 16.303 sec  <<< ERROR!
org.eclipse.swtbot.swt.finder.widgets.TimeoutException: Timeout after: 10000 ms.: The shell 'Eclipse Marketplace' did not activate

testSelectCategory(org.eclipse.epp.mpc.tests.ui.wizard.MarketplaceWizardTest)  Time elapsed: 16.357 sec  <<< ERROR!
org.eclipse.swtbot.swt.finder.widgets.TimeoutException: Timeout after: 10000 ms.: The shell 'Eclipse Marketplace' did not activate

testSearchMarketplaceUrl(org.eclipse.epp.mpc.tests.ui.wizard.MarketplaceWizardTest)  Time elapsed: 16.318 sec  <<< ERROR!
org.eclipse.swtbot.swt.finder.widgets.TimeoutException: Timeout after: 10000 ms.: The shell 'Eclipse Marketplace' did not activate

testMoreInfoLearnMore(org.eclipse.epp.mpc.tests.ui.wizard.MarketplaceWizardTest) skipped
testRecentBackToSearch(org.eclipse.epp.mpc.tests.ui.wizard.MarketplaceWizardTest)  Time elapsed: 16.347 sec  <<< ERROR!
org.eclipse.swtbot.swt.finder.widgets.TimeoutException: Timeout after: 10000 ms.: The shell 'Eclipse Marketplace' did not activate

testShowSelected(org.eclipse.epp.mpc.tests.ui.wizard.MarketplaceWizardTest)  Time elapsed: 16.342 sec  <<< ERROR!
org.eclipse.swtbot.swt.finder.widgets.TimeoutException: Timeout after: 10000 ms.: The shell 'Eclipse Marketplace' did not activate

testRecent(org.eclipse.epp.mpc.tests.ui.wizard.MarketplaceWizardTest)  Time elapsed: 16.333 sec  <<< ERROR!
org.eclipse.swtbot.swt.finder.widgets.TimeoutException: Timeout after: 10000 ms.: The shell 'Eclipse Marketplace' did not activate

testSearch(org.eclipse.epp.mpc.tests.ui.wizard.MarketplaceWizardTest)  Time elapsed: 16.38 sec  <<< ERROR!
org.eclipse.swtbot.swt.finder.widgets.TimeoutException: Timeout after: 10000 ms.: The shell 'Eclipse Marketplace' did not activate

testFavorite(org.eclipse.epp.mpc.tests.ui.wizard.MarketplaceWizardTest)  Time elapsed: 16.344 sec  <<< ERROR!
org.eclipse.swtbot.swt.finder.widgets.TimeoutException: Timeout after: 10000 ms.: The shell 'Eclipse Marketplace' did not activate


Results :

Failed tests: 
  MarketplaceClientServiceTest.testOpenProvisioning:164 expected:<1> but was:<0>
Tests in error: 
  MarketplaceClientServiceTest.testOpenDefault:79->AbstractMarketplaceWizardBotTest.initWizardBot:196 » Timeout
  MarketplaceClientServiceTest.testOpenFavorites:173->AbstractMarketplaceWizardBotTest.initWizardBot:196 » Timeout
  MarketplaceClientServiceTest.testOpenInstalled:87->AbstractMarketplaceWizardBotTest.initWizardBot:196 » Timeout
  MarketplaceClientServiceTest.testOpenNodes:96->AbstractMarketplaceWizardBotTest.initWizardBot:196 » Timeout
  MarketplaceClientServiceTest.testOpenSearch:108->AbstractMarketplaceWizardBotTest.initWizardBot:196 » Timeout
  MarketplaceClientServiceTest.testOpenSelected:142->AbstractMarketplaceWizardBotTest.initWizardBot:196 » Timeout
  MarketplaceClientServiceTest.testOpenWithSelection:129->AbstractMarketplaceWizardBotTest.initWizardBot:196 » Timeout
  MarketplaceWizardTest>AbstractMarketplaceWizardBotTest.setUp:166->AbstractMarketplaceWizardBotTest.initWizardBot:196 » Timeout
  MarketplaceWizardTest>AbstractMarketplaceWizardBotTest.setUp:166->AbstractMarketplaceWizardBotTest.initWizardBot:196 » Timeout
  MarketplaceWizardTest>AbstractMarketplaceWizardBotTest.setUp:166->AbstractMarketplaceWizardBotTest.initWizardBot:196 » Timeout
  MarketplaceWizardTest>AbstractMarketplaceWizardBotTest.setUp:166->AbstractMarketplaceWizardBotTest.initWizardBot:196 » Timeout
  MarketplaceWizardTest>AbstractMarketplaceWizardBotTest.setUp:166->AbstractMarketplaceWizardBotTest.initWizardBot:196 » Timeout
  MarketplaceWizardTest>AbstractMarketplaceWizardBotTest.setUp:166->AbstractMarketplaceWizardBotTest.initWizardBot:196 » Timeout
  MarketplaceWizardTest>AbstractMarketplaceWizardBotTest.setUp:166->AbstractMarketplaceWizardBotTest.initWizardBot:196 » Timeout
  MarketplaceWizardTest>AbstractMarketplaceWizardBotTest.setUp:166->AbstractMarketplaceWizardBotTest.initWizardBot:196 » Timeout
  MarketplaceWizardTest>AbstractMarketplaceWizardBotTest.setUp:166->AbstractMarketplaceWizardBotTest.initWizardBot:196 » Timeout
  MarketplaceWizardTest>AbstractMarketplaceWizardBotTest.setUp:166->AbstractMarketplaceWizardBotTest.initWizardBot:196 » Timeout
  MarketplaceWizardTest>AbstractMarketplaceWizardBotTest.setUp:166->AbstractMarketplaceWizardBotTest.initWizardBot:196 » Timeout
  MarketplaceWizardTest>AbstractMarketplaceWizardBotTest.setUp:166->AbstractMarketplaceWizardBotTest.initWizardBot:196 » Timeout
  MarketplaceWizardTest>AbstractMarketplaceWizardBotTest.setUp:166->AbstractMarketplaceWizardBotTest.initWizardBot:196 » Timeout
  MarketplaceWizardTest>AbstractMarketplaceWizardBotTest.setUp:166->AbstractMarketplaceWizardBotTest.initWizardBot:196 » Timeout

Tests run: 138, Failures: 1, Errors: 21, Skipped: 6

[ERROR] There are test failures.

Please refer to /jobs/genie.mpc/epp-mpc-maintenance/workspace/org.eclipse.epp.mpc.tests/target/surefire-reports for the individual test results.
[INFO] 
[INFO] >>> findbugs-maven-plugin:3.0.5:check (default) > :findbugs @ org.eclipse.epp.mpc.tests >>>
[INFO] 
[INFO] --- findbugs-maven-plugin:3.0.5:findbugs (findbugs) @ org.eclipse.epp.mpc.tests ---
[INFO] 
[INFO] <<< findbugs-maven-plugin:3.0.5:check (default) < :findbugs @ org.eclipse.epp.mpc.tests <<<
[INFO] 
[INFO] 
[INFO] --- findbugs-maven-plugin:3.0.5:check (default) @ org.eclipse.epp.mpc.tests ---
[INFO] 
[INFO] >>> maven-pmd-plugin:3.9.0:cpd-check (default) > :cpd @ org.eclipse.epp.mpc.tests >>>
[INFO] 
[INFO] --- maven-pmd-plugin:3.9.0:cpd (cpd) @ org.eclipse.epp.mpc.tests ---
[INFO] 
[INFO] <<< maven-pmd-plugin:3.9.0:cpd-check (default) < :cpd @ org.eclipse.epp.mpc.tests <<<
[INFO] 
[INFO] 
[INFO] --- maven-pmd-plugin:3.9.0:cpd-check (default) @ org.eclipse.epp.mpc.tests ---
[INFO] 
[INFO] -------< org.eclipse.epp.mpc:org.eclipse.epp.mpc.tests.catalog >--------
[INFO] Building org.eclipse.epp.mpc.tests.catalog 1.7.4-SNAPSHOT        [11/12]
[INFO] ---------------------------[ eclipse-plugin ]---------------------------
[INFO] 
[INFO] --- maven-clean-plugin:2.5:clean (default-clean) @ org.eclipse.epp.mpc.tests.catalog ---
[INFO] 
[INFO] --- tycho-packaging-plugin:1.2.0:build-qualifier (default-build-qualifier) @ org.eclipse.epp.mpc.tests.catalog ---
[INFO] The project's OSGi version is 1.7.4.v20190206-1730
[INFO] 
[INFO] --- tycho-packaging-plugin:1.2.0:validate-id (default-validate-id) @ org.eclipse.epp.mpc.tests.catalog ---
[INFO] 
[INFO] --- tycho-packaging-plugin:1.2.0:validate-version (default-validate-version) @ org.eclipse.epp.mpc.tests.catalog ---
[INFO] 
[INFO] --- maven-enforcer-plugin:3.0.0-M1:enforce (enforce-java) @ org.eclipse.epp.mpc.tests.catalog ---
[INFO] 
[INFO] --- maven-resources-plugin:3.0.2:resources (default-resources) @ org.eclipse.epp.mpc.tests.catalog ---
[INFO] Using 'ISO-8859-1' encoding to copy filtered resources.
[INFO] skip non existing resourceDirectory /jobs/genie.mpc/epp-mpc-maintenance/workspace/org.eclipse.epp.mpc.tests.catalog/src/main/resources
[INFO] 
[INFO] --- tycho-compiler-plugin:1.2.0:compile (default-compile) @ org.eclipse.epp.mpc.tests.catalog ---
[INFO] 
[INFO] --- maven-resources-plugin:3.0.2:testResources (default-testResources) @ org.eclipse.epp.mpc.tests.catalog ---
[INFO] Using 'ISO-8859-1' encoding to copy filtered resources.
[INFO] skip non existing resourceDirectory /jobs/genie.mpc/epp-mpc-maintenance/workspace/org.eclipse.epp.mpc.tests.catalog/src/test/resources
[INFO] 
[INFO] --- tycho-source-plugin:1.2.0:plugin-source (attach-source) @ org.eclipse.epp.mpc.tests.catalog ---
[INFO] 
[INFO] --- target-platform-configuration:1.2.0:target-platform (default-target-platform) @ org.eclipse.epp.mpc.tests.catalog ---
[INFO] 
[INFO] --- tycho-packaging-plugin:1.2.0:package-plugin (default-package-plugin) @ org.eclipse.epp.mpc.tests.catalog ---
[INFO] Building jar: /jobs/genie.mpc/epp-mpc-maintenance/workspace/org.eclipse.epp.mpc.tests.catalog/target/org.eclipse.epp.mpc.tests.catalog-1.7.4-SNAPSHOT.jar
[INFO] 
[INFO] --- tycho-p2-plugin:1.2.0:p2-metadata-default (default-p2-metadata-default) @ org.eclipse.epp.mpc.tests.catalog ---
[INFO] 
[INFO] >>> findbugs-maven-plugin:3.0.5:check (default) > :findbugs @ org.eclipse.epp.mpc.tests.catalog >>>
[INFO] 
[INFO] --- findbugs-maven-plugin:3.0.5:findbugs (findbugs) @ org.eclipse.epp.mpc.tests.catalog ---
[INFO] 
[INFO] <<< findbugs-maven-plugin:3.0.5:check (default) < :findbugs @ org.eclipse.epp.mpc.tests.catalog <<<
[INFO] 
[INFO] 
[INFO] --- findbugs-maven-plugin:3.0.5:check (default) @ org.eclipse.epp.mpc.tests.catalog ---
[INFO] 
[INFO] >>> maven-pmd-plugin:3.9.0:cpd-check (default) > :cpd @ org.eclipse.epp.mpc.tests.catalog >>>
[INFO] 
[INFO] --- maven-pmd-plugin:3.9.0:cpd (cpd) @ org.eclipse.epp.mpc.tests.catalog ---
[INFO] 
[INFO] <<< maven-pmd-plugin:3.9.0:cpd-check (default) < :cpd @ org.eclipse.epp.mpc.tests.catalog <<<
[INFO] 
[INFO] 
[INFO] --- maven-pmd-plugin:3.9.0:cpd-check (default) @ org.eclipse.epp.mpc.tests.catalog ---
[INFO] 
[INFO] ------------< org.eclipse.epp.mpc:org.eclipse.epp.mpc-root >------------
[INFO] Building org.eclipse.epp.mpc-root 1.7.4-SNAPSHOT                 [12/12]
[INFO] --------------------------------[ pom ]---------------------------------
[INFO] 
[INFO] --- maven-clean-plugin:2.5:clean (default-clean) @ org.eclipse.epp.mpc-root ---
[INFO] 
[INFO] --- maven-enforcer-plugin:3.0.0-M1:enforce (enforce-java) @ org.eclipse.epp.mpc-root ---
[INFO] ------------------------------------------------------------------------
[INFO] Reactor Summary:
[INFO] 
[INFO] org.eclipse.epp.mpc-target ......................... SUCCESS [  6.712 s]
[INFO] org.eclipse.epp.mpc.core ........................... SUCCESS [ 34.662 s]
[INFO] org.eclipse.epp.mpc.core.win32 ..................... SUCCESS [  0.403 s]
[INFO] org.eclipse.epp.mpc.dependencies ................... SUCCESS [  0.735 s]
[INFO] org.eclipse.epp.mpc.ui.css ......................... SUCCESS [  0.427 s]
[INFO] org.eclipse.epp.mpc.ui ............................. SUCCESS [  2.528 s]
[INFO] org.eclipse.epp.mpc.help.ui ........................ SUCCESS [  0.235 s]
[INFO] org.eclipse.epp.mpc ................................ SUCCESS [  0.138 s]
[INFO] EPP Marketplace Client ............................. SUCCESS [  9.902 s]
[INFO] org.eclipse.epp.mpc.tests .......................... SUCCESS [06:13 min]
[INFO] org.eclipse.epp.mpc.tests.catalog .................. SUCCESS [  0.118 s]
[INFO] org.eclipse.epp.mpc-root 1.7.4-SNAPSHOT ............ SUCCESS [  0.004 s]
[INFO] ------------------------------------------------------------------------
[INFO] BUILD SUCCESS
[INFO] ------------------------------------------------------------------------
[INFO] Total time: 11:29 min
[INFO] Finished at: 2019-02-08T05:44:55-05:00
[INFO] ------------------------------------------------------------------------
[WARNING] The requested profile "maintenance" could not be activated because it does not exist.
Terminating xvnc.
Sending e-mails to: reckord@yatta.de
Recording test results
Build step 'Publish JUnit test result report' changed build result to UNSTABLE
Archiving artifacts
Started calculate disk usage of build
Finished Calculation of disk usage of build in 0 seconds
Started calculate disk usage of workspace
Finished Calculation of disk usage of workspace in 0 seconds
Finished: UNSTABLE