FailedConsole Output

01:42:38 Started by timer
01:42:38 Running as SYSTEM
01:42:39 Agent default-agent-zw120 is provisioned from template Kubernetes Pod Template
01:42:39 ---
01:42:39 apiVersion: "v1"
01:42:39 kind: "Pod"
01:42:39 metadata:
01:42:39   annotations: {}
01:42:39   labels:
01:42:39     jenkins: "slave"
01:42:39   name: "default-agent-zw120"
01:42:39 spec:
01:42:39   containers:
01:42:39   - env:
01:42:39     - name: "MAVEN_OPTS"
01:42:39       value: "-Dorg.slf4j.simpleLogger.log.org.apache.maven.cli.transfer.Slf4jMavenTransferListener=warn"
01:42:39     - name: "JENKINS_SECRET"
01:42:39       value: "********"
01:42:39     - name: "JENKINS_TUNNEL"
01:42:39       value: "jenkins-discovery.microprofile.svc.cluster.local:50000"
01:42:39     - name: "JENKINS_AGENT_NAME"
01:42:39       value: "default-agent-zw120"
01:42:39     - name: "MAVEN_CONFIG"
01:42:39       value: "-B -e"
01:42:39     - name: "JENKINS_NAME"
01:42:39       value: "default-agent-zw120"
01:42:39     - name: "JENKINS_AGENT_WORKDIR"
01:42:39       value: "/home/jenkins/agent"
01:42:39     - name: "JENKINS_URL"
01:42:39       value: "http://jenkins-ui.microprofile.svc.cluster.local/microprofile/"
01:42:39     - name: "HOME"
01:42:39       value: "/home/jenkins"
01:42:39     image: "eclipsecbijenkins/jenkins-agent:3.35@sha256:5d06ebec6e9dffc44fb41009a51d085a83944a23f651416531b960143d186340"
01:42:39     imagePullPolicy: "IfNotPresent"
01:42:39     name: "jnlp"
01:42:39     resources:
01:42:39       limits:
01:42:39         memory: "4096Mi"
01:42:39         cpu: "2000m"
01:42:39       requests:
01:42:39         memory: "4096Mi"
01:42:39         cpu: "1000m"
01:42:39     securityContext:
01:42:39       privileged: false
01:42:39     tty: true
01:42:39     volumeMounts:
01:42:39     - mountPath: "/home/jenkins/.m2/toolchains.xml"
01:42:39       name: "toolchains-xml"
01:42:39       readOnly: true
01:42:39       subPath: "toolchains.xml"
01:42:39     - mountPath: "/opt/tools"
01:42:39       name: "volume-0"
01:42:39       readOnly: false
01:42:39     - mountPath: "/home/jenkins"
01:42:39       name: "volume-2"
01:42:39       readOnly: false
01:42:39     - mountPath: "/home/jenkins/.m2/repository"
01:42:39       name: "volume-3"
01:42:39       readOnly: false
01:42:39     - mountPath: "/home/jenkins/.m2/settings-security.xml"
01:42:39       name: "settings-security-xml"
01:42:39       readOnly: true
01:42:39       subPath: "settings-security.xml"
01:42:39     - mountPath: "/home/jenkins/.m2/settings.xml"
01:42:39       name: "settings-xml"
01:42:39       readOnly: true
01:42:39       subPath: "settings.xml"
01:42:39     - mountPath: "/home/jenkins/.ssh"
01:42:39       name: "volume-1"
01:42:39       readOnly: false
01:42:39     - mountPath: "/home/jenkins/agent"
01:42:39       name: "workspace-volume"
01:42:39       readOnly: false
01:42:39     workingDir: "/home/jenkins/agent"
01:42:39   nodeSelector: {}
01:42:39   restartPolicy: "Never"
01:42:39   volumes:
01:42:39   - name: "settings-security-xml"
01:42:39     secret:
01:42:39       items:
01:42:39       - key: "settings-security.xml"
01:42:39         path: "settings-security.xml"
01:42:39       secretName: "m2-secret-dir"
01:42:39   - name: "volume-0"
01:42:39     persistentVolumeClaim:
01:42:39       claimName: "tools-claim-jiro-microprofile"
01:42:39       readOnly: true
01:42:39   - configMap:
01:42:39       items:
01:42:39       - key: "toolchains.xml"
01:42:39         path: "toolchains.xml"
01:42:39       name: "m2-dir"
01:42:39     name: "toolchains-xml"
01:42:39   - emptyDir:
01:42:39       medium: ""
01:42:39     name: "volume-2"
01:42:39   - configMap:
01:42:39       name: "known-hosts"
01:42:39     name: "volume-1"
01:42:39   - name: "settings-xml"
01:42:39     secret:
01:42:39       items:
01:42:39       - key: "settings.xml"
01:42:39         path: "settings.xml"
01:42:39       secretName: "m2-secret-dir"
01:42:39   - emptyDir:
01:42:39       medium: ""
01:42:39     name: "workspace-volume"
01:42:39   - emptyDir:
01:42:39       medium: ""
01:42:39     name: "volume-3"
01:42:39 
01:42:39 Building remotely on default-agent-zw120 in workspace /home/jenkins/agent/workspace/JWT-Auth-maven-snapshots
01:42:39 [WS-CLEANUP] Deleting project workspace...
01:42:39 [WS-CLEANUP] Deferred wipeout is used...
01:42:44 No credentials specified
01:42:44 Cloning the remote Git repository
01:42:44 Cloning repository https://github.com/eclipse/microprofile-jwt-auth.git
01:42:44  > git init /home/jenkins/agent/workspace/JWT-Auth-maven-snapshots # timeout=10
01:42:44 Fetching upstream changes from https://github.com/eclipse/microprofile-jwt-auth.git
01:42:44  > git --version # timeout=10
01:42:44  > git fetch --tags --force --progress -- https://github.com/eclipse/microprofile-jwt-auth.git +refs/heads/*:refs/remotes/origin/*
01:42:45  > git config remote.origin.url https://github.com/eclipse/microprofile-jwt-auth.git # timeout=10
01:42:45  > git config --add remote.origin.fetch +refs/heads/*:refs/remotes/origin/* # timeout=10
01:42:45  > git config remote.origin.url https://github.com/eclipse/microprofile-jwt-auth.git # timeout=10
01:42:45 Fetching upstream changes from https://github.com/eclipse/microprofile-jwt-auth.git
01:42:45  > git fetch --tags --force --progress -- https://github.com/eclipse/microprofile-jwt-auth.git +refs/heads/*:refs/remotes/origin/*
01:42:45  > git rev-parse refs/remotes/origin/master^{commit} # timeout=10
01:42:45  > git rev-parse refs/remotes/origin/origin/master^{commit} # timeout=10
01:42:45 Checking out Revision 4dd48a77b8d9450557ab2a3a602d2275c85d12c3 (refs/remotes/origin/master)
01:42:45  > git config core.sparsecheckout # timeout=10
01:42:45  > git checkout -f 4dd48a77b8d9450557ab2a3a602d2275c85d12c3
01:42:46 Commit message: "Merge pull request #155 from andreas-eberle/add-get-claims-with-claims"
01:42:46  > git rev-list --no-walk 4dd48a77b8d9450557ab2a3a602d2275c85d12c3 # timeout=10
01:42:48 Parsing POMs
01:42:57 Downloaded artifact https://repo.eclipse.org/content/repositories/maven_central/org/jboss/arquillian/arquillian-bom/1.1.13.Final/arquillian-bom-1.1.13.Final.pom
01:42:57 Downloaded artifact https://repo.eclipse.org/content/repositories/maven_central/org/jboss/shrinkwrap/shrinkwrap-bom/1.2.6/shrinkwrap-bom-1.2.6.pom
01:42:57 Downloaded artifact https://repo.eclipse.org/content/repositories/maven_central/org/jboss/shrinkwrap/resolver/shrinkwrap-resolver-bom/2.2.4/shrinkwrap-resolver-bom-2.2.4.pom
01:42:57 Downloaded artifact https://repo.eclipse.org/content/repositories/maven_central/org/jboss/shrinkwrap/descriptors/shrinkwrap-descriptors-bom/2.0.0-alpha-10/shrinkwrap-descriptors-bom-2.0.0-alpha-10.pom
01:42:58 Modules changed, recalculating dependency graph
01:42:58 Established TCP socket on 37420
01:42:58 Copied maven35-agent.jar
01:42:58 Copied maven35-interceptor.jar
01:42:58 Copied maven3-interceptor-commons.jar
01:42:58 [JWT-Auth-maven-snapshots] $ /opt/tools/java/oracle/jdk-8/latest/bin/java -Dorg.slf4j.simpleLogger.log.org.apache.maven.cli.transfer.Slf4jMavenTransferListener=warn -cp /home/jenkins/agent/maven35-agent.jar:/opt/tools/apache-maven/latest/boot/plexus-classworlds-2.6.0.jar:/opt/tools/apache-maven/latest/conf/logging jenkins.maven3.agent.Maven35Main /opt/tools/apache-maven/latest /usr/share/jenkins/agent.jar /home/jenkins/agent/maven35-interceptor.jar /home/jenkins/agent/maven3-interceptor-commons.jar 37420
01:42:58 Picked up JAVA_TOOL_OPTIONS: -XX:+IgnoreUnrecognizedVMOptions -XX:+UseContainerSupport -XX:+UnlockExperimentalVMOptions -XX:+UseCGroupMemoryLimitForHeap
01:42:58 Picked up _JAVA_OPTIONS: -XX:MaxRAMPercentage=64.0
01:43:00 <===[JENKINS REMOTING CAPACITY]===>channel started
01:43:05 Executing Maven:  -B -f /home/jenkins/agent/workspace/JWT-Auth-maven-snapshots/pom.xml -pl !spec -Peclipse-jarsigner install deploy -DaltDeploymentRepository=repo.eclipse.org::default::https://repo.eclipse.org/content/repositories/microprofile-snapshots/
01:43:07 [INFO] Scanning for projects...
01:43:07 [INFO] ------------------------------------------------------------------------
01:43:07 [INFO] Reactor Build Order:
01:43:07 [INFO] 
01:43:07 [INFO] MicroProfile JWT Auth Parent                                       [pom]
01:43:07 [INFO] MicroProfile JWT Auth API                                          [jar]
01:43:07 [INFO] MicroProfile JWT Auth TCK Harness                                  [jar]
01:43:07 [INFO] 
01:43:07 [INFO] -----< org.eclipse.microprofile.jwt:microprofile-jwt-auth-parent >------
01:43:07 [INFO] Building MicroProfile JWT Auth Parent 1.2-SNAPSHOT                 [1/3]
01:43:07 [INFO] --------------------------------[ pom ]---------------------------------
01:43:09 [INFO] 
01:43:09 [INFO] --- apache-rat-plugin:0.12:check (rat-check) @ microprofile-jwt-auth-parent ---
01:43:17 [INFO] Enabled default license matchers.
01:43:17 [INFO] Will parse SCM ignores for exclusions...
01:43:17 [INFO] Parsing exclusions from /home/jenkins/agent/workspace/JWT-Auth-maven-snapshots/.gitignore
01:43:17 [INFO] Finished adding exclusions from SCM ignore files.
01:43:17 [INFO] 75 implicit excludes (use -debug for more details).
01:43:17 [INFO] Exclude: .travis.yml.*
01:43:17 [INFO] Exclude: bnd.bnd
01:43:17 [INFO] Exclude: **/*.json
01:43:17 [INFO] Exclude: **/*.jwk
01:43:17 [INFO] Exclude: **/META-INF/services/*
01:43:17 [INFO] Exclude: *.log
01:43:17 [INFO] Exclude: .checkstyle
01:43:17 [INFO] Exclude: .factorypath
01:43:17 [INFO] Exclude: .editorconfig
01:43:17 [INFO] Exclude: sandbox/**
01:43:17 [INFO] 7 resources included (use -debug for more details)
01:43:17 [INFO] Rat check: Summary over all files. Unapproved: 0, unknown: 0, generated: 0, approved: 5 licenses.
01:43:17 [INFO] 
01:43:17 [INFO] --- maven-checkstyle-plugin:2.17:check (verify-style) @ microprofile-jwt-auth-parent ---
01:43:25 [INFO] Starting audit...
01:43:25 Audit done.
01:43:25 [INFO] 
01:43:25 [INFO] --- maven-install-plugin:2.4:install (default-install) @ microprofile-jwt-auth-parent ---
01:43:26 [INFO] Installing /home/jenkins/agent/workspace/JWT-Auth-maven-snapshots/pom.xml to /home/jenkins/.m2/repository/org/eclipse/microprofile/jwt/microprofile-jwt-auth-parent/1.2-SNAPSHOT/microprofile-jwt-auth-parent-1.2-SNAPSHOT.pom
01:43:26 [INFO] 
01:43:26 [INFO] --- apache-rat-plugin:0.12:check (rat-check) @ microprofile-jwt-auth-parent ---
01:43:26 [INFO] Enabled default license matchers.
01:43:26 [INFO] Will parse SCM ignores for exclusions...
01:43:26 [INFO] Parsing exclusions from /home/jenkins/agent/workspace/JWT-Auth-maven-snapshots/.gitignore
01:43:26 [INFO] Finished adding exclusions from SCM ignore files.
01:43:26 [INFO] 75 implicit excludes (use -debug for more details).
01:43:26 [INFO] Exclude: .travis.yml.*
01:43:26 [INFO] Exclude: bnd.bnd
01:43:26 [INFO] Exclude: **/*.json
01:43:26 [INFO] Exclude: **/*.jwk
01:43:26 [INFO] Exclude: **/META-INF/services/*
01:43:26 [INFO] Exclude: *.log
01:43:26 [INFO] Exclude: .checkstyle
01:43:26 [INFO] Exclude: .factorypath
01:43:26 [INFO] Exclude: .editorconfig
01:43:26 [INFO] Exclude: sandbox/**
01:43:26 [INFO] 7 resources included (use -debug for more details)
01:43:26 [INFO] Rat check: Summary over all files. Unapproved: 0, unknown: 0, generated: 0, approved: 5 licenses.
01:43:27 [INFO] 
01:43:27 [INFO] --- maven-checkstyle-plugin:2.17:check (verify-style) @ microprofile-jwt-auth-parent ---
01:43:27 [INFO] Starting audit...
01:43:27 Audit done.
01:43:27 [INFO] 
01:43:27 [INFO] --- maven-install-plugin:2.4:install (default-install) @ microprofile-jwt-auth-parent ---
01:43:27 [INFO] Installing /home/jenkins/agent/workspace/JWT-Auth-maven-snapshots/pom.xml to /home/jenkins/.m2/repository/org/eclipse/microprofile/jwt/microprofile-jwt-auth-parent/1.2-SNAPSHOT/microprofile-jwt-auth-parent-1.2-SNAPSHOT.pom
01:43:27 [INFO] 
01:43:27 [INFO] --- maven-deploy-plugin:2.7:deploy (default-deploy) @ microprofile-jwt-auth-parent ---
01:43:27 [INFO] Using alternate deployment repository repo.eclipse.org::default::https://repo.eclipse.org/content/repositories/microprofile-snapshots/
01:43:29 [INFO] 
01:43:29 [INFO] -------< org.eclipse.microprofile.jwt:microprofile-jwt-auth-api >-------
01:43:29 [INFO] Building MicroProfile JWT Auth API 1.2-SNAPSHOT                    [2/3]
01:43:29 [INFO] --------------------------------[ jar ]---------------------------------
01:43:32 [INFO] 
01:43:32 [INFO] --- apache-rat-plugin:0.12:check (rat-check) @ microprofile-jwt-auth-api ---
01:43:32 [INFO] Enabled default license matchers.
01:43:32 [INFO] Will parse SCM ignores for exclusions...
01:43:32 [INFO] Finished adding exclusions from SCM ignore files.
01:43:32 [INFO] 61 implicit excludes (use -debug for more details).
01:43:32 [INFO] Exclude: .travis.yml.*
01:43:32 [INFO] Exclude: bnd.bnd
01:43:32 [INFO] Exclude: **/*.json
01:43:32 [INFO] Exclude: **/*.jwk
01:43:32 [INFO] Exclude: **/META-INF/services/*
01:43:32 [INFO] Exclude: *.log
01:43:32 [INFO] Exclude: .checkstyle
01:43:32 [INFO] Exclude: .factorypath
01:43:32 [INFO] Exclude: .editorconfig
01:43:32 [INFO] Exclude: sandbox/**
01:43:32 [INFO] 10 resources included (use -debug for more details)
01:43:32 [INFO] Rat check: Summary over all files. Unapproved: 0, unknown: 0, generated: 0, approved: 10 licenses.
01:43:32 [INFO] 
01:43:32 [INFO] --- maven-resources-plugin:2.6:resources (default-resources) @ microprofile-jwt-auth-api ---
01:43:33 [INFO] Using 'UTF-8' encoding to copy filtered resources.
01:43:33 [INFO] skip non existing resourceDirectory /home/jenkins/agent/workspace/JWT-Auth-maven-snapshots/api/src/main/resources
01:43:33 [INFO] 
01:43:33 [INFO] --- maven-compiler-plugin:3.1:compile (default-compile) @ microprofile-jwt-auth-api ---
01:43:36 [INFO] Changes detected - recompiling the module!
01:43:36 [INFO] Compiling 9 source files to /home/jenkins/agent/workspace/JWT-Auth-maven-snapshots/api/target/classes
01:43:37 [INFO] 
01:43:37 [INFO] --- maven-checkstyle-plugin:2.17:check (verify-style) @ microprofile-jwt-auth-api ---
01:43:37 [INFO] Starting audit...
01:43:37 Audit done.
01:43:37 [INFO] 
01:43:37 [INFO] --- bnd-maven-plugin:3.4.0:bnd-process (default) @ microprofile-jwt-auth-api ---
01:43:38 [INFO] 
01:43:38 [INFO] --- maven-resources-plugin:2.6:testResources (default-testResources) @ microprofile-jwt-auth-api ---
01:43:38 [INFO] Using 'UTF-8' encoding to copy filtered resources.
01:43:38 [INFO] skip non existing resourceDirectory /home/jenkins/agent/workspace/JWT-Auth-maven-snapshots/api/src/test/resources
01:43:38 [INFO] 
01:43:38 [INFO] --- maven-compiler-plugin:3.1:testCompile (default-testCompile) @ microprofile-jwt-auth-api ---
01:43:38 [INFO] No sources to compile
01:43:38 [INFO] 
01:43:38 [INFO] --- maven-surefire-plugin:2.12.4:test (default-test) @ microprofile-jwt-auth-api ---
01:43:39 [INFO] No tests to run.
01:43:39 [JENKINS] Recording test results
01:43:39 [INFO] 
01:43:39 [INFO] --- maven-jar-plugin:3.0.2:jar (default-jar) @ microprofile-jwt-auth-api ---
01:43:42 [INFO] Building jar: /home/jenkins/agent/workspace/JWT-Auth-maven-snapshots/api/target/microprofile-jwt-auth-api-1.2-SNAPSHOT.jar
01:43:42 [INFO] 
01:43:42 [INFO] --- maven-javadoc-plugin:2.10.4:jar (attach-javadocs) @ microprofile-jwt-auth-api ---
01:43:46 [INFO] 
01:43:46 Loading source files for package org.eclipse.microprofile.auth...
01:43:46 Loading source files for package org.eclipse.microprofile.jwt...
01:43:46 Loading source files for package org.eclipse.microprofile.jwt.config...
01:43:46 Constructing Javadoc information...
01:43:46 Standard Doclet version 1.8.0_202
01:43:46 Building tree for all the packages and classes...
01:43:46 Generating /home/jenkins/agent/workspace/JWT-Auth-maven-snapshots/api/target/apidocs/org/eclipse/microprofile/auth/LoginConfig.html...
01:43:46 Generating /home/jenkins/agent/workspace/JWT-Auth-maven-snapshots/api/target/apidocs/org/eclipse/microprofile/jwt/Claim.html...
01:43:46 Generating /home/jenkins/agent/workspace/JWT-Auth-maven-snapshots/api/target/apidocs/org/eclipse/microprofile/jwt/ClaimLiteral.html...
01:43:46 Generating /home/jenkins/agent/workspace/JWT-Auth-maven-snapshots/api/target/apidocs/org/eclipse/microprofile/jwt/Claims.html...
01:43:46 Generating /home/jenkins/agent/workspace/JWT-Auth-maven-snapshots/api/target/apidocs/org/eclipse/microprofile/jwt/ClaimValue.html...
01:43:46 Generating /home/jenkins/agent/workspace/JWT-Auth-maven-snapshots/api/target/apidocs/org/eclipse/microprofile/jwt/JsonWebToken.html...
01:43:46 Generating /home/jenkins/agent/workspace/JWT-Auth-maven-snapshots/api/target/apidocs/org/eclipse/microprofile/jwt/config/Names.html...
01:43:46 Generating /home/jenkins/agent/workspace/JWT-Auth-maven-snapshots/api/target/apidocs/overview-frame.html...
01:43:46 Generating /home/jenkins/agent/workspace/JWT-Auth-maven-snapshots/api/target/apidocs/org/eclipse/microprofile/auth/package-frame.html...
01:43:46 Generating /home/jenkins/agent/workspace/JWT-Auth-maven-snapshots/api/target/apidocs/org/eclipse/microprofile/auth/package-summary.html...
01:43:46 Generating /home/jenkins/agent/workspace/JWT-Auth-maven-snapshots/api/target/apidocs/org/eclipse/microprofile/auth/package-tree.html...
01:43:46 Generating /home/jenkins/agent/workspace/JWT-Auth-maven-snapshots/api/target/apidocs/org/eclipse/microprofile/jwt/package-frame.html...
01:43:46 Generating /home/jenkins/agent/workspace/JWT-Auth-maven-snapshots/api/target/apidocs/org/eclipse/microprofile/jwt/package-summary.html...
01:43:46 Generating /home/jenkins/agent/workspace/JWT-Auth-maven-snapshots/api/target/apidocs/org/eclipse/microprofile/jwt/package-tree.html...
01:43:46 Generating /home/jenkins/agent/workspace/JWT-Auth-maven-snapshots/api/target/apidocs/org/eclipse/microprofile/jwt/config/package-frame.html...
01:43:46 Generating /home/jenkins/agent/workspace/JWT-Auth-maven-snapshots/api/target/apidocs/org/eclipse/microprofile/jwt/config/package-summary.html...
01:43:46 Generating /home/jenkins/agent/workspace/JWT-Auth-maven-snapshots/api/target/apidocs/org/eclipse/microprofile/jwt/config/package-tree.html...
01:43:46 Generating /home/jenkins/agent/workspace/JWT-Auth-maven-snapshots/api/target/apidocs/constant-values.html...
01:43:46 Generating /home/jenkins/agent/workspace/JWT-Auth-maven-snapshots/api/target/apidocs/serialized-form.html...
01:43:46 Generating /home/jenkins/agent/workspace/JWT-Auth-maven-snapshots/api/target/apidocs/org/eclipse/microprofile/auth/class-use/LoginConfig.html...
01:43:46 Generating /home/jenkins/agent/workspace/JWT-Auth-maven-snapshots/api/target/apidocs/org/eclipse/microprofile/jwt/class-use/JsonWebToken.html...
01:43:46 Generating /home/jenkins/agent/workspace/JWT-Auth-maven-snapshots/api/target/apidocs/org/eclipse/microprofile/jwt/class-use/Claims.html...
01:43:46 Generating /home/jenkins/agent/workspace/JWT-Auth-maven-snapshots/api/target/apidocs/org/eclipse/microprofile/jwt/class-use/ClaimValue.html...
01:43:46 Generating /home/jenkins/agent/workspace/JWT-Auth-maven-snapshots/api/target/apidocs/org/eclipse/microprofile/jwt/class-use/ClaimLiteral.html...
01:43:46 Generating /home/jenkins/agent/workspace/JWT-Auth-maven-snapshots/api/target/apidocs/org/eclipse/microprofile/jwt/class-use/Claim.html...
01:43:46 Generating /home/jenkins/agent/workspace/JWT-Auth-maven-snapshots/api/target/apidocs/org/eclipse/microprofile/jwt/config/class-use/Names.html...
01:43:46 Generating /home/jenkins/agent/workspace/JWT-Auth-maven-snapshots/api/target/apidocs/org/eclipse/microprofile/auth/package-use.html...
01:43:46 Generating /home/jenkins/agent/workspace/JWT-Auth-maven-snapshots/api/target/apidocs/org/eclipse/microprofile/jwt/package-use.html...
01:43:46 Generating /home/jenkins/agent/workspace/JWT-Auth-maven-snapshots/api/target/apidocs/org/eclipse/microprofile/jwt/config/package-use.html...
01:43:46 Building index for all the packages and classes...
01:43:46 Generating /home/jenkins/agent/workspace/JWT-Auth-maven-snapshots/api/target/apidocs/overview-tree.html...
01:43:46 Generating /home/jenkins/agent/workspace/JWT-Auth-maven-snapshots/api/target/apidocs/index-all.html...
01:43:46 Generating /home/jenkins/agent/workspace/JWT-Auth-maven-snapshots/api/target/apidocs/deprecated-list.html...
01:43:46 Building index for all classes...
01:43:46 Generating /home/jenkins/agent/workspace/JWT-Auth-maven-snapshots/api/target/apidocs/allclasses-frame.html...
01:43:46 Generating /home/jenkins/agent/workspace/JWT-Auth-maven-snapshots/api/target/apidocs/allclasses-noframe.html...
01:43:46 Generating /home/jenkins/agent/workspace/JWT-Auth-maven-snapshots/api/target/apidocs/index.html...
01:43:46 Generating /home/jenkins/agent/workspace/JWT-Auth-maven-snapshots/api/target/apidocs/overview-summary.html...
01:43:46 Generating /home/jenkins/agent/workspace/JWT-Auth-maven-snapshots/api/target/apidocs/help-doc.html...
01:43:46 [WARNING] Javadoc Warnings
01:43:46 [WARNING] Picked up JAVA_TOOL_OPTIONS: -XX:+IgnoreUnrecognizedVMOptions -XX:+UseContainerSupport -XX:+UnlockExperimentalVMOptions -XX:+UseCGroupMemoryLimitForHeap
01:43:46 [WARNING] Picked up _JAVA_OPTIONS: -XX:MaxRAMPercentage=64.0
01:43:47 [INFO] Building jar: /home/jenkins/agent/workspace/JWT-Auth-maven-snapshots/api/target/microprofile-jwt-auth-api-1.2-SNAPSHOT-javadoc.jar
01:43:47 [INFO] 
01:43:47 [INFO] >>> maven-source-plugin:3.0.1:jar (attach-sources) > generate-sources @ microprofile-jwt-auth-api >>>
01:43:47 [INFO] 
01:43:47 [INFO] --- apache-rat-plugin:0.12:check (rat-check) @ microprofile-jwt-auth-api ---
01:43:47 [INFO] Enabled default license matchers.
01:43:47 [INFO] Will parse SCM ignores for exclusions...
01:43:47 [INFO] Finished adding exclusions from SCM ignore files.
01:43:47 [INFO] 61 implicit excludes (use -debug for more details).
01:43:47 [INFO] Exclude: .travis.yml.*
01:43:47 [INFO] Exclude: bnd.bnd
01:43:47 [INFO] Exclude: **/*.json
01:43:47 [INFO] Exclude: **/*.jwk
01:43:47 [INFO] Exclude: **/META-INF/services/*
01:43:47 [INFO] Exclude: *.log
01:43:47 [INFO] Exclude: .checkstyle
01:43:47 [INFO] Exclude: .factorypath
01:43:47 [INFO] Exclude: .editorconfig
01:43:47 [INFO] Exclude: sandbox/**
01:43:47 [INFO] 10 resources included (use -debug for more details)
01:43:47 [INFO] Rat check: Summary over all files. Unapproved: 0, unknown: 0, generated: 0, approved: 10 licenses.
01:43:47 [WARNING] Failed to getClass for org.apache.maven.plugins.source.SourceJarMojo
01:43:47 [INFO] 
01:43:47 [INFO] <<< maven-source-plugin:3.0.1:jar (attach-sources) < generate-sources @ microprofile-jwt-auth-api <<<
01:43:47 [INFO] 
01:43:47 [INFO] 
01:43:47 [INFO] --- maven-source-plugin:3.0.1:jar (attach-sources) @ microprofile-jwt-auth-api ---
01:43:47 [INFO] Building jar: /home/jenkins/agent/workspace/JWT-Auth-maven-snapshots/api/target/microprofile-jwt-auth-api-1.2-SNAPSHOT-sources.jar
01:43:47 [INFO] 
01:43:47 [INFO] --- maven-jar-plugin:3.0.2:test-jar (default) @ microprofile-jwt-auth-api ---
01:43:47 [WARNING] JAR will be empty - no content was marked for inclusion!
01:43:47 [INFO] Building jar: /home/jenkins/agent/workspace/JWT-Auth-maven-snapshots/api/target/microprofile-jwt-auth-api-1.2-SNAPSHOT-tests.jar
01:43:47 [INFO] 
01:43:47 [INFO] --- eclipse-jarsigner-plugin:1.1.4:sign (default) @ microprofile-jwt-auth-api ---
01:43:52 [INFO] Signing jar: /home/jenkins/agent/workspace/JWT-Auth-maven-snapshots/api/target/microprofile-jwt-auth-api-1.2-SNAPSHOT.jar
01:43:53 [INFO] Signing jar: /home/jenkins/agent/workspace/JWT-Auth-maven-snapshots/api/target/microprofile-jwt-auth-api-1.2-SNAPSHOT-javadoc.jar
01:43:55 [INFO] Signing jar: /home/jenkins/agent/workspace/JWT-Auth-maven-snapshots/api/target/microprofile-jwt-auth-api-1.2-SNAPSHOT-sources.jar
01:43:56 [INFO] Signing jar: /home/jenkins/agent/workspace/JWT-Auth-maven-snapshots/api/target/microprofile-jwt-auth-api-1.2-SNAPSHOT-tests.jar
01:43:57 [INFO] 
01:43:57 [INFO] --- bnd-baseline-maven-plugin:3.5.0:baseline (baseline) @ microprofile-jwt-auth-api ---
01:43:57 [INFO] Automatically determining the baseline version for org.eclipse.microprofile.jwt:microprofile-jwt-auth-api:jar:1.2-SNAPSHOT using repositories [ossrh (https://oss.sonatype.org/content/repositories/snapshots/, default, releases+snapshots), eclipse.maven.central.mirror (https://repo.eclipse.org/content/repositories/maven_central/, default, releases)]
01:43:57 [INFO] The baseline version was found to be 1.1.1
01:43:58 [ERROR] Baseline mismatch for package org.eclipse.microprofile.jwt, MINOR change. Current is 1.0.0, repo is 1.0.0, suggest 1.1.0 or -
01:43:59 [INFO] ------------------------------------------------------------------------
01:43:59 [INFO] Reactor Summary for MicroProfile JWT Auth Parent 1.2-SNAPSHOT:
01:43:59 [INFO] 
01:43:59 [INFO] MicroProfile JWT Auth Parent ....................... SUCCESS [ 20.319 s]
01:43:59 [INFO] MicroProfile JWT Auth API .......................... FAILURE [ 28.637 s]
01:43:59 [INFO] MicroProfile JWT Auth TCK Harness .................. SKIPPED
01:43:59 [INFO] ------------------------------------------------------------------------
01:43:59 [INFO] BUILD FAILURE
01:43:59 [INFO] ------------------------------------------------------------------------
01:43:59 [INFO] Total time:  52.391 s
01:43:59 [INFO] Finished at: 2020-02-29T06:43:59Z
01:43:59 [INFO] ------------------------------------------------------------------------
01:43:59 Waiting for Jenkins to finish collecting data
01:43:59 [ERROR] Failed to execute goal biz.aQute.bnd:bnd-baseline-maven-plugin:3.5.0:baseline (baseline) on project microprofile-jwt-auth-api: An error occurred while calculating the baseline: The baselining plugin detected versioning errors -> [Help 1]
01:43:59 [ERROR] 
01:43:59 [ERROR] To see the full stack trace of the errors, re-run Maven with the -e switch.
01:43:59 [ERROR] Re-run Maven using the -X switch to enable full debug logging.
01:43:59 [ERROR] 
01:43:59 [ERROR] For more information about the errors and possible solutions, please read the following articles:
01:43:59 [ERROR] [Help 1] http://cwiki.apache.org/confluence/display/MAVEN/MojoExecutionException
01:43:59 [ERROR] 
01:43:59 [ERROR] After correcting the problems, you can resume the build with the command
01:43:59 [ERROR]   mvn <goals> -rf :microprofile-jwt-auth-api
01:43:59 [JENKINS] Archiving /home/jenkins/agent/workspace/JWT-Auth-maven-snapshots/api/pom.xml to org.eclipse.microprofile.jwt/microprofile-jwt-auth-api/1.2-SNAPSHOT/microprofile-jwt-auth-api-1.2-SNAPSHOT.pom
01:43:59 [JENKINS] Archiving /home/jenkins/agent/workspace/JWT-Auth-maven-snapshots/api/target/microprofile-jwt-auth-api-1.2-SNAPSHOT.jar to org.eclipse.microprofile.jwt/microprofile-jwt-auth-api/1.2-SNAPSHOT/microprofile-jwt-auth-api-1.2-SNAPSHOT.jar
01:43:59 [JENKINS] Archiving /home/jenkins/agent/workspace/JWT-Auth-maven-snapshots/api/target/microprofile-jwt-auth-api-1.2-SNAPSHOT-javadoc.jar to org.eclipse.microprofile.jwt/microprofile-jwt-auth-api/1.2-SNAPSHOT/microprofile-jwt-auth-api-1.2-SNAPSHOT-javadoc.jar
01:43:59 [JENKINS] Archiving /home/jenkins/agent/workspace/JWT-Auth-maven-snapshots/api/target/microprofile-jwt-auth-api-1.2-SNAPSHOT-sources.jar to org.eclipse.microprofile.jwt/microprofile-jwt-auth-api/1.2-SNAPSHOT/microprofile-jwt-auth-api-1.2-SNAPSHOT-sources.jar
01:43:59 [JENKINS] Archiving /home/jenkins/agent/workspace/JWT-Auth-maven-snapshots/api/target/microprofile-jwt-auth-api-1.2-SNAPSHOT-tests.jar to org.eclipse.microprofile.jwt/microprofile-jwt-auth-api/1.2-SNAPSHOT/microprofile-jwt-auth-api-1.2-SNAPSHOT-tests.jar
01:43:59 [JENKINS] Archiving /home/jenkins/agent/workspace/JWT-Auth-maven-snapshots/pom.xml to org.eclipse.microprofile.jwt/microprofile-jwt-auth-parent/1.2-SNAPSHOT/microprofile-jwt-auth-parent-1.2-SNAPSHOT.pom
01:43:59 [JENKINS] Archiving /home/jenkins/agent/workspace/JWT-Auth-maven-snapshots/tck/pom.xml to org.eclipse.microprofile.jwt/microprofile-jwt-auth-tck/1.2-SNAPSHOT/microprofile-jwt-auth-tck-1.2-SNAPSHOT.pom
01:43:59 channel stopped
01:44:00 Sending e-mails to: microprofile-dev@eclipse.org
01:44:00 Finished: FAILURE